##TITLE=31Pdec_SR88_rm2
 , 24 sc
 20.09.2021
##JCAMPDX= 6.0         $$ Bruker NMR JCAMP-DX V2.0
##DATA TYPE= NMR SPECTRUM
##DATA CLASS= NTUPLES
##ORIGIN= UXNMR, Bruker Analytische Messtechnik GmbH
##OWNER= root
$$ XWIN-NMR		Version 3.5
$$ Mon Sep 20 11:25:31 2021 Russian Standard Time (UT+4h)  she@DPX200
##.OBSERVE FREQUENCY= 81.013821
##.OBSERVE NUCLEUS= ^31P
##.ACQUISITION MODE= SIMULTANEOUS
##.ACQUISITION SCHEME= undefined
##.AVERAGES= 24
##.DIGITISER RES= 16
##SPECTROMETER/DATA SYSTEM= spect
##.PULSE SEQUENCE= zgpg30
##.SOLVENT NAME= CDCl3
##.SHIFT REFERENCE= (INTERNAL, CDCl3, 0, 248.564)
##AUDIT TRAIL= $$ (NUMBER, WHEN, WHO, WHERE, WHAT)
$$ ##TITLE= Audit trail, XWIN-NMR		Version 3.5
$$ ##JCAMPDX= 5.01
$$ ##ORIGIN= Bruker BioSpin GmbH
$$ ##OWNER= she
$$ F:/spectra/data/she/nmr/P31/1/pdata/1/auditp.txt
$$ ##AUDIT TRAIL=  $$ (NUMBER, WHEN, WHO, WHERE, WHAT)
(   1,<2021-09-20 11:23:57.85 +0400>,<she>,<DPX200>,
      <created by zg, POWCHK disabled, PULCHK disabled
       configuration hash MD5:
       00 E9 B6 7A A2 85 ED C7 34 08 36 98 17 FE 4E 26
       data hash MD5: 32K
       26 92 7D BC B4 5D 1E 94 68 8D C5 2E C7 8B 3B 92>)
(   2,<2021-09-20 11:24:08.76 +0400>,<she>,<DPX200>,
      <Start of raw data processing
       efp BC_mod = 2 LB = 1 FT_mod = 6 PKNL = 1 PHC0 = -8149.773 PHC1 = 376.6703 SI = 64K 
       data hash MD5: 64K
       26 0C 7F 86 22 47 91 7F 8F B6 B1 D3 BF CB CE FC>)
(   3,<2021-09-20 11:24:59.89 +0400>,<she>,<DPX200>,
      <pk PHC0 = 41.08418 PHC1 = -302.6 
       data hash MD5: 64K
       05 D4 21 04 6C 75 17 E4 07 BD 1E 21 D5 A2 93 C7>)
(   4,<2021-09-20 11:25:03.43 +0400>,<she>,<DPX200>,
      <abs ABSG = 5 
       data hash MD5: 64K
       74 0E 31 5E 70 00 84 17 02 07 00 FB A0 AC 44 C4>)
$$ ##END=
$$ 
$$ hash MD5
$$ 5D 53 52 DC 3A 67 C2 E1 4E D4 6B 60 C7 F4 08 56
##$RELAX= 
##$RELAX= 
##$RELAX= 
##$RELAX= 
##$RELAX= 
##$RELAX= 
##$RELAX= 
##$RELAX= 
$$ Bruker specific parameters
$$ --------------------------
##$DU= <F:/spectra>
##$EXPNO= 1
##$NAME= <P31>
##$PROCNO= 1
##$TYPE= <nmr>
##$USER= <she>
##$AMP= (0..31)
100 100 100 100 100 100 100 100 100 100 100 100 100 100 100 100 100 100 
100 100 100 100 100 100 100 100 100 100 100 100 100 100 
##$AQSEQ= 0
##$AQ_mod= 1
##$AUNM= <au_zg>
##$AUTOPOS= <>
##$BF1= 81.014009
##$BF2= 200.13
##$BF3= 200.13
##$BF4= 200.13
##$BF5= 200.13
##$BF6= 200.13
##$BF7= 200.13
##$BF8= 200.13
##$BYTORDA= 1
##$CFDGTYP= 0
##$CFRGTYP= 5
##$CHEMSTR= <none>
##$CNST= (0..31)
1 1 145 1 1 1 1 1 1 1 1 1 1 1 1 1 1 1 1 1 1 1 1 1 1 1 1 1 1 1 1 1 
##$CPDPRG= <waltz16>
##$CPDPRG1= <>
##$CPDPRG2= <waltz16>
##$CPDPRG3= <>
##$CPDPRG4= <mlev>
##$CPDPRG5= <mlev>
##$CPDPRG6= <mlev>
##$CPDPRG7= <mlev>
##$CPDPRG8= <mlev>
##$CPDPRGB= <>
##$CPDPRGT= <>
##$D= (0..31)
0 1 0 0 0 0 0 0 0 0 0 0.03 2e-05 3e-06 0 0 0 0 0 0 0 0 0 0 0 0 0 0 0 0 
0 0 
##$DATE= 1632122637
##$DBL= (0..7)
120 120 120 11 120 120 24 19 
##$DBP= (0..7)
150 150 150 150 150 150 150 150 
##$DBP07= 0
##$DBPNAM0= <>
##$DBPNAM1= <>
##$DBPNAM2= <>
$$ [...]
##$SUBNAM3= <"">
##$SUBNAM4= <"">
##$SUBNAM5= <"">
##$SUBNAM6= <"">
##$SUBNAM7= <"">
##$SUBNAM8= <"">
##$SUBNAM9= <"">
##$SW= 501.771253377433
##$SWIBOX= (0..15)
0 1 3 0 0 0 0 0 0 0 0 0 0 0 0 0 
##$SW_h= 40650.406504065
##$TD= 32768
##$TD0= 1
##$TE= 0
##$TE2= 300
##$TE3= 300
##$TEG= 300
##$TL= (0..7)
0 120 53 12 22 120 120 120 
##$TP= (0..7)
150 150 150 150 150 150 150 150 
##$TP07= 0
##$TPNAME0= <>
##$TPNAME1= <>
##$TPNAME2= <>
##$TPNAME3= <>
##$TPNAME4= <>
##$TPNAME5= <>
##$TPNAME6= <>
##$TPNAME7= <>
##$TPOAL= (0..7)
0.5 0.5 0.5 0.5 0.5 0.5 0.5 0.5 
##$TPOFFS= (0..7)
0 0 0 0 0 0 0 0 
##$TUNHIN= 0
##$TUNHOUT= 0
##$TUNXOUT= 0
##$USERA1= <user>
##$USERA2= <user>
##$USERA3= <user>
##$USERA4= <user>
##$USERA5= <user>
##$V9= 5
##$VALIST= <valist>
##$VCLIST= <CCCCCCCCCCCCCCC>
##$VD= 0
##$VDLIST= <DDDDDDDDDDDDDDD>
##$VPLIST= <PPPPPPPPPPPPPPP>
##$VTLIST= <TTTTTTTTTTTTTTT>
##$WBST= 1024
##$WBSW= 4
##$XGAIN= (0..3)
0 0 0 0 
##$XL= 0
##$YL= 0
##$YMAX_a= 6179
##$YMIN_a= -9278
##$ZGOPTNS= <>
##$ZL1= 120
##$ZL2= 120
##$ZL3= 120
##$ZL4= 120
##$ABSF1= 248.5645
##$ABSF2= -253.2056
##$ABSG= 5
##$ABSL= 3
##$ALPHA= 0
##$AQORDER= 0
##$ASSFAC= 0
##$ASSFACI= 0
##$ASSFACX= 0
##$ASSWID= 0
##$AUNMP= <proc_1d>
##$AZFE= 0.1
##$AZFW= 0.5
##$BCFW= 0
##$BC_mod= 2
##$BYTORDP= 0
##$COROFFS= 0
##$CY= -3
##$DATMOD= 1
##$DC= 0
##$DFILT= <>
##$DTYPP= 0
##$F1P= 0
##$F2P= 0
##$FCOR= 1
##$FTSIZE= 65536
##$FT_mod= 6
##$GAMMA= 0
##$GB= 0
##$INTBC= 1
##$INTSCL= 5.30512e-09
##$ISEN= 30
##$LB= 1
##$LEV0= 0
##$LPBIN= 0
##$MAXI= 10000
##$MC2= 0
##$MEAN= 0
##$ME_mod= 0
##$MI= 50
##$NCOEF= 0
##$NC_proc= -8
##$NLEV= 6
##$NOISF1= 182.463
##$NOISF2= 159.3651
##$NSP= 0
##$NTH_PI= 0
##$NZP= 0
##$OFFSET= 248.5645
##$PC= 4
##$PHC0= -8108.689
##$PHC1= 74.07028
##$PH_mod= 1
##$PKNL= yes
##$PPARMOD= 0
##$PSCAL= 0
##$PSIGN= 0
##$REVERSE= no
##$SF= 81.014009
##$SI= 65536
##$SIGF1= 159.3651
##$SIGF2= -187.1042
##$SINO= 113.3802
##$SIOLD= 16384
##$SREGLST= <1H.CDCl3>
##$SSB= 0
##$STSI= 65536
##$STSR= 0
##$SW_p= 40650.406504065
##$SYMM= 0
##$S_DEV= 0
##$TDeff= 32768
##$TDoff= 0
##$TI= <>
##$TILT= no
##$TM1= 0
##$TM2= 0
##$TOPLEV= 0
##$USERP1= <user>
##$USERP2= <user>
##$USERP3= <user>
##$USERP4= <user>
##$USERP5= <user>
##$WDW= 1
##$XDIM= 65536
##$YMAX_p= 180393320
##$YMIN_p= -403508249
$$ End of Bruker specific parameters
$$ ---------------------------------
##NTUPLES= NMR SPECTRUM
##VAR_NAME=  FREQUENCY,     SPECTRUM/REAL,   SPECTRUM/IMAG
##SYMBOL=    X,             R,               I
##VAR_TYPE=  INDEPENDENT,   DEPENDENT,       DEPENDENT
##VAR_FORM=  AFFN,          ASDF,            ASDF
##VAR_DIM=   65536,         65536,           65536
##UNITS=     HZ,            ARBITRARY UNITS, ARBITRARY UNITS
##FACTOR=    0.620285442955139, 1,           1
##FIRST=     20137.2065510759, 0,            0
##LAST=      -20513.1999529892, 0,           0
##MIN=       -20513.1999529892, -403508249,  0
##MAX=       20137.2065510759, 180393320,    0
$$ Real data points
##PAGE= N=1
##DATA TABLE= (X++(R..R)), XYDATA
$$ [...]
##PAGE= N=2
##DATA TABLE= (X++(I..I)), XYDATA
13001a469309K670302K913634q55805k811072Q82302M547607K153609j841826
12993F189442n31300K272177j232305p494335o579492K79078K592626r64829j303431
12984f772369L084684K863930l903706o054137J698961Q384670M103386m304826
12976h99407n014939Q68492L804532J346012j188341j225189j006435j491607
12968d806882j180498L84500K444257M413541M740350J648970k922647m456248
12960B65343k628610j643036k392411j109962K168305J887404k928989n289907
12952a1671863j489668K591559J852696K67619K281692M014543R28286k789158
12944d014294j158076L057024L426718N63185p92312r41536k793176m083774q66393
$$ plain form
13001 -1469309 1200993 4114627 3258822 447750 1330052 5877659 8031268 6189442
12993 6189442 5658142 7930319 6698014 -796321 -7375813 -7096735 -4504109 -5468938 -6772369
12984 -6772369 -3687685 -823755 -4727461 -10781598 -9082637 -697967 3405419 -899407
12976 -899407 -5914346 -5045854 -1241322 104690 -1083651 -2308840 -3315275 -4806882
12968 -4806882 -5987380 -5602880 -3158623 1254918 5995268 7644238 4721591 265343
12960 265343 -2363267 -4006303 -6398714 -7508676 -5340371 -3452967 -6381956 -11671863
12952 -11671863 -13161531 -10569972 -8717276 -8449657 -6167965 -2153422 -1225136 -4014294
12944 -4014294 -5172370 -2115346 1311372 1874557 1082245 140709 -2652467 -6736241 -7602634
12935g602634M170368N270313K893066J451857O92348k189518m608869k128732
12927b051801J986311O51704m429470m362538K083422N659023J286284m196490
12919c373555l411305P16296J407257r65106j092162J902352L919529L013424
12911B116730J363592M10369j111142l340008l530633l60384K777002J959603
12903B85129j172186j370809K108996L791135K73336m188953m120208r55568M81586
12894d867542L84740K081205L875001R03885n195058p025202k983401M41277n829
12885a2390924L84686M273936O530408L562935J32797P89033K085530R0208j548103
12876C910506J189550L848670N86751n053015n522650j485306L67166j261186
$$ plain form
12935 -7602634 -3432266 1838047 4731113 6182970 6875318 4685800 76931 -2051801
12927 -2051801 -65490 586214 -3843256 -8205794 -6122372 -463349 822935 -3373555
12919 -3373555 -6784860 -6068564 -4661307 -5626413 -6718575 -4816223 -896694 2116730
12911 2116730 3480322 3890691 2779549 -560459 -4091092 -4451476 -1674474 285129
12903 285129 -887057 -2257866 -148870 3642265 3915601 -273352 -4393560 -5349128 -4867542
12894 -4867542 -4482802 -2401597 1473404 2377289 -2817769 -9842971 -12826372 -12385095 -12390924
12885 -12390924 -12006238 -7732302 -1201894 2361041 2493838 3282871 5368401 5458609 3910506
12876 3910506 5100056 8948726 9535477 4482462 -1040188 -2525494 -2158328 -3419514
12868c419514j899827l42275L90700j19125M59621J531946P00366o57293M39169
12859b916232K411157J848267M80283K149316M616194K395397l253223n432256
12851B298903k586889k71798j281942j865927N67380K985564K333469L2381j209965
12842A001176p09103J201718L524433L769598P86158k237348j963863o43156k372637
12833B356976n387480m591557n09775J634432J208762K498784N333224M021995
12825F565361k199954n914486k433297L001023L403501l16977k844690l022883
12817c762402l501558m587954l696749k37114K837077K908480R90024J98194J624521
12808g227481K908398J778663j22830M24240K472683J645724k459504m643995
$$ plain form
12868 -3419514 -5319341 -5661616 -5270916 -5390041 -4930420 -3398474 -2698108 -3355401 -2916232
12859 -2916232 -505075 1343192 1823475 3972791 8588985 10984382 7731159 2298903
12851 2298903 -287986 -559784 -1841726 -3707653 -3140273 -154709 2178760 2211141 1001176
12842 1001176 292073 1493791 5018224 8787822 9573980 7336632 5372769 4729613 2356976
12833 2356976 -3030504 -7622061 -8131836 -6497404 -5288642 -2789858 2543366 6565361
12825 6565361 4365407 -1549079 -3982376 -981353 2422148 2105171 -739519 -3762402
12817 -3762402 -7263960 -11851914 -15548663 -15785777 -12948700 -10040220 -9050196 -8852002 -7227481
12808 -7227481 -4319083 -2540420 -2663250 -2239010 233673 1879397 -580107 -5224102
12800e224102k232383N67976O926j107195N64441K369499J207845K87563L157282
12791d02148N706447K262502m117343n943966k790599j9530R51899K212676K125718
12782a4344j819988n374977k876293J901167J025578l309427j804651N347379
12774f925556P863678K550581j845911J39664K839994R85533k023328k235754
12766A348901j711399k178435j098633J591761J465658j761247k310571J329373
12758c324592L276172J064034j20425J954697J918941k365595m526055q98690
12750c021513K784781J861380J61524Q41544j22447m365236n215179P05732N628886
12741g40528K989760j553276n49628K656227J557499j581139j746147j452365
$$ plain form
12800 -5224102 -7456485 -6888509 -6881583 -7988778 -7424337 -5054838 -3846993 -3559430 -402148
12791 -402148 5304299 7566801 3449458 -2494508 -5285107 -5304637 -4352738 -2140062 -14344
12782 -14344 -1834332 -7209309 -10085602 -8184435 -7158857 -10468284 -12272935 -6925556
12774 -6925556 938122 3488703 1642792 1782456 4622450 5607983 3584655 1348901
12766 1348901 -362498 -2540933 -3639566 -2047805 -582147 -2343394 -4653965 -3324592
12758 -3324592 -48420 1015614 895189 2849886 4768827 2403232 -2122823 -3021513
12750 -3021513 -236732 1624648 1786172 2627716 2505269 -1859967 -7075146 -6369414 -740528
12741 -740528 2249232 695956 146328 2802555 4360054 2778915 1032768 -419597
12733d19597m257335n217483P28032P203848N221998j698986l392704K86248J095320
12724d50659k253684k827066J483535M791601L337230j90093k465452k476154
12716a050742J37775L357452K114450m336417q471405m775423J365314K875889
12708h783107K498703N272774O609298M71113o461416l498953N069316N500228
12700F677956k686217o026612J95198N130257J655752k923331j199178K577087
12692C400912K049814o57153q69178O89515J725843K665470K580911j611600p919911
12683B054623q980760k851257L484221M753370L568530K826429P66285k493506
12675C127935k437817J266743K351287j218597k939650N06247K593771j529059
$$ plain form
12733 -419597 -4676932 -9894415 -9166383 -1962535 3259463 1560477 -1832227 -1545979 -450659
12724 -450659 -2704343 -5531409 -4047874 743727 4080957 3890864 1425412 -1050742
12716 -1050742 -912967 2444485 4558935 222518 -8248887 -13024310 -11658996 -8783107
12708 -8783107 -6284404 -1011630 5597668 6068781 -392635 -3891588 1177728 6677956
12700 6677956 3991739 -2034873 -1839675 3290582 4946334 2023003 823825 3400912
12692 3400912 5450726 4793573 3924395 4613910 6339753 9005223 11586134 9974534 2054623
12683 2054623 -6926137 -9777394 -6293173 -1539803 2028727 4855156 5621441 3127935
12675 3127935 690118 1956861 4308148 3089551 149901 656148 3249919 1720860
12667A720860n837475l356995K571551M888410L636312K263306j22783m418633
12659A344553n669745m05717N461790M764824K22395j093789N43684M41477o69953
12650D939519M70277J206202k065185m318319R93488Q092305N300961n466269
12642I152979r663784k472879L862645j1720o403455m458619K556039M305369
12634c133425L69654j156139J802390L084546j68267l201951k184133M42263J334301
12625b810761R83073N27331j027609l324756k786719J946610O076982M483000
12617D067151p69407l330570j575219L14919m3920q2014J840096K626251k95283
12608B752004l887521l663154j79892K671521L657554M065073L271542m30842
$$ plain form
12667 1720860 -4116615 -7473610 -4902059 -13649 3622663 5885969 5763186 1344553
12659 1344553 -4325192 -4730909 730881 5495705 5718100 4624311 5167995 5609472 4939519
12650 4939519 5409796 6615998 4550813 232494 1225982 9318287 14619248 9152979
12642 9152979 -510805 -2983684 878961 867241 -5536214 -9994833 -7438794 -3133425
12634 -3133425 -2763771 -3919910 -2117520 967026 798759 -2403192 -4587325 -4145062 -2810761
12625 -2810761 -1827688 -1300357 -2327966 -5652722 -8439441 -6492831 -415849 4067151
12617 4067151 3297744 -32826 -1608045 -1293126 -1337046 -1419060 421036 3047287 2752004
12608 2752004 -1135517 -4798671 -4978563 -2307042 1350512 5415585 8687127 8256285
12600H256285n018539n804386k054007J742950K217764Q29119N4976k81609j117214
12591a174661j757890j283765m0428J412340K589666J971187j400408m922995
12583d606954m687470j244110J011430Q53683J578425L967149L848741l44143
12575C76751l514012j881831L54143j778912m637384j187362O794949R696052
12567D222394L384386n248433p676220l386711J983855M091635K978627J270409
12559A619942J297927K789586K920328j6630l604909m263049k431496j556151
12551c244452k189692j152321K517588M866752K601718j736463l174713r58296
12543b469879J318500J263354J89481j34534l75463j756110l079160j974289J190971
$$ plain form
12600 8256285 3237746 -2566640 -4620647 -2877697 -659933 169186 224162 -57447 -1174661
12591 -1174661 -2932551 -4216316 -4256744 -2844404 -254738 1716449 316041 -4606954
12583 -4606954 -9294424 -10538534 -9527104 -8673421 -7094996 -3127847 720894 376751
12575 376751 -3137261 -5019092 -4664949 -6443861 -11081245 -12268607 -5473658 4222394
12567 4222394 7606780 2358347 -5317873 -8704584 -6720729 -2629094 349533 1619942
12559 1619942 2917869 5707455 8627783 8611153 5006244 743195 -1688301 -3244452
12551 -3244452 -5434144 -6586465 -4068877 797875 3399593 1663130 -1511583 -2469879
12543 -2469879 -1151379 111975 301456 166922 -208541 -1964651 -5043811 -7018100 -5827129
12534e827129L027651J692355l28398J5045J411627J99423l264922m239920o68817
12525g983085L243590K932750k40003j842254j011351l30894o94171o19642q9631
12516f634691p05168j712979j30933L922083N850126K631286k711177n093099
12508d584552l596309j213864o5184L85410J083977J785354J726160M72176j651527
12499e658359k985654j372649K845639N638893L360162k309403n832304m353834
12491a0667509l95382K349454L074847K546186P73940j573753j913623Q51198
12483d954642L414752K206145r21238j461304K78401k630k269280j432878L011631
12474b131043M044283j590348o157360k125746N106047M975274j475330l610112
$$ plain form
12534 -5827129 -2799478 -1107123 -1435521 -1420476 -8849 190574 -3074348 -7314268 -7983085
12525 -7983085 -4739495 -1806745 -2046748 -3889002 -4900353 -5231247 -5925418 -6545060 -6634691
12516 -6634691 -7339859 -9052838 -9183771 -5261688 588438 3219724 508547 -4584552
12508 -4584552 -8180861 -9394725 -9459909 -9074499 -7990522 -6205168 -4479008 -4006832 -5658359
12499 -5658359 -8644013 -10016662 -7171023 -1532130 1828032 -481371 -6313675 -10667509
12491 -10667509 -11062891 -8713437 -5638590 -3092404 -2318464 -3892217 -5805840 -4954642
12483 -4954642 -1539890 666255 -254983 -1716287 -1437886 -1440516 -3709796 -5142674 -2131043
12474 -2131043 1913240 322892 -5834468 -7960214 -2854167 2121107 645777 -2964335
12466b964335J120397L580812q45779m394439o22190M539211L216376j405702
12458B224351j768739R00346M10496j966228K5714M983942M907660j087236m706800
12449C923506j856206J710482J119406m08591N22333O73316k771499n135495j247416
12440c470164N269630O750429K362400k274847l957184m025308l242813r12138
12432c499995J393343J015215p70012j91445K310541K214188j430998m045991
12424c005154l023432j732130k999065l598190J88007N143382M888243n05477
12416d643816m260623k419467J406554K318159Q00483K36134R25918N64138p59050
12407e831570l42557K012725K670892j86331k821244j048326K996051L381578
$$ plain form
12466 -2964335 -1843938 1736874 891095 -3503344 -4125534 413677 3630053 2224351
12458 2224351 455612 1355958 1766454 -199774 -174060 4809882 9717542 8630306 3923506
12449 3923506 2067300 3777782 4897188 4488597 5010930 5684246 2912747 -2222748 -3470164
12440 -3470164 1799466 8549895 10912295 8637448 4680264 654956 -2587857 -3499995
12432 -3499995 -2106652 -1091437 -1861449 -2052894 257647 2471835 1040837 -3005154
12424 -3005154 -6028586 -7760716 -10759781 -14357971 -14169964 -9026582 -4138339 -4643816
12416 -4643816 -8904439 -11323906 -9917352 -7599193 -6798710 -6562576 -5636658 -5072520 -5831570
12407 -5831570 -6174127 -4161402 -1490510 -1676841 -4498085 -5546411 -2550360 831218
12399H31218p99716l772272j588078K051668J654683j650580k111948J721645
12391c663380N040627M067477Q17666j009701j181461j556659k306741k250153
12383b042325j220130K33554J959612K956133J002255l729488o604506l679029
12375a1123924K272017M925511L058017J436783K651566L183362j52713m355111
12367A895508m525021r85450J931618K306925J771715J344230L37445o82727J68332
12358C562575K381546K655482m11915l923830m545947k599966o94616j22238l57135
12349d056044o82247n62862N19305K069353K442964J132633j3774M85447J152761
12340B487536o4390j930420j403181J409357L151243K598881K513394M347003
$$ plain form
12399 831218 31502 -3740770 -5328848 -3277180 -1622497 -3273077 -5385025 -3663380
12391 -3663380 1377247 5444724 6262390 5252689 4071228 2514569 207828 -2042325
12383 -2042325 -3262455 -3028901 -1069289 1886844 2889099 -840389 -7444895 -11123924
12375 -11123924 -8851907 -3926396 -868379 568404 3219970 6403332 6250619 1895508
12367 1895508 -2629513 -3614963 -1683345 623580 2395295 3739525 4076970 3394243 3562575
12358 3562575 5944121 8599603 8187688 4263858 -282089 -2882055 -3576671 -3698909 -4056044
12349 -4056044 -4738291 -5301153 -4781848 -2712495 -269531 863102 849328 1334775 2487536
12340 2487536 2423146 492726 -910455 498902 3650145 6249026 8762420 13109423
12332A3109423M543952n04864p926328j0869930p051161j054069K182822K544982
12324e025173K342815K279731J976603J792838J568778l29813m034939o162766
12316e591926l898426M20578K318391J666111K099181M386504M986107K031525
12308H418045j630763l075809k969165k402053q8818L964746N511329J348257
12300I075769m496902m839920Q34835N189912K523303m222188p601475m371770
12292g908436J799421N087410L477965J78181m41360J979269L656084K079170
12284I907704m38300n26262P99119j80248l465314m677783j730094J639822J282253
12275B610897j362629j946298j28511J87029k511582m470451k310134J455027
$$ plain form
12332 13109423 17653375 17148511 9222183 -1647747 -8698908 -9752977 -7570155 -5025173
12324 -5025173 -2682358 -402627 1573976 3366814 4935592 4605779 570840 -5591926
12316 -5591926 -9490352 -9069774 -6751383 -5085272 -2986091 1400413 6386520 8418045
12308 8418045 6787282 3711473 742308 -1659745 -1748563 2216183 7727512 9075769
12300 9075769 4578867 -261053 573782 5763694 8286997 4064809 -3536666 -7908436
12292 -7908436 -6109015 -1021605 2456360 2634541 2193181 4172450 7828534 9907704
12284 9907704 9469404 8943142 9742261 9562013 6096699 1418916 -311178 1328644 2610897
12275 2610897 1248268 -698030 -826541 -639512 -3151094 -7621545 -9931679 -8476652
12267h476652J859769r36919j639969K026434N259202K946988k516492m287027
12259e764666o02479L287061K959304K13599r59606j28566L88289m29249j703594
12250b739907k573620k551152j123341J278289K911784K616902J109051l29284
12242a401278j148104j198967q25186j208328k328825j263450L781463Q318993
12234B726318N883000j882490n827436k050551K796601K312941q15361j704966
12226A438056j626041k783908j790292L217454N272556j394959r160968o636261
12218a3464363K970706O173914M07873l176151P96485M066302N43791l466932
12210e148375j594109J537355j65596l062055j119598K905873K731850o18387
$$ plain form
12267 -8476652 -6616883 -7553802 -9193771 -7167337 -1908135 1038853 -1477639 -5764666
12259 -5764666 -6367145 -3080084 -120780 92819 -866787 -995353 -607064 -1036313 -2739907
12250 -2739907 -5313527 -7864679 -8988020 -7709731 -4797947 -2181045 -1071994 -1401278
12242 -1401278 -2549382 -3748349 -4573535 -5781863 -8110688 -9374138 -5592675 2726318
12234 2726318 8609318 6726828 899392 -1151159 1645442 3958383 3143022 1438056
12226 1438056 -187985 -2971893 -4762185 -1544731 3727825 2332866 -6828102 -13464363
12218 -13464363 -10493657 -4319743 -3911870 -7088021 -6291536 -2225234 -1681443 -5148375
12210 -5148375 -6742484 -5205129 -5370725 -8432780 -9552378 -6646505 -3914655 -4533042
12202d533042j853151q09094p40451r55808J118034L501267K436905q73022k612704
12193e321066k705990k819698j311240L178772O230144L121956k513959l068898
12185e209979J570866M434549K458272m02778j034207j047935j946751k519224
12177c697187k177384j830583q93839J762685L893879K124899j799960k486463
12169e103953R28049L531961K409537K59722p3612L48281k81247j569850k680840
12160b231952l361597k449672P41497L271681J456114k693896l237216N70536
12152g934505K823810M78648j912889j71094K693341K154182k34186l48823J051503
12143a400013L92882j457994l37167L346778L974451p14356n415341m399574M94217
$$ plain form
12202 -4533042 -6386193 -7195287 -7935738 -8891546 -7773512 -4272245 -1835340 -2708362 -5321066
12193 -5321066 -8027056 -10846754 -12157994 -8979222 -2749078 372878 -2141081 -5209979
12185 -5209979 -3639113 795436 3253708 2850930 1816723 768788 -1177963 -3697187
12177 -3697187 -5874571 -7705154 -8598993 -6836308 -2942429 -817530 -2617490 -5103953
12169 -5103953 -4175904 -643943 1765594 2025316 1951704 2299985 2018738 448888 -2231952
12160 -2231952 -5593549 -8043221 -7301724 -4030043 -2573929 -5267825 -8505041 -7934505
12152 -7934505 -5110695 -4632047 -6544936 -6716030 -4022689 -1868507 -2102693 -2451516 -1400013
12143 -1400013 -1007131 -2465125 -2802292 544486 4518937 3804581 -1610760 -6010334 -5516117
12134e516117K517081q74772n114271m906268n54871L528859M563164L361013
12126b996182J640340J19001o33033K4804J373366J609373K53412j388555k320522
12117b317996k288834m32190L254970N247049J793955m366157o002121j816449
12109f927773J369855k04361j192202K557110N264104Q63826n035999l240321
12101f545761L384136M220644j325916l298904J165879L043440k293323o617680
12093h267485k814456L570835M548774K364793K996307M318961Q26764m829822
12085B714671n278288o75434J996781O27457Q8986K598595M111224J795669j594829
12076F384832k870089k594271k141783j045514P19206J476331O85913M2678L94008
$$ plain form
12134 -5516117 -2999036 -3873808 -8988079 -13894347 -14449218 -10920359 -6357195 -2996182
12126 -2996182 -1355842 -1236841 -1869874 -1845070 -471704 1137669 1391081 2526 -2317996
12117 -2317996 -4606830 -5039020 -1784050 3462999 5256954 890797 -5111324 -6927773
12109 -6927773 -5557918 -5762279 -6954481 -4397371 866733 1730559 -3305440 -6545761
12101 -6545761 -3161625 1059019 -266897 -3565801 -2399922 643518 -1649805 -8267485
12093 -8267485 -11081941 -7511106 -2962332 -597539 2398768 6717729 7544493 2714671
12085 2714671 -2563617 -3239051 -1242270 -614813 -525827 2072768 6183992 7979661 6384832
12076 6384832 3514743 920472 -1221311 -2266825 -1547619 -71288 614625 657303 1051311
12067A051311M04810n10759p31331O93854K101899J610945l48821k041213k517539
12058b86844j991579j385364j691453k498775j689980J403455L412831P17004
12050d010705m350837n146918K17286N525336M784018M42303o05478K949276N533986
12041E338267L154763j428703l538107l049430l183487m705462m664105j060069
12033a3136333L668778N143128K126659k036780l082992k88603L128360L837970
12025f39813J834534m10408j291949j150251m92114O83585J426820K41794j828201
12016a626003j254051K638388N106381K123415l212724m735995j981315L50121
12008b591783O76932J849699L798142K150730l335126n974146j931464L361371
$$ plain form
12067 1051311 1456121 945362 214031 907885 3009784 4620729 4271908 2230695 -286844
12058 -286844 -2278423 -3663787 -5355240 -7854015 -9543995 -8140540 -4727709 -4010705
12050 -4010705 -8361542 -13508460 -13291174 -7765838 -2981820 -2539517 -3144995 -195719 5338267
12041 5338267 8493030 7064327 3526220 476790 -2706697 -7412159 -12076264 -13136333
12033 -13136333 -9467555 -4324427 -2197768 -4234548 -7317540 -7606143 -4477783 -639813
12025 -639813 1194721 784313 -507636 -1657887 -2150001 -1466416 -39596 202198 -1626003
12016 -1626003 -2880054 -241666 4864715 6988130 3775406 -960589 -2941904 -2591783
12008 -2591783 -1914851 -65152 3732990 5883720 2548594 -3425552 -5357016 -1995645
12000a995645L652531J068457P25445J315814j219075m309479j804454N066045
11992B499639Q123109L736610l302890p703185q548871n828708N48512O670993
11984c804791O529627N79012l580527j677135J782010J425361j250593j917940
11976a914976n15700Q6448o51010r77338j52980J156197K189177K067079L19537
11967A606434j569299j417809L46811J364428J349189J948480K706462J446594
11959G781290j148612k055029j264728j417178j879674N17210M019147K550021
11951G102447l982487p443601l143317L125140M059860N92485k027550k063419
11943c780442l85784K656872M622642J039606o700586r598321l211451M502667
$$ plain form
12000 -1995645 1656886 2725343 3450788 4766602 3547527 -761952 -2566406 2499639
11992 2499639 10622748 14359358 11056468 3353283 -5195588 -11024296 -10475784 -3804791
11984 -3804791 2724836 3303848 -276679 -1953814 -171804 1253557 2964 -1914976
11976 -1914976 -2430676 -2344228 -2995238 -3972576 -4125556 -2969359 -780182 1286897 1606434
11967 1606434 37135 -1380674 -1033863 330565 1679754 3628234 6334696 7781290
11959 7781290 6632678 4577649 3312921 1895743 16069 533279 4552426 7102447
11951 7102447 3119960 -4323641 -7466958 -4341818 -281958 310527 -1717023 -3780442
11943 -3780442 -4166226 -1509354 3113288 4152894 -2547692 -12146013 -15357464 -10854797
11935a0854797M456154l31068r75703K798200L865636K65485k828770k340274
11927e945137l00275J549198L097594K910782L44076j222865M47630J096074k853406
11918h76329n619483k24692P764861O472294l273816q081208k755505K321985
11910d271893r22586n602452k721909L731306M378813p0919j421518K022247L986687
11901h92224J190583k763360m399476m128625k346950J793765O049897N209676
11893b86714j374618o562938l771682L796614O743381J890803l473196j689655
11885d728005M696248O604842R36834n747399o562791k334514J733570K987881
11877b413334J892118n61676k481776j315531K076094K903040m52739k900558
$$ plain form
11935 -10854797 -6398643 -6729711 -7705414 -4907214 -1041578 -776093 -3604863 -5945137
11927 -5945137 -6245412 -4696214 -1598620 1312162 1656238 433373 881003 1977077 -876329
11918 -876329 -6495812 -6720504 1044357 7516651 4242835 -3838373 -6593878 -4271893
11910 -4271893 -5194479 -10796931 -13518840 -9787534 -5408721 -5479640 -6901158 -4878911 -892224
11901 -892224 298359 -2465001 -6864477 -10993102 -13340052 -11546287 -5496390 -286714
11893 -286714 -1661332 -8224270 -11995952 -8199338 -1455957 434846 -3038350 -4728005
11885 -4728005 -31757 6573085 7509919 1762520 -4800271 -7134785 -5401215 -2413334
11877 -2413334 -521216 -1082892 -3564668 -4880199 -2804105 98935 -353804 -3254362
11869c254362p01069J606771j333119n517150l061826M699119Q590680N271663
11861F300707O30124q75279j441575k893195k861008p46754r3104j919010k367675
11852f266769K8519J293751o55774k112670m46793J449425J199553J087090K271175
11843b152493J406516k419294l954697l75283K744827L20578l322850j681393
11835i434089K951124L952425J762641J804534L614128J660825l528450m567909
11827a784771P35800M864077J653768m605025n735992r56134L356408K905409
11819D33540j82052k012410k146894k569016l472362k704837M62174L401360L528890
11810e261607J853289Q70328N43663m62568r41036J187687L965867L151477p95736
$$ plain form
11869 -3254362 -3955431 -2348660 -3681779 -9198929 -12260755 -7561636 1029044 6300707
11861 6300707 6930831 6055552 4613977 1720782 -1140226 -1886980 -1980084 -3899094 -6266769
11852 -6266769 -6238250 -4944499 -5600273 -7712943 -8159736 -6710311 -5510758 -4423668 -2152493
11843 -2152493 -745977 -3165271 -7119968 -7495251 -4750424 -4429846 -7752696 -9434089
11835 -9434089 -6482965 -2530540 -767899 1036635 4650763 6311588 2783138 -1784771
11827 -1784771 -1048971 3815106 5468874 863849 -4872143 -5828277 -2471869 433540
11819 433540 251488 -1760922 -3907816 -6476832 -9949194 -12654031 -12191857 -8790497 -5261607
11810 -5261607 -3408318 -2537990 -1994327 -2456895 -3397931 -2210244 1755623 4907100 4111364
11801D111364k762944j029886L28754j177123k538132j338301M6978l28407k32984
11792d920681J478593J601030j065695k017397J161685L365451M88602k654832
11784b563244m20514L278066J642768k516706j232413M524222O002264R27163
11776I641606l890500m372062l433783k501529R16932N011561L244625m188927
11768D27923p921962l107367L094201L071089l78602j129610j79825j310756k321916
11759i756825Q50002N351562N204583J277689n13272P25247M87081k032141k265886
11750f71960J267274L745708J592296k182285k950898o73657J632966K437995
11742D197439J914654o6840l305100n719230m784260n28808M013841N516113L334956
$$ plain form
11801 4111364 1348420 318534 647288 -529835 -3067967 -4406268 -4359290 -4687697 -4920681
11792 -4920681 -3442088 -1841058 -2906753 -4924150 -3762465 -397014 91588 -2563244
11784 -2563244 -2983758 294308 1937076 -579630 -1812043 2712179 8714443 9641606
11776 9641606 5751106 1379044 -2054739 -4556268 -3639336 1372225 4616850 427923
11768 427923 -7494039 -10601406 -7507205 -4436116 -4814718 -5944328 -6124153 -7434909 -9756825
11759 -9756825 -8906823 -3555261 1649322 2927011 2413739 3138986 3626067 1593926 -671960
11750 -671960 595314 4341022 5933318 3751033 800135 126478 1759444 4197439
11742 4197439 6112093 6045253 2740153 -2979077 -7763337 -8292145 -4278304 1237809 4572765
11733D572765j15022k099634k471224k763838k615924R9917M224810M076596k767836
11724A40610r141584n783508N217996J1241584N521150l727488n073202N81782
11716a022660L082523j291463n530027l762994M56260J223069m71754L0812K405377
11707d880857K241103p67552j762774J292796L882032J680746k814018l852945
11699d981469m89603K572787J712264j156755j764454Q19007L305170K591507
11691B608454m28815k308150j541601K5678M62735L03316N11184J7941k173914
11682b523172l891065k043436K581675O016905O330900M758052J969726k417131
11674A0782454o155147n246571l43180K541768L81869k410571j248679J495208
$$ plain form
11733 4572765 4457743 2358109 -113115 -2876953 -5492877 -5392960 -1168150 2908446 140610
11724 140610 -9000974 -14784482 -9566486 1675098 7196248 3468760 -1604442 -1022660
11716 -1022660 2059863 768400 -4761627 -8524621 -8068361 -6845292 -7317046 -7286234 -4880857
11707 -4880857 -2639754 -3407306 -5170080 -3877284 4748 1685494 -1128524 -4981469
11699 -4981469 -5471072 -2898285 -1186021 -2342776 -4107230 -3288223 16947 2608454
11691 2608454 2179639 -128511 -1670112 -1644434 -1181699 -878383 -367199 -349258 -2523172
11682 -2523172 -6414237 -8457673 -5875998 140907 6471807 11229859 13199585 10782454
11674 10782454 4627307 -619264 -962444 1579324 1961193 -449378 -1698057 -202849
11666b02849J130970j516929k312855r25524r1261N7618J191816K034373L36103
11657b98538j770058o67855J553420j79742m376904m068934J483835M490510R10990
11648b923276l011838j149216K786134K178510j508872k002148J291196L468904
11640h70606K622228J121951l47615l227570n866400m417877L95639L309247K238065
11631e042938L02968q20653l108616n648957l010957N448625J0947973O340784
11623E408229k739900n288230n99069J966706j826564n280271k403124K936295
11615g825928M226747K201343J380863J405885j088947m528669l629437J885671
11607e972472O167299N416106J808708j416047l561098m164505k330219J00933
$$ plain form
11666 -202849 928121 -588808 -2901663 -3827187 -3918448 -3860830 -2669014 -634641 -298538
11657 -298538 -2068596 -2736451 -1183031 -1362773 -5739677 -9808611 -8324776 -3834266 -2923276
11648 -2923276 -5935114 -7084330 -4298196 -2119686 -3628558 -5630706 -4339510 -870606
11640 -870606 1751622 2873573 2525958 -701612 -6568012 -10985889 -10590250 -7281003 -5042938
11631 -5042938 -4739970 -5560623 -8669239 -14318196 -17329153 -11880528 -932555 5408229
11623 5408229 2668329 -2619901 -3218970 -1252264 -3078828 -8359099 -10762223 -7825928
11615 -7825928 -3599181 -1397838 -16975 1388910 299963 -4228706 -7858143 -5972472
11607 -5972472 194827 5610933 7419641 6003594 2442496 -1722009 -4052228 -3951295
11599c951295l04832k644764k150612J549290K688936j117756m023282j150432
11591a1104747L419666L755453J678913K031168K980943k14841m806078l630359
11583e889882K354454M491093L00574k747850j01263K499092n87346n021730l715868
11574h418726J679486L924604J488809o04299J23834M83863j734255l554803j592507
11565h203994K395457L589294M52341l370009l732781r96268J029996N53371j06537
11556h389130J271227L079879K674086P87121p1448j49382j566538l710881l624875
11547i699941q86317J756436K630413K302082R06378j383813j732963K264805
11539c842920O912315N838909k16622l644013j471333N80471j740381m563383
$$ plain form
11599 -3951295 -4256127 -6900891 -9051503 -7502213 -4813277 -5931033 -9954315 -11104747
11591 -11104747 -7685081 -3929628 -2250715 -219547 2761396 2546555 -2259523 -5889882
11583 -5889882 -3535428 955665 1256239 -1491611 -1592874 906218 318872 -4702858 -8418726
11574 -8418726 -6739240 -2814636 -1325827 -1930126 -1806292 -1322429 -3056684 -6611487 -8203994
11565 -8203994 -5808537 -2219243 -1766902 -5136911 -8869692 -9865960 -8835964 -8282593 -8389130
11556 -8389130 -7117903 -4038024 -1363938 -576817 -648265 -797647 -2364185 -6075066 -9699941
11547 -9699941 -10586258 -8829822 -6199409 -3897327 -2990949 -4374762 -6107725 -3842920
11539 -3842920 3069395 8908304 8691682 5047669 3576336 4156807 2416426 -2146957
11531b146957l697273j834467k241826j825774K515987O194264L655533j342467
11523g22980q45845M484830O407597J884440l397216m361835k019039R15426L034301
11514E379679K185481k882621p770939n982116J272379N477046L021219k5780
11506F74348J425521L169232n36819o473496o693394l97994N171164N002979J692954
11497C034495j54386j30641n59678j903467k357560j025781O54897R69236K05401
11488a267484r009P55408J070116q3793j541121j420297M35224K536048L530944
11479D006036K830757L99010k579858l649992j591304J380862J766890r11879
11471A650522l620180l721038j792789p6082O34062J559264L559119N001477L290116
$$ plain form
11531 -2146957 -5844230 -7678697 -9920523 -11746297 -9230310 -3036046 619487 -722980
11523 -722980 -1568825 2916005 9323602 11208042 7810826 3448991 1429952 2345378 5379679
11514 5379679 7565160 4682539 -3088400 -9070516 -7798137 -2321091 700128 674348
11506 674348 2099869 5269101 4732282 -1741214 -8434608 -8832602 -3661438 1341541 3034495
11497 3034495 2880109 2749468 2189790 286323 -2071237 -3097018 -2442121 -1472885 -1267484
11488 -1267484 -1276493 -521085 549031 465238 -1075883 -2496180 -2060956 475092 4006036
11479 4006036 6836793 7235803 4655945 1005953 -585351 795511 2562401 1650522
11471 1650522 -1969658 -5690696 -7483485 -7559567 -6925505 -5366241 -1807122 3194355 6484471
11462F484471r39594l127345o96508K131860k07649n130133m148055L862060Q835225
11453G064332L515613n159708n781486J001830M469732L12818m304877l096671
11445a978417M86600J81779l539318n282082k586578J674229L145788M27854l233951
11436a0704096k759819K465561O463197M032089j489344k585479J574473M586912
11428A583494K864525l93015k190812l808550n660556m667097j24212L432421
11420h963802K873806J011491J023773J447448N88018P27720L178903L859593
11412E746950o10806o089895o016897p19109L870082M689345L430110J647215
11404E946995n89094j954184p32311J623084J737478q68949l323317l419753j505084
$$ plain form
11462 6484471 5544877 2417532 1721024 3852884 3645235 -1484898 -5632953 -1770893 7064332
11453 7064332 10579945 5420237 -361249 640581 5110313 5423131 1118254 -1978417
11445 -1978417 -1491817 -1310038 -4849356 -10131438 -12718016 -11043787 -7897999 -7470145 -10704096
11436 -10704096 -13463915 -10998354 -4535157 -503068 -1992412 -4577891 -3003418 1583494
11428 1583494 4448019 4055004 1864192 -1944358 -7604914 -12272011 -12396223 -8963802
11420 -8963802 -6089996 -5078505 -4054732 -2607284 -2019266 -1291546 1887357 5746950
11412 5746950 5136144 -953751 -6970648 -7689757 -3819675 869670 4299780 5946995
11404 5946995 5357901 3403717 2671406 4294490 6031968 5163019 1839702 -1580051 -3085135
11395c085135Q34734J660950l36243l420339l377857Q43412M505479L288004n16628
11386C96377j866968m08511N65955L68495Q89323J805072J255194M58057K126739
11377E589733M510712K634988l791881q773521p646072k180655K986852N156485
11369a513359L829941K5718l298598l220496k97659K362745L309845L042758J029583
11360E270478l199820o420745m421620J086893L574881Q36114k359384k246319
11352g879522p87224l7267J837904M974311M399370k061576p486679m565597K755544
11343h850736M296159j155661m201299N28459O286430M714624j861882m597622
11335d841528j079531K521791J646733n34773O67187L723024L382680j154301
$$ plain form
11395 -3085135 -2250401 -589451 -925694 -4346033 -7723890 -6880478 -2374999 913005 396377
11386 396377 -1470591 -1879102 -1313147 -944652 -55329 1749743 3004937 3462994 5589733
11377 5589733 10100445 12735433 8943552 170031 -7476041 -9656696 -6669844 -1513359
11369 -1513359 2316582 2342300 -956298 -4176794 -4474453 -2111708 1198137 4240895 5270478
11360 5270478 2070658 -4350087 -8771707 -7684814 -4109933 -3273819 -5633203 -7879522
11352 -7879522 -8666746 -8704013 -6866109 -1891798 2507572 445996 -7040683 -11606280 -8850736
11343 -8850736 -4554577 -5710238 -9911537 -9383078 -3096648 1617976 -243906 -4841528
11335 -4841528 -5921059 -3399268 -1752535 -2287308 -1620121 2102903 5485583 4331282
11327D331282m917258m077050m92690J914072K257877J966237J315233k95715
11319B001988j819054j465748R0742K66059j334113j936886L47906L513104M018022
11310C682020J129380k117801k072755J481094M351305K064925m328172q349983
11302d159987n699788J93672K951130J682753O69401J786128K359318R45461n8191
11293F69897O21575M28221j935598l012193M6349L992261L727737k00012k762312
11284A575925j764620K90316J042639Q34495K33834j276880l222207l668250j965095
11275g919843K15608J439566K112745K702897K337359M17340j781781k426354
11267b902463j300562K16698Q72824O89927O48013J338618J858032P27203j577810
$$ plain form
11327 4331282 -585976 -4663026 -5155716 -3241644 -983767 982470 2297703 2001988
11319 2001988 182934 -1282814 -1192072 -926013 -2260126 -4197012 -3849106 -336002 3682020
11310 3682020 4811400 2693599 620844 2101938 6453243 8518168 4189996 -4159987
11302 -4159987 -9859775 -9666103 -6714973 -5032220 -4362819 -2576691 -217373 728088 669897
11293 669897 1291472 1719693 -215905 -3228098 -3181749 810512 4538249 4338237 1575925
11284 1575925 -188695 101621 1144260 1978755 2212589 935709 -2286498 -5954748 -7919843
11275 -7919843 -7704235 -6264669 -4151924 -1449027 888332 1305672 -476109 -2902463
11267 -2902463 -4203025 -3986327 -3113503 -2423576 -1775563 -436945 1421087 2148290 570480
11258E70480k338087l12994J637977K61329k599788j879552K897110N785101K553552
11249F575128k950204m093995n82820K094328J055016r89476j262045o58088n90158
11240a402314l77421J09511q41643k727206j479144L988632P563140L529009m188382
11231D174182o619893k385355J132731m54796k877900j553092J240851J627709
11223e715563J001559K413941M130815K446489j547815l329379j701250L47580
11215a953623N56206o71314k217919k812026j020752K246263L260370P11835j401588
11206c302548J0241J619867l97883k792488o19067L045122J505606l339802l231394
11197g502346K170614M137826o1405k257314K065827N264207N99481n695146m484956
$$ plain form
11258 570480 -1767607 -2080601 -442624 -181295 -2781083 -4660635 -1763525 4021576 6575128
11249 6575128 3624924 -469071 -1051891 1042437 2097453 1107977 -154068 -812156 -1402314
11240 -1402314 -1779735 -1670224 -2511867 -5239073 -6718217 -2729585 4833555 8362564 4174182
11231 4174182 -2445711 -4831066 -3698335 -4153131 -7031031 -8584123 -7343272 -5715563
11223 -5715563 -4714004 -2300063 1830752 4277241 2729426 -599953 -2301203 -1953623
11215 -1953623 -1397417 -2068731 -4286650 -7098676 -8119428 -5873165 -2612795 -1900960 -3302548
11206 -3302548 -3292307 -1672440 -2070323 -4862811 -5481878 -2436756 -931150 -4270952 -7502346
11197 -7502346 -5331732 -1193906 -1255311 -3512625 -1446798 3817409 4416890 -1278256 -5763212
11188e763212J447285K846709p60863j903043J392369L318531J048197j362480
11180B63493r04085J08811n90708j650243j646722j331114j000758K33639J768453
11171d749234J808398N40846m48594j232268k217206j331134K573269N231794
11163A75871K045442l604825m317296m12266O04353k941710l775340J472694N682680
11154e070397K889809j777569j014425K521575J641736k431100k108691L485431
11146a863631O670277K989255k826095m578736k271573M42787J846315K296675
11138B705274J784929K5848k307180l795999l190194m24782K317112J960093j266514
11129b191413k976657o24342K146038J124752j103635O96979M557200L247856
$$ plain form
11188 -5763212 -4315927 -1469218 -2230081 -4133124 -2740755 577776 1625973 263493
11180 263493 -640592 -531781 -1122489 -2772732 -4419454 -5750568 -6751326 -6517687 -4749234
11171 -4749234 -2940836 -2399990 -2848584 -4080852 -6298058 -7629192 -5055923 175871
11163 175871 2221313 -1383512 -5700808 -6113074 -5508721 -8450431 -12225771 -10753077 -5070397
11154 -5070397 -2180588 -3958157 -4972582 -2451007 -809271 -3240371 -5349062 -1863631
11146 -1863631 4806646 7795901 4969806 391070 -1880503 -1437716 408599 2705274
11138 2705274 4490203 4516051 2208871 -1587128 -4777322 -5202104 -2884992 -924899 -2191413
11129 -2191413 -5168070 -5792412 -3646374 -2521622 -3625257 -2928278 1628922 4876778
11121D876778l360749o265870r12464M975609K765868m126517n988608j404505
11113i440458K150736O80167j542785l46883K144497K177610J65590j111329p70969
11104e893824J44640N91423j16879j811003k502532l52336K839035L101739N3750
11095c945987k167885r66674J274217J605072P75665O12739M49741p42583j441119
11086d546814j77341J202669L99167j100383l39617J952094K356775J92742j648695
11077a709403j101560Q61716K298092K043006j96026l098488l818149j323412
11069f044224J325999Q31176j349364j137145J968842M461094M026968J567659
11061E651005j441546l800566l385004N60559M198957K925426j457428k586131
$$ plain form
11121 4876778 1516029 -4749841 -5662305 -686696 2079172 -2047345 -8035953 -9440458
11113 -9440458 -7289722 -6609555 -8152340 -8499223 -6354726 -4177116 -4011526 -5122855 -5893824
11104 -5893824 -5749184 -5157761 -5274640 -7085643 -9588175 -9940511 -7101476 -3999737 -3945987
11095 -3945987 -6113872 -7080546 -5806329 -4201257 -3425592 -2812853 -2363112 -3105695 -4546814
11086 -4546814 -4724155 -3521486 -3122319 -4222702 -4562319 -2610225 -253450 -60708 -1709403
11077 -1709403 -2810963 -1949247 348845 2391851 2195825 -902663 -4720812 -6044224
11069 -6044224 -4718225 -3887049 -5236413 -6373558 -4404716 56378 4083346 5651005
11061 5651005 4209459 408893 -2976111 -2415552 1783405 4708831 3251403 665272
11053F65272P87935K767362k66373m114356l812637r51422K28305k05230M62117
11044d439027K044067K253023R88767k42617j409608k770227k539869L41113K835778
11035b938600J415101k194152l133468m87982K101194K528446K311808K127747
11027A730094K4877m006711n729032k123614L271093M123280l02708l857885j418049
11018h288655M440607O700241K621866l386272n743321l875810j126446J11030
11010h546760j21362r39993j000541J287572N005417N746987J099186m311168
11002a780662l956616J164652L765770J084037j757567o95898J357283N92024
10994b26977j422346j566455n30616k2243J248592M221340N697137K667543k396438
$$ plain form
11053 665272 1453207 4220569 3954196 -160160 -3972797 -4924219 -4695914 -4901144 -4439027
11044 -4439027 -2394960 -141937 846830 604213 -805395 -3575622 -6115491 -5774378 -2938600
11035 -2938600 -1523499 -3717651 -6851119 -7339101 -5237907 -2709461 -397653 1730094
11027 1730094 1754971 -2251740 -7980772 -10104386 -6833293 -2710013 -3012721 -6870606 -8288655
11018 -8288655 -3848048 2852193 5474059 2087787 -3655534 -7531344 -8657790 -8546760
11010 -8546760 -8668122 -9608115 -10608656 -9321084 -4315667 1431320 2530506 -1780662
11002 -1780662 -5737278 -4572626 -806856 277181 -1480386 -2176284 -819001 -226977
10994 -226977 -1649323 -3215778 -3746394 -3768637 -2520045 1701295 7398432 10065975 7669537
10985G669537n014935m850591m187643k983836J0105L361140M515734L554266
10977B073777J950893j63171k366415k572301n69186N74401j46541M19285K615425
10968A816167J173282n040785p510707m90298P599604N741380k004228l033760
10960a749345K988266M323840k369416o983684l965234n68989j930635j916207
10952a2171404L496422O549327J390855l618740P66138P850713N093362m942239
10944D414434q313311j724792L738041J540406j363780J578236N421932L087424
10936H378590k767499m908584l051147k590585m788561n295361j757949K777051
10928a4004045M668775L780551J862363M8240q60190j30102J482093J848937K79904
$$ plain form
10985 7669537 2654602 -2195989 -6383632 -9367468 -9357363 -5996223 -1480489 2073777
10977 2073777 4024670 3861499 1495084 -1077217 -1646403 -1072002 -1218543 -799258 1816167
10968 1816167 2989449 -2051336 -9562043 -10052341 -2452737 3288643 1284415 -1749345
10960 -1749345 1238921 5562761 3193345 -3790339 -7755573 -8324562 -10255197 -12171404
10952 -12171404 -8674982 -2125655 -734800 -4353540 -3587402 4263311 9356673 4414434
10944 4414434 -3898877 -5623669 -1885628 -345222 -1709002 -130766 5291166 8378590
10936 8378590 5611091 702507 -2348640 -4939225 -9727786 -15023147 -16781096 -14004045
10928 -14004045 -9335270 -5554719 -3692356 -3644116 -4504306 -4634408 -3152315 -1303378 -1023474
10919a023474j295457j129154m8085M29743P03250J661992K037249O2241k868230
10910a469925l405115j193608O02405K22132o28995n68584p04662j372803m83021
10901i002176K414223L949400J919180o95654k05440K032870K052718q85390m467516
10892b887785o866746o560113j744782N627532Q544368L324740l418528k733594
10884f714908L775466O376662J655150l410820k664093J439343L533967K597536
10876F588303O79598p60723q00260P10633J383950j228667m668346l816969J108576
10867h03905M127042K315655m50789l86209R98891R13435l69951j579238k569860
10858B195071k604003q25527M49550j990228n723636m563547J492683N005225
$$ plain form
10919 -1023474 -2318931 -3448085 -3496170 -3066427 -2363177 -701185 1336064 1398305 -1469925
10910 -1469925 -4875040 -6068648 -5466243 -5244111 -5873106 -6441690 -7146352 -8519155 -9002176
10901 -9002176 -6587953 -2638553 -719373 -1415027 -1620467 412403 2465121 1579731 -2887785
10892 -2887785 -9754531 -16314644 -18059426 -12431894 -3887526 -562786 -3981314 -6714908
10884 -6714908 -2939442 3437220 5092370 1681550 -982543 456800 3990767 6588303
10876 6588303 7267901 6507178 5706918 6417551 7801501 6572834 1904488 -1912481 -803905
10867 -803905 3323137 5638792 5188003 4801794 5800685 6714120 6344169 4764931 2195071
10858 2195071 -408932 -1234459 -784909 -2775137 -8498773 -13062320 -11569637 -6564412
10850f564412K318110j044599J51542K925841K465491L31260O70081K962299L922481
10841H138094K883353Q02397k369991n417966n038848j054354J852149J075802
10833H70636j61989N28938K89049k352233k961505Q94461L560472J19943m361473
10824c573701k468286L266867M403153j95150l834155k884563j93410J516261
10816c962984K590700L147558K580787J714621J009922j245771m637646m391263
10808c194076R53839M338331J1585o060579m728361J280614J652191m365704o950353
10799a7062513j884400L936317N012764M252130M427266L042825j10536K7331
10791A641184M146196M948067r38195n901189l246909J565755J55477m533556
$$ plain form
10850 -6564412 -4246302 -5290901 -5139359 -2213518 251973 583233 1253314 4215613 8138094
10841 8138094 11021447 11823844 9453853 4035887 -1002961 -2057315 -205166 870636
10833 870636 708647 1237585 1526634 -825599 -3787104 -2892643 667829 787772 -3573701
10824 -3573701 -6041987 -2775120 1628033 1432883 -2401272 -5285835 -5479245 -3962984
10816 -3962984 -1372284 1775274 4356061 6070682 7080604 5834833 1197187 -3194076
10808 -3194076 -2240237 2098094 2109679 -3950900 -8679261 -7398647 -5746456 -10112160 -17062513
10799 -17062513 -18946913 -15010596 -9997832 -5745702 -1318436 1724389 1613853 1641184
10791 1641184 5787380 10735447 9797252 3896063 649154 2214909 2370386 -2163170
10783b163170l288519L654050O542584J401669m140418k605135L153538N362143
10775G916742J969544k515182m179863l483505k454701j532273l04146N78099
10767d005285J49236p23391K2384K319249L231443R31826k322194l280013k240428
10758e917173j660581j431866N45711L217002K453490k102601m675098j129088
10750a0700204M281310M535064K64432j131476K983811N949023J880256m835282
10742C226934n767362j194770P26907k683372m348521M64301N582174L621197
10734c72512j929725k683095P24632O85049l166070k951107K996751N912066J063878
10725B79867l728155p28848M967449L855315k799884n629020j796828K113214
$$ plain form
10783 -2163170 -5451689 -1797639 4744945 6146614 2006196 -598939 2554599 7916742
10775 7916742 9886286 7371104 3191241 -292264 -2746965 -4279238 -4583384 -4005285
10767 -4005285 -3856049 -4579440 -4557056 -2237807 993636 1925462 -396732 -3676745 -5917173
10758 -5917173 -7577754 -9009620 -8463909 -5246907 -2793417 -4896018 -9571116 -10700204
10750 -10700204 -6418894 -1883830 -1619398 -2750874 232937 6181960 8062216 3226934
10742 3226934 -2540428 -3735198 -3008291 -5691663 -10040184 -9575883 -3993709 -372512
10734 -372512 -2302237 -4985332 -4260700 -3575651 -6741721 -9692828 -6696077 -784011 279867
10725 279867 -3448288 -4177136 790313 4645628 1845744 -3783276 -5580104 -3466890
10717c466890J079913k194429k964679n91175K361684L467266J993798n89672
10709i04184j740476r49610n09545j889986l453471l203186j267551J524875M309275
10700h083859M583809M71241m231627k973708L590743P097214L751526k71410
10692C933929K90338J614294p47160l269931j710055L26474j568096l578082p43014
10683e451303L020051J709699j541328m54912K337978M59231l540399k705156
10675f166139Q98395M5112l359659j544315L462395K096844m917427o117357J326297
10666a4275854O498978K886001k141076j312691J549895Q44886j417628j938826
10658i306315k129509k007348K134500Q216607O999806k810920q647664k077264
$$ plain form
10717 -3466890 -2386977 -4581406 -7546085 -8137260 -5775576 -2308310 -314512 -904184
10709 -904184 -2644660 -3594270 -4103815 -5993801 -9447272 -12650458 -13918009 -12393134 -8083859
10700 -8083859 -3500050 -3028809 -7260436 -10234144 -6643401 453813 4205339 3933929
10692 3933929 4224267 5838561 5091401 1821470 111415 437889 -1130207 -4708289 -5451303
10683 -5451303 -2431252 -721553 -2262881 -2717793 -379815 79416 -3460983 -6166139
10675 -6166139 -5267744 -5222632 -8582291 -10126606 -6664211 -4567367 -9484794 -15602151 -14275854
10666 -14275854 -7776876 -4890875 -7031951 -8344642 -6794747 -5949861 -7367489 -9306315
10658 -9306315 -11435824 -13443172 -11308672 -3092065 3907741 1096821 -7550843 -9628107
10650i628107O995163M863472n106352q463710j590955N125621M469993R82711
10642b352164Q63146K692106J873245j670098m128092l195849j94802J961157
10634d151351J679303J2748p83183n5701P04708K48127q10712j126482k77688
10625d560231Q67802P37568j288942l124857j727813K161405L863594J439512
10617a631962j080077l10672Q69493j050877l315632j859284N85412j205236n257967
10608a4256802n107174n14174K676720K420135K098092K797546K072368L84396
10600g428893R14981K763685J897471j082079j657727L11494P23626p19289n91812
10591d868543O79418k65754j934962j39909K836861J142952l077021j936652M057944
$$ plain form
10650 -9628107 -2632944 2230528 -2875824 -11339534 -12930489 -7804868 -3334875 -2352164
10642 -2352164 -1489018 1203088 3076333 1406235 -2721857 -5917706 -6112508 -4151351
10634 -4151351 -2472048 -2459300 -3242483 -3298184 -2593476 -2345349 -3156061 -4282543 -4560231
10625 -4560231 -3692429 -2954861 -4243803 -7368660 -9096473 -6935068 -3071474 -1631962
10617 -1631962 -2712039 -3022711 -2153218 -3204095 -6519727 -8379011 -7793599 -8998835 -14256802
10608 -14256802 -19363976 -19878150 -17201430 -14781295 -12683203 -9885657 -7813289 -7428893
10600 -7428893 -6513912 -3750227 -1852756 -2934835 -4592562 -4281068 -3557442 -4276731 -4868543
10591 -4868543 -4189125 -4454879 -6389841 -6529750 -3692889 -2549937 -5626958 -7563610 -3505666
10582c505666N777925Q32502k770590r60278L40039k546157m202742q12945K513002
10573e334910J108695j222791L91714L593880L449529j10139l664477m680817
10565f469316k419283J240611J954702j167111k090254L055406P371243K949537
10557D425535n044118n768439m20783J060158k041248j891375J207217m84127
10549h957180n357106l900282K552535K710286l583903m160894K989861N808769
10541a1897914O96424j300777L697484M803652k387180o887365k816777M67814
10533a5624639k523339l094468L437950P451929K695563k839302k672503j742113
10525a4910922k909729r08995L578595K073460l985483l392536K878380K205665
$$ plain form
10582 -3505666 2272259 3104761 334171 -626107 -286068 -2832225 -7034967 -7847912 -5334910
10573 -5334910 -4226215 -5449006 -5057292 -1463412 1986117 1875978 -1788499 -6469316
10565 -6469316 -8888599 -7647988 -5693286 -6860397 -8950651 -5895245 1475998 4425535
10557 4425535 -618583 -6387022 -6807805 -5747647 -7788895 -9680270 -8473053 -8957180
10549 -8957180 -14314286 -18214568 -15662033 -12951747 -16535650 -20696544 -17706683 -11897914
10541 -11897914 -11201490 -12502267 -8804783 -4001131 -6388311 -13275676 -16092453 -15624639
10533 -15624639 -18147978 -21242446 -17804496 -10352567 -7657004 -10496306 -13168809 -14910922
10525 -14910922 -17820651 -18729646 -15151051 -13077591 -17063074 -20455610 -17577230 -15371565
10517a5371565m062522j526461P399394M651748p733555p155258P280287R882776
10509f635156m344943r019010L641364P056862p892650j3270164J602996P163339
10501b1697362q403642j2809994O636638J2236950j2005413k2066470L663372
10494e4445921J4389488j8672444l5729947Q26655J1728960o6293335j24973793
10487b73170337j8447853J81516745K41759754R3732880o9962230p8198071J619261
10480G8850149J9394114k5557847l5144906J971116J5047332r012407j6723206
10473B8824345L037723P679760r887580j1564090P802676J1458901p473817j4629342
10465A5248576L63468R005642J73844m441470K565840K666185o787403o064286
$$ plain form
10517 -15371565 -19434087 -20960548 -13561154 -8909406 -16642961 -23798219 -16517932 -6635156
10509 -6635156 -10980099 -19999109 -16357745 -9300883 -17193533 -30463697 -28860701 -21697362
10501 -21697362 -30101004 -42910998 -36274360 -24037410 -36042823 -58109293 -54445921
10494 -54445921 -40056433 -58728877 -94458824 -93632169 -81903209 -148196544 -273170337
10487 -273170337 -291618190 -110101445 131658309 225391189 155428959 77230888 78850149
10480 78850149 98244263 72686416 37541510 39512626 54559958 45547551 28824345
10473 28824345 31862068 39541828 29654248 18090158 25892834 37351735 29877918 15248576
10465 15248576 15612044 24617686 24791530 20350060 22915900 25582085 18794682 12730396
10457A2730396N547814N874677p045967j0185827P33366L944946n750827p462992
10449a614414M858663J0675270J512071m940577L74678L166794l347475n193245
10441E491765L337162P516459N17681m153319N03600K569394l664208o026815
10433F091719J225431N952216J534430j614018K141870L180118k422945l972122
10425A2116699K180933M098296l050664p459159l285879j009308n464598n576464
10417g450144L173757P706919P56823n295851o91921N096161K211072k437929
10409C068887m33086K583490j1447k678972k91015R74019k854241l931730J994639
10400a579456N577819Q70888k865771J527206N276721K91980n156835j592374
$$ plain form
10457 12730396 18278210 24152887 17106920 6921093 7654459 11599405 5848578 -1614414
10449 -1614414 3244249 13919519 15431590 10491013 10865691 14032485 10685010 5491765
10441 5491765 8828927 16345386 16863067 12709748 13213348 15782742 12118534 6091719
10433 6091719 7317150 13269366 14803796 13189778 15331648 18511766 16088821 12116699
10425 12116699 14297632 18395928 15345264 7886105 4600226 3590918 -1873680 -7450144
10417 -7450144 -4276387 3430532 4187355 -1108496 -1800417 3295744 5506816 3068887
10409 3068887 2635801 5219291 5207844 2528872 2237857 3211876 357635 -3574095 -1579456
10400 -1579456 3998363 4869251 2003480 3530686 8807407 9099387 3942552 2350178
10392B350178M423845K989540j496830m08746K498008k86073m545975k536241
10384B987706J737028L3613m469131l037373K991535N384200K882769L95027r90815
10375G914559k839885k962118L90319K698778m1076l921773m000872k425514k467413
10366g654995j539751K258880M142645J049152j645818L19545K132893k60153
10358a197602j405458L204341P009313L266889k516011k403877j73518l207610
10350B576467p458019m123388L908650O039008J116099k250076n66395J207025
10342D49371K60963o78267k89536j07128M38725K836119M622527K663680o31068
10333I565386r36973P38656Q01495k55499l61200j021466l170545k610146K724768
$$ plain form
10392 2350178 6774023 9763563 8266733 7857987 10355995 10069922 5523947 2987706
10384 2987706 4724734 4758347 289216 -2748157 243378 5627578 8510347 8905374 7914559
10375 7914559 5074674 2112556 2502875 5201653 5160577 1238804 -2762068 -5187582 -7654995
10366 -7654995 -9194746 -6935866 -2793221 -1744069 -3389887 -3070342 -937449 -1197602
10358 -1197602 -2603060 601281 7610594 10877483 8361472 5957595 5784077 2576467
10350 2576467 -4881552 -9004940 -5096290 942718 2058817 -191259 -757654 449371
10342 449371 710334 32067 -257469 -364597 74128 2910247 7532774 10196454 9565386
10333 9565386 8628413 9367069 10168564 9913065 9551865 8530399 5359854 2749708 5474476
10324E474476O007962J009809o232115n325891K325270N960825K042460k333501
10316H929295k220747r16089j966023l451946k464246N41193L282534L710684
10308E444655J071383j915296n89621M297983N196711j259145p230726m450833
10300E65111L236102O296102L635959R52986p73506m373129o938069k843903M539925
10291D297578N534952q20116n136822k637036N88206q85158l544858k435532P99892
10282d238894K009488R16318m79424j282927o43775K369871N598955M753270m01360
10273H601522m737366m394309j107479J409742J877149J050495L7953j41120K51669
10264B848256o81358l052496l203179R82576N011978L400764j444194k492901
$$ plain form
10324 5474476 11482438 12492247 6260132 934241 3259511 9220336 11262796 8929295
10316 8929295 6708548 5792459 3826436 374490 -2089756 -1548563 1733971 5444655
10308 5444655 6516038 4600742 4011121 8309104 13505815 12246670 5015944 565111
10300 565111 3801213 10097315 13733274 14686260 13912754 9539625 2601556 -242347 4297578
10291 4297578 9832530 9012414 3875592 1238556 1826762 941604 -2603254 -5038786 -4238894
10282 -4238894 -2229406 -1313088 -1792512 -3075439 -3719214 -1349343 4249612 9002882 8601522
10273 8601522 3864156 -530153 -1637632 -227890 1649259 2699754 2737707 2596587 2848256
10264 2848256 2166898 -885598 -4088777 -3106201 1905777 5306541 3862347 1369446
10256A369446O86742J485391k340576m636098r70722L920502L139238k463521
10248A90402n877982l093697K818106N936500L908031J19863o77233J186225Q63443
10239E373658k729776l879273N94783M122779j92439o823581m416678O106724
10231a843803J1255438M661896m022520m665056r22354j442616m867346l437346
10223e283707K894100O011061K253227k987981m118998k034007k07155N06416
10215b967044O79042j71466k095188l097892j392517J984047M356528M301327
10207A596837K404278J84434q21374P6670J710415J692680q28919l637166l836906
10198a459051j413563Q69799J004929k32921r89477n85946N37535J756778K259840
$$ plain form
10256 1369446 2056188 3541579 1201003 -3435095 -4405817 -485315 2653923 190402
10248 190402 -5687580 -8781277 -5963171 -26671 3881360 4001223 3323990 4510215 5373658
10239 5373658 2643882 -1235391 -640608 3482171 3289732 -3533849 -7950527 -1843803
10231 -1843803 9411635 14073531 10051011 5385955 4463601 3020985 -1846361 -5283707
10223 -5283707 -2389607 3621454 5874681 2886700 -1232298 -3266305 -3473460 -2967044
10215 -2967044 -2288002 -2459468 -4554656 -7652548 -9045065 -7061018 -2704490 1596837
10207 1596837 4001115 4185549 3364175 3440845 5151260 6843940 6015021 2377855 -1459051
10198 -1459051 -2872614 -2002815 -997886 -1230807 -2220284 -2806230 -2268695 -511917 1747923
10189A747923J312500n57338j815236k050772k146690j614749J371475N458598
10181A705711N239843j274812p355888n221868K607182N973086J035557n085419
10173b376608n155412q68543K084018K424861K351143K144307N70677j399260
10165b24817j367428P37478K241034O64049l757259p428028n813765R38782N931071
10156h078883L389702k425596k417649L489411N923314J191301k780325j90900
10148a899625K715749q26220n192623j475900O396656O724850j375145o477258
10140a409516k286831M312927N158133J531548r78676j183083j200128j546227
10132B398147j513114j331179j071828M4781J473597J313556j37067M292K342936
$$ plain form
10189 1747923 3060423 2503085 687849 -1362923 -3509613 -5124362 -3752887 1705711
10181 1705711 6945554 5670742 -1685146 -6907014 -4299832 1673254 2708811 -2376608
10173 -2376608 -7532020 -8400563 -6316545 -3891684 -1540541 603766 1174443 -224817
10165 -224817 -1592245 -854767 1386267 2050316 -1706943 -9134971 -14948736 -14009954 -8078883
10156 -8078883 -4689181 -7114777 -9532426 -6043015 -119701 1071600 -1708725 -1899625
10148 -1899625 816124 -10096 -5202719 -6678619 -281963 6442887 5067742 -1409516
10140 -1409516 -3696347 616580 5774713 7306261 6327585 5144502 3944374 2398147
10132 2398147 885033 -446146 -1517974 -1473193 404 1313960 1176893 1181185 3524121
10123C524121L204985q3192m432799m462071L85546M866184M345875L95128j467355
10114F276422P56606K653609k28123n226870n771155j014804K934991K241479
10106B622155l4238p32557j639516l763589l004809K487036O263416K456905l695162
10097I59641k971485L140571M640405j061635n567154l235390R90699R81265j362142
10088c485225j186159J004751J555575L01386n6869R50486J207945k38547j987628
10079a934285k458549j598302o40066p38551j531827j493949l90219j4869j072466
10070a1873083j287266J001583L400548K812612M66584o4089J578303K818289
10062a146519K689380K068106O49803j991286l521557j683493J013015M05541
$$ plain form
10123 3524121 6729106 6645914 2213115 -2248956 -1863410 3002774 7348649 7743777 6276422
10114 6276422 7033028 9686637 9458514 4231644 -1539511 -2554315 380676 2622155
10106 2622155 2587917 1855360 215844 -3547745 -6552554 -4065518 2197898 4654803 959641
10097 959641 -2011844 1128727 5769132 4707497 -859657 -4095047 -3104348 -2123083 -3485225
10088 -3485225 -4671384 -3666633 -2111058 -1809672 -1866541 -916055 291890 53343 -1934285
10079 -1934285 -4392834 -5991136 -6631202 -7369753 -8901580 -10395529 -10785748 -10800617 -11873083
10070 -11873083 -13160349 -12158766 -8758218 -5945606 -5479022 -5543111 -3964808 -1146519
10062 -1146519 1542861 3610967 4260770 2269484 -1252073 -2935566 -1922551 -1517010
10054a517010k309257k044465J937828M711849L059809p78381l297090l268872
10046c505589r27357K132604K576359p56054l521408j369420K838801L298433
10038G66369Q37228O80370K196381J83368l891721k682965L302136M212472k882465
10029B721173p657985k860530L717309K251039l359474l328486J525218K931274
10021d060462K01891m5406L021747L462870M38513q8460L108534L740307m42924
10012I336610l103248o39471R36772l372362p585216l471123N670339Q823196
10004F595497K860455m042517m851577j935120o21118r54024j33280J197371L76589
9995a507724j586364r26019K468348M123627J561270k008825k585846r28138m39036
$$ plain form
10054 -1517010 -3826267 -5870732 -3932904 778945 3838754 3060373 -236717 -3505589
10046 -3505589 -4432946 -2300342 276017 -480037 -4001445 -5370865 -2532064 766369
10038 766369 1603597 2283967 4480348 4663716 771995 -1910970 1391166 5603638 2721173
10029 2721173 -4936812 -7797342 -4080033 -1828994 -5188468 -8516954 -6991736 -4060462
10021 -4060462 -3858571 -3903977 -882230 2580640 3019153 2930693 6039227 9779534 9336610
10012 9336610 6233362 5593891 6530663 3158301 -4426915 -7898038 -2227699 6595497
10004 6595497 9455952 5413435 561858 -1373262 -1994380 -2948404 -3081684 -1884313 -1507724
9995 -1507724 -3094088 -4020107 -1551759 2571868 4133138 2124313 -461533 -1389671 -1828707
9986a828707j619231j965399n32730P47188O06818M20244J433593K189034O97071
9977A47881j860711j950724J375718M365194L130191p50075j947332J056019L445483
9968G011644J025113l466995m467802j675458M75624R2123m85541R9648N08824
9959h82820M83530J152750J171955j801576n190836l538667K302093N173137K734167
9950A603733O53133J871001J624417k391860m340873r56557J458912j460056l082032
9941e020182K131176O758963K604266l669996j332293M931966K762965n430309
9933C736556o093251J263679K958997m173375o686752J604551Q292321L487133
9925D389859m236643l807250N81733P091k614697O4282M755856L441203j917327
$$ plain form
9986 -1828707 -3447938 -5413337 -5946067 -5198879 -4592061 -4171817 -2738224 -549190 147881
9977 147881 -1712830 -3663554 -2287836 2077358 5207549 4457474 2510142 3566161 7011644
9968 7011644 8036757 4569762 101960 -1573498 -1097874 -1005751 -1491292 -1391644 -882820
9959 -882820 -399290 753460 1925415 123839 -5066997 -8605664 -6303571 -1130434 1603733
9950 1603733 2256866 4127867 5752284 3360424 -980449 -1937006 -478094 -1938150 -5020182
9941 -5020182 -2889006 3869957 6474223 2804227 1471934 6403900 9166865 3736556
9933 3736556 -2356695 -1093016 1865981 -2307394 -8994146 -7389595 902726 4389859
9925 4389859 153216 -3654034 -3072301 -3065210 -5679907 -5615625 -859769 2581434 664107
9916F64107l251498m23840L07067j600881j332783J270760K050932J020536J493983
9907A98383K559624R71885j334973j60222K312707N57409l923972m349779k80676
9898c449614J715466m38607j349663J412787K649253j110372m970196l226562
9890h767508J816704L745049J284224j238469r04653O33154Q15869k15885p19958
9881c551473k99736r7479l95394O6686J469375J680462o4794k57524M130995R171011
9871A1852129P650233m10547o801586o354648l070822k177251k305177j62434
9863a780103K425732J999784N3930R0752R56577q24200m013808m023006n72368
9854e686710J481222o35365l778634l221409J703197O856153P170024J889209
$$ plain form
9916 664107 -2587391 -3011231 -2704164 -4305045 -5637828 -4367068 -2316136 -1295600 198383
9907 198383 2758007 3729892 2394919 2234697 4547404 5104813 1180841 -3168938 -3449614
9898 -3449614 -1734148 -2172755 -3522418 -2109631 539622 -570750 -5540946 -8767508
9890 -8767508 -6950804 -3205755 -1921531 -3160000 -4064653 -3431499 -2615630 -2831515 -3551473
9881 -3551473 -3851209 -3948688 -4344082 -4277396 -2808021 -1127559 -1192353 -1449877 2681118 11852129
9871 11852129 19502362 19091815 12290229 5935581 2864759 687508 -1617669 -1780103
9863 -1780103 645629 2645413 2699343 2790095 3746672 2922472 -1091336 -5114342 -5686710
9854 -5686710 -4205488 -4840853 -8619487 -11840896 -10137699 -3281546 3888478 5777687
9846E777687l831789m505115j304349L7602j742401j929216J409959L680112J822596
9837e84914l82376N80409J748687j59194k256986j253452j56972k275562l616339
9828h356699P34260O706106O359408K41030l859795k866584r91764j196581j749629
9819d980248j321366q85684l58643J150492K197311J116943n4920J120062K353447
9810C37394N08223j825143j87955L449372L291101j008622m633444n551982n161892
9801a0782948k902119K123204N867406L862694l96228r5427L276325K376326k738743
9792E90490m254823j67297K389394m01669l208215j490474J617697K163440J364132
9783a397325J143027O03558q6394J015197K279891l43656n014661m911038M20841
$$ plain form
9846 5777687 1945898 -2559217 -3863566 -3825964 -5568365 -7497581 -6087622 -2407510 -584914
9837 -584914 -967290 -386881 1361806 1202612 -1054374 -2307826 -2464798 -4740360 -8356699
9828 -8356699 -7622439 -916333 5443075 5684105 1824310 -1042274 -2034038 -3230619 -4980248
9819 -4980248 -6301614 -7187298 -7545941 -6395449 -4198138 -3081195 -3136115 -2016053 337394
9810 337394 845617 -979526 -1167481 2281891 5572992 4564370 -69074 -5621056 -10782948
9801 -10782948 -13685067 -11561863 -5694457 -1831763 -2227991 -2323418 952907 3329233 590490
9792 590490 -3664333 -3831630 -1442236 -1843905 -5052120 -6542594 -4924897 -2761457 -1397325
9783 -1397325 -254298 349260 262866 1278063 3557954 3214298 -1800363 -6711401 -6290560
9774f290560L443607J114005m84722K166377L512922n11840m674569l727828j247430
9765f700038k105048l544041j312914J779891J182476r78253k19534K279147K837957
9756f780357J966967J576394K44928k537882k588680J940644N163078K265649
9748A250741j742527j34293L887784K811922k149360l590234o74605O78686j077954
9739g39840j543775L35904M83242k047257l027620n25376K355005L190121K752131
9730A232535J434335j122687k946606j935991l97848j340554j732789L014932
9722c794673Q939883P027563k441036q474244m911180J476762K443202k91640
9714b5363o35302J392402J458065q94169k161331r50356P54997J287819Q47436
$$ plain form
9774 -6290560 -2846953 -1732948 -2217670 -51293 3461629 2949789 -1724780 -5452608 -6700038
9765 -6700038 -8805086 -12349127 -13662041 -11882150 -10699674 -11677927 -11897461 -9618314 -6780357
9756 -6780357 -4813390 -3236996 -2992068 -5529950 -8118630 -6177986 -1014908 1250741
9748 1250741 -491786 -626079 3261705 6073627 3924267 334033 -340572 338114 -739840
9739 -739840 -2283615 -1947711 -1464469 -3511726 -6539346 -7064722 -4709717 -1519596 1232535
9730 1232535 2666870 1544183 -1402423 -3338414 -3736262 -5076816 -6809605 -3794673
9722 -3794673 5145210 12172773 9731737 1257493 -3653687 -2176925 266277 -25363
9714 -25363 -660665 731737 2189802 1295633 -865698 -1816054 -1061057 226762 1074198
9705A074198K71111M05947J499666K095137N31023j822983j813047K68705N09856
9696C019613k244370m119589k453148o377m0265j164160n65774J102804J825149
9687d646117K171419L246252L373012R10458j881981j886834n0243P50683O44067
9678B630716J124620O29907k785828n751821k926233L835334O184274R21975n022459
9669a159515m332207J075869M293614L232307J106179l09360k186453l986522
9661b266088k671655K097760N912952M843832K29130l584861m309071k679366
9653b427367j27402K112535K461380J43813k862050l038253N54635M576220M982199
9644F375710J760890j161637r36692N40406o89053m692893o554981k618460L832048
$$ plain form
9705 1074198 1345309 1751256 3250922 5346059 5877082 4054099 2241052 2509757 3019613
9696 3019613 775243 -3344346 -5797494 -5803871 -5844136 -7008296 -7574070 -6471266 -4646117
9687 -4646117 -2474698 771554 4144566 5055024 3173043 1286209 1235966 1986649 2630716
9678 2630716 3755336 4385243 1599415 -4152406 -7078639 -3243305 2940969 3862944 -1159515
9669 -1159515 -5491722 -4415853 -122239 3110068 4216247 3906887 1720434 -2266088
9661 -2266088 -4937743 -2839983 3072969 7916801 8145931 4561070 251999 -2427367
9653 -2427367 -2554769 -442234 2019146 2162959 -699091 -3737344 -3182709 1393511 6375710
9644 6375710 8136600 6974963 6038271 6578677 5889624 1196731 -5358250 -7976710 -4144662
9635d144662N845818J450383m013546n001513k165703K25097M81009N9635k23741
9626g487223q69544j170746M58199L353622M760598L601607J483371l71005k324465
9617A434414l916498l404200q77883J080370J213397J162290J737120R61205j824767
9608b434552l229817o06545L000231K774013o02015j907100R46404M313337M185653
9599F439609O51299l610532o136302n220984p41133M300549N682448K877965j19712
9590D123207j79531J123858P82840q66174j271143j09390M04798o52154j500511
9581A855800o60215P24872P09373o18288j461747r17757j671M055p26262j063070
9571b154910p02319o22881j538422k498219j739855J081067M133989N228326M055723
$$ plain form
9635 -4144662 1701156 3151539 -862007 -5863520 -8029223 -7804126 -7323117 -7263482 -7487223
9626 -7487223 -8356767 -9527513 -9069314 -5715692 -955094 2646513 4129884 3758879 1434414
9617 1434414 -2482084 -5886284 -6764167 -5683797 -4470400 -3308110 -1570990 -609785 -2434552
9608 -2434552 -5664369 -6270914 -3270683 -496670 -1098685 -3005785 -2059381 2253956 6439609
9599 6439609 7090908 3480376 -2655926 -7876910 -8618043 -4317494 1364954 4242919 4123207
9590 4123207 3943676 5067534 5850374 4984200 3713057 3603667 4008465 3356311 1855800
9581 1855800 1195585 1920457 2629830 2011542 549795 -367962 -369633 -365578 -1091840 -2154910
9571 -2154910 -2857229 -3480110 -5018532 -7516751 -9256606 -8175539 -4041550 1186776 5242499
9562E242499K204335J112606O00135l53652j898021l012798k805369j434307L74195
9553B9623J974245K585790J347768j396511l397976k486979O08775K698894J883978
9544C847607k55225j046935k79562M6019r22524j549183l07094J699356K108868
9535C341327M83126j417052k281635k341723j562480Q59981L796535L485387j475379
9526B888087o046449l814974L921740Q569398N095101j691343m182565j564071
9518C174924J173165R40044r58486k400796k477948q53319J423522J459199j719965
9509b39660m235407k069818K547113L967674J417843o06631J23330J122928O57735
9500B685107P4447k60456j737938k994404o21228L855815M231231m62270l200715
$$ plain form
9562 5242499 7446834 8559440 9159575 8805923 6907902 3895104 1089735 -344572 29623
9553 29623 2003868 4589658 5937426 4540915 1142939 -1344040 -735265 1963629 3847607
9544 3847607 3592382 2545447 2265885 2311904 1389380 -159803 -466897 1232459 3341327
9535 3341327 3824453 2407401 125766 -2215957 -3778437 -2918456 878079 4363466 2888087
9526 2888087 -3158362 -6973336 -3051596 5517802 10612903 8921560 4738995 3174924
9518 3174924 4348089 5288133 4329647 1928851 -549097 -1402416 21106 1480305 -239660
9509 -239660 -4475067 -6544885 -3997772 -30098 1387745 781114 904444 2027372 2685107
9500 2685107 2759554 2499098 761160 -2233244 -2854472 1001343 5232574 4770304 1569589
9491A569589n9214L012113P8532m680851l987057P46370K872114J743746J555952
9482B851294J745970j670647o178217m335825L522102P710379L309948k621258
9474D333746k256599J921313K836793j5839j535187J42813J742435N76321k198619
9465E547177l712731k250088J291955L504093J698054k147081l380657j396869
9457h46147m23485k151925k615906N76725L189957J276362j564713n8687L255940
9448F38121J845311l530038n391405j274211K933238K690796N17238l65009j132037
9439c067996k603954j795414K179976M337039J344471k046075l27978L170234
9431A190303J444517m246163n938403j557074K498853K178096J001174K097659
$$ plain form
9491 1569589 1510375 4522488 4601020 -79831 -4066888 -3320518 -448404 1295342 2851294
9482 2851294 4597264 2926617 -3251600 -7587425 -4065323 3645056 6955004 4333746
9474 4333746 2077147 3998460 6835253 6819414 5284227 5427040 7169475 7745796 5547177
9465 5547177 1834446 -415642 876313 4380406 6078460 3931379 550722 -846147
9457 -846147 -1269632 -3421557 -6037463 -5460738 -2270781 -994419 -2559132 -2617819 638121
9448 638121 2483432 -1046606 -6438011 -7712222 -4778984 -2088188 -1570950 -1935959 -3067996
9439 -3067996 -5671950 -7467364 -5287388 -950349 394122 -1651953 -1979931 1190303
9431 1190303 2634820 -1611343 -7549746 -9106820 -6607967 -4429871 -3428697 -1331038
9423a331038K693175M28044j484226k78155Q41826j306826l271239o15253L720907
9414f02785L613135l81127k423001r57881K62121j66281P1289P14314j277076
9405a147292m553309l382292K920831P430495N539421J130967p59054j292190
9397E887577l252002m664880k610317P93188J875403J506028K155406K018130
9389C708533j748033o141774n265475N63921M600408K812611j651286l590645
9381f711740j325025L070079N706089L492980j942492m278407l33907M119698
9373A797275J830977m280371m230775L898734R866109N382642m358444q140276
9365A765871l172382L249397M062307m34291m994957n391889j792514J968682
$$ plain form
9423 -1331038 1362137 1790181 305955 27800 869626 -437200 -3708439 -4323692 -602785
9414 -602785 3010350 2629223 206222 -751659 -489538 -655819 -584530 129784 -1147292
9405 -1147292 -5700601 -9082893 -6162062 1268433 6807854 7938821 7179767 5887577
9397 5887577 2635575 -2029305 -4639622 -3846434 -1971031 -465003 1690403 3708533
9389 3708533 1960500 -4181274 -9446749 -8882828 -4282420 -1469809 -3121095 -6711740
9381 -6711740 -8036765 -4966686 739403 4232383 2289891 -1988516 -2322423 1797275
9373 1797275 3628252 -652119 -4882894 -984160 8881949 14264591 9906147 1765871
9365 1765871 -1406511 1842886 5905193 5470902 475945 -4915944 -6708458 -4739776
9357d739776K493242O00139j29296J434768K607584J367453o07752p72562Q44186
9348C097986K496700K860048J180843k277775m927625l877013l86279J093291
9340g39824l41305n72423K044811K876674j150422m831159k025593L816539M153963
9331C231261j195438l582370P11732M760349K402843k179919j984727J367433
9323C531164J015772l409102n330398k020557J617435J698510J138796L313537
9315A555157N357060K914248j905893l189675l19634J412699o30602k803390j685134
9306G04836N58361Q6443k824604m946392m618777k363712R55417L985800M710388
9297c752240K801197M12277j181956l029662m462582j682085N552477R834115
$$ plain form
9357 -4739776 -2246534 -1646395 -1775691 -340923 2266661 3634114 3026362 2253800 3097986
9348 3097986 5594686 8454734 9635577 7357802 2430177 -1446836 -1833115 -739824
9340 -739824 -1081129 -1653552 391259 3267933 2117511 -2713648 -4739241 -922702 3231261
9331 3231261 2035823 -1546547 -834815 3925534 6328377 4148458 2163731 3531164
9323 3531164 4546936 1137834 -4192564 -6213121 -4595686 -2897176 -1758380 1555157
9315 1555157 6912217 9826465 7920572 4730897 4411263 5823962 5193360 2389970 704836
9306 704836 1263197 1349640 -1474964 -6421356 -11040133 -13403845 -12448428 -8462628 -3752240
9297 -3752240 -951043 -538766 -1720722 -4750384 -9212966 -10895051 -5342574 4491541
9289D491541M862006m304470o947279j525182L048149J382589j536538j07323
9281f36507L191829L559154J895444J256079J82894l913681p962508o556389o48415
9272i632100L158896J862488n96361L5643K578695K951979p774k896191j565029
9263d109754L446061O034012J443196o162128p426072n29450N382841L112536
9255A191242k188093j743845K847620L142968j551201l453385j33972J540860
9247c47806j986225m397016p14734L571913J772033k488576j688133K420962J894371
9238a963211l276003m361591J832202P252646M685788j980600m665114k552179
9230e028062m63821L53060K632951N678262M833978l74701l794554j413906K239193
$$ plain form
9289 4491541 9353547 5049077 -1898202 -3423384 -375235 1007354 -529184 -636507
9281 -636507 2555322 6114476 8009920 9265999 9448893 5535212 -2427296 -8983685 -9632100
9272 -9632100 -6473204 -4610716 -5207077 -5171434 -2592739 359240 351466 -2544725 -4109754
9263 -4109754 -663693 5370319 6813515 651387 -6774685 -7304135 -1921294 1191242
9255 1191242 -996851 -2740696 106924 3249892 1698691 -1754694 -1888666 -347806
9247 -347806 -2334031 -6731047 -7445781 -3873868 -2101835 -4590411 -6278544 -3857582 -1963211
9238 -1963211 -5239214 -9600805 -7768603 -515957 4169831 2189231 -2475883 -5028062
9230 -5028062 -5491883 -5138823 -2505872 3172390 8006368 7631667 3837113 2423207 4662400
9221D662400P84663m331394o180651k674614J321412K248808K183634K983650
9213I97908J930850k724532o466652m351381P29165J894081j023994j509768K622130
9204g902193N518517L079671k81078P80600L608851K279781k301577l933335j205424
9195c56187R00010k26224j020346J346737L896417K847200o25344l178652m309226
9186g25615m641390k362302L558787Q407888N860046k610796p836974m357021
9178d707377K734121N186264K088950j159438j840634k390782l962121l119200
9170g170217K186931P176938N378602j951473o209969k314383M660749O303325
9162H060503J513371l502686m466271l399031l115266k343617O62281L458008
$$ plain form
9221 4662400 5447063 1115669 -5064982 -7739596 -6418184 -4169376 -1985742 997908
9213 997908 2928758 204226 -6262426 -10613807 -9884642 -7990561 -9014555 -10524323 -7902193
9204 -7902193 -2383676 695995 414917 1195517 4804368 7084149 4782572 849237 -356187
9195 -356187 543823 317599 -702747 643990 4540407 7387607 6762263 3583611 -725615
9186 -725615 -5367005 -7729307 -4170520 4237368 10097414 7486618 -350356 -4707377
9178 -4707377 -1973256 3213008 5301958 4142520 2301886 -88896 -4051017 -7170217
9170 -7170217 -4983286 2193652 7572254 5620781 -589188 -2903571 1757178 8060503
9162 8060503 9573874 6071188 1604917 -1794114 -4909380 -7252997 -6590716 -3132708
9154c132708K782338L46852K97972K029930J093942k556918l354543Q27242M276362
9145B610469J901456k874663l750720j170814j71547j214747k21341L008766L635982
9136A752841J74565k468060q09678J827411R89941k217092l603115j740419J745712
9127d347894M794573N168231J304220m312517o042954k423598J064882R1679j842966
9118f546344L01534M080776L350692j421335l838608j653710R29462J184634J121203
9109b491696J679341M71536k456762k903172L77651K471373r4069l558466k987045
9100i491309K05988J517881O47212N02273J460894J579413Q49412P31500P61567
9091a235169k32120q74646N87208K197119R67726j374061m57332L160551L974990
$$ plain form
9154 -3132708 -350370 -3518 294454 2324384 3418326 861408 -2493135 -1665893 2610469
9145 2610469 4511925 1637262 -2113458 -3284272 -3455819 -4670566 -4891907 -1883141 1752841
9136 1752841 1927406 -540654 -1350332 477079 1467020 -750072 -4353187 -6093606 -4347894
9127 -4347894 446679 5614910 6919130 2606613 -3436341 -5859939 -4795057 -4703378 -6546344
9118 -6546344 -6244810 -2164034 1186658 -234677 -4073285 -5726995 -4797533 -3612899 -2491696
9109 -2491696 -812355 -340819 -2797581 -5700753 -5323102 -2851729 -2945798 -6504264 -9491309
9100 -9491309 -9285321 -7767440 -7120228 -6617955 -5157061 -3577648 -2728236 -1996736 -1235169
9091 -1235169 -1467289 -2341935 -1754727 442392 1410118 36057 -421275 2739276 6714266
9082F714266K9389l830224l270510m37585L69417p02747n28968J239762J825048
9073A407848L3545j871656j415870R09688K380902J152030j707202l238066j897369
9064d246150M83955R47304p29032j946702j075852N94093J242710Q93756L65813
9055c470105l33543j109797q07555J043670K528406J363340j751232l557159k175602
9046h269577O63959J773829K05518j686407r47657K251756M293289K503955p71127
9037A7538p09412K996137M575908k53018p428922q759496k307768N172315O858702
9028A61984L382672j83484j712123k798417l641611j650719L704130Q033183O670366
9019A1965981P27742l998915l818450p94449N56251j470607m440409m754116j447640
$$ plain form
9082 6714266 6743655 2913431 -357079 -794664 -425247 -1127994 -1656962 -417200 1407848
9073 1407848 1441393 -430263 -1846133 -936445 1444457 2596487 889285 -2348781 -4246150
9064 -4246150 -3762195 -2814891 -3543923 -5490625 -6566477 -5972384 -4729674 -3835918 -3470105
9055 -3470105 -3803648 -4913445 -5721000 -4677330 -2148924 -785584 -2536816 -6093975 -8269577
9046 -8269577 -7605618 -5831789 -5626271 -7312678 -8260335 -6008579 -1715290 788665 17538
9037 17538 -691874 2304263 6880171 6627153 -801769 -9561265 -11869033 -6696718 161984
9028 161984 3544656 3361172 1649049 -1149368 -4790979 -6441698 -2737568 5295615 11965981
9019 11965981 12693723 8694808 4876358 4081909 4638160 3167553 -1272856 -6026972 -7474612
9010g474612K593971L431342N55025k327788k036916p944M94317k62896M90869
9001d544632K316740J643116j638785k839551l0854K251724O02037r71099K192655
8992a018649O503038N031727j132905m215653j683635J005046J64605j417950
8984C235624j368533j674100k753442r47135L908451N380682L12369m532539k281251
8975g19874L035888L059321j510793k974493K50105J931097p17610l021931j740037
8966b408327K9442k64928J31878L143413M824859J411990l803595m758778j026948
8957b720994K731442L681137K595282J76149l458094n789457l304061K720388
8949c368208N900860K769956j967446j729592K361215K929896k584255p603527
$$ plain form
9010 -7474612 -4880641 -1449299 -894274 -3222062 -5258978 -5266922 -4772605 -5035501 -4544632
9001 -4544632 -2227892 -584776 -2223561 -5063112 -5093966 -2842242 -2240205 -3211304 -1018649
8992 -1018649 5484389 10516116 9383211 5167558 3483923 4488969 4653574 3235624
8984 3235624 1867091 192991 -2560451 -3507586 400865 5781547 6093916 1561377 -719874
8975 -719874 2316014 5375335 3864542 890049 1140154 3071251 2353641 -668290 -2408327
8966 -2408327 -2378885 -2643813 -2511935 631478 5456337 6868327 3064732 -1694046 -2720994
8957 -2720994 10448 3691585 6286867 6463016 3004922 -2784535 -6088596 -3368208
8949 -3368208 2532652 5302608 3335162 1605570 3966785 6896681 4312426 -3291101
8941c291101n811437k99916J607752l93979k72479L221534L902998j255559o143598
8932h735785m559519N68440K611330J393723J603318M228757O071259N714557
8924H896080L919971O2820n603939q276186m329683J026686K1094m737264l120422
8915a2140843N929364J1061149N239771l881858n941271j993067L68615n64036
8907a922176j120192p19497j629414k664648o00787L131730L650470L46534k123597
8898c651577r64690J262442J147782j057014k498324j236877J766920L289443
8890a941895J264103j918167j721188J998096M022578J234625k630165k613335
8882b305348N61345K813381K826696J862487J93815k089998l100425k062378j795876
$$ plain form
8941 -3291101 -9102538 -9402454 -7794702 -8188681 -8461160 -5239626 -1336628 -2592187 -8735785
8932 -8735785 -13295304 -12726864 -10115534 -8721811 -7118493 -2889736 3181523 8896080
8924 8896080 12816051 12878871 7274932 -1001254 -5330937 -4304251 -4283157 -9020421 -12140843
8915 -12140843 -6211479 4849670 10089441 6207583 266312 -1726755 -1358140 -1922176
8907 -1922176 -3042368 -3761865 -5391279 -8055927 -8656714 -5524984 -1874514 -1527980 -3651577
8898 -3651577 -4616267 -3353825 -2206043 -3263057 -5761381 -6998258 -5231338 -1941895
8890 -1941895 -677792 -2595959 -4317147 -2319051 1703527 2938152 307987 -2305348
8882 -2305348 -1744003 1069378 3896074 5758561 5952376 3862378 761953 -1300425 -3096301
8873c096301m147498n675787k660696K218451L651367J939603J524410K903175
8865c343276K459839k41546j376689N20616K456289K151868M62877j607925l496744
8856b014691k857861J845530O506196N052362j403881n206363l150011m79052
8848a707771j716458l755654j689354L408176O528529N221372R61675l148015
8840D102500l957763p00968K586306Q49462m339593n639664n59058M182132K428849
8831a047797k435286l219170M31454K893666J604183n32737q66302j90390j24901
8822c487280r38667k147225k688415r30270L096335O215207N354712J646116j083296
8813E037217j284917q18094j531428k923824l243115j493582J468342L119357
$$ plain form
8873 -3096301 -7243799 -12919586 -15580282 -13361831 -9710464 -7770861 -6246451 -3343276
8865 -3343276 -883437 -1124983 -2501672 -1981056 475233 2627101 3089978 1482053 -2014691
8856 -2014691 -4872552 -3027022 3479174 8531536 7127655 1921292 -1228719 -1707771
8848 -1707771 -3424229 -7179883 -8869237 -5461061 1067468 6288840 7250515 4102500
8840 4102500 144737 -556231 2030075 2879537 -1460056 -7099720 -7658778 -3476646 -1047797
8831 -1047797 -3483083 -6702253 -6270799 -3377133 -1772950 -2305687 -3171989 -3362379 -3487280
8822 -3487280 -4425947 -6573172 -9261587 -10191857 -7095522 -880315 4474397 6120513 5037217
8813 5037217 3752300 2934206 1402778 -1521046 -4764161 -6257743 -4789401 -1670044
8805a670044J546514j719798k737871n9132L248625L695129J334731j747267m230925
8796b340038m833519j828832L584863O061348K209693l791032m771324L02351
8788e406490N761866O948291M274054R2027l805876n206176k706121Q73825P22624
8779A548024k694296l163674J996090O860401N099496p18295l439059k250066
8771C238621k612528n886992o338125p40767N295386M936825k63243l420496k148314
8762g939633R2245Q60214J209891J529692M88645r86819J30051L273742L697995
8753B356023k65834m156816m272890k743570k279187r15101L126393N794701K636544
8744g19737l212290n021388k406984n86056j055238k09854K848481M301990K577544
$$ plain form
8805 -1670044 -123530 -1843328 -4581199 -4640331 -1391706 2303423 3638154 1890887 -2340038
8796 -2340038 -7173557 -9002389 -5417526 643822 2853515 -937517 -5708841 -5406490
8788 -5406490 355376 7303667 11577721 11669748 7863872 2657696 -48425 825400 1548024
8779 1548024 -1146272 -4309946 -2313856 4546545 9646041 8927746 5488687 3238621
8771 3238621 626093 -5260899 -11599024 -12339791 -7044405 -2107580 -2370823 -5791319 -7939633
8762 -7939633 -7847388 -6987174 -5777283 -4247591 -3758946 -4745765 -4615714 -1341972 2356023
8753 2356023 2090189 -2066627 -6339517 -9083087 -11362274 -12277375 -9150982 -3356281 -719737
8744 -719737 -3932027 -8953415 -11360399 -11946455 -13001693 -13211547 -10363066 -6061076 -3483532
8735c483532Q56372Q80963K03366k212163l231148j124185J029023N03799p29583
8726g307088K07709K590397M026432L733718J843209j278670l434659k116980
8718a735932Q69688O54765l081280m621555p19252M450666N808383L814768J014499
8709F454750k597452o411160o409432r31303M705170M854491J555379M62934J865101
8700C548478J724650o06492j891181j035237l9199L51050R53065Q25466j490658
8691B339942l919810k846174R47760K863441J224871p69926l84011J181728J641396
8682B279217R25321L80844M75751J43860k056558n574077o736708k466457M244684
8673h384123O337042K008312k325037j360096J666921J391815o94121m0939J949739
$$ plain form
8735 -3483532 -2627160 -1746197 -1542831 -3754994 -6986142 -8110327 -7081304 -6577505 -7307088
8726 -7307088 -7099379 -4508982 -482550 3251168 5094377 3815707 381048 -1735932
8718 -1735932 -866244 -211479 -3292759 -7914314 -8633566 -4182900 1625483 5440251 6454750
8709 6454750 3857298 -2553862 -8963294 -9894597 -5189427 -334936 1220443 1683377 3548478
8700 3548478 5273128 4666636 2775455 1740218 1701019 2052069 3005134 3830600 2339942
8691 2339942 -1579868 -4426042 -3478282 -614841 610030 -159896 -543907 637821 2279217
8682 2279217 3204538 3585382 4061133 4204993 2148435 -3425642 -10162350 -12628807 -8384123
8673 -8384123 -2047081 -38769 -2363806 -3723902 -2056981 -665166 -1359287 -1400226 549513
8664E49513M24421l392743l260100J616086M722961K132123k175302k885354j29649
8655b398044K388219K153089p42513l844745l600747N91300M212063L057495n32862
8646A283255j410119J70244j1183j805253j012559K095408K394425p65761j774566
8637h36109J345626L116605K49067k436528n98467J976065M26832k188223j42702
8628I12166M691514N410631R19308k885689k405035p50569k048610n871594q571834
8619a0599712p221633j663891N044006Q251511N979292J378860q97832K61J499168
8610A770030K037734K189135J982066M05433k034309l053800j741626J53808Q38770
8601B547241M49821l09552j431267k349085j503788R58652J817957j123171m559955
$$ plain form
8664 549513 973934 -2418809 -5678909 -4062823 660138 2792261 616959 -2268395 -2398044
8655 -2398044 -9825 2143264 1400751 -2443994 -6044741 -5453441 -1241378 1816117 1283255
8646 1283255 -126864 43380 32197 -1773056 -2785615 -690207 1704218 938457 -836109
8637 -836109 509517 3626122 3875189 1438661 840194 2816259 3243091 1054868 912166
8628 912166 5603680 11014311 11933619 9047930 6642895 5892326 3843716 -2027878 -10599712
8619 -10599712 -17821345 -19485236 -14441230 -6189719 -210427 1168433 270601 270862 1770030
8610 1770030 3807764 5996899 7978965 8384398 6350089 3296289 1554663 1708471 2547241
8601 2547241 2997062 2687510 1256243 -1092842 -2596630 -1637978 179979 -943192 -5503147
8592e503147k968658L132085O185200J256768o567966q262931k312210M400843
8584a0640016O185659M050591J461963k29524p46030R2638N37424j621598m338437
8575e247330l052533J304573K316928j271040k304645K854048O973540L399171
8567D972712k436076j945380K265609J731550k661726k885770J225211J902584
8559B168714j988264l071711N10732J842713j169333j548676K896448L900806
8551C541429k520941p258975k558646M778822M622822l62376r34505K595364K354638
8542D257632k450828m478726j039089K064151M35150l007550l592901o90996L154004
8533e349153M810911K376338k176285l513014L71305M337936L119929q78602k008286
$$ plain form
8592 -5503147 -8471805 -5339720 845480 2102248 -4465718 -12728649 -15040859 -10640016
8584 -10640016 -4454357 -403766 1058197 828673 82643 175281 712705 -908893 -5247330
8575 -5247330 -8299863 -6995290 -4678362 -5949402 -8254047 -5399999 1573541 4972712
8567 4972712 2536636 591256 2856865 4588415 1926689 -959081 266130 2168714
8559 2168714 180450 -2891261 -2380529 -537816 -1707149 -3255825 -359377 3541429
8551 3541429 1020488 -6238487 -8797133 -4018311 604511 242135 -692370 1902994 4257632
8542 4257632 1806804 -2671922 -3711011 -1646860 -1211710 -4219260 -7812161 -8503157 -5349153
8533 -5349153 -538242 1838096 -338189 -3851203 -3479898 858038 3977967 3099365 1091079
8524A091079m60612m18495j590962j83458K793950K196067j862346l086577O37961
8515h83393L131543m81571n880127n662255M28424N806476N701586J876278r26069
8506C110892q43056l82586k394191n436747n038600j73157M325370M113428J429607
8497a289040J238052L372026L239047m09469l401760k496064M76714K185062J981608
8488D896176Q00764j210930l755784m910665k875718J256241L999200L181512
8480A380796O40525K39170K644353L566189n73996o398538o918128j239536L836732
8471b822433L400699M82075k57794L76323m18721j599896j219318j238205l469617
8462f766887m197815M01225O184826N877369M09394k319933M55353L236385J808099
$$ plain form
8524 1091079 630467 211972 -1378990 -1562448 1231502 3427569 1565223 -1521354 -883393
8515 -883393 2248150 1766579 -4113548 -9775803 -9347379 -3540903 2160683 4036961 3110892
8506 3110892 2267836 1885250 -508941 -5945688 -10984288 -11157445 -6832075 -2718647 -1289040
8497 -1289040 -50988 3321038 6560085 6150616 2748856 252792 729506 2914568 4896176
8488 4896176 5696940 4486010 730226 -4180439 -7056157 -5799916 -1800716 1380796
8480 1380796 2021321 2260491 4904844 8471033 7897037 1498499 -5419629 -6659165 -2822433
8471 -2822433 578266 1060341 802547 1178870 760149 -839747 -2059065 -3297270 -6766887
8462 -6766887 -10964702 -10563477 -4378651 1498718 1908112 -411821 43532 3279917 5088016
8453E088016j490955l473707m213752l570668j05592M237727M511374M26649k187271
8444g78179k86325K016988J217426L09973K391151M050222J006583l864446m520990
8435A542403j138922P53292p87369k019271m45323J381553L97491k364668l645320
8426f326134k244815K81077K070648K659529K443939J491913l29717k211565k660465
8417d825590j608780q36714r97099q4136K815206M323313J177895l512015l437267
8408f985187J543450M751557K668115k02592P18761K734430J096054k489847k409563
8399A425178J666207L826216L39974n320535p099770l310106K257300M775592
8391a439944L135669N49265K77645J291568P4777l303954m316778p70858L145888
$$ plain form
8453 5088016 3597061 123354 -4090398 -7661066 -7766658 -3528931 982443 1409092 -778179
8444 -778179 -1064504 952484 2169910 2479883 4871034 8921256 9927839 6063393 1542403
8435 1542403 403481 1156773 369404 -1649867 -2095190 -713637 -316146 -2680814 -6326134
8426 -6326134 -8570949 -8289872 -6219224 -3559695 -1115756 376157 46440 -2165125 -4825590
8417 -4825590 -6434370 -7271084 -8268183 -8352319 -5537113 -1213800 -35905 -3547920 -6985187
8408 -6985187 -5441737 -690180 1977935 1775343 2494104 5228534 6324588 3834741 1425178
8399 1425178 3091385 6917601 7257575 1937040 -5162730 -8472836 -6215536 -1439944
8391 -1439944 1695725 2244990 2522635 3814203 3888980 585026 -3731752 -4502610 -1356722
8382a356722K815954J51018J25161K324482J500064l510506o979088m332176J348424
8373g913389L812110J643866j441797k326199j040572J477597M603546O565575
8365E380737M804041n80981n475856n673055j503394K762535L709523J727930
8357E151480o22845j774741k070562k268221k011891k00775L007992N118673L492978
8348G822088j002943m095562l080905k98689K34052j584925k384220p19919J191879
8339c919144J490129J227224J705940J944973N32675j786491k886188j573696
8331c264578J365615L290150J452735l272122n567600j989863L137173L067301
8323a781189r92236j581684K540658M007234l81157l531978o7618M162653K243434
$$ plain form
8382 -1356722 1459232 1610250 1735411 4059893 5559957 2049451 -4929637 -9261813 -7913389
8373 -7913389 -4101279 -2457413 -3899210 -6225409 -7265981 -5788384 -1184838 5380737
8365 5380737 10184778 9603797 4127941 -1545114 -3048508 -285973 3423550 5151480
8357 5151480 4528635 2753894 683332 -1584889 -3596780 -3797555 -789563 4329110 7822088
8348 7822088 6819145 2723583 -357322 -656011 -421959 -2006884 -4391104 -5111023 -3919144
8339 -3919144 -2429015 -1201791 504149 2449122 2981797 1195306 -1690882 -3264578
8331 -3264578 -1898963 1391187 2843922 -428200 -5995800 -7985663 -4848490 -1781189
8323 -1781189 -2773425 -4355109 -1814451 2192783 1811626 -1720352 -1787970 2374683 4618117
8314D618117j752052n61007K599156k45754o391610n599786K399093O431592J542940
8305C040689l819528k039326K731408L193442k8113j938751j404029j54904J558932
8296A139820L424774L066195m56267m347248n853494n004608k380085J391149
8288i019764L227849N21662k690863M08732P839110R386453J726908n769445m885710
8279G44932L80871K421589J412743R59934j29098l417693m520148l0476M500546
8270B323200K451857k697812l306384l19803m7415j794408J79445M362660L255499
8261D406839l116075o121618k472575J145513M234j808622k27384J817918J015396
8252e356374j04875J304582K812504J771480O10906J807378K261658j614341o775140
$$ plain form
8314 4618117 2866065 2305058 4904214 4658460 -1733150 -7332936 -4933843 1497749 3040689
8305 3040689 -778839 -2818165 -86757 3106685 3078572 1139821 -264208 -419112 1139820
8296 1139820 4564594 7630789 7174522 2827274 -3026220 -8030828 -10410913 -9019764
8288 -9019764 -5791915 -5270253 -7961116 -7552384 286726 9673179 11400087 5630642 744932
8279 744932 1125803 3547392 4960135 5920069 5790971 2373278 -2146870 -2177346 2323200
8270 2323200 4775057 2077245 -1229139 -1548942 -1596357 -3390765 -3211320 1151340 4406839
8261 4406839 1290764 -4830854 -7303429 -6157916 -6153682 -7962304 -8189688 -6371770 -5356374
8252 -5356374 -5461249 -4156667 -1344163 427317 1038223 2845601 5107259 3492918 -3282222
8243c282222p282948k874313J464380K923117K966099K877096J887066k6339j171394
8234b519458o68381O22431J927784K918002K276841j145331n111713n095857m18421
8225g214103L472044J834358k283554k107718K398497L809829j170498n423342
8217f684487j746193N231009N118556k364299o595612j995403M267956M090189
8209f78284j47326j658983k39839j04106j262915m78473J839402K456850J275617
8200A001943N23709k30026k420047l672104q55998L436013L801420M53088j620610
8191D17388j146071j449321k985235k038804K069281M905009L689398O56962j704421
8182B414186l479432m175771k155678J236291K028924l69452k218295j520284
$$ plain form
8243 -3282222 -10565170 -13439483 -11975103 -9051986 -6085887 -3208791 -1321725 -1348064 -2519458
8234 -2519458 -3187839 -2565408 -637624 2280378 4557219 3411888 -1699825 -6795682 -7214103
8225 -7214103 -3742059 -1907701 -4191255 -6298973 -3900476 -90647 -1261145 -6684487
8217 -6684487 -8430680 -3199671 1918885 -445414 -7041026 -9036429 -4768473 -678284
8209 -678284 -825610 -2484593 -2724432 -2828538 -4091453 -4569926 -2730524 -273674 1001943
8200 1001943 1525652 1295626 -1124421 -4796525 -5652523 -2216510 1584910 2037998 417388
8191 417388 -728683 -2178004 -5163239 -7202043 -5132762 -227753 3461645 4118607 2414186
8182 2414186 -1065246 -5241017 -7396695 -6160404 -4131480 -4500932 -6719227 -8239511
8174h239511r3124J096326K961808L821669M55589m718476m597600J667870N761496
8165a883953K250673l089095k248776L300033N954150L040225j494060l812707
8157B016490l285136o95684K099236K143445j266108m485939l669924N14357M475036
8148b154227N851844M219864M50196k745583k850354j724956l576518p131705
8140i661439n727646J698367O602084L161414k081419m58966M637546L540039
8132A709980l282387n773469p99974L047300k31574m773724k934039K970447N444480
8123d622960L298212J474505J993110J733588q62907k453885j80729L087598K060984
8114E527516l383808o997910l834970K865215N277851J046415l812560l334744
$$ plain form
8174 -8239511 -8332635 -7236309 -4274501 -452832 2757 -4715719 -9313319 -7645449 -1883953
8165 -1883953 366720 -2722375 -4971151 -1671118 4283032 7323257 5829197 2016490
8157 2016490 -1268646 -1964330 134906 2278351 1012243 -3473696 -7143620 -6629263 -2154227
8148 -2154227 3697617 7917481 8367677 5622094 2771740 1046784 -2529734 -9661439
8140 -9661439 -15389085 -13690718 -7088634 -3927220 -6008639 -6467605 -1830059 1709980
8132 1709980 -1572407 -7345876 -8145850 -5098550 -5330124 -10103848 -13037887 -10067440 -4622960
8123 -4622960 -1324748 149757 2142867 3876455 3013548 559663 378934 3466532 5527516
8114 5527516 2143708 -4854202 -8689172 -5823957 -546106 500309 -3312251 -6646995
8106f646995O67257K362833O22430m94158J038171K245440L04579l042170m040662
8097f983275j639267J946032L922313L027277J25094k349053k385761n03519P79272
8088d060887j09600k014441k396595M8782M055183O584426N311898J001978k886204
8079E534540l602708j806312l36390p69426j895741j426305J203851L754133L269977
8070C925619k62381l239819k718281l28341K84931r63318q40130J523231L109310
8061D90821K136139P80913R78192J172918k73183j683260r52452P92980J209937
8052D653005J66475j193325k387364k551960m69270K240311J681391k004324l394942
8043c260003k76507J907006r06553l439523O38359P025811O483237m13223m214280
$$ plain form
8106 -6646995 -5979738 -3616905 -2994475 -3488633 -2450462 -205022 99557 -2942613 -6983275
8097 -6983275 -8622542 -6676510 -2754197 273080 398174 -1950879 -4336640 -4840159 -4060887
8088 -4060887 -4170487 -6184928 -8581523 -8532741 -4477558 2106868 7418766 8420744 5534540
8079 5534540 1931832 125520 -210870 -980296 -2876037 -4302342 -3098491 655642 3925619
8070 3925619 3663238 423419 -2294862 -2623203 -2338272 -3301590 -4141720 -2618489 490821
8061 490821 2626960 3407873 4386065 5558983 5285800 3602540 2650088 3443068 4653005
8052 4653005 4819480 3626155 1238791 -1313169 -1782439 457872 2139263 134939 -3260003
8043 -3260003 -3536510 -1629504 -2536057 -5975580 -5337221 1688590 8171827 7758604 3544324
8034C544324j693953L98394j737752k600108J821216N782387K627512m369550
8026C772470o741985k545111K630518L930000J555021j559890k484460n4387L242323
8017A744499K957145j270339l888882p01953M556888M736298j162617o695296
8009B75743n858081M81863N969825N050869j514768o695286m389143K869760O301494
8000B492276K130527l524666l631078J71228J531392m12667r84174J176312J843739
7991G92889j111484l491398j064767L868569N722837L172585n3404j051661j087617
7982E696549k341311l746118k225483K360645N661995L589676k271343n818036
7974I06574l194828L019739O840054M857027j223750o597092p161324k668879
$$ plain form
8034 3544324 1850371 2248765 511013 -2089095 -267879 5514508 8142020 3772470
8026 3772470 -2969515 -5514626 -2884108 1045892 2600913 1041023 -1443437 -1497824 1744499
8017 1744499 4701644 3431305 -457577 -1159530 3397358 8133656 6971039 275743
8009 275743 -5582338 -5100475 869350 5920219 4405451 -2289835 -6678978 -3809218 2492276
8000 2492276 4622803 1098137 -2532941 -2361713 -830321 -1242988 -2227162 -1050850 792889
7991 792889 -318595 -3809993 -4874760 -1006191 4716646 7889231 7835827 6784166 5696549
7982 5696549 3355238 -390880 -2616363 -255718 5406277 8995953 6724610 906574
7974 906574 -2288254 731485 7571539 12428566 11204816 4607724 -2553600 -5222479
7966e222479K841337M643051K100392j061205j613157l42282J33080p78943j607968
7957i08174j360186k90999J078337K075410J573709q36927l598935m398177k612496
7948i278438K22413K095420K017901L82577j368188j802321q02401N72681J670004
7939f290352K685050L189803J757096j744213m622104l834248K24601L745620
7931d888747L662131J100207Q4910K667490N901412M905293q32540o138800o518635
7922e7279l676164k001020j570985R20675M922587N178542l17330o285693o874578
7913i761245k764091J369947L181640L069726J191788j887944l425303j304657
7905a0330139K385260L794091K307326K54939r91495j538574r91561O84469J570418
$$ plain form
7966 -5222479 -2381142 2261909 4362301 3301096 1687939 1345657 1478737 699794 -908174
7957 -908174 -2268360 -2559359 -1481022 594388 2168097 1331170 -2267765 -6665942 -9278438
7948 -9278438 -9056025 -6960605 -4942704 -4560127 -5928315 -7730636 -8533037 -7960356 -6290352
7939 -6290352 -3605302 -415499 1341597 -402616 -5024720 -8858968 -8634367 -4888747
7931 -4888747 -1226616 -126409 -41499 2625991 8527403 13432696 12600156 6461356 -57279
7922 -57279 -3733443 -5734463 -7305448 -6384773 -1462186 3716356 3399026 -2886667 -9761245
7913 -9761245 -12525336 -11155389 -7973749 -4904023 -3712235 -5600179 -9025482 -10330139
7905 -10330139 -7944879 -4150788 -1843462 -1588523 -2580018 -4118592 -5110153 -4425684 -2855266
7896b855266M84818j45631K004799M110512J811250k925453l423357J530993N083351
7887E676016K145637l418225m882718j782603J176366J406431K96775n18754p05020
$$ plain form
7896 -2855266 -2370448 -2516079 -511280 3599232 5410482 2485029 -938328 592665 5676016
7887 5676016 7821653 4403428 -479290 -2261893 -1085527 320904 617679 98925 -606095
$$ [...]
##END NTUPLES=NMR SPECTRUM
##END=
