##TITLE=31Pdec_SR87
 CDCl3, 124 sc
 11.1.2022
##JCAMPDX= 6.0         $$ Bruker NMR JCAMP-DX V2.0
##DATA TYPE= NMR SPECTRUM
##DATA CLASS= NTUPLES
##ORIGIN= UXNMR, Bruker Analytische Messtechnik GmbH
##OWNER= root
$$ XWIN-NMR		Version 3.5
$$ Tue Jan 11 12:14:36 2022 Russian Standard Time (UT+4h)  she@DPX200
##.OBSERVE FREQUENCY= 81.013821
##.OBSERVE NUCLEUS= ^31P
##.ACQUISITION MODE= SIMULTANEOUS
##.ACQUISITION SCHEME= undefined
##.AVERAGES= 124
##.DIGITISER RES= 16
##SPECTROMETER/DATA SYSTEM= spect
##.PULSE SEQUENCE= zgpg30
##.SOLVENT NAME= CDCl3
##.SHIFT REFERENCE= (INTERNAL, CDCl3, 0, 248.564)
##AUDIT TRAIL= $$ (NUMBER, WHEN, WHO, WHERE, WHAT)
$$ ##TITLE= Audit trail, XWIN-NMR		Version 3.5
$$ ##JCAMPDX= 5.01
$$ ##ORIGIN= Bruker BioSpin GmbH
$$ ##OWNER= she
$$ F:/spectra/data/she/nmr/P31/1/pdata/1/auditp.txt
$$ ##AUDIT TRAIL=  $$ (NUMBER, WHEN, WHO, WHERE, WHAT)
(   1,<2022-01-11 12:13:45.68 +0400>,<she>,<DPX200>,
      <continue with go, POWCHK disabled, PULCHK disabled
       configuration hash MD5:
       00 E9 B6 7A A2 85 ED C7 34 08 36 98 17 FE 4E 26
       data hash MD5: 32K
       4A 82 45 D4 76 A6 F3 85 2F D0 A5 BA 36 F8 FD 6F>)
(   2,<2022-01-11 12:13:48.68 +0400>,<she>,<DPX200>,
      <Start of raw data processing
       efp BC_mod = 2 LB = 1 FT_mod = 6 PKNL = 1 PHC0 = -9187.41 PHC1 = 92.86993 SI = 64K 
       data hash MD5: 64K
       02 38 1C 08 EC AD E3 53 1A 42 44 23 18 BA 28 22>)
(   3,<2022-01-11 12:14:08.29 +0400>,<she>,<DPX200>,
      <pk PHC0 = 14.01326 PHC1 = 0.5999996 
       data hash MD5: 64K
       BC 58 55 43 24 68 1E FF E1 DB 85 BC CC 47 C1 96>)
(   4,<2022-01-11 12:14:12.20 +0400>,<she>,<DPX200>,
      <abs ABSG = 5 
       data hash MD5: 64K
       86 15 EB 6D F7 BB 8D 0F 03 30 7B 5D B2 B2 B2 A3>)
$$ ##END=
$$ 
$$ hash MD5
$$ 57 B6 F9 3F 63 03 4E DE 5F 38 72 E1 DB AB 0D 57
##$RELAX= 
##$RELAX= 
##$RELAX= 
##$RELAX= 
##$RELAX= 
##$RELAX= 
##$RELAX= 
##$RELAX= 
$$ Bruker specific parameters
$$ --------------------------
##$DU= <F:/spectra>
##$EXPNO= 1
##$NAME= <P31>
##$PROCNO= 1
##$TYPE= <nmr>
##$USER= <she>
##$AMP= (0..31)
100 100 100 100 100 100 100 100 100 100 100 100 100 100 100 100 100 100 
100 100 100 100 100 100 100 100 100 100 100 100 100 100 
##$AQSEQ= 0
##$AQ_mod= 1
##$AUNM= <au_zg>
##$AUTOPOS= <>
##$BF1= 81.014009
##$BF2= 200.13
##$BF3= 200.13
##$BF4= 200.13
##$BF5= 200.13
##$BF6= 200.13
##$BF7= 200.13
##$BF8= 200.13
##$BYTORDA= 1
##$CFDGTYP= 0
##$CFRGTYP= 5
##$CHEMSTR= <none>
##$CNST= (0..31)
1 1 145 1 1 1 1 1 1 1 1 1 1 1 1 1 1 1 1 1 1 1 1 1 1 1 1 1 1 1 1 1 
##$CPDPRG= <waltz16>
##$CPDPRG1= <>
##$CPDPRG2= <waltz16>
##$CPDPRG3= <>
##$CPDPRG4= <mlev>
##$CPDPRG5= <mlev>
##$CPDPRG6= <mlev>
##$CPDPRG7= <mlev>
##$CPDPRG8= <mlev>
##$CPDPRGB= <>
##$CPDPRGT= <>
##$D= (0..31)
0 1 0 0 0 0 0 0 0 0 0 0.03 2e-05 3e-06 0 0 0 0 0 0 0 0 0 0 0 0 0 0 0 0 
0 0 
##$DATE= 1641888647
##$DBL= (0..7)
120 120 120 11 120 120 24 19 
##$DBP= (0..7)
150 150 150 150 150 150 150 150 
##$DBP07= 0
##$DBPNAM0= <>
##$DBPNAM1= <>
##$DBPNAM2= <>
$$ [...]
##$SUBNAM3= <"">
##$SUBNAM4= <"">
##$SUBNAM5= <"">
##$SUBNAM6= <"">
##$SUBNAM7= <"">
##$SUBNAM8= <"">
##$SUBNAM9= <"">
##$SW= 501.771253377433
##$SWIBOX= (0..15)
0 1 3 0 0 0 0 0 0 0 0 0 0 0 0 0 
##$SW_h= 40650.406504065
##$TD= 32768
##$TD0= 1
##$TE= 0
##$TE2= 300
##$TE3= 300
##$TEG= 300
##$TL= (0..7)
0 120 53 12 22 120 120 120 
##$TP= (0..7)
150 150 150 150 150 150 150 150 
##$TP07= 0
##$TPNAME0= <>
##$TPNAME1= <>
##$TPNAME2= <>
##$TPNAME3= <>
##$TPNAME4= <>
##$TPNAME5= <>
##$TPNAME6= <>
##$TPNAME7= <>
##$TPOAL= (0..7)
0.5 0.5 0.5 0.5 0.5 0.5 0.5 0.5 
##$TPOFFS= (0..7)
0 0 0 0 0 0 0 0 
##$TUNHIN= 0
##$TUNHOUT= 0
##$TUNXOUT= 0
##$USERA1= <user>
##$USERA2= <user>
##$USERA3= <user>
##$USERA4= <user>
##$USERA5= <user>
##$V9= 5
##$VALIST= <valist>
##$VCLIST= <CCCCCCCCCCCCCCC>
##$VD= 0
##$VDLIST= <DDDDDDDDDDDDDDD>
##$VPLIST= <PPPPPPPPPPPPPPP>
##$VTLIST= <TTTTTTTTTTTTTTT>
##$WBST= 1024
##$WBSW= 4
##$XGAIN= (0..3)
0 0 0 0 
##$XL= 0
##$YL= 0
##$YMAX_a= 5505
##$YMIN_a= -6426
##$ZGOPTNS= <>
##$ZL1= 120
##$ZL2= 120
##$ZL3= 120
##$ZL4= 120
##$ABSF1= 248.5645
##$ABSF2= -253.2056
##$ABSG= 5
##$ABSL= 3
##$ALPHA= 0
##$AQORDER= 0
##$ASSFAC= 0
##$ASSFACI= 0
##$ASSFACX= 0
##$ASSWID= 0
##$AUNMP= <proc_1d>
##$AZFE= 0.1
##$AZFW= 0.5
##$BCFW= 0
##$BC_mod= 2
##$BYTORDP= 0
##$COROFFS= 0
##$CY= -3
##$DATMOD= 1
##$DC= 0
##$DFILT= <>
##$DTYPP= 0
##$F1P= 0
##$F2P= 0
##$FCOR= 1
##$FTSIZE= 65536
##$FT_mod= 6
##$GAMMA= 0
##$GB= 0
##$INTBC= 1
##$INTSCL= 5.30512e-09
##$ISEN= 30
##$LB= 1
##$LEV0= 0
##$LPBIN= 0
##$MAXI= 10000
##$MC2= 0
##$MEAN= 0
##$ME_mod= 0
##$MI= 50
##$NCOEF= 0
##$NC_proc= -8
##$NLEV= 6
##$NOISF1= 182.463
##$NOISF2= 159.3651
##$NSP= 0
##$NTH_PI= 0
##$NZP= 0
##$OFFSET= 248.5645
##$PC= 4
##$PHC0= -9173.396
##$PHC1= 93.46992
##$PH_mod= 1
##$PKNL= yes
##$PPARMOD= 0
##$PSCAL= 0
##$PSIGN= 0
##$REVERSE= no
##$SF= 81.014009
##$SI= 65536
##$SIGF1= 159.3651
##$SIGF2= -187.1042
##$SINO= 113.3802
##$SIOLD= 16384
##$SREGLST= <1H.CDCl3>
##$SSB= 0
##$STSI= 65536
##$STSR= 0
##$SW_p= 40650.406504065
##$SYMM= 0
##$S_DEV= 0
##$TDeff= 32768
##$TDoff= 0
##$TI= <>
##$TILT= no
##$TM1= 0
##$TM2= 0
##$TOPLEV= 0
##$USERP1= <user>
##$USERP2= <user>
##$USERP3= <user>
##$USERP4= <user>
##$USERP5= <user>
##$WDW= 1
##$XDIM= 65536
##$YMAX_p= 445178779
##$YMIN_p= -47248699
$$ End of Bruker specific parameters
$$ ---------------------------------
##NTUPLES= NMR SPECTRUM
##VAR_NAME=  FREQUENCY,     SPECTRUM/REAL,   SPECTRUM/IMAG
##SYMBOL=    X,             R,               I
##VAR_TYPE=  INDEPENDENT,   DEPENDENT,       DEPENDENT
##VAR_FORM=  AFFN,          ASDF,            ASDF
##VAR_DIM=   65536,         65536,           65536
##UNITS=     HZ,            ARBITRARY UNITS, ARBITRARY UNITS
##FACTOR=    0.620285442955139, 1,           1
##FIRST=     20137.2065510759, 0,            0
##LAST=      -20513.1999529892, 0,           0
##MIN=       -20513.1999529892, -47248699,   0
##MAX=       20137.2065510759, 445178779,    0
$$ Real data points
##PAGE= N=1
##DATA TABLE= (X++(R..R)), XYDATA
$$ [...]
$$ plain form
12919 -1979336 -8099336 -15861115 -21210994 -21439040 -19041312 -16599722 -12310368 -5633854
12911 -5633854 -2728122 -9170087 -20220416 -25778367 -23183059 -17593070 -11306232 -2017330
12903 -2017330 7528159 8184534 -2540498 -13522810 -12615880 -1700368 7377759 8997895
12895 8997895 8518807 11157025 13824966 11733099 7699613 8409961 12926821 11877456
12887 11877456 436325 -13047418 -15832077 -5500484 8477273 16111344 15212390 9528523
12879 9528523 3919524 1875665 3393260 4491398 2388256 887534 6032807 16437877
12871 16437877 23320253 20974435 12023806 1655949 -7361411 -12953850 -14041018 -14661957
12863 -14661957 -20504529 -28350935 -26910999 -12893143 1384095 2917253 -5591914 -11268415
$$ packed form
12919a979336o120000p761779n349879k28046K397728K441590M289354O676514
12911e633854K905732o441965j1050329n557951K595308N589989O286838R288902
12903b017330R545489O56375j0725032j0982312R06930J0915512R078127J620136
12895H997895m79088K638218K667941k091867m033486P10348M516860j049365
12887A1877456j1441131j3483743k784659J0331593J3977757P634071q98954n683867
12879I528523n608999k043859J517595J098138k103142j500722N145273J0405070
12871A6437877O882376k345818q950629j0367857r017360n592439j087168o20939
12863a4661957n842572p846406J439936J4017856J4277238J533158q509167n676501
$$ plain form
12855 -11268415 -7990195 -575353 4054431 2791790 -3904332 -12055026 -15970869 -14264069
12847 -14264069 -11021192 -8290191 -3561976 1485909 -1226340 -12298605 -18127172 -8957195
12839 -8957195 4357496 5142890 -3780296 -5568048 3277596 8983519 4752849 888744
12831 888744 5554106 11557363 10504690 6546333 5887227 3659789 -6739556 -18543776
12823 -18543776 -18259924 -4584183 9157382 10787318 701913 -11736012 -17907583 -16340346
12815 -16340346 -12608953 -12123890 -12497585 -6956265 3931657 10570053 7431676 605892
12807 605892 -2792354 -5343536 -11808128 -17191178 -12762536 -1224106 4963780 1108166
12799 1108166 -3261252 1432513 11421682 15112107 7804643 -3713207 -9614731 -6601643
$$ packed form
12855a1268415L278220P414842M629784j262641o696122q150694l915843J706800
12847a4264069L242877K731001M728215N047885k712249j1072265n828567R169977
12839h957195J3314691P85394q923186j787752Q845644N705923m230670l864105
12831H88744M665362O003257j052673l958357o59106k227438j0399345j1804220
12823a8543776K83852J3675741J3741565J629936j0085405j2437925o171571J567237
12815a6340346L731393M85063l73695N541320J0887922O638396l138377o825784
12807F05892l398246k551182o464592n383050M428642J1538430O187886l855614
12799A108166m369418M693765R989169L690425p307464j1517850n901524L013088
$$ plain form
12791 -6601643 817700 6286099 7482250 6253806 4607937 2930976 2099595 4085565
12783 4085565 8646983 11929683 10711987 6144592 1114121 -3803167 -8737383 -10842596
12775 -10842596 -6293421 4179005 14841193 20373459 19685802 14774291 8480239 3681679
12767 3681679 2158789 3039496 3724934 3190185 3176084 5092939 6761837 4177229 -3024807
12758 -3024807 -9801499 -11642669 -11359968 -16192983 -26962276 -34235783 -28943878 -14097842
12750 -14097842 -1516602 1292206 -3810692 -11806592 -19096553 -21665395 -15976144 -4874556
12742 -4874556 2526754 502784 -6969164 -11813095 -10269725 -3855382 3782699 8230001
12734 8230001 6447648 667809 -2974485 -2034689 -428378 -1514564 -3227510 -3152704 -3521488
$$ packed form
12791f601643P419343N468399J196151j228444j645869j676961q31381J985970
12783D085565M561418L282700j217696m567395n030471m917288m934216k105213
12775a0842596M549175J0472426J0662188N532266o87657m911511o294052m798560
12767C681679j522890Q80707O85438n34749j4101J916855J668898k584608p202036
12758c024807o776692j841170K82701m833015j0769293p273507N291905J4846036
12750a4097842J2581240K808808n102898p995900p289961k568842N689251J1101588
12742d874556P401310k023970p471948m843931J543370O414343P638081M447302
12734H230001j782353n779839l642294R39796J606311j086186j712946P4806l68784
$$ plain form
12725 -3521488 -6869362 -10830049 -11759161 -10014544 -7528459 -4106752 -552038 -864970
12717 -864970 -5747443 -8425240 -3804563 2106289 -19783 -8452919 -12908839 -10139739
12709 -10139739 -7070527 -7352785 -4951691 4571667 14597779 15782489 8963292 3190793
12701 3190793 3255039 5253601 4534586 2886565 5040546 10200348 11097189 3358134 -6712679
12692 -6712679 -8292345 -295113 5832825 487914 -11726432 -18717827 -15916244 -8251888
12684 -8251888 -109818 8495063 15831421 16641288 9178054 -1454978 -9615639 -14335911
12676 -14335911 -16193590 -13919452 -7542467 -1181629 1435470 2465780 7385241 17077386
12668 17077386 24827349 22517734 9997459 -2856857 -5893612 -619074 1676152 -4665661
$$ packed form
12725c521488l347874l960687r29112J744617K486085L421707L554714l12932
12717h64970m882473k677797M620677N910852k126072q433136m455920K769100
12709a0139739L069212k82258K401094R523358J0026112J184710o819197n772499
12701C190793O4246J998562p19015j648021K153981N159802Q96841p739055j0070813
12692f712679j579666P997232O127938n344911j2214346o991395K801583P664356
12684h251888Q142070Q604881P336358Q09867p463234j0633032q160661m720272
12676a4335911j857679K274138O376985O360838K617099J030310M919461R692145
12668A7077386P749963k309615j2520275j2854316l036755N274538K295226o341813
$$ plain form
12660 -4665661 -12004555 -11814571 -8303347 -10775438 -16794379 -15183354 -5708733 -2714695
12652 -2714695 -14447659 -29578118 -31766837 -20100403 -7223562 -2539064 -5000560 -9048103
12644 -9048103 -10498662 -8278312 -5571940 -7459607 -13633112 -16803143 -12595558 -6760987
12636 -6760987 -6806990 -10332756 -8663541 469718 10984381 17346039 18121640 11908071
12628 11908071 -1991403 -17814368 -25635202 -22021946 -13345725 -6943562 -4150428 -3520138
12620 -3520138 -4987328 -7710326 -8554319 -6321713 -3967734 -3568851 -2727040 514640 2824282
12611 2824282 626964 -2236014 1991536 13290688 21320815 17965140 8949569 7620735
12603 7620735 17358417 25965913 21056328 6593420 -2542842 -818543 1985623 -2503546
$$ packed form
12660d665661p338894J89984L511224k472091o018941J611025R474621K994038
12652b714695j1732964j5130459k188719J1666434J2876841M684498k461496m047543
12644i048103j450559K220350K706372j887667o173505l170031M207585N834571
12636f760987m6003l525766J669215R133259J0514663O361658P75601o213569
12628A1908071j3899474j5822965p820834L613256Q676221O402163K793134O30290
12620c520138j467190k722998q43993K232606K353979L98883Q41811L241680K309642
12611B824282k197318k862978M227550J1299152Q030127l355675r015571j328834
12603G620735R737682Q607496m909585j4462908r136262J724299K804166m489169
$$ plain form
12595 -2503546 -7926736 -4099597 5489775 8145460 1762883 -1702226 5076795 13185749
12587 13185749 10578745 -631580 -7704338 -4123564 4568186 10305428 11017793 8760796
12579 8760796 4749226 -736238 -5835980 -7578581 -5296840 -2095229 -1257058 -1359258
12571 -1359258 2353428 10294865 15836189 14318506 11577501 16722556 27745960 32935905
12563 32935905 27902161 21678508 21590893 21569260 13295841 1160912 -4456240 -3921096 -6442037
12554 -6442037 -13230372 -14877997 -7198358 1443436 2817771 -152009 -284422 3227213
12546 3227213 6791742 9165863 10354312 8485593 3550329 319909 1975300 4510692
12538 4510692 3242241 1246535 4537097 11557477 15049550 13132331 10785893 10183266
$$ packed form
12595b503546n423190L827139R589372K655685o382577l465109O779021Q108954
12587A3185749k607004j1210325p072758L580774Q691750N737242P12365k256997
12579H760796m011570n485464n099742j742601K281741L201611Q38171j02200
12571a359258L712686P941437N541324j517683k741005N145055J1023404N189945
12563C2935905n033744o223653q7615k1633q273419j2134929n617152N35144k520941
12554f442037o788335j647625P679639Q641794J374335k969780j32413L511635
12546C227213L564529K374121J188449j868719m935264l230420J655391K535392
12538D510692j268451j995706L290562P020380L492073j917219k346438o02627
$$ plain form
12530 10183266 7315262 130092 -6906074 -9582442 -9697197 -10497870 -11246959 -10421940 -10099352
12521 -10099352 -12238539 -13762144 -10857858 -6241458 -6060033 -9879951 -10159535 -3638701
12513 -3638701 2563034 568431 -6606096 -9256622 -5465470 -4080116 -11004374 -19060372
12505 -19060372 -17092348 -5109483 6848288 13142511 17341047 21794497 22014722 16391672
12497 16391672 13137124 19106759 27118181 24455010 11504810 1251229 33639 -204588
12489 -204588 -7072221 -15089656 -14400665 -5196733 3956086 7944740 8307531 7264014 5006204
12480 5006204 1772668 -2458242 -9157779 -17593378 -21690026 -16012553 -4293084 3448102
12472 3448102 2853333 -402249 722500 5823521 8934896 6378461 524085 -3175310
$$ packed form
12530A0183266k868004p185170p036166k676368j14755q00673p49089Q25019L22588
12521a0099352k139187j523605K904286M616400J81425l819918k79584O520834
12513c638701O201735j994603p174527k650526L791152J385354o924258q055998
12505a9060372J968024J1982865J1957771O294223M198536M453450K20225n623050
12497A6391672l254548N969635Q011422k663171j2950200j0253581j217590k38227
12489b04588o867633q017435O88991R203932R152819L988654L62791j043517k257810
12480E006204l233536m230910o699537q435599m096648N677473J1719469P741186
12472C448102n94769l255582J124749N101021L111375k556435n854376l699395
$$ plain form
12464 -3175310 -1776588 2322721 4538533 4159486 5047299 9003116 11616669 7967040
12456 7967040 -22575 -5960576 -6911720 -4748490 -1363184 2549609 5216623 5614304
12448 5614304 6627538 10731844 13646097 9342148 1011486 -1580765 2835481 4160750
12440 4160750 -2889259 -9331515 -5624560 3431565 6930752 4901497 5807427 10180324
12432 10180324 9228121 718688 -5129782 39305 10879204 16000613 11384456 1190307
12424 1190307 -9542642 -17283380 -18845900 -13899291 -7073188 -2955224 -257452 5162206
12416 5162206 13032887 18665344 19233631 15988249 10923425 5454526 2184745 3628265
12408 3628265 8422032 12202446 12569422 9841474 3467292 -7092574 -17216589 -19171174
$$ packed form
12464c175310J398722M099309K215812l79047Q87813L955817K613553l649629
12456G967040p989615n938001r51144K163230L385306L912793K667014L97681
12448E614304J013234M104306K914253m303949q330662k592251M416246J325269
12440D160750p050009o442256L706955R056125L499187k029255R05930M372897
12432A0180324r52203q509433n848470N169087J0839899N121409m616157j0194149
12424A190307j0732949p740738j562520M946609O826103M117964K697772N419658
12416E162206P870681N632457N68287l245382n064824n468899l269781J443520
12408C628265M793767L780414L66976k727948o374182j0559866j0124015j954585
$$ plain form
12400 -19171174 -12432816 -6398094 -8164025 -12398615 -9676165 -1551736 658783 -8097844
12392 -8097844 -19329547 -22129121 -16050062 -9352900 -7810075 -8928123 -6329585 2109607
12384 2109607 10694554 11377853 4058707 -1148709 3950596 13397615 13778022 3140883
12376 3140883 -5165831 -880184 8920958 10245010 910350 -8998994 -11657632 -7995986
12368 -7995986 -1522878 5289638 7803303 1205760 -10745026 -15782161 -7173845 6485665
12360 6485665 10972071 3676483 -4355082 -3486893 2641631 3034443 -5979232 -16565867
12352 -16565867 -20147774 -17853906 -16854513 -19162739 -19708487 -15394910 -9827263 -6482061
12344 -6482061 -2684379 4990543 13183701 15373725 11511329 8862365 12977392 21044084
$$ packed form
12400a9171174O738358O034722j765931m234590K722450Q124429K210519q756627
12392h097844j1231703k799574O079059O697162J542825j118048K598538Q439192
12384B109607Q584947O83299p319146n207416N099305R447019L80407j0637139
12376C140883q306714M285647R801142J324052r334660r909344k658638L661646
12368g995986O473108O812516K513665o597543j1950786n037135Q608316J3659510
12360F485665M486406p295588q031565Q68189O128524L92812r013675j0586635
12352a6565867l581907K293868R99393k308226n45748M313577N567647L345202
12344f482061L797682P674922Q193158K190024l862396k648964M115027Q066692
$$ plain form
12336 21044084 24551213 17314214 2219830 -9229746 -7290116 4680917 13515246 12445989
12328 12445989 7443973 4064978 -2760246 -17389699 -29808129 -25839495 -7686661 7977596
12320 7977596 11309683 7167816 2363015 -2359120 -6028537 -5338544 -2309507 -3688311
12312 -3688311 -9511007 -12112728 -8798506 -4536513 -86135 9063813 18285105 14180555
12304 14180555 -3146667 -13977853 -6074962 6712505 6491443 -1668683 -1714161 5751364
12296 5751364 7947537 4604640 6271269 11013929 5355610 -9725909 -15316163 -3471357
12288 -3471357 9255588 6873065 -3085998 -3831749 5167969 10763487 7469007 2772848
12280 2772848 2900042 4231739 1134290 -4100882 -3057242 7954678 20978072 23284934
$$ packed form
12336B1044084L507129p236999j5094384j1449576J939630J1971033Q834329j069257
12328A2445989n002016l378995o825224j4629453j2418430L968634J8152834J5664257
12320G977596L332087m141867m804801m722135l669417O89993L029037j378804
12312c688311n822696k601721L314222M261993M450378R149948R221292m104550
12304A4180555j7327222j0831186P902891J2787467k21062q160126m5478P465525
12296E751364K196173l342897J666629M742660n658319j5081519n590254J1844806
12288c471357J2726945k382523r959063p45751Q999718N595518l294480m696159
12280B772848J27194J331697l097449n235172J043640J1011920J3023394K306862
$$ plain form
12272 23284934 12570147 1072178 93353 5070941 3774601 -4609573 -9794732 -8598272
12264 -8598272 -9676768 -17333506 -23278937 -20312764 -13287768 -9224181 -6122020 -199960
12256 -199960 3579038 -2292108 -16231840 -29953879 -37801993 -37283871 -26587186 -9453205
12248 -9453205 3337175 5930100 5540022 10189874 14902296 10986279 2971584 2519353
12240 2519353 9064561 11627900 8600207 9260437 13985333 10797851 -2044624 -7256812
12232 -7256812 6259389 23376158 22740940 6914602 -4241718 -4355678 -6228872 -17269507
12224 -17269507 -27253444 -25538569 -15778689 -6027400 3540556 13541508 16270106 5898014
12216 5898014 -8379586 -11918624 -4331812 2162160 2387309 3386285 8750529 10922822
$$ packed form
12272B3284934j0714787j1497969r78825M977588j296340q384174n185159J196460
12264h598272j078496p656738n945431K966173P024996M063587L102161N922060
12256a99960L778998n871146j3939732j3722039p848114N18122J0696685J7133981
12248i453205J2790380K592925l90078M649852M712422l916017q014695m52231
12240B519353O545208K563339l027693O60230M724896l187482j2842475n212188
12232g256812J3516201J7116769o35218j5826338j1156320j13960j873194j1040635
12224a7269507r983937J714875R759880R751289R567956J0000952K728598j0372092
12216E898014j4277600l539038P586812O493972K25149R98976N364244K172293
$$ plain form
12208 10922822 4549348 -3183373 -3275527 1679652 3020141 -452690 -2585673 -9167
12200 -9167 5139065 10150915 13196593 12365557 8921100 8338445 12189819 13050383 4847704
12191 4847704 -5792379 -7715805 -1620999 2387392 1728455 3308054 7848532 5964840
12183 5964840 -5166152 -13251810 -6926813 8320493 18357263 17711797 10712409 1412999
12175 1412999 -8540479 -15912039 -18808359 -21759249 -29802545 -38300680 -36342239 -21204435
12167 -21204435 -3137154 6207235 5537591 2083113 1701941 3956753 5639238 5906685
12159 5906685 6139890 5888918 2590370 -2918557 -4520089 1034718 7248981 5918434
12151 5918434 166441 629521 8449307 12465038 6538148 -1039148 -1701719 -203632
$$ packed form
12208A0922822o373474p732721r2154M955179J340489l472831k132983K576506
12200i167N148232N011850L045678q31036l444457n82655L851374Q60564q202679
12191D847704j0640083j923426O094806M008391o58937J579599M540478j883692
12183E964840j1130992q085658O324997J5247306J0036770o45466o999388r299410
12175A412999r953478p371560k896320k950890q043296q498135J958441J5137804
12167b1204435J8067281R344389o69644l454478l81172K254812J682485K67447
12159E906685K33205k50972l298548n508927j601532N554807O214263j330547
12151E918434n751993M63080P819786M015731n926890p577296o62571J498087
$$ plain form
12143 -203632 -4687813 -10952999 -8420873 2268008 9602508 8293927 5147360 6335758
12135 6335758 8189417 4497078 -3384793 -8090620 -4825706 4285341 12726787 15333542
12127 15333542 12532777 8675331 5814657 1584772 -5354800 -11357890 -12209908 -8387630
12119 -8387630 -2980737 2162497 5358535 4827314 3315387 7533963 17859108 24551308
12111 24551308 21155979 15673049 18976012 26690767 24288807 9082526 -4350323 -2847038
12103 -2847038 9893265 19184895 14553090 -2126244 -18322544 -21032197 -10798611 -3583392
12095 -3583392 -11718582 -26220689 -28121057 -15206002 -4411335 -6258923 -10707222 -4063627
12087 -4063627 11494850 23172296 24226013 17816688 10128598 6244323 8256537 12169839
$$ packed form
12143b03632m484181o265186K532126J0688881P334500j308581l146567J188398
12135F335758J853659l692339p881871m705827L264914R111047Q441446K606755
12127A5333542k800765l857446k860674m229885o939572o003090q52018L822278
12119h387630N406893N143234L196038n31221j511927M218576J0325145O692200
12111B4551308l395329n482930L302963P714755k401960j5206281j3432849J503285
12103b847038J2740303R291630m631805j6679334j6196300k709653J0233586P215219
12095c583392q135190j4502107j900368J2915055J0794667j847588m448299O643595
12087d063627J5558477J1677446J053717o409325p688090l884275K012214L913302
$$ plain form
12079 12169839 10688234 2720026 -4607861 -5934629 -3289029 867021 7868586 15684234
12071 15684234 16597632 8945261 3052030 7130245 14417830 13992980 8286114 8355409 15342725
12062 15342725 19014815 14636025 9883929 11933788 16377298 13912944 3329877 -6419073
12054 -6419073 -5759546 5137133 14958764 11740187 -3685240 -17583602 -19143720 -12158256
12046 -12158256 -6654073 -4160523 793946 7814059 9737028 5629610 5061985 14886246
12038 14886246 28431470 33647750 28212798 20749933 18377595 18429965 14039932 4478647
12030 4478647 -3699099 -5609425 -4212017 -4572076 -4882578 812162 11024645 15269248
12022 15269248 7650219 -3991087 -7882120 -2846728 2926865 4020842 1844440 -1085121
$$ packed form
12079A2169839j481605p968208p327887j326768K645600M156050P001565P815648
12071A5684234R13398p652371n893231M078215P287585m24850n706866O9295O987316
12062A5342725L672090m378790m752096K049859M443510k464354j0583067r748950
12054f419073O59527J0896679R821631l218577j5425427j3898362j560118O985464
12046a2158256N504183K493550M954469P020113J922969m107418n67625R824261
12038A4886246J3545224N216280n434952p462865k372338N2370m390033r561285
12030D478647q177746j910326J397408l60059l10502N694740J0212483M244603
12022A5269248p619029j1641306l891033N035392N773593J093977k176402k929561
$$ plain form
12014 -1085121 -3666775 -3949628 -1117286 681253 -2878669 -7970575 -6523326 688259
12006 688259 2847347 -5989040 -17692841 -20147783 -11274790 1466134 10970159 14656691
11998 14656691 12251254 5672637 251651 636817 4477647 4045352 -3825393 -11822450
11990 -11822450 -9392527 3896766 15359209 12637027 -1290512 -11439042 -9674278
11983 -9674278 -3639269 -3271485 -5974868 -3504922 2031417 1202072 -5299321 -5854349 2730008
11974 2730008 8446139 2961241 -5092167 -5152672 -2020654 -5148305 -9100791 -1183146
11966 -1183146 14911770 20537991 8965787 -4812183 -6007659 2050967 8873117 12902986
11958 12902986 16693266 16170413 6964073 -4650903 -8708680 -5472474 -2115579 207532
$$ packed form
12014a085121k581654k82853K832342J798539l559922n091906J447249P211585
12006F88259K159088q836387j1703801k454942Q872993J2740924R504025L686532
11998A4656691k405437o578617n420986L85166L840830m32295p870745p997057
11990a1822450K429923J3289293J1462443k722182j3927539j0148530J764764
11983i674278O035009L67784k703383K469946N536339q29345o501393n55028Q584357
11974B730008N716131n484898q053408o0505L132018l127651l952486P917645
11966a183146J6094916N626221j1572204j3777970j195476Q058626O822150M029869
11958A2902986L790280n22853r206340j1614976m057777L236206L356895K323111
$$ plain form
11950 207532 4448230 6502126 -190801 -9834773 -8997813 1716483 5988283 -2851716
11942 -2851716 -10107211 -2985527 8295789 6843187 -3675089 -5698528 3180131 6798022
11934 6798022 -2585350 -11423974 -5882103 7914128 14522397 10832099 6057286 5499571
11926 5499571 5595347 3608008 1962309 1221426 -2873453 -11307564 -16747843 -12160927 -1130638
11917 -1130638 6484488 7884727 9556804 15008076 17698893 11407406 1947572 218493
11909 218493 6118031 9144558 5541232 4333722 12245925 22463494 25707989 24610477
11901 24610477 27497552 32934984 31019362 18516166 3767335 -3655026 -1905830 3589938
11893 3589938 4201156 -5761870 -21229492 -28572650 -22187017 -13154700 -12379902 -12433296 -245790
$$ packed form
11950B07532M240698K053896o692927r643972Q36960J0714296M271800q839999
11942b851716p255495P121684J1281316j452602j0518276k023439Q878659L617891
11934F798022r383372q838624N541871J3796231O608269l690298m774813n57715
11926E499571R5776j987339j645699p40883m094879q434111n440279M586916J1030289
11917a130638P615126J400239J672077N451272K690817o291487r459834j729079
11909B18493N899538L026527l603326j207510P912203J0217569L244495j097512
11901B4610477K887075N437432j915622j2503196j4748831p422361J749196N495768
11893C589938O11218r963026j5467622p343158O385633R032317P74798n3394J2187506
$$ plain form
11884 -245790 17766952 22237222 11935444 7422186 18323765 27223621 17129545 -2035142
11876 -2035142 -9109922 -1508798 6534099 7366927 5782690 5716668 5342181 4533756 6291252
11867 6291252 10610146 14494777 17031678 18690546 18314977 16068207 15247577 15904309 12150262
11858 12150262 1805177 -7619564 -9514339 -8050254 -9775575 -12469068 -11224906 -8658372
11850 -8658372 -9342216 -10726597 -9398379 -8947428 -10923773 -6661935 8618029 22006713
11842 22006713 19041696 6674912 2748187 8424735 10429595 6418359 6400259 10077734
11834 10077734 5458731 -7707150 -15073631 -12225347 -10137842 -10876261 -1517892 18435937
11826 18435937 27283409 12818012 -7024599 -11684611 -7407675 -10195606 -15987379 -10656989
$$ packed form
11884b45790J8012742M470270j0301778m513258J0901579Q899856j0094076j9164687
11876b035142p074780P601124Q042897Q32828j584237o6022l74487q08425J757496
11867F291252M318894L884631K536901J658868l75569k246770q20630O56732l754047
11858A2150262j0345085r424741j894775J464085j725321k693493J244162K566534
11850h658372o83844j384381J328218M50951j976345M261838J5279964J3388684
11842B2006713k965017j2366784l926725N676548K004860m011236j8100L677475
11834A0077734m619003j3165881p366481K848284K087505p38419R358369J9953829
11826A8435937Q847472j4465397j9842611m660012M276936k787931n791773N330390
$$ plain form
11818 -10656989 1492258 2851459 -9429202 -21241637 -23932849 -20202192 -10605703 6765385
11810 6765385 23609017 26354336 15568742 5262490 1681538 -2151881 -9339204 -12629165
11802 -12629165 -9038357 -6018469 -7173711 -5149271 4104007 11823056 9867838 4266635
11794 4266635 5837451 13612448 16724301 9603880 -1821284 -7899634 -5087894 1051297
11786 1051297 1346434 -6489201 -13750270 -11401722 -2870594 1206072 -391381 1230628
11778 1230628 7852706 9044356 64160 -7403349 -2252876 8016397 8708932 769009
11770 769009 -1893442 4891784 10017893 5579020 -2217255 -5114147 -4907351 -6622808
11762 -6622808 -7575289 -1565609 10101624 19054713 19580763 12912025 3858682 -2086855
$$ packed form
11818a0656989J2149247J359201j2280661j1812435k691212L730657R596489J7371088
11810F765385J6843632K745319j0785594j0306252l580952l833419p187323l289961
11802a2629165L590808L019888j155242K024440R253278P719049j955218n601203
11794D266635J570816P774997L111853p120421j1425164o078350K811740O139191
11786A051297K95137p835635p261069K348548Q531128M076666j597453J622009
11778A230628O622078J191650q980196p467509N150473J0269273O92535p939923
11770G69009k662451O785226N126109m438873p796275k896892K06796j715457
11762f622808r52481O009680J1667233Q953089N26050o668738r053343n945537
$$ plain form
11754 -2086855 -506884 7418426 13089355 8818052 -1829614 -7261765 -2390919 5117772
11746 5117772 5184605 -2499443 -9660834 -9623103 -2981984 4817198 8360425 5724818 -335947
11737 -335947 -4737954 -4679019 -1523374 1595350 2109613 -1546708 -8262784 -12659635 -9767169
11728 -9767169 -2797654 -1110582 -7708874 -14184980 -12111059 -3959981 2725361 6723726
11720 6723726 11542199 16611668 18346786 17444513 16883057 14424387 5425301 -8092149
11712 -8092149 -19335154 -26225133 -30338458 -28694878 -17823871 -5004594 -2105044 -6592616
11704 -6592616 -2769129 13944084 28369214 28081577 20519960 17836507 17575369 11348974
11696 11348974 2485338 32766 1879795 -940505 -6941197 -5919431 3343368 10644619
$$ packed form
11754b086855J579971P925310N670929m271303j0647666n432151M870846P508691
11746E117772O6833p684048p161391L7731O641119P799182L543227k635607o060765
11737c35947m402007N8935L155645L118724N14263l656321o716076m396851K892466
11728i767169O969515J687072o598292o476106K073921Q151078O685342L998365
11720F723726M818473N069469J735118r02273n61456k458670q999086j3517450
11712h092149j1243005o889979m113325J643580J0871007J2819277K899550m487572
11704f592616L823487J6713213J4425130k87637p561617k683453k61138o226395
11696A1348974q863636k452572J847029k820300o000692J021766R262799P301251
$$ plain form
11688 10644619 10060334 6322658 4728565 5693750 10480239 21284236 33009975 34915503
11680 34915503 24145424 9829736 1152906 -996326 1376113 8039908 15872529 17374275
11672 17374275 9005729 -4003530 -14257955 -18618734 -16593624 -9217721 -1880730 -823034
11664 -823034 -3586514 -584549 9934465 16903294 12156194 2899606 442444 3341353
11656 3341353 1845628 -5284646 -9661879 -7711721 -5211010 -5715737 -4384268 2336643
11648 2336643 8869410 8653506 4662499 4457286 7866038 7774238 2708253 -264886 1621097
11639 1621097 -521000 -14088595 -29665323 -29534741 -11464620 6486096 8834038 1414153
11631 1414153 594438 10760076 21599577 23915059 18322983 9150378 -960041 -8770401
$$ packed form
11688A0644619n84285l737676j594093R65185M786489J0803997J1725739J905528
11680C4915503j0770079j4315688q676830k149232K372439O663795P832621J501746
11672A7374275q368546j3009259j0254425m360779K025110P375903P336991J057696
11664h23034k763480L001965J0519014O968829m747100r256588k457162K898909
11656C341353j495725p130274m377233J950158K500711n04727J331469O720911
11648B336643O532767k15904l991007k05213L408752r1800n065985k973139J885983
11639A621097k142097j3567595j5576728J30582J8070121J7950716K347942p419885
11631A414153q19715J0165638J0839501K315482n592076r172605j0110419p810360
$$ plain form
11623 -8770401 -10635366 -8070645 -7468091 -11441603 -15251372 -14412954 -11145722 -9895320
11615 -9895320 -10167041 -7718184 -1055416 6261131 9330173 6808919 2564790 1896505
11607 1896505 4874673 5253154 -1349723 -10643173 -15479707 -16191658 -18687111 -23252669
11599 -23252669 -23345230 -17093685 -11836880 -13025689 -15347780 -10838511 -1341553 3620673
11591 3620673 -608014 -9125978 -15015318 -16946780 -17994468 -19668832 -19580284 -15363321
11583 -15363321 -9372580 -6656673 -7572200 -6357517 -177076 4679869 1621914 -4284947
11575 -4284947 -1561284 10747249 20171099 17200788 6903751 474894 1527430 5206068
11567 5206068 6285043 4083057 2296043 5764855 13902875 17570530 8782398 -6184924
$$ packed form
11623h770401j864965K564721O02554l973512l809769Q38418L267232J250402
11615i895320k71721K448857O662768P316547L069042k521254m244129o68285
11607A896505K978168L78481o602877r293450m836534p11951k495453m565558
11599b3252669r2561O251545N256805j188809k322091M509269R496958M962226
11591C620673m228687q517964n889340j931462j047688j674364Q8548M216963
11583a5363321N990741K715907r15527J214683O180441M856945l057955n906861
11575d284947K723663J2308533R423850k970311j0297037o428857J052536L678638
11567E206068J078975k201986j787014L468812Q138020L667655q788132j4967322
$$ plain form
11559 -6184924 -11771085 -3196427 7653597 9649092 5400614 1605708 -2373928 -7825893
11551 -7825893 -8787129 -1891347 3947570 -162388 -7695222 -6788499 -297742 -729461 -8100739
11542 -8100739 -9285661 -212493 7213450 4292920 -2675587 -5764464 -7599918 -11830064
11534 -11830064 -12252430 -2266330 11416559 15182715 5957812 -5990491 -10573695 -7996095
11526 -7996095 -5583066 -8764995 -15625889 -19098296 -15575272 -10555963 -11689556 -16910580
11518 -16910580 -16578920 -8916345 -4580068 -11005154 -20272257 -20000222 -9994240 729450
11510 729450 8577337 16494359 22754553 20253101 8997448 -181705 1141347 8291781
11502 8291781 10473497 4165370 -4615182 -8749658 -7126036 -4440480 -6001010 -12205379
$$ packed form
11559f184924n586161Q574658J0850024J995495m248478l794906l979636n451965
11551g825893r61236O895782N838917m109958p532834R06723O490757m31719p371278
11542h100739j184922R073168P425943k920530o968507l088877j835454m230146
11534a1830064m22366R986100J3682889L766156r224903j1948303m583204K577600
11526g996095K413029l181929o860894l472407L523024N019309j133593n221024
11518a6910580L31660P662575M336277o425086r267103K72035J0005982J0723690
11510G29450P847887P917022O260194k501452j1255653r179153J323052P150434
11502H291781K181716o308127q780552m134476J623622K685556j560530o204369
$$ plain form
11494 -12205379 -17857408 -18038509 -13613294 -8363204 -2328983 6907393 16325301 17371980
11486 17371980 6931541 -6666515 -13145253 -12337919 -11735317 -14255370 -14334580 -6530458
11478 -6530458 6565666 16667813 17584406 9837482 -292518 -5546375 -3468473 1525612
11470 1525612 2924595 -733285 -4671033 -3791383 1823824 7614337 9254217 6278600
11462 6278600 2219377 1210052 3186765 2908223 -3999809 -13943037 -17304776 -9125036
11454 -9125036 4353458 12022747 9490521 2100049 -2769466 -3603181 -4144506 -6928852
11446 -6928852 -9860207 -9941034 -8759441 -11271816 -17977338 -21335520 -13938164 682886
11438 682886 10353550 8685006 2556810 2164974 7638557 10448020 5863332 -1852354
$$ packed form
11494a2205379n652029j81101M425215N250090O034221R236376R417908J046679
11486A7371980j0440439j3598056o478738Q07334O02602k520053p9210P804122
11478f530458J3096124J0102147R16593p746924j0130000n253857K077902M994085
11470A525612J398983l657880l937748Q79650N615207N790513J639880k975617
11462F278600m059223j009325J976713k78542o908032r943228l361739Q179740
11454i125036J3478494P669289k532226p390472m869515q33715n41325k784346
11446f928852k931355q0827J181593k512375o705522l358182P397356J4621050
11438F82886R670664j668544o128196l91836N473583K809463m584688p715686
$$ plain form
11430 -1852354 -6788487 -8476062 -9475544 -9896790 -7820851 -3426915 572972 2474056
11422 2474056 3119906 3227520 1147200 -4683190 -11565108 -13528049 -7997291 522938
11414 522938 5834964 7270934 7860868 7043127 1466726 -6406437 -8197964 -1971258 2458825
11405 2458825 -2923053 -11343285 -10488457 -793275 5838899 4141176 1198693 2853866
11397 2853866 5519123 5496239 6300033 10553206 13197685 10296063 7349067 10084948 12769746
11388 12769746 5851647 -8246684 -17557631 -17476699 -14831401 -14561963 -12854730 -6800656
11380 -6800656 -1651157 -2725761 -6422683 -5359210 1494665 8871833 12099153 9355272
11372 9355272 438600 -11199200 -17480363 -12901418 -2371781 3249603 -565698 -9176689
$$ packed form
11430a852354m936133j687575r99482m21246K075939M393936L999887J901084
11422B474056O45850J07614k080320n830390o881918j962941N530758Q520229
11414E22938N312026J435970N89934q17741n576401p873163j791527O226706M430083
11405B458825n381878q420232Q54828R695182O632174j697723k942483J655173
11397B853866K665257k2884Q03794M253173K644479k901622k946996K735881K684798
11388A2769746o918099j4098331r310947Q0932K645298K69438J707233O054074
11380f800656N149499j074604l696922J063473O853875P377168L227320k743881
11372I355272q916672j1637800o281163M578945J0529637N621384l815301q610991
$$ plain form
11364 -9176689 -18148816 -28633081 -40437950 -46345626 -40214700 -27827520 -21874937 -25625904
11356 -25625904 -28651563 -21587094 -8788367 -1160473 -1508767 -4609990 -8910896 -18073943
11348 -18073943 -29499124 -31620736 -18995755 -3042135 515766 -9127166 -19570788
11341 -19570788 -23276096 -23886389 -24742828 -22311054 -15158237 -10000901 -11908778 -15179164
11333 -15179164 -11596174 -2851097 3251722 4974911 6100604 6213927 2161814 -1573279
11325 -1573279 4098900 16904900 21964687 12231041 -234547 -1464573 5056053 6791355
11317 6791355 2840824 3220119 10973316 18614246 22111124 25159505 27395052 21432531
11309 21432531 6838291 -4350813 -3178877 4409127 8631147 9885161 12969343 15442600
$$ packed form
11364i176689q972127j0484265j1804869n907676O130926J2387180N952583l750967
11356b5625904l025659P064469J2798727P627894l48294l101223m300906r163047
11348a8073943j1425181k121612J2624981J5953620L557901r642932j0443622
11341a9570788l705308o10293q56439K431774P152817N157336j907877l270386
11333a5179164L582990Q745077O102819J723189J125693J13323m052113l735093
11325a573279N672179J2806000N059787r733646j2465588j230026O520626J735302
11317F791355l950531L79295P753197P640930L496878L048381K235547n962521
11309B1432531j4594240j1189104J171936P588004M222020J254014L084182K473257
$$ plain form
11301 15442600 12650730 8522142 9605771 12039432 6483044 -5709704 -13197498 -11560675
11293 -11560675 -8106854 -8531648 -9972063 -10063615 -12107257 -16779450 -18204011 -13496334
11285 -13496334 -7902185 -5287493 -1813769 5138644 10185262 9161286 7069779 8346353
11277 8346353 6804214 -4122102 -17152574 -19617168 -12629652 -8548479 -10363474 -7815593
11269 -7815593 3399379 12337364 9174866 -299287 -5169812 -5749228 -9272944 -15111807
11261 -15111807 -15655081 -9828249 -5168392 -5873042 -7715544 -6612802 -4356576 -3228948
11253 -3228948 -2149779 -1435225 -4322110 -9567925 -9736999 -2585209 3091172 905332
11245 905332 -789649 8577169 21678734 20540605 4004475 -7789718 -1622936 10480993
$$ packed form
11301A5442600k791870m128588J083629K433661n556388j2192748p487794J636823
11293a1560675L453821m24794j440415r1552k043642m672193j424561M707677
11285a3496334N594149K614692L473724O952413N046618j023976k091507J276574
11277H346353j542139j0926316j3030472k464594O987516M081173j814995K547881
11269g815593J1214972Q937985l162498r474153m870525n79416l523716n838863
11261a5111807n43274N826832M659857p04650j842502J102742K256226J127628
11253c228948J079169P14554k886885n245815j69074P151790N676381k185840
11245I05332j694981R366818J3101565j138129j6536130j1794193O166782J2103929
$$ plain form
11237 10480993 10637621 1028650 -2575157 4303426 11038639 10384363 7236072 7671376
11229 7671376 9853195 8788033 2901246 -6242483 -15387472 -20307269 -20136824 -20083622 -24481725
11220 -24481725 -29383781 -28480096 -23123293 -18315759 -12672442 -3260727 3016555 -2950955
11212 -2950955 -14325210 -13861337 28006 9425753 4232400 -4077830 -4571184 -4902639
11204 -4902639 -13725935 -21045306 -14666847 -4719750 -9979644 -25409958 -26129851 -4594836
11196 -4594836 16964303 17275700 2424884 -7418594 -5114614 243084 -409364 -6771540
11188 -6771540 -12964254 -13620973 -7812260 -1204683 -2217673 -12348080 -22218852 -20839791
11180 -20839791 -8137397 4163962 4226711 -8115557 -20954095 -21670075 -9111060 6116354
$$ packed form
11237A0480993J56628r608971l603807O878583O735213o54276l148291M35304
11229G671376K181819j065162n886787r143729r144989m919797J70445N3202m398103
11220b4481725m902056R03685N356803M807534N643317R411715O277282n967510
11212b950955j1374255M63873J3889343R397747n193353q310230m93354l31455
11204d902639q823296p319371O378459R947097n259894j5430314p19893K1535015
11196d594836K1559139L11397j4850816r843478K303980N357698o52448o362176
11188f771540o192714o56719N808713O607577j012990j0130407r870772J379061
11180b0839791J2702394J2301359O2749j2342268j2838538p15980J2559015J5227414
$$ plain form
11172 6116354 13271048 10816961 3449567 -5622750 -15316319 -22600127 -23426633 -17786840
11164 -17786840 -10357555 -6103384 -7131118 -12152692 -16481461 -14825847 -7437559 -1474166
11156 -1474166 -2809422 -8469596 -10634027 -6112900 1331464 5552837 1915328 -9527593
11148 -9527593 -20701476 -19887542 -5192943 10183330 12533871 3892138 -3334008 -3985451
11140 -3985451 -2952395 -2429531 2538829 13759899 24095245 25975675 20248319 13614194
11132 13614194 11062545 12333678 12882564 8438461 1197081 -1083460 3888726 7306316
11124 7306316 1593777 -6117988 -2991758 9336083 15348962 7079804 -6451527 -13704206
11116 -13704206 -13687430 -10632184 -5771727 -126577 2614645 1639105 813895 755754 -3282701
$$ packed form
11172F116354P154694k454087p367394r072317r693569p283808q26506N639793
11164a7786840P429285M254171j027734n021574m328769J655614P388288N963393
11156a474166j335256n660174k164431M521127P444364M221373l637509j1442921
11148i527593j1173883Q13934J4694599J5376273K350541q641733p226146o51443
11140c985451J033056N22864M968360J1221070J0335346J880430n727356o634125
11132A3614194k551649J271133N48886m444103p241380k280541M972186L417590
11124G306316n712539p711765L126230J2327841O012879q269158j3531331p252679
11116a3704206J6776L055246M860457N645150K741222r75540q25210n8141m038455
$$ plain form
11107 -3282701 -11023389 -13439039 -6354816 57498 -5712761 -19427954 -26262104 -19879779
11099 -19879779 -7843270 180381 1539648 -1640288 -6330570 -8679411 -5686973 775818
11091 775818 4709711 2658303 -2076792 -3387500 108734 3013808 -105072 -6729547
11083 -6729547 -8799971 -4633582 -3293691 -11973183 -23640950 -25539619 -17369918 -10780125
11075 -10780125 -11129014 -11472031 -7181026 -4119882 -6206814 -6332503 1117328 7976058
11067 7976058 3856318 -6478383 -9728531 -4629199 -3294646 -12201419 -23415708 -27358620
11059 -27358620 -24692441 -21014808 -17026421 -9991456 -1148880 4048830 2620500 -2238128
11051 -2238128 -4687432 -2371096 1402467 1656885 -2364041 -6471083 -7079268 -5743568
$$ packed form
11107c282701p740688k415650P084223O412314n770259j3715193o834150O382325
11099a9879779J2036509Q023651J359267l179936m690282k348841K992438O462791
11091G75818L933893k051408m735095j310708L496234K905074l118880o624475
11083f729547k070424M166389J339891q679492j1667767j898669Q169701O589793
11075a0780125l48889l43017M291005L061144k086932j25689P449831O858730
11067G976058m119740j0334701l250148N099332J334553q906773j1214289l942912
11059b7358620K666179L677633L988387P034965Q842576N197710j428330m858628
11051b238128k449304K316336L773563K54418m020926m107042o08185J335700
$$ plain form
11043 -5743568 -6656752 -10681731 -13693046 -11172243 -4010043 894597 -2593729 -11775992
11035 -11775992 -16514693 -11156020 -1911153 2073393 1853393 5862130 15428473 21849709
11027 21849709 19127282 11128992 3428934 -3459714 -8673744 -7599080 -351950 3617818
11019 3617818 -2737945 -12988763 -15691281 -9626854 -2597187 1278127 4010870 5477966
11011 5477966 2409338 -3257510 -3112241 7281516 21414844 28214394 22950201 10541373
11003 10541373 145911 -2554801 1139599 6424263 10922378 15016014 17214479 14121194
10995 14121194 6414284 -198554 -2446177 -2972985 -3935788 -3377630 -1681728 -4349655
10987 -4349655 -12289383 -16279274 -9307880 1265236 3590923 -718181 539773 10944311
$$ packed form
11043e743568r13184m024979l011315K520803P162200M904640l488326r182263
11035a1775992m738701N358673R244867L984546k20000M008737R566343O421236
11027B1849709k722427p998290p700058o888648n214030J074664P247130L969768
11019C617818o355763j0250818k702518O064427P029667L875314K732743J467096
11011E477966l068628n666848J45269J0393757J4133328O799550n264193j2408828
11003A0541373j0395462k700712L694400N284664M498115M093636K198465l093285
10995A4121194p706910o612838k247623n26808r62803N58158J695902k667927
10987d349655p939728l989891O971394J0573116K325687m309104J257954J0404538
$$ plain form
10979 10944311 20064713 18273901 7768104 -3017256 -8293753 -6552411 -371554 3695004
10971 3695004 1187219 -3561319 -3126573 1134469 1516650 -1407760 2398720 15310965
10963 15310965 24844725 20988406 11726206 11394499 19630474 23304260 16976777 9777457
10955 9777457 10205231 13990190 12077861 4013061 -3076037 -5401714 -5841931 -7050317
10947 -7050317 -7333328 -5225136 -3395864 -4256440 -4498473 1217616 11634057 18365612
10939 18365612 15250358 5362275 -2469477 -1957426 6200138 15274121 17237491 9764005
10931 9764005 -390671 -4036202 -313132 2940315 357141 -4486487 -5873574 -3814552
10923 -3814552 -1506902 298982 1933949 1556473 -2357286 -8159134 -13578371 -16971628
$$ packed form
10979A0944311R120402j790812j0505797j0785360n276497J741342O180857M066558
10971C695004k507785m748538M34746M261042L82181k924410L806480J2912245
10963A5310965R533760l856319r262200l31707Q235975L673786o327483p199320
10955I777457M27774L784959j912329q064800p089098k325677m40217j208386
10947g050317k83011K108192J829272q60576k42033N716089J0416441O731555
10939A8365612l115254r888083p831752N12051Q157564R073983J963370p473486
10931I764005j0154676l645531L723070L253447k583174m843628j387087K059022
10923c814552K307650J805884J634967l77476l913759n801848n419237l393257
$$ plain form
10915 -16971628 -13815015 607395 19885992 26566129 13074846 -3956425 -2114335
10908 -2114335 17921434 34618126 34770717 26385204 21191574 18860364 14446058 9722196
10900 9722196 8719449 9697790 9285233 9073428 11565894 14356428 14290983 13140243 13646425
10891 13646425 14069782 12065761 9922374 10242754 10088725 5425960 -1550638 -5349315
10883 -5349315 -4836403 -2407172 1629030 7655453 12296100 12174745 10242899 11322555
10875 11322555 13194103 10399109 5762376 7944661 16290575 19252677 12309375 6568636
10867 6568636 11784729 20324257 19069985 10460258 8025302 13916707 15808406 7733141
10859 7733141 -382457 509784 4812920 3550601 -1026388 -2365366 -2706025 -7091244
$$ packed form
10915a6971628L156613J4422410J9278597O680137j3491283j7031271J842090
10908b114335K0035769J6696692J52591q385513n193630k331210m414306m723862
10900I722196j002747R78341m12557k11805K492466K790534o5445j150740N06182
10891A3646425M23357k004021k143387L20380j54029m662765o976598l798677
10883e349315N12912K429231M036202O026423M640647j21355j931846J079656
10875A1322555J871548k794994m636733K182285Q345914K962102o943302n740739
10867F568636N216093Q539528j254272q609727k434956N891405J891699q075265
10859G733141q115598Q92241M303136j262319m576989j338978l40659m385219
$$ plain form
10851 -7091244 -10338650 -3747988 8130777 11615256 4600542 -830143 1431427 2822687
10843 2822687 -3332200 -9650764 -7272403 -336018 1493638 -2660300 -7231746 -10666615
10835 -10666615 -14278778 -15427117 -10876109 -3609527 1628519 6176137 13143349 19081150
10827 19081150 18711892 15088827 15781164 20598869 22295016 18692207 14808933 12525132
10819 12525132 7437075 -1700155 -8422612 -7127123 -586469 4320250 4278346 641264
10811 641264 -3624358 -6157162 -6732581 -7313880 -8865206 -9265030 -6869610 -3947518 -3051500
10802 -3051500 -2666133 -935223 -570088 -4068209 -6806533 -2301233 7037146 12078480
10794 12078480 9517647 4675003 1681962 -968611 -3528106 -1638233 6618006 16174056
$$ packed form
10851g091244l247406O590662J1878765L484479p014714n430685K261570J391260
10843B822687o154887o318564K378361O936385J829656m153938m571446l434869
10835a0666615l612163j148339M551008P266582N238046M547618O967212N937801
10827A9081150l69258l623065O92337M817705J696147l602809l883274k283801
10819A2525132n088057r137230o722457J295489O540654M906719m1904l637082
10811F41264m265622k532804n75419n81299j551326l99824K395420K922092Q96018
10802c051500L85367J730910L65135l498121k738324M505300R338379N041334
10794A2078480k560833m842644k993041k650573k559495J889873Q256239R556050
$$ plain form
10786 16174056 20980768 20281607 16374305 10102784 1222727 -9200905 -18068672 -20602480
10778 -20602480 -13388491 -680084 5162213 -4090421 -20912638 -29224407 -22884648 -10529580
10770 -10529580 -2561954 -1126436 -3781764 -8819741 -13903468 -15901344 -15362712 -16333228
10762 -16333228 -19585195 -20706315 -16538857 -9091809 -2135606 1805009 1367389 -1715439
10754 -1715439 -1804819 3382350 6678238 653297 -9080544 -10150825 -2347410 2018228
10746 2018228 -1790918 -3926008 2490498 10058244 10647446 8417298 10135908 12666952
10738 12666952 10607849 8066701 11361386 16099323 13163538 3725364 -2406229 -926214
10730 -926214 3883206 7898921 10008276 8331812 2671653 -732664 4013621 11602482
$$ packed form
10786A6174056M806712o99161l907302o271521q880057j0423632q867767k533808
10778b0602480P213989J2708407N842297r252634j6822217q311769O339759J2355068
10770a0529580P967626J435518k655328n037977n083727j997876N38632r70516
10762a6333228l251967j121120M167458P447048O956203L940615m37620l082828
10754a715439q9380N187169L295888o024941r733841j070281P803415M365638
10746B018228l809146k135090O416506P567746N89202k230148J718610K531044
10738A2666952k059103k541148L294685M737937k935785r438174o131593J480015
10730i26214M809420M015715K109355j676464n660159l404317M746285P588861
$$ plain form
10722 11602482 10574934 -297221 -9544014 -8761722 -2719928 -407652 -2751820 -3986141
10714 -3986141 -1025218 3321024 4816844 1988711 -3871041 -10457366 -15038326 -14311077
10706 -14311077 -6661184 3238693 5074098 -6083536 -19979104 -20022587 -4387263 9501400
10698 9501400 6582658 -6853917 -13101348 -6330794 3185460 5166469 272361 -4700000
10690 -4700000 -4817043 428330 6752595 7608163 2275230 -612374 5701189 14030209
10682 14030209 11768228 270145 -5732654 123093 6738582 3386773 -4598822 -6350219
10674 -6350219 -2642808 -2000231 -5895324 -9448809 -13113069 -21081745 -28792532 -24846477
10666 -24846477 -8286803 7167288 11001286 8302551 8111638 8719580 3724943 -4305596
$$ packed form
10722A1602482j027548j0872155r246793P82292O041794K312276k344168j234321
10714c986141K960923M346242J495820k828133n859752o586325m580960P27249
10706a4311077P649893R899877J835405j1157634j3895568m3483J5635324J3888663
10698I501400k918742j3436575o247431O770554R516254J981009m894108m972361
10690d700000j17043N245373O324265Q55568n332933k887604O313563Q329020
10682A4030209k261981j1498083o002799N855747O615489l351809p985595j751397
10674f350219L707411O42577l895093l553485l664260p968676p710787L946055
10666b4846477J6559674J5454091L833998k698735j90913O07942m994637q030539
$$ plain form
10658 -4305596 -7650728 -7406306 -11757114 -20516584 -22937884 -14143600 -4130138 -4759193
10650 -4759193 -14184802 -20179599 -15263577 -3608217 5105444 5359466 444055 -1377169
10642 -1377169 3264274 8046209 5662165 -855405 -2109168 3553816 8484524 8554954
10634 8554954 7533400 6797481 2198577 -4364218 -2284386 11485151 24648722 27199770
10626 27199770 26219340 31784671 37887418 31731697 15634905 4630157 5207016 9788291
10618 9788291 10677917 7576573 2447371 -2608849 -4110766 -3015340 -7654593 -20520682
10610 -20520682 -28058935 -17336905 1901559 7664103 -4435859 -17980971 -21012884
10603 -21012884 -17538920 -13492379 -8404373 -3545348 -2682084 -2147582 4972415 13409248
$$ packed form
10658d305596l345132K44422m350808q759470k421300Q794284J0013462o29055
10650d759193r425609n994797M916022J1655360Q713661K54022m915411j821224
10642a377169M641443M781935k384044o517570j253763N662984M930708P0430
10634H554954j021554p35919m598904o562795K079832J3769537J3163571K551048
10626B7199770r80430N565331O102747o155721j6096792j1004748N76859M581275
10618I788291Q89626l101344n129202n056220j501917J095426m639253j2866089
10610b0520682p538253J0722030J9238464N762544j2099962j3545112l031913
10603b1012884L473964M046541N088006M859025Q63264N34502P119997Q436833
$$ plain form
10595 13409248 10787920 -471950 -4609920 1460425 3682121 -2855338 -5161651 1453299
10587 1453299 798909 -16782792 -34008419 -30947979 -14514099 -5457271 -7559596 -8438919
10579 -8438919 -3244772 616570 -849052 -2741108 -1015393 2329663 3310784 -512466
10571 -512466 -7790814 -11634680 -6150641 3049501 3983181 -3537398 -6881842 -1693274
10563 -1693274 586218 -6638416 -12144943 -5010978 7748043 13375233 11399860 7710774
10555 7710774 1890761 -7000896 -11858465 -7184488 769093 3864544 3616027 4174264
10547 4174264 4057447 3457552 7910762 15579584 14286974 1646049 -6102454 2735601
10539 2735601 17532523 23231598 21086601 17954450 10712034 -2710924 -11591073 -8512826
$$ packed form
10595A3409248k621328j1259870m137970O070345K221696o537459k306313O614950
10587A453299o54390j7581701j7225627L060440J6433880R056828k102325q79323
10579h438919N194147L861342j465622j892056J725715L345056R81121l823250
10571e12466p278348l843866N484039R200142R33680p520579l344444N188568
10563a693274K279492p224634n506527P133965J2759021N627190j975373l689086
10555G710774n820013q891657m857569M673977P953581L095451k48517N58237
10547D174264j16817n99895M453210P668822j292610j2640925p748503Q838055
10539B735601J4796922N699075k144997l132151p242416j3422958q880149L078247
$$ plain form
10531 -8512826 -3285348 -4605358 -3281674 8491422 17460500 9546120 -4971550 -7915097
10523 -7915097 -1236455 2586741 4017533 8230503 7892703 -2336278 -8152751 3318982
10515 3318982 18762611 19463796 11819170 11308637 12328926 2444242 -9327792 -8518130
10507 -8518130 -3442230 -6879154 -7951757 4409626 10924149 -6765691 -25949224 -17125650
10499 -17125650 3837963 5929795 1035121 15564696 29629106 12166043 -7511728
10492 -7511728 15198528 45497559 23398186 4217378 113221810 328452578 445178779
10485 445178779 333762532 120106444 9839915 26026515 41833819 3630760 -22696979
10478 -22696979 -2387256 12324470 -7681360 -17430145 9847713 30565191 9871666
$$ packed form
10531h512826N227478j320010J323684J1773096Q969078p914380j4517670k943547
10523g915097O678642L823196J430792M212970l37800j0228981n816473J1471733
10515C318982J5443629P01185p644626n10533J020289r884684j1772034Q09662
10507h518130N075900l436924j072603J2361383O514523j7689840j9183533Q823574
10499a7125650K0963613K091832m894674J4529575J4064410j7463063j9677771
10492g511728K2710256L0299031k2099373j9180808J09004432K15230768J16726201
10485D45178779j11416247k13656088j10266529J6186600J5807304l8203059k6327739
10478b2696979K0309723J4711726k0005830r748785K7277858K0717478k0693525
$$ plain form
10471 9871666 -20373910 -22512015 -11575277 -14080979 -19688979 -12367309 -6648752 -15919108
10463 -15919108 -21118809 -5691371 10438822 4894381 -8063930 -5256248 3895046 -3193403
10455 -3193403 -21354404 -28281311 -21271355 -14539244 -11536043 -6004060 -1284125 -4942845
10447 -4942845 -11153949 -8731968 -538988 2611257 966766 2709793 8007820 10899277
10439 10899277 11394542 12729170 12637305 9237532 8855926 16231742 23604391 21067444 11493485
10430 11493485 4391860 1616212 24925 1420919 7956468 13210738 9690074 1244731
10422 1244731 -2619091 -1273176 -1806119 -6225733 -9254366 -7284155 -1902172 4080359
10414 4080359 8242976 8325181 5259851 3863596 6760165 10916518 12637097 11044813
$$ packed form
10471I871666l0245576k138105J0936738k505702n608000P321670N718557r270356
10463a5919108n199701J5427438J6130193n544441j2958311K807682R151294p088449
10455c193403j8161001o926907P009956O732111L003201N531983M719935l658720
10447d942845o211104K421981Q192980L150245j644491J743027N298027K891457
10439A0899277M95265J334628r1865l399773l81606P375816P372649k536947r573959
10430A1493485p101625k775648j591287J395994O535549N254270l520664q445343
10422A244731l863822J345915n32943m419614l028633J970211N381983N982531
10414D080359M162617Q2205l065330j396255K896569M156353J720579j592284
$$ plain form
10406 11044813 4972508 -5956947 -14438382 -9413802 7715161 20346178 17235855 6900329
10398 6900329 3325269 5941244 3999423 -5654113 -15784836 -19531540 -15093762 -3908019
10390 -3908019 7799920 10720326 4233013 918352 9799319 21002104 18750798 4635662
10382 4635662 -6014984 -8177965 -11509345 -19477903 -20844729 -8883322 4597706 5113889
10374 5113889 -3740486 -7223265 -1737044 2385172 -888931 -4581668 -1446562 4584552
10366 4584552 5994359 3693533 3485881 4925037 2929397 -1068001 450141 7907364
10358 7907364 11322484 4477244 -5429927 -7782775 -1553612 7524351 16033564 21865862
10350 21865862 20534543 11632330 4299575 6645606 13188861 12294988 2758893 -7042035
$$ packed form
10406A1044813o072305j0929455q481435N024580J7128963J2631017l110323j0335526
10398F900329l575060K615975j941821r653536j0130723l746704M437778J1185743
10390c908019J1707939K920406o487313l314661Q880967J1202785k251306j4115136
10382D635662j0650646k162981l331380p968558j366826J1961407J3481028N16183
10374E113889q854375l482779N486221M122216l274103l692737L135106O031114
10366D584552J409807k300826k07652J439156j995640l997398J518142P457223
10358G907364L415120o845240r907171k352848O229163R077963Q509213N832298
10350B1865862j331319q902213p332755K346031O543255q93873r536095r800928
$$ plain form
10342 -7042035 -13110238 -17590031 -19354085 -15494245 -10639949 -11389356 -12415483 -3204547
10334 -3204547 10935221 11969573 -2794022 -13483849 -6306817 6943183 8654304 264240
10326 264240 -5575071 -5940541 -6358816 -7013730 -4316018 -484084 766020 2687897 8136350
10317 8136350 10059575 2584685 -3984949 5058442 24364440 32145593 19960424 4039204
10309 4039204 1916964 10048336 12334238 2710855 -9385189 -12863358 -7660168 -3140262
10301 -3140262 -6480919 -14141750 -16293895 -9613796 -1790618 -1106619 -6091776 -9530721
10293 -9530721 -8180897 -3228556 4335667 12046954 13696836 6564002 -2317797 -5478327
10285 -5478327 -7263723 -16496261 -29127862 -30898948 -18561818 -5800896 -3789857 -7521848
$$ packed form
10342g042035o068203m479793j764054L859840M854296p49407j026127R210936
10334c204547J4139768J034352j4763595j0689827P177032J3250000J711121q390064
10326B64240n839311l65470m18275o54914K697712L831934J250104J921877N448453
10317H136350J923225p474890o569634R043391J9305998P781153j2185169j5921220
10309D039204k122240Q131372K285902r623383j2096044l478169N203190M519906
10301c140262l340657p660831k152145O680099P823178O83999m985157l438945
10293i530721J349824M952341P564223P711287J649882p132834q881799l160530
10285e478327j785396r232538j2631601j771086J2337130J2760922K011039l731991
$$ plain form
10277 -7521848 -7952015 -6861864 -9973271 -13535646 -9972320 -2907138 -3903594 -13759353
10269 -13759353 -18313905 -7292554 10666960 18299834 10893236 443929 -712056 5421241
10261 5421241 6845463 -2529239 -15738039 -22198902 -20624517 -18694085 -20896079 -22098711
10253 -22098711 -16033754 -5884868 -656984 -2562075 -5086783 -4934419 -8068776 -18415235
10245 -18415235 -26776900 -20196132 -422470 16446399 19766921 14827715 10864205 8240209
10237 8240209 3768061 532154 3001088 6975603 4149690 -5037252 -11482501 -9565608
10229 -9565608 -1978247 6491407 12693466 13874436 10589952 9776211 16320346 22599535
10221 22599535 16547090 71903 -12209324 -14158152 -14821658 -19697917 -19713182 -8066869
$$ packed form
10277g521848m30167J090151l111407l562375L563326P065182r96456r855759
10269a3759353m554552J1021351J7959514P632874p406598j0449307j155985O133297
10261E421241J424222r374702j3208800o460863J574385J930432k201994j202632
10253b2098711O064957J0148886N227884j905091k524708J52364l134357j0346459
10245a8415235q361665O580768J9773662J6868869L320522m939206l963510k623996
10237H240209m472148l235907K468934L974515k825913r186942o445249J916893
10229i565608P587361Q469654O202059J180970l284484q13741O544135O279189
10221B2599535o052445j6475187j2281227j948828o63506m876259j5265J1646313
$$ plain form
10213 -8066869 4220684 2441122 -10213800 -18711979 -18637859 -18395287 -20932388 -18006635
10205 -18006635 -5875816 5197809 3997027 -5987920 -11433601 -7348582 -3601052 -10873462
10197 -10873462 -23779734 -24463359 -5637892 16339313 19726161 5287469 -6069105
10190 -6069105 -3661439 229920 -6256769 -14854228 -13652337 -9442561 -14855528 -21893896
10182 -21893896 -11117973 14011005 25278842 8693511 -14322065 -16044358 2162199
10175 2162199 17490031 18240807 12728211 10211941 8704514 3823061 -1597428 -2124481
10167 -2124481 1751146 4521780 3097729 391752 1521649 7361019 12560714 10970764
10159 10970764 2897222 -4756364 -5978738 -1496830 3326669 4496424 2569826 1340206
$$ packed form
10213h066869J2287553j779562j2654922q498179P4120K42572k537101K925753
10205a8006635J2130819J1073625j200782r984947n445681M085019L747530p272410
10197a0873462j2906272o83625J8825467K1977205L386848j4438692j1356574
10190f069105K407666L891359o486689q597459J201891M209776n412967p038368
10182b1893896J0775923K5128978J1267837j6585331k3015576j722293J8206557
10175B162199J5327832P50776n512596k516270j507427m881453n420489n27053
10167b124481L875627K770634j424051k705977J129897N839370N199695j589950
10159A0970764q073542p653586j222374M481908M823499J169755j926598j229620
$$ plain form
10151 1340206 3562497 6835879 5115120 -3059156 -9786396 -6118020 5519295 13183091
10143 13183091 10662883 4553114 3450825 6264593 6042649 992749 -3931965 -4211584
10135 -4211584 68344 5721074 8629342 6309227 1616540 1513379 8403917 15368756
10127 15368756 14713046 8847243 6781622 11104134 15130803 13417103 8478188 4978956
10119 4978956 3101841 1022743 -720741 -1388910 -3169972 -7994146 -13450166 -15502451
10111 -15502451 -13442630 -9050989 -3238349 2712440 5014577 1457085 -3772238 -4645241
10103 -4645241 -2091363 -2636800 -8007150 -12036298 -9467678 -2377287 4113617 7082109
10095 7082109 4585494 -4487951 -15632920 -19853227 -14427146 -7128522 -4846486 -4532984
$$ packed form
10151A340206K222291L273382j720759q174276o727240L668376J1637315P663796
10143A3183091k520208o109769j102289K813768k21944n049900m924714k79619
10135d211584M279928N652730K908268k320115m692687j03161O890538O964839
10127A5368756o55710n865803k065621M322512M026669j713700m938915l499232
10119D978956j877115k079098j743484o68169j781062m824174n456020k052285
10111a5502451K059821M391641N812640N950789K302137l557492n229323q73003
10103d645241K553878n45437n370350m029148K568620P090391O490904K968492
10095G082109k496615r073445j1144969m220307N426081P298624K282036L13502
$$ plain form
10087 -4532984 -1909424 -1415771 -7277217 -11219357 -2922789 10522701 11423649 -1561421
10079 -1561421 -9515389 -873961 12529731 14904852 7933586 1965363 -2196199 -9252920
10071 -9252920 -15950545 -16163727 -13731227 -16024606 -18832800 -12341577 83284 4365644
10063 4365644 -2784868 -9724798 -9346856 -7835669 -9487660 -7570891 1501436 7463604
10055 7463604 729522 -11133319 -13266639 -4541390 2633081 866680 -4519183 -6460804
10047 -6460804 -5696482 -6600694 -9325054 -9577117 -4019358 5804140 14158551 15715255 10007153
10038 10007153 921650 -7248635 -10922421 -6302753 6752011 19537512 20533020 9707196
10030 9707196 -123450 -426431 2121230 -1804192 -8465566 -7859604 -892072 2265373
$$ packed form
10087d532984K623560M93653n861446l942140Q296568J3445490R00948j2985070
10079a561421p953968Q641428J3403692K375121o971266n968223m161562p056721
10071i252920o697625k13182K432500k293379k808194O491223J2424861M282360
10063D365644p150512o939930L77942J511187j651991J916769R072327N962168
10055G463604o734082j1862841k133320Q725249P174471j766401n385863j941621
10047f460804P64322r04212k724360k52063N557759R823498Q354411J556704n708102
10038A0007153r085503q170285l673786M619668J3054764J2785501R95508j0825824
10030I707196r830646l02981K547661l925422o661374O05962O967532L157445
$$ plain form
10022 2265373 -884142 -2038413 3088319 8278826 8453676 7597659 10019055 12380700
10014 12380700 10659613 7858133 7680027 6225483 -1959872 -12964399 -16626680 -9710947
10006 -9710947 98080 3150841 -3638896 -16223512 -26777356 -28169073 -19435032 -7131165
9998 -7131165 1425866 5430931 8707007 12718310 15179779 14026989 9073669 1355482
9990 1355482 -5698755 -7130013 -3062714 -1372586 -7655914 -15433315 -14282286 -5852776
9982 -5852776 -2003420 -6759176 -11083506 -8762691 -6470191 -11462343 -18491805 -18001394
9974 -18001394 -11126625 -6936694 -8415739 -10413008 -9645624 -8032124 -6392918 -2663254
9966 -2663254 2638771 5577867 4891493 3888142 5102536 7365581 9010663 9924910 9610841
$$ packed form
10022B265373l149515j154271N126732N190507J74850q56017K421396K361645
10014A2380700j721087k801480j78106j454544q185355j1004527l662281O915733
10006i710947R809027L052761o789737j2584616j0553844j391717Q734041J2303867
9998g131165Q557031M005065L276076M011303K461469j152790m953320p718187
9990A355482p054237j431258M067299J690128o283328p777401J151029Q429510
9982e852776L849356m755756m324330K320815K292500m992152p029462M90411
9974a8001394O874769M189931j479045j997269P67384J613500J639206L729664
9966b663254N302025K939096o86374j003351J214394K263045J645082R14247l14069
$$ plain form
9957 9610841 7043473 3598498 3143864 8052746 16491207 23190929 22090934 11235475
9949 11235475 -2279888 -5903235 5388086 22475667 32533906 32011888 24244032 10456826
9941 10456826 -7361655 -19210477 -15441841 -2016892 4684630 -402504 -6401379 -5646487
9933 -5646487 -3920766 -6477105 -7662574 -3394751 -1851265 -9787048 -17656168 -12555189
9925 -12555189 -150467 1442590 -12061841 -25112013 -24006042 -12322684 -1316885
9918 -1316885 4423023 6300654 4889380 460758 -4398894 -8058783 -12261709 -17018310
9910 -17018310 -16921020 -8010297 4108324 9182750 5142777 335079 1652849 6089859
9902 6089859 7722814 8018508 12256695 17905889 15651799 4212965 -4425647 -263616
$$ packed form
9957I610841k567368l444975m54634M908882Q438461O699722j099995j0855459
9949A1235475j3515363l623347J1291321J7087581J0058239n22018p767856j3787206
9941A0456826j7818481j1848822L768636J3424949O701522n087134n998875P54892
9933e646487J725721k556339j185469M267823J543486p935783p869120N100979
9925a2555189J2404722J593057j3504431j3050172J105971J1683358J1005799
9918a316885N739908J877631j411274m428622m859652l659889m202926m756601
9910a7018310R7290Q910723J2118621N074426m039973m807698J317770M437010
9902F089859J632955K95694M238187N649194k254090j1438834q638612M162031
$$ plain form
9894 -263616 10769225 15369172 10163534 1920771 -5263742 -12501416 -17941633 -17305197
9886 -17305197 -12628088 -9996431 -8533889 -2881896 3556201 1629515 -6026379 -6577401
9878 -6577401 370941 524398 -7538984 -4464319 15794112 25798198 2048133 -33501981
9870 -33501981 -38805472 -10815274 11948787 5587540 -11673299 -15409518 -9028591 -6627654
9862 -6627654 -5571569 3017522 11924703 7737826 -5415548 -11799889 -9472100 -11599664
9854 -11599664 -22972347 -31604970 -27315367 -16088941 -10283943 -12947888 -17643151 -18550979
9846 -18550979 -15344810 -10579699 -6602996 -4808051 -5443295 -7228613 -7829356 -5853010
9838 -5853010 -2763712 -1324906 -886566 3401605 13399278 22026724 19765490 6976312
$$ packed form
9894b63616J1032841M599947n205638q242763p184513p237674n440217O36436
9886a7305197M677109K631657J462542N651993O438097j926686p655894n51022
9878f577401O948342J53457q063382L074665K0258431J0004086k3750065l5550114
9870c3501981n303491K7990198K2764061o361247j7260839l736219O380927K400937
9862f627654J056085Q589091Q907181m186877j3153374o384341K327789k127564
9854a1599664j1372683q632623M289603J1226426N804998k663945m695263r07828
9846a8550979L206169M765111L976703J794945o35244j785318o00743J976346
9838e853010L089298J438806M38340M288171R997673Q627446k261234j2789178
$$ plain form
9830 6976312 -5555473 -9168194 -5367575 -429234 2283285 2427926 336879 -2521431
9822 -2521431 -4499297 -6676805 -10460076 -11918513 -5331420 5771380 9170905 -116125
9814 -116125 -11778227 -13689628 -6958709 -1135802 -558208 -3287757 -8604133 -16235270
9806 -16235270 -20620521 -15047512 -1480866 10565477 14817527 12358468 6550192 668502
9798 668502 -353950 6393160 15395892 16915304 9478165 2197011 2441489 6863444 7821477
9789 7821477 3979662 468209 1423445 6137567 11133292 13034556 9859752 1732024
9781 1732024 -8856931 -17685707 -20407764 -15379785 -6111111 720892 1450795 -1851239
9773 -1851239 -6139949 -11597294 -17821683 -19569938 -12492660 -1485875 3851204 2484951
$$ packed form
9830F976312j2531785l612721L800619M938341K712519J44641k091047k858310
9822b521431j977866k177508l783271j458437O587093J1102800L399525r287030
9814a16125j1662102j911401O730919N822907N77594k729549n316376p631137
9806a6235270m385251N573009J3566646J2046343M252050k459059n808276n881690
9798F68502j022452O747110R002732J519412p437139p281154K44478M421955R58033
9789G821477l841815l511453R55236M714122M995725J901264l174804q127728
9781A732024j0588955q828776k722057N027979R268674O832003P29903l302034
9773a851239m288710n457345o224389j748255P077278J1006785N337079j366253
$$ plain form
9765 2484951 3287759 10891353 17715103 15086610 6363316 1962186 4606330 7115010
9757 7115010 4178245 -953813 -3240064 -3245118 -4171419 -5540303 -4340778 -715237 1675077
9748 1675077 776282 -1635406 -3241643 -3850238 -3913729 -3055668 -1717295 -2133414 -5424027
9739 -5424027 -9046727 -9456498 -6456495 -2605720 992884 5511396 10956937 14770972
9731 14770972 14853144 11816569 7066149 514493 -8100489 -16540412 -20324582 -16206387
9723 -16206387 -5664295 5117597 10196059 9887806 10117442 14047103 17101787 13995340
9715 13995340 7796870 5382497 4802432 -3854062 -21744492 -33901004 -26035143 -4057149
9707 -4057149 11538140 9549399 -959713 -4315988 3246681 11518485 9524692 -2010665
$$ packed form
9765B484951Q02808P603594O823750k628493q723294m401130K644144K508680
9757G115010k936765n132058k286251n054r26301j368884J199525L625541K390314
9748A675077q98795k411688j606237o08595o3491Q58061J338373m16119l290613
9739e424027l622700m09771L000003L850775L598604M518512N445541L814035
9731A4770972Q2172l036575m750420o551656q614982q439923l784170M118195
9723a6206387J0542092J0781892N078462l08253K29636L929661L054684l106447
9715A3995340o198470k414373n80065q656494j7890430j2156512P865861K1977994
9707d057149J5595289j988741j0509112l356275P562669Q271804j993793j1535357
$$ plain form
9699 -2010665 -11208798 -7753301 5408114 15257373 13756997 5351433 -2324414 -8619397
9691 -8619397 -14958028 -15927447 -5446710 10261151 16830290 10183151 966364 -1863402
9683 -1863402 -1607502 -3343526 -3268241 3342651 11498890 13608953 11767178 12781897 14979257
9674 14979257 11239247 3384419 1608327 8393112 14028503 11364109 5202320 2470750
9666 2470750 2041684 561736 947781 7416916 16876658 22404247 22015869 17975351 10786970
9657 10786970 347435 -9264514 -12376120 -8195234 -776737 5190352 5482196 -1871731
9649 -1871731 -11058524 -10795564 713977 9498910 4138050 -5819062 -2886633 11089899
9641 11089899 17113935 8319001 -855151 640300 4164037 -827988 -7822044 -5163998
$$ packed form
9699b010665r198133L455497J3161415R849259j500376q405564p675847o294983
9691h619397o338631r69419J0480737J5707861O569139o647139r216787k829766
9683a863402K55900j736024P5285O610892Q156239K110063j841775J014719K197360
9674A4979257l740010p854828j776092O784785N635391k664394o161789k731570
9666B470750m29066j479948L86045O469135R459742N527589l88378m040518p188381
9657A0786970j0439535r611949l111606M180886P418497N967089K91844p353927
9649a871731r186793K62960J1509541Q784933n360860r957112K932429J3976532
9641A1089899O024036q794934r174152J495451L523737m992025o994056K658046
$$ plain form
9633 -5163998 3972935 7660014 3956438 -9971 -2550378 -7701250 -13976852 -15149797
9625 -15149797 -11070093 -7479314 -6502076 -6538132 -8999250 -15102264 -18637782 -13038274 -3680648
9616 -3680648 -1428694 -5284526 -4143649 4341283 10103613 7475225 2380413 -192157
9608 -192157 -2815153 -5728750 -3631541 1909379 -116232 -12544852 -21722802 -16208450
9600 -16208450 -3620471 1447692 -2302486 -5508893 -3802981 592620 7490175 17431154
9592 17431154 25015209 23835136 15930548 7791420 -14095 -10472601 -20735271 -24824825
9584 -24824825 -23392151 -21159138 -16977502 -7129955 3052513 3329840 -4445868 -5825910
9576 -5825910 5659358 18374247 19128695 10635934 4608454 4409798 3923282 114984
$$ packed form
9633e163998R136933L687079l703576l966409k540407n150872o275602j172945
9625a5149797M079704L590779R77238l6056k461118o103014l535518N599508R357626
9616c680648K251954l855832J140877Q484932N762330k628388n094812k572570
9608a92157k622996k913597K097209N540920k025611j2428620r177950N514352
9600a6208450J2587979N068163l750178l206407J705912M395601O897555R940979
9592A7431154P584055j180073p904588q139128p805515j0458506j0262670m089554
9584b4824825J432674K233013M181636R847547J0182468K77327p775708j380042
9576e825910J1485268J2714889P54448q492761o027480j98656m86516l808298
$$ plain form
9568 114984 -2616375 -640940 3576826 6157246 6820591 6847047 5453409 1076724 -5361749
9559 -5361749 -10849157 -13162205 -11548066 -5585047 3738453 11762191 12539546 5423446
9551 5423446 -3449233 -8595876 -11113219 -13778329 -13873572 -7242983 2183457 4959463 -343954
9542 -343954 -3644025 3015786 14367719 19098022 13603146 3764118 -3579578 -6095054
9534 -6095054 -5162418 -3885206 -4668651 -6089359 -3839547 3386851 11345480 14941967 12440378
9525 12440378 4450267 -6331019 -13268128 -10364136 -1566699 1489572 -4918038 -10654003
9517 -10654003 -6746026 1444748 3493980 -816007 -4685282 -6862850 -10610577 -14333461
9509 -14333461 -14009742 -11989712 -12617952 -11800196 -2995263 7766609 6354011 -8360807
$$ packed form
9568A14984k731359J975435M217766K580420O63345K6456j393638m376685o438473
9559e361749n487408k313048J614139N963019R323500Q023738P77355p116100
9551E423446q872679n146643k517343k665110r5243O630589R426440K776006n303417
9542c43954l300071O659811J1351933M730303n494876r839028p343696k515476
9534f095054R32636J277212p83445j420708K249812P226398P958629L596487k501589
9525A2440378p990111j0781286o937109K903992Q797437L056271o407610n735965
9517a0654003L907977Q190774K049232m309987l869275k177568l747727l722884
9509a4333461L23719K020030o28240Q17756Q804933J0761872j412598j4714818
$$ plain form
9501 -8360807 -20801764 -19936948 -12279041 -8072306 -5890233 153201 6169903 2468162
9493 2468162 -11196883 -23300167 -23696411 -13484273 -1134448 7135986 11283346 13406608
9485 13406608 12546099 6133201 -3480024 -8500214 -4963084 1311887 2603700 -571001
9477 -571001 -2881009 -3703218 -5479861 -5815490 -674048 6276444 7668157 4965886 5999143
9468 5999143 10031872 8014990 -178769 -2542160 5994077 14590201 14014111 10540495
9460 10540495 12556144 14695083 7886739 -3327218 -7301809 -3598512 -1214028 -1998930
9452 -1998930 514593 6831461 9119335 4479663 -579049 -1258190 -297521 71715 2874315
9443 2874315 9115930 13395258 11463515 6463099 3422690 2306890 590700 -1215951
$$ packed form
9501h360807j2440957Q64816P657907M206735K182073O043434O016702l701741
9493B468162j3665045j2103284l96244J0212138J2349825Q270434M147360K123262
9485A3406608q60509o412898r613225n020190L537130O274971J291813l174701
9477e71001k310008q22209j776643l35629N141442O950492J391713k702271J033257
9468E999143M032729k016882q193759k363391Q536237Q596124n76090l473616
9460A0540495K015649K138939o808344j1213957l974591L703297K384484p84902
9452a998930K513523O316868K287874m639672n058712o79141R60669L69236K802600
9443B874315O241615M279328j931743n000416l040409j115800j716190j806651
$$ plain form
9435 -1215951 -837332 1432114 3158928 3318000 3241071 4664335 7488371 8860896 5627608
9426 5627608 -500388 -2470944 3644043 11689667 12321283 5875329 1789700 4539732
9418 4539732 7317782 2807519 -5729372 -8818809 -2645010 7643651 14380813 14125040
9410 14125040 9629806 6910068 8622253 10242535 6440100 961939 3568694 14994199
9402 14994199 22767211 17440244 5980835 940012 1672735 -3001136 -15435018 -24064062
9394 -24064062 -19896056 -8365910 -155284 2296514 3301271 4414375 3217324 -776431
9386 -776431 -4705449 -6463326 -6615679 -6368990 -5788710 -3800045 594049 5738242 6528001
9377 6528001 -292413 -10123433 -14902508 -14194599 -15051323 -18600551 -15798620 -2683767
$$ packed form
9435a215951L78619K269446J726814J59072p6929J423264K824036J372525l233288
9426E627608o127996j970556O114987Q045624O31616o445954m085629K750032
9418D539732K778050m510263q536891l089437O173799J0288661O737162k55773
9410A4125040m495234k719738J712185J620282l802435n478161K606755J1425505
9402A4994199P773012n326967j1459409n040823P32723m673871j2433882q629044
9394b4064062M168006J1530146Q210626K451798J004757J113104j197051l993755
9386g76431l929018j757877j52353K46689N80280J988665M394094N144193P89759
9377F528001o820414r831020m779075P07909q56724l549228K801931J3114853
$$ plain form
9369 -2683767 8884242 5907018 -6240663 -11047347 -4577185 1009125 -2546893 -9169990
9361 -9169990 -10792457 -8280220 -5406725 -2226585 88549 -3011465 -11008985 -15825112
9353 -15825112 -13234557 -8329320 -4384741 3325644 15087112 19254872 8368281 -6303830
9345 -6303830 -9223522 -2555929 80207 -3840851 -4687242 1100045 7294285 11346630
9337 11346630 16495294 20481304 17449292 11933674 14600106 21652200 16484015 -2412529
9329 -2412529 -13737073 -3664389 13021240 15628439 6949021 3403678 7144124 7437150
9321 7437150 3553705 5900887 14932409 17373788 7192003 -4426785 -5470240 2098202
9313 2098202 9594216 13916661 16179879 15634895 11854271 8350786 8519069 10922651 12003389
$$ packed form
9369b683767J1568009k977224j2147681m806684O470162N586310l556018o623097
9361i169990j622467K512237K873495L180140K315134l100014p997520m816127
9353a5825112K590555M905237L944579P710385J1761468M167760j0886591j4672111
9345f303830k919692O667593K636136l921058q46391N787287O194240M052345
9337A1346630N148664L986010l032012n515618K666432P052094n168185j8896544
9329b412529j1324544J0072684J6685629K607199q679418l545343L740446K93026
9321G437150l883445K347182R031522K441379j0181785j1618788j043455P568442
9313B098202P496014M322445K263218n44984l780624l503485J68283K403582J080738
$$ plain form
9304 12003389 10381480 6317085 918538 -2055386 1539160 9314551 12745805 8406286
9296 8406286 4062862 8169300 16708603 17187945 5177430 -9099709 -12620318 -4386356
9288 -4386356 4459185 4275123 -2054610 -3483514 4694982 14395826 15311552 8596460 4312262
9279 4312262 6298968 7204776 1012688 -6944786 -8261704 -4424624 -3992354 -9590332 -15643785
9270 -15643785 -18420418 -20448456 -23541234 -24570084 -21242933 -16371154 -12781905 -8825533
9262 -8825533 -2900395 1979675 2910935 2839833 6220537 11335640 12406786 8003003 2221907
9253 2221907 -1699448 -4115398 -5843397 -6945315 -8281488 -9939321 -8917983 -3234449
9245 -3234449 2628739 2150221 -3882728 -8788975 -10344713 -12096747 -13896149 -10250360
$$ packed form
9304A2003389j621909m064395n398547k973924L594546P775391L431254m339519
9296H406286m343424M106438Q539303M79342j2010515j4277139l520609Q233962
9288d386356Q845541j84062o329733j428904Q178496R700844R15726o715092m284198
9279D312262J986706R05808o192088p957474j316918L837080M32270n597978o053453
9270a5643785k776633k028038l092778j028850L327151M871779L589249L956372
9262h825533N925138M880070R31260p1102L380704N115103J071146m403783n781096
9253B221907l921355k415950j727999j101918j336173j657833J021338N683534
9245c234449N863188m78518o032949m906247j555738j752034j799402L645789
$$ plain form
9237 -10250360 -723728 7317575 10630233 15245769 23343607 24496580 9814755 -11904992
9229 -11904992 -23174279 -19125945 -9580733 -2872624 1272714 3684235 1969158 -2927046
9221 -2927046 -5202033 -2351935 1520779 2660374 2122848 1478442 -499680 -4645542 -8875181
9212 -8875181 -10242109 -6809484 1757619 12119197 17776126 15934802 11237885 8009070
9204 8009070 3210640 -6034772 -13181461 -10703131 -4016176 -4721259 -11715142 -12543991 -3982787
9195 -3982787 2941868 1257517 -2638451 -2713510 -2847737 -6090134 -6972201 -2633893 -298373
9186 -298373 -4672072 -8184538 -3596836 2841297 1283723 -6541233 -12515219 -15279265
9178 -15279265 -17324571 -15404326 -5614702 6428379 11538019 9679410 7037606 4566331
$$ packed form
9237a0250360R526632Q041303L312658M615536Q097838J152973j4681825k1719747
9229a1904992j1269287M048334R545212O708109M145338K411521j715077m896204
9221b927046k274987K850098L872714J139595n37526o44406j978122m145862m229639
9212h875181j366928L432625Q567103J0361578N656929j841324m696917l228815
9204H009070m798430r245412p146689K478330O686955p05083o993883q28849Q561204
9195c982787O924655j684351l895968p5059j34227l242397q82067M338308K335520
9186b98373m373699l512466M587702O438133j557574p824956n973986k764046
9178a5279265k045306J920245R789624J2043081N109640j858609k641804k471275
$$ plain form
9170 4566331 -30792 -2587950 3700293 16116056 24098799 22385759 14456478 5167231
9162 5167231 -1680614 -1529570 5598308 10440990 4901111 -5267644 -8263423 -4166250
9154 -4166250 -3577825 -9703092 -14121645 -11212764 -5355962 -1926829 -1295199 -3401019 -8404509
9145 -8404509 -11291310 -5950797 3563293 6042439 -545486 -6132012 -4277941 241465
9137 241465 2777098 5931049 10295710 9666657 2672793 -941169 5877311 15479741 15788575
9128 15788575 5942035 -6217167 -15831201 -21702026 -20986181 -12857623 -4232302 -3030327
9120 -3030327 -7332923 -8435087 -3240338 2918182 4713702 2153903 -1824516 -3953316
9112 -3953316 -1387789 5600788 11958086 12452864 7597790 2502566 1062099 3419304
$$ packed form
9170D566331m597123k557158O288243J2415763P982743j713040p929281r289247
9162E167231o847845J51044P127878M842682n539879j0168755k995779M097173
9154d166250N88425o125267m418553K908881N856802L429133O31630k105820n003490
9145h404509k886801N340513R514090K479146o587925n586526J854071M519406
9137B41465K535633L153951M364661o29053o993864l613962O818480R602430L08834
9128A5788575r846540j2159202r614034n870825P15845Q128558Q625321J201975
9120c030327m302596j102164N194749O158520J795520k559799l978419k128800
9112c953316K565527O988577O357298M94778m855074n095224j440467K357205
$$ plain form
9104 3419304 7119842 8418967 4858938 -1000682 -3107280 481115 4818003 5451010
9096 5451010 4362301 4799428 4603916 223416 -5527211 -5721362 1555811 10810109 15209401
9087 15209401 12013436 3738562 -3074643 -2808944 2214546 2952799 -4275195 -11333573
9079 -11333573 -9749689 -4288721 -6475711 -16582074 -21937064 -14573732 -1886683 3679173
9071 3679173 -1158815 -10260363 -16034948 -13361039 -800192 16469346 27891818 26688778
9063 26688778 16248760 4371387 -5642643 -14004751 -18375590 -15732793 -8998714 -4432515
9055 -4432515 -1802076 5177099 15912614 18628466 5745579 -12004099 -16200812 -4078557
9047 -4078557 8020945 6305367 -3813133 -7440443 -55499 9373160 11839612 7496577
$$ packed form
9104C419304L700538J299125l560029n859620k106598L588395M336888O33007
9096E451010j088709M37127j95512m380500n750627j94151P277173R254298M399292
9087A5209401l195965q274874o813205K65699N023490P38253p227994p058378
9079a1333573J583884N460968k186990j0106363n354990P363332J2687049N565856
9071C679173m837988r101548n774585K673909J2560847J7269538J1422472j203040
9063B6688778j0440018j1877373j0014030q362108m370839K642797O734079M566199
9055d432515K630439O979175J0735515K715852j2882887j7749678m196713J2122255
9047d078557J2099502j715578j0118500l627310P384944R428659K466452m343035
$$ plain form
9039 7496577 1736485 -1448432 -121992 7050956 19120557 30585299 33369276 22931820
9031 22931820 3749378 -11732305 -12633488 -222923 12706937 14958064 7759214 697900
9023 697900 -621112 629808 -979234 -5092830 -4680709 7190725 28226192 44828640
9015 44828640 43550199 26444376 10089804 6382387 10190255 10719434 7855780 8401644
9007 8401644 11470666 9622085 3381699 2641551 11266962 20570865 22336580 19920977
8999 19920977 20899153 24818492 24427623 16294391 5906049 2751003 10731758 21935747
8991 21935747 22374568 8243123 -6805489 -7751766 1417108 3596334 -6211978 -14071409
8983 -14071409 -8174610 5576723 14834354 17141896 17545251 18009634 16916805 13466594
$$ packed form
9039G496577n760092l184917J326440P172948J2069601J1464742K783977j0437456
9031B2931820j9182442j5481683r01183J2410565J2929860K251127p198850p061314
9023F97900j319012J250920j609042m113596M12121J1871434K1035467J6602448
9015D4828640j278441j7105823j6354572l707417L807868N29179k863654N45864
9007H401644L069022j848581o240386p40148Q625411R303903J765715k415603
8999A9920977R78176L919339l90869q133232j0388342l155046P980755J1203989
8991B1935747M38821j4131445j5048612r46277R168874K179226r808312p859431
8983a4071409N896799J3751333R257631K307542M03355M64383j092829l450211
$$ plain form
8975 13466594 7069839 -1801005 -6625711 534901 14532223 17732307 2889860 -14510584
8967 -14510584 -16445876 -5835622 1446304 149972 -1867539 477888 4231250 6238349
8959 6238349 5150611 -1381719 -11197416 -13668152 -2993894 8915362 6412785 -6257296
8951 -6257296 -10345745 -194949 10685190 12216656 9991477 10857824 11651749 8950625
8943 8950625 7057488 8693602 8606459 3743402 -126572 927654 1357128 -3254966 -7039725
8934 -7039725 -3483248 4037433 9622484 14646372 21246853 23994650 18566293 12064779
8926 12064779 13167425 17123976 12956174 2379816 -1498384 6060389 15183612 16645295
8918 16645295 12675034 9484869 8358778 8344395 9944464 11168158 6276279 -5899694
$$ packed form
8975A3466594o396755q870844m824706P160612J3997322L200084j4842447j7400444
8967a4510584j935292J0610254P281926j296332k017511K345427L753362K007099
8959F238349j087738o532330r815697k470736J0674258J1909256k502577j2670081
8951f257296m088449J0150796J0880139J531466k225179Q66347P93925k701124
8943H950625j893137J636114q7143m863057l869974J054226M29474m612094l784759
8934g039725L556477P520681N585051N023888O600481K747797n428357o501514
8926A2064779J102646L956551m167802j0576358l878200P558773R123223J461683
8918A6645295l970261l190165j126091j4383J600069J223694m891879j2175973
$$ plain form
8910 -5899694 -16858741 -17306259 -8562366 -225745 2011303 1533416 3693145 7456933
8902 7456933 6557139 -1881413 -12316667 -16570485 -14220111 -13527622 -19726122 -26218610
8894 -26218610 -22798611 -10641174 -1730210 -2371529 -5247394 -2278964 1866018 -2524270
8886 -2524270 -12845771 -15151003 -3777038 9518077 10943931 1843253 -6678825 -10778005
8878 -10778005 -15487414 -21024676 -19141808 -7159808 3691221 1660510 -9088622 -13858044
8870 -13858044 -6981883 2278818 3797637 -931334 -3356470 117936 4705710 3868258
8862 3868258 -3331104 -11128636 -12655438 -6944994 647622 5875856 10618062 17545482
8854 17545482 23126400 21538267 13739858 6045539 377728 -6471261 -13369977 -13669284
$$ packed form
8910e899694j0959047m47518Q743893Q336621K237048m77887K159729L763788
8902G456933q99794q438552j0435254m253818K350374O92489o198500o492488
8894b6218610L419999J2157437Q910964o41319k875865K968430M144982m390288
8886b524270j0321501k305232J1373965J3295115J425854r100678q522078m099180
8878a0778005m709409n537262J882868J1982000J0851029k030711j0749132m769422
8870a3858044O876161R260701J518819m728971k425136L474406M587774q37452
8862C868258p199362p797532j526802N710444P592616N228234M742206O927420
8854A7545482N580918j588133p798409p694319n667811o848989o898716k99307
$$ plain form
8846 -13669284 -6794449 -2342963 -6795643 -13290173 -11832472 -3903380 1500803 2150854
8838 2150854 3436855 6991990 8232456 5637218 3479951 3188552 98859 -7379634
8830 -7379634 -12053035 -6632947 5997240 15948348 16998611 10207309 -345100 -10608192
8822 -10608192 -16443281 -15153096 -8378716 -1275429 2168583 2230467 1961010 3342487 4884301
8813 4884301 3156957 -2424899 -6986313 -4851924 2821623 8419291 7720135 5866895
8805 5866895 9704917 16653207 16819623 6429079 -6247801 -10909230 -7267721 -3319160
8797 -3319160 -3725964 -4397495 942903 11999690 21420447 21896673 12720399 -105440
8789 -105440 -9453822 -12727132 -12341934 -11576411 -11378156 -11172795 -10265928 -6793316 2280524
$$ packed form
8846a3669284O874835M451486m452680o494530J457701P929092N404183O50051
8838B150854J286001L555135J240466k595238k157267k91399l089693p478493
8830g379634m673401N420088J2630187R951108J050263o791302j0552409j0263092
8822a0608192n835089J290185O774380P103287L444012O1884k69457J381477J541814
8813D884301j727344n581856m561414K134389P673547N597668o99156j853240
8805E866895L838022O948290J66416j0390544j2676880m661429L641509L948561
8797c319160m06804o71531N340398J1056787R420757M76226r176274j2825839
8789a05440r348382l273310L85198P65523J98255K05361R06867L472612R073840
$$ plain form
8780 2280524 16714168 29494149 31713503 21848070 7691590 -1378823 -1739872 4348605
8772 4348605 11814713 14948328 10701220 2221355 -3822346 -5173405 -5898973 -8787294
8764 -8787294 -10481905 -7277636 -1132120 4225108 8611941 11814514 9716998 1127415
8756 1127415 -5819919 -3335189 2454882 -1533419 -14748914 -21160950 -11558106 3232436
8748 3232436 7930494 2632460 -1613307 -709401 -774621 -5825559 -11355605 -11161733 -4834859
8739 -4834859 2407629 3812755 -4061616 -16595802 -22423482 -14127340 2799494 15688961
8731 15688961 18505585 15392002 11436485 6335682 -935516 -6789231 -6649685 -1356485
8723 -1356485 3909753 6216162 7130127 8094475 6611815 -410883 -10465584 -16080194
$$ packed form
8780B280524J4433644J2779981K219354r865433j4156480r070413l61049O088477
8772D348605P466108L133615m247108q479865o043701j351059p25568k888321
8764h787294j694611L204269O145516N357228M386833L202573k097516q589583
8756A127415o947334K484730N790071l988301j3215495o412036R602844J4790542
8748C232436M698058n298034m245767R03906o5220n050938n530046J93872O326874
8739d834859P242488J405126p874371j2534186n827680Q296142J6926834J2889467
8731A5688961K816624l113583l955517n100803p271198n853715J39546N293200
8723a356485N266238K306409R13965R64348j482660p022698j0054701n614610
$$ plain form
8715 -16080194 -13419111 -7653068 -6379319 -9141470 -8027704 1138276 13013347 19802850
8707 19802850 19867786 16812359 13650368 10966597 8365000 5259334 2276223 2846546 9703362
8698 9703362 18635376 21023294 15137424 9002377 8231127 7629154 770340 -8508346 -12373193
8689 -12373193 -11821506 -13657201 -17779065 -17880265 -13668121 -11808287 -13905167 -13650739 -8319882
8680 -8319882 -3828345 -4675421 -6791556 -4571918 1530637 7962221 12181357 10799324
8672 10799324 1095555 -11499709 -15202776 -6694143 3171116 4882057 3781052 9058934
8664 9058934 15897880 11056577 -5852491 -19302081 -18158227 -8534605 -2012553 123041
8656 123041 3917665 9844530 11586131 6545241 217793 -1699547 -414082 -313770 -2015072
$$ packed form
8715a6080194K661083N766043J273749k762151J113766R165980J1875071O789503
8707A9802850O4936l055427l161991k683771k601597l105666k983111N70323O856816
8698I703362Q932014K387918n885870o135047p71250o01973o858814r278686l864847
8689a2373193N51687j835695m121864j01200M212144J859834k096880K54428N330857
8680h319882M491537q47076k116135K219638O102555O431584M219136j382033
8672A0799324r703769j2595264l703067Q508633R865259J710941j101005N277882
8664I058934O838946m841303j6909068j3449590J143854R623622O522052K135594
8656A23041L794624N926865J741601n040890o327448j917340J285465J00312j701302
$$ plain form
8647 -2015072 -3441777 -5413192 -10270451 -15034284 -12767430 -3649410 1900379 -3021772
8639 -3021772 -10226398 -6920468 5369445 12457207 7694138 -380679 -2933398 -2101572
8631 -2101572 -1823296 1664935 10544581 14924021 4346080 -13923304 -21119931 -11681944
8623 -11681944 113672 989388 -4784662 -5499739 187789 4167850 2557921 -716972
8615 -716972 -2360846 -3150947 -2337264 3054800 9943681 7754068 -8017264 -25591801
8607 -25591801 -28711114 -16656711 -3488864 2137013 5059276 8674048 5381424 -8565197
8599 -8565197 -19789600 -13886501 1557372 6297650 -2878834 -9360765 -4557502 325499
8591 325499 -3624243 -7247700 -681058 8357978 7679501 1015059 376073 5992833 8817595
$$ packed form
8647b015072j426705j971415m857259m763833K266854R118020N549789m922151
8639c021772p204626L305930J2289913P087762m763069q074817k552719Q31826
8631b101572K78276L488231Q879646M379440j0577941j8269384p196627R437987
8623a1681944J1795616Q75716n774050p15077N687528L980061j609929l274893
8615g16972j643874p90101Q13683N392064O888881k189613j5771332j7574537
8607b5591801l119313J2054403J3167847N625877K922263L614772l292624j3946621
8599h565197j1224403N903099J5443873M740278r176484o481931M803263M883001
8591C25499l949742l623457O566642R039036o78477o664442o38986N616760K824762
$$ plain form
8582 8817595 7224479 6458552 5756221 712964 -4699929 -3371348 48656 -4734054 -13541086
8573 -13541086 -10819783 5078117 16741830 12858135 2567211 -2735252 -6905225 -17445191
8565 -17445191 -28217495 -27118221 -14632646 -2844918 1101578 1234306 3844610 9462115
8557 9462115 13745755 12663827 7243457 3634635 5471701 7328244 2016278 -6807422
8549 -6807422 -9009535 -5292129 -7300419 -16611023 -18147803 -3236998 14216572 17026629
8541 17026629 9082941 5560009 7809011 5871478 743839 4072659 15336975 18682865
8533 18682865 7800711 -2628652 1238837 12696596 17162654 13972507 12848467 15213560
8525 15213560 12862923 3792735 -3216611 -2562508 -457026 -3918757 -7906200 -1614667
$$ packed form
8582H817595j593116p65927p02331n043257n412893J328581L420004m782710q807032
8573a3541086K721303J5897900J1663713l883695j0290924n302463m169973j0539966
8565a7445191j0772304J099274J2485575J1787728L946496J32728K610304N617505
8557I462115M283640j081928n420370l608822J837066J856543n311966q823700
8549f807422k202113L717406k008290r310604j536780J4910805J7453570K810057
8541A7026629p943688l522932K249002j937533n127639L328820J1264316L345890
8533A8682865j0882154j0429363L867489J1457759M466058l190147j124040K365093
8525A5213560k350637r070188p009346O54103K105482l461731l987443O291533
$$ plain form
8517 -1614667 14490192 26282742 23021390 10561282 2688971 3579094 5833615 4095722
8509 4095722 1972717 3552924 5971996 5045223 2480586 2264033 4367850 6925460 9930621
8500 9930621 11493336 6141685 -5631061 -11589352 -2015736 13350107 15131511 1616996
8492 1616996 -6694444 5321519 26380548 33592731 20850074 2910193 -5052206 -2494209
8484 -2494209 1662008 1431128 -1661378 -2231267 3193678 12233902 17624757 13870081 3423133
8475 3423133 -5510484 -7719463 -5508522 -3733107 -3033602 -853715 2224109 1641593 -4066098
8466 -4066098 -9105263 -6981795 820404 7008794 8285763 7925074 8388893 7173950 2224332
8457 2224332 -3597705 -6678441 -7118174 -5909401 -2271374 2164855 1429928 -6641032 -14105685
$$ packed form
8517a614667J6104859J1792550l261352j2460108p872311Q90123K254521j737893
8509D095722k123005J580207K419072r26773k564637k16553K103817K557610L005161
8500I930621J562715n351651j1772746n958291R573616J5365843J781404j3514515
8492A616996q311440J2015963K1059029P212183j2742657j7939881p962399K557997
8484b494209M156217k30880l092506n69889N424945R040224N390855l754676j0446948
8475C423133q933617k208979K210941J775415O99505K179887L077824n82516n707691
8466d066098n039165K123468P802199O188390J276969l60689M63819j214943m949618
8457B224332n822037l080736m39733J208773L638027M436229p34927q070960p464653
$$ plain form
8448 -14105685 -11678412 -1524455 5870739 6372511 5978205 9366194 12314506 8610920
8440 8610920 -846735 -9460711 -12310448 -9535832 -4617700 -1173123 -76133 881677
8432 881677 3374417 5632784 5288604 3259099 1189497 -3051929 -11920883 -20874548 -21021946
8423 -21021946 -11005412 -860510 -705604 -8894080 -14350045 -8590671 6500765 20855316
8415 20855316 24613376 16369065 4680417 77955 4683948 10896888 10350962 2353606
8407 2353606 -6558208 -9247147 -3738922 5711129 12501878 13289279 9526673 3671744
8399 3671744 -3458964 -10264756 -13111618 -11134241 -9290421 -11890660 -15188806 -11920361
8391 -11920361 -2385189 4522568 1782783 -8679226 -19552544 -24255158 -19058962 -4185016
$$ packed form
8448a4105685K427273J0153957P395194N01772l94306L387989K948312l703586
8440H610920r457655q613976k849737K774616M918132L444577J096990R57810
8432H81677K492740K258367l44180k029505k069602m241426q868954q953665j47398
8423b1021946J0016534J0144902J54906q188476n455965N759374J5091436J4354551
8415B0855316L758060q244311j1688648m602462M605993O212940n45926p997356
8407B353606q911814k688939N508225R450051O790749P87401l762606n854929
8399C671744p130708o805792k846862J977377J843820k600239l298146L268445
8391a1920361R535172O907757k739785j0462009j0873318m702614N196196J4873946
$$ plain form
8383 -4185016 14538974 27636887 28257661 17233692 2767114 -5250381 -3644526 387725
8375 387725 -2209484 -9362460 -9561888 999417 11260279 11032737 5535787 5516566 10372813
8366 10372813 12150120 10056919 7897496 1876539 -13677183 -30573017 -33306085 -22412502
8358 -22412502 -15227106 -20283532 -26825522 -24741715 -18832371 -15187509 -8226889 7357764
8350 7357764 22788789 25108713 13659682 -2319158 -15209576 -20174352 -13333542 1656444
8342 1656444 12092905 10294510 3061291 -296574 -1197028 -4192454 -5062199 1767913
8334 1767913 10613690 11713098 6383934 3517386 5221492 7490461 11090067 19161962
8326 19161962 26464788 23739423 12213924 2404204 -1067257 -2460846 -3434330 -713114
$$ packed form
8383d185016J8723990J3097913O20774j1023969j4466578q017495J605855M032251
8375C87725k597209p152976j99428J0561305J0260862k27542n496950j9221M856247
8366A0372813J777307k093201k159423o020957j5553722j6895834k733068J0893583
8358b2412502P185396n056426o541990K083807N909344L644862O960620J5584653
8350G357764J5431025K319924j1449031j5978840j2890418m964776O840810J4989986
8342A656444J0436461j798395p233219l357865r00454k995426q69745O830112
8334A767913Q845777J099408n329164k866548J704106K268969L599606Q071895
8326A9161962P302826k725365j1525499r809720l471461j393589r73484K721216
$$ plain form
8318 -713114 3695303 2092551 -5815836 -9936488 -4140859 5325287 10144726 10438168 9848903
8309 9848903 7258819 -153134 -9897334 -16066260 -16440828 -14011968 -12430168 -11960074 -9451377
8300 -9451377 -2324728 6485912 9465860 3046176 -7005812 -12498135 -12794616 -12965003
8292 -12965003 -14138126 -12347521 -6809578 -2779886 -4427275 -9585882 -13337293 -13450220
8284 -13450220 -11329663 -10362917 -13436223 -19454930 -22940600 -19767043 -12073437 -4848489
8276 -4848489 13477 2894704 3066041 1221292 2394765 9845748 17814313 17378721 9024009
8267 9024009 2547324 4017923 9293008 11768001 10608937 8876503 7913933 6443727
8259 6443727 3144979 -1259625 -3691541 -1467586 3358280 4934133 1236802 -2460262
$$ packed form
8318g13114M408417j602752p908387m120652N795629R466146M819439K93442n89265
8309I848903k590084p411953r744200o168926l74568K428860J581800M70094K508697
8300i451377P126649Q810640K979948o419684j0051988n492323k96481j70387
8292a2965003j173123J790605N537943M029692j647389n158607l751411j12927
8284a3450220K120557R66746l073306o018707l485670L173557P693606P224948
8276d848489M861966K881227J71337j844749J173473P450983P968565m35592q354712
8267I024009o476685J470599N275085K474993j159064j732434r62570j470206
8259F443727l298748m404604k431916K223955M825866J575853l697331l697064
$$ plain form
8251 -2460262 -961724 3695865 6495963 6754770 6214484 4187318 742162 540833 6264209
8242 6264209 11885439 10417638 4939768 2932369 2569694 -4640970 -18174245 -26134636
8234 -26134636 -20445708 -6136194 5981138 8847980 1520570 -9869052 -13589962 -3663671
8226 -3663671 9890458 11599422 1855164 -3360818 3644102 10950508 5602842 -7161794
8218 -7161794 -12294411 -5717482 2738249 4171945 519035 -199759 6210577 15555076
8210 15555076 18981658 11824369 -1196226 -11096347 -13719376 -10992556 -5642939 34273
8202 34273 1907933 -2444163 -7772226 -5591850 4252028 12717876 13668235 10730714 10062981
8193 10062981 11720261 10830159 3772241 -8112184 -18355187 -19956105 -13624089 -8792746
$$ packed form
8251b460262J498538M657589K800098K58807n40286k027166l445156k01329N723376
8242F264209N621230j467801n477870k007399l62675p210664j3533275p960391
8234b6134636N688928J4309514J2117332K866842p327410j1389622l720910R926291
8226c663671J3554129J708964r744258n215982P004920P306406n347666j2764636
8218g161794n132617O576929Q455731J433696l652910p18794O410336R344499
8210A5555076L426582p157289j3020595r900121k623029K726820N349617N677212
8202C4273J873660m352096n328063K180376R843878Q465848R50359k937521o67733
8193A0062981J657280q90102p057918j1884425j0243003j600918O332016M831343
$$ plain form
8185 -8792746 -11479666 -14976258 -9900038 397401 4390062 74645 -3175047 -252744
8177 -252744 3616275 3945020 3237119 3566220 2768224 823683 951723 2168967 26703
8168 26703 -3629569 -2029747 3453178 3263520 -3861772 -6375986 2782847 15327236 20232533
8159 20232533 17503366 13240249 10085778 8735449 10601764 13295547 11283922 5461091
8151 5461091 3403421 6313263 5929345 -1182480 -7601083 -8723443 -10416159 -16196133
8143 -16196133 -19000543 -14131313 -8918108 -10454151 -14667640 -16537797 -19367627 -23881707
8135 -23881707 -20913491 -7630417 1124676 -6943772 -19935921 -17147463 995379 15341678
8127 15341678 15669345 9508305 5915120 5859916 8282393 12566550 14748104 11578715 7001260
$$ packed form
8185h792746k686920l496592N076220J0297439L992661m315417l249692K922303
8177b52744L869019L28745p07901L29101p97996j944541J28040J217244k142264
8168B6703l656272J599822N482925j89658p125292k514214R158833J2544389M905297
8159B0232533k729167m263117l154471j350329J866315K693783k011625n822831
8151E461091k057670K909842l83918p111825o418603j122360j692716n779974
8143a6196133k804410M869230N213205j536043m213489j870157k829830m514080
8135b3881707K968216J3283074Q755093q068448j2992149K788458J8142842J4346299
8127A5341678L27667o161040l593185n5204K422477M284157K181554l169389m577455
$$ plain form
8118 7001260 5441509 2554403 -6775496 -15997322 -15183911 -8127450 -7545114 -15320711 -20910013
8109 -20910013 -18174115 -10775560 -1861837 8258026 14466901 10443856 820480 -2922505
8101 -2922505 452046 1612982 -1830605 -1260344 7293673 17192935 24330582 32492222
8093 32492222 40720177 39150886 25034585 10991863 8166961 10663193 6283730 -4967864
8085 -4967864 -13192904 -13789028 -10166316 -4716094 2695569 7815588 3196252 -10674097
8077 -10674097 -22203058 -21836656 -14926015 -15180732 -25391589 -31921425 -23124848 -7345579
8069 -7345579 -3121472 -13262876 -20298984 -10601946 8193713 20017160 20481864 15572873
8061 15572873 8888109 1146201 -3212507 -68350 6601235 9885956 9885059 10743464 11748408
$$ packed form
8118G001260j559751k887106r329899r221826Q13411P056461N82336p775597n589302
8109b0910013K735898P398555Q913723J0119863O208875m023045r623376l742985
8101b922505L374551J160936l443587N70261Q554017R899262P137647Q161640
8093C2492222Q227955j569291j4116301j4042722k824902K496232m379463j1251594
8085d967864q225040n96124L622712N450222P411663N120019m619336j3870349
8077a0674097j1528961L66402O910641k54717j0210857o529836Q796577J5779269
8069g345579M224107j0141404p036108R697038J8795659J1823447M64704m908991
8061A5572873o684764p741908m358708L144157O669585L284721q97Q58405J004944
$$ plain form
8052 11748408 9236624 3210453 -4872958 -14899098 -21751377 -15371196 2994344 15139895
8044 15139895 9677535 570654 5123984 14390924 7809591 -10481663 -16963127 -8371009
8036 -8371009 -7078142 -22243059 -33867951 -26600869 -14355120 -15492581 -23754823 -22218738
8028 -22218738 -11163913 -3298562 -1511567 1083850 5450933 6204235 3015057 642541
8020 642541 803815 2503017 5660253 7440079 2085740 -8125027 -10613522 -502420
$$ packed form
8052A1748408k511784o026171q083411j0026140o852279O380181J8365540J2145551
8044A5139895n462360r106881M553330R266940o581333j8291254o481464Q592118
8036h371009J292867j5164917j1624892P267082J2245749j137461q262242J536085
8028b2218738J1054825P865351J786995K595417M367083P53302l189178k372516
8020F42541J61274J699202L157236J779826n354339j0210767k488495J0111102
$$ [...]
##END NTUPLES=NMR SPECTRUM
##END=
