##TITLE=31Pdec_SR85
 CDCl3, 24 sc
 3.09.2021
##JCAMPDX= 6.0         $$ Bruker NMR JCAMP-DX V2.0
##DATA TYPE= NMR SPECTRUM
##DATA CLASS= NTUPLES
##ORIGIN= UXNMR, Bruker Analytische Messtechnik GmbH
##OWNER= root
$$ XWIN-NMR		Version 3.5
$$ Fri Sep  3 12:09:44 2021 Russian Standard Time (UT+4h)  she@DPX200
##.OBSERVE FREQUENCY= 81.013821
##.OBSERVE NUCLEUS= ^31P
##.ACQUISITION MODE= SIMULTANEOUS
##.ACQUISITION SCHEME= undefined
##.AVERAGES= 124
##.DIGITISER RES= 16
##SPECTROMETER/DATA SYSTEM= spect
##.PULSE SEQUENCE= zgpg30
##.SOLVENT NAME= CD2Cl2
##.SHIFT REFERENCE= (INTERNAL, CD2Cl2, 0, 248.564)
##AUDIT TRAIL= $$ (NUMBER, WHEN, WHO, WHERE, WHAT)
$$ ##TITLE= Audit trail, XWIN-NMR		Version 3.5
$$ ##JCAMPDX= 5.01
$$ ##ORIGIN= Bruker BioSpin GmbH
$$ ##OWNER= she
$$ F:/spectra/data/she/nmr/P31/1/pdata/1/auditp.txt
$$ ##AUDIT TRAIL=  $$ (NUMBER, WHEN, WHO, WHERE, WHAT)
(   1,<2021-09-03 12:05:28.26 +0400>,<she>,<DPX200>,
      <created by zg, POWCHK disabled, PULCHK disabled
       configuration hash MD5:
       00 E9 B6 7A A2 85 ED C7 34 08 36 98 17 FE 4E 26
       data hash MD5: 32K
       CD 79 82 F0 40 68 28 66 57 73 0E B3 F7 BD 46 60>)
(   2,<2021-09-03 12:08:48.07 +0400>,<she>,<DPX200>,
      <Start of raw data processing
       efp BC_mod = 2 LB = 1 FT_mod = 6 PKNL = 1 PHC0 = -7583.025 PHC1 = -325.1298 SI = 64K 
       data hash MD5: 64K
       59 55 37 44 FE 34 AF E6 5B 3D AC 77 E5 33 F8 65>)
(   3,<2021-09-03 12:09:17.35 +0400>,<she>,<DPX200>,
      <pk PHC0 = -279.8286 PHC1 = 643.5999 
       data hash MD5: 64K
       67 E0 56 E5 17 B3 AD 3F AB E2 4A 57 9F CD 74 B9>)
$$ ##END=
$$ 
$$ hash MD5
$$ 29 C1 E2 0D AF 76 82 CB A6 24 5D 6B F9 EF 01 D2
##$RELAX= 
##$RELAX= 
##$RELAX= 
##$RELAX= 
##$RELAX= 
##$RELAX= 
##$RELAX= 
##$RELAX= 
$$ Bruker specific parameters
$$ --------------------------
##$DU= <F:/spectra>
##$EXPNO= 1
##$NAME= <P31>
##$PROCNO= 1
##$TYPE= <nmr>
##$USER= <she>
##$AMP= (0..31)
100 100 100 100 100 100 100 100 100 100 100 100 100 100 100 100 100 100 
100 100 100 100 100 100 100 100 100 100 100 100 100 100 
##$AQSEQ= 0
##$AQ_mod= 1
##$AUNM= <au_zg>
##$AUTOPOS= <>
##$BF1= 81.014009
##$BF2= 200.13
##$BF3= 200.13
##$BF4= 200.13
##$BF5= 200.13
##$BF6= 200.13
##$BF7= 200.13
##$BF8= 200.13
##$BYTORDA= 1
##$CFDGTYP= 0
##$CFRGTYP= 5
##$CHEMSTR= <none>
##$CNST= (0..31)
1 1 145 1 1 1 1 1 1 1 1 1 1 1 1 1 1 1 1 1 1 1 1 1 1 1 1 1 1 1 1 1 
##$CPDPRG= <waltz16>
##$CPDPRG1= <>
##$CPDPRG2= <waltz16>
##$CPDPRG3= <>
##$CPDPRG4= <mlev>
##$CPDPRG5= <mlev>
##$CPDPRG6= <mlev>
##$CPDPRG7= <mlev>
##$CPDPRG8= <mlev>
##$CPDPRGB= <>
##$CPDPRGT= <>
##$D= (0..31)
0 1 0 0 0 0 0 0 0 0 0 0.03 2e-05 3e-06 0 0 0 0 0 0 0 0 0 0 0 0 0 0 0 0 
0 0 
##$DATE= 1630656327
##$DBL= (0..7)
120 120 120 11 120 120 24 19 
##$DBP= (0..7)
150 150 150 150 150 150 150 150 
##$DBP07= 0
##$DBPNAM0= <>
##$DBPNAM1= <>
##$DBPNAM2= <>
##$DBPNAM3= <>
##$DBPNAM4= <>
##$DBPNAM5= <>
##$DBPNAM6= <>
##$DBPNAM7= <>
##$DBPOAL= (0..7)
0.5 0.5 0.5 0.5 0.5 0.5 0.5 0.5 
##$DBPOFFS= (0..7)
$$ [...]
##$SUBNAM2= <"">
##$SUBNAM3= <"">
##$SUBNAM4= <"">
##$SUBNAM5= <"">
##$SUBNAM6= <"">
##$SUBNAM7= <"">
##$SUBNAM8= <"">
##$SUBNAM9= <"">
##$SW= 501.771253377433
##$SWIBOX= (0..15)
0 1 3 0 0 0 0 0 0 0 0 0 0 0 0 0 
##$SW_h= 40650.406504065
##$TD= 32768
##$TD0= 1
##$TE= 0
##$TE2= 300
##$TE3= 300
##$TEG= 300
##$TL= (0..7)
0 120 53 12 22 120 120 120 
##$TP= (0..7)
150 150 150 150 150 150 150 150 
##$TP07= 0
##$TPNAME0= <>
##$TPNAME1= <>
##$TPNAME2= <>
##$TPNAME3= <>
##$TPNAME4= <>
##$TPNAME5= <>
##$TPNAME6= <>
##$TPNAME7= <>
##$TPOAL= (0..7)
0.5 0.5 0.5 0.5 0.5 0.5 0.5 0.5 
##$TPOFFS= (0..7)
0 0 0 0 0 0 0 0 
##$TUNHIN= 0
##$TUNHOUT= 0
##$TUNXOUT= 0
##$USERA1= <user>
##$USERA2= <user>
##$USERA3= <user>
##$USERA4= <user>
##$USERA5= <user>
##$V9= 5
##$VALIST= <valist>
##$VCLIST= <CCCCCCCCCCCCCCC>
##$VD= 0
##$VDLIST= <DDDDDDDDDDDDDDD>
##$VPLIST= <PPPPPPPPPPPPPPP>
##$VTLIST= <TTTTTTTTTTTTTTT>
##$WBST= 1024
##$WBSW= 4
##$XGAIN= (0..3)
0 0 0 0 
##$XL= 0
##$YL= 0
##$YMAX_a= 16391
##$YMIN_a= -18548
##$ZGOPTNS= <>
##$ZL1= 120
##$ZL2= 120
##$ZL3= 120
##$ZL4= 120
##$ABSF1= 0
##$ABSF2= 0
##$ABSG= 0
##$ABSL= 0
##$ALPHA= 0
##$AQORDER= 0
##$ASSFAC= 0
##$ASSFACI= 0
##$ASSFACX= 0
##$ASSWID= 0
##$AUNMP= <proc_1d>
##$AZFE= 0.1
##$AZFW= 0.5
##$BCFW= 0
##$BC_mod= 2
##$BYTORDP= 0
##$COROFFS= 0
##$CY= -3
##$DATMOD= 1
##$DC= 0
##$DFILT= <>
##$DTYPP= 0
##$F1P= 0
##$F2P= 0
##$FCOR= 1
##$FTSIZE= 65536
##$FT_mod= 6
##$GAMMA= 0
##$GB= 0
##$INTBC= 1
##$INTSCL= 5.30512e-09
##$ISEN= 30
##$LB= 1
##$LEV0= 0
##$LPBIN= 0
##$MAXI= 10000
##$MC2= 0
##$MEAN= 0
##$ME_mod= 0
##$MI= 50
##$NCOEF= 0
##$NC_proc= -5
##$NLEV= 6
##$NOISF1= 182.463
##$NOISF2= 159.3651
##$NSP= 0
##$NTH_PI= 0
##$NZP= 0
##$OFFSET= 248.5645
##$PC= 4
##$PHC0= -7862.854
##$PHC1= 318.4701
##$PH_mod= 1
##$PKNL= yes
##$PPARMOD= 0
##$PSCAL= 0
##$PSIGN= 0
##$REVERSE= no
##$SF= 81.014009
##$SI= 65536
##$SIGF1= 159.3651
##$SIGF2= -187.1042
##$SINO= 113.3802
##$SIOLD= 16384
##$SREGLST= <1H.CDCl3>
##$SSB= 0
##$STSI= 65536
##$STSR= 0
##$SW_p= 40650.406504065
##$SYMM= 0
##$S_DEV= 0
##$TDeff= 32768
##$TDoff= 0
##$TI= <>
##$TILT= no
##$TM1= 0
##$TM2= 0
##$TOPLEV= 0
##$USERP1= <user>
##$USERP2= <user>
##$USERP3= <user>
##$USERP4= <user>
##$USERP5= <user>
##$WDW= 1
##$XDIM= 65536
##$YMAX_p= 443575320
##$YMIN_p= -80711540
$$ End of Bruker specific parameters
$$ ---------------------------------
##NTUPLES= NMR SPECTRUM
##VAR_NAME=  FREQUENCY,     SPECTRUM/REAL,   SPECTRUM/IMAG
##SYMBOL=    X,             R,               I
##VAR_TYPE=  INDEPENDENT,   DEPENDENT,       DEPENDENT
##VAR_FORM=  AFFN,          ASDF,            ASDF
##VAR_DIM=   65536,         65536,           65536
##UNITS=     HZ,            ARBITRARY UNITS, ARBITRARY UNITS
##FACTOR=    0.620285442955139, 1,           1
##FIRST=     20137.2065510759, 0,            0
##LAST=      -20513.1999529892, 0,           0
##MIN=       -20513.1999529892, -80711540,   0
##MAX=       20137.2065510759, 443575320,    0
$$ Real data points
##PAGE= N=1
##DATA TABLE= (X++(R..R)), XYDATA
$$ [...]
$$ plain form
40267 -1266676 94341 1254360 1084625 193905 -425784 -854027 -1316904 -1176027 -177208
40258 -177208 497288 -33922 -651796 -48553 777971 51603 -1460078 -1293992 632666
40249 632666 1630933 524688 -474326 517318 2013043 1819915 728439 1060069 2794364
40240 2794364 3760044 3143543 2367202 2523033 3100936 3506648 3900373 4087677 3330206
40231 3330206 1860382 1032418 1306376 1533145 964909 514643 1072197 1924258 2024116
40222 2024116 1690448 1724578 1757657 903633 -579194 -1649260 -2000548 -1912632 -1149077 436270
40212 436270 1605638 921808 -746639 -869967 1084682 2560847 1493616 -761192 -1644778
40203 -1644778 -1183865 -1435393 -2737664 -2915512 -711077 1975708 2501990 906578 -534815
$$ packed form
40267a266676J361017J160019j69735q90720o19689m28243m62877J40877R98819
40258a77208O74496n31210o17874O03243Q26524p26368j511681J66086J926658
40249F32666R98267j106245r99014R91644J495725j93128j091476L31630J734295
40240B794364R65680o16501p76341J55831N77903M05712L93725J87304p57471
40231C330206j469824q27964K73958K26769n68236m50266N57554Q52061R9858
40222B024116l33668L4130L3079q54024j482827j070066l51288Q7916P63555J585347
40212D36270J169368o83830j668447j23328J954649J476165j067231k254808q83586
40203a644778M60913k51528j302271j77848K204435K686785N26282j595412j441393
$$ plain form
40194 -534815 -549783 -93109 -323379 -869813 -840852 -509276 -845812 -1810807 -2329080 -2034149
40184 -2034149 -1893989 -2610321 -3376954 -3114765 -2267487 -2194323 -3013830 -3326250 -2313388
40175 -2313388 -963984 -618520 -1192084 -1615800 -1374436 -730231 104195 1046227 1630514
40166 1630514 1362517 562437 65243 109799 293096 516726 1009197 1405055 961984 -51229
40156 -51229 -423269 46058 7287 -1135015 -1744044 -253366 2062256 2541976 952120
40147 952120 -236315 401921 1247728 271236 -1972850 -3319366 -2929655 -1839834 -1099342
40138 -1099342 -662309 -12008 1100847 2537388 3659934 3471826 1654384 -578270 -1471356
40129 -1471356 -732687 116528 -376166 -1904510 -2908823 -2408604 -988387 -55088 -288377
$$ packed form
40194e34815j4968M56674k30270n46434K8961L31576l36536r64995n18273K94931
40184b034149J40160p16332p66633K62189Q47278P3164q19507l12420J012862
40175b313388J349404L45464n73564m23716K41364O44205Q34426R42032N84287
40166A630514k67997q00080m97194M4556J83297K23630M92471L95858m43071j013213
40156e1229l72040M69327l8771j142302o09029J490678K315622M79720j589856
40147I52120j188435O38236Q45807r76492k244086j346516L89711J089821P40492
40138a099342M37033O50301J112855J436541J122546j88108j817442k232654q93086
40129a471356P38669Q49215m92694j528344j004313N00219J420217R33299k33289
$$ plain form
40120 -288377 -880143 -416806 1459253 3536553 4348605 3688760 2540828 1847413 1772830
40111 1772830 1920426 1782483 1120036 306160 88338 608120 1000454 539682 -194370
40102 -194370 -114489 655776 885107 86174 -811720 -968448 -801752 -1028663 -1330496 -815802
40092 -815802 579978 1916174 2331953 1766222 703588 -304620 -861734 -856425 -521138
40083 -521138 -273459 -466767 -1185365 -2049705 -2298738 -1481296 -118257 801900 1112713
40074 1112713 1645175 2769804 3419013 2312144 -129963 -1919514 -1681773 -139993 829719
40065 829719 269108 -1043166 -1677395 -1118485 -126835 287901 -64068 -638564 -1008628
40056 -1008628 -1202142 -1247090 -897347 -63938 795799 1042047 517008 -307761 -753748 -453483
$$ packed form
40120b88377n91766M63337J876059K077300Q12052o59845j147932o93415p4583
40111A772830J47596j37943o62447q13876k17822N19782L92334m60772p34052
40102a94370P9881P70265K29331p98933q97894j56728J66696k26911l01833N14694
40092h15802J395780J336196M15779n65731j062634j008208n57114N309L35287
40083e21138K47679j93308p18598q64340k49033Q17442J363039R20157L10813
40074A112713N32462J124629O49209j106869k442107j789551K37741J541780R69712
40065H29719n60611j312274o34229N58910R91650M14736l51969n74496l70064
40056a008628j93514m4948L49743Q33409Q59737K46248n25039q24769m45987L00265
$$ plain form
40046 -453483 358264 976266 845402 163260 -307253 -102850 470074 822402 807838 790629
40036 790629 1113099 1628188 1753150 1058191 -98063 -709295 -183916 870308 1287793
40027 1287793 677033 -287080 -798155 -648174 -69066 588697 964668 1009583 1234649 2053453
40017 2053453 2858187 2511282 945023 -513537 -740882 3781 859954 1492939 1882610
40008 1882610 1803128 1315855 1168871 1828895 2559725 2355348 1459759 1021486 1403716 1784701
39998 1784701 1489652 882589 694712 1056155 1452971 1310601 554229 -104681 479164
39989 479164 2807009 5969661 8281525 8739109 7798754 7035851 8225658 12114730 17364645
39980 17364645 21048938 21059178 18040515 14412464 11712265 9637030 7453039 5256665
$$ packed form
40046d53483Q11747O18002j30864o82142m70513K04403N72924L52328j4564j7209
40036G90629L22470N15089J24962o94959j156254o11232N25379J054224M17485
40027A287793o10760r64113n11075J49981N79108O57763L75971M4915K25066Q18804
40017B053453Q04734l46905j566259j458560k27345P44663Q56173O32985L89671
40008A882610p9482m87273j46984O60024P30830k04377q95589m38273L82230L80985
39998A784701k95049o07063j87877L61443L96816j42370p56372o58910N83845
39989D79164K327845L162652K311864M57584r40355p62903J189807L889072N249915
39980A7364645L684293J0240l018663l628051k700199k075235k183991k196374
$$ plain form
39972 5256665 3605074 2748704 2577541 2726977 2567466 1767901 1010240 1330855 2524231
39963 2524231 3142827 2489093 1560149 1313539 1077111 -147409 -1608324 -1578451 57750
39954 57750 1552054 1787821 1553487 1831466 2232966 2082726 1924525 2638115 3730269
39945 3730269 3917871 3162680 2775658 3450662 4444341 4962934 5197366 5550387 5914650
39936 5914650 6302072 7205806 8618906 9547057 9252188 8191189 7003113 5531859 3800472
39927 3800472 2873688 3337194 3755122 2350024 -251450 -1728751 -1313398 -511066 -568585
39918 -568585 -1088578 -1442310 -1694856 -1599607 -495835 1046316 1247523 -251067 -1455127
39909 -1455127 -857984 410288 669511 376479 921645 1914857 1751006 326273 -747647
$$ packed form
39972E256665j651591q56370j71163J49436j59511p99565p57661L20615J193376
39963B524231O18596o53734r28944k46610k36428j224520j460915K9873J636201
39954E7750J494304K35767k34334K77979M01500j50240j58201P13590J092154
39945C730269J87602p55191l87022O75004R93679N18593K34432L53021L64263
39936E914650L87422R03734J413100R28151k94869j060999j188076j471254j731387
39927C800472r26784M63506M17928j405098k601474j477301M15353Q02332n7519
39918e68585n19993l53732k52546R5249J103772J542151K01207j498590j204060
39909a455127N97143J268272K59223k93032N45166R93212j63851j424733j073920
$$ plain form
39900 -747647 -525729 279702 761196 935571 1163357 1403502 1316604 662157 -330906 -813501
39890 -813501 -136993 927061 827943 -382504 -668875 1020319 2853621 2623571 840212
39881 840212 -458438 -849631 -1361161 -1979357 -1695631 -750591 -549555 -1247603 -1418853
39872 -1418853 -342800 1133231 2153246 2621702 2406916 1484449 809627 1216760 1586723
39863 1586723 234770 -1912731 -2023703 367617 2387673 1972687 503551 77449 471465
39854 471465 441634 113978 263826 647615 725035 878561 1474563 1843958 1503885 1181718
39844 1181718 1332528 1004610 -320669 -1162453 -163309 1378843 1183883 -573588 -1625475
39835 -1625475 -1020538 -110944 -117134 -545696 -410328 360576 1205931 1689633 1664229 1310189
$$ packed form
39900g47647K21918Q05431M81494J74375K27786K40145q6898o54447r93063m82595
39890h13501O76508J064054r9118j210447k86371J689194J833302k30050j783359
39881H40212j298650l91193n11530o18196K83726R45040K01036o98048j71250
39872a418853J076053J476031J020015M68456k14786r22467o74822M07133L69963
39863A586723j351953k147501j10972K391320K020056m14986j469136m26102L94016
39854D71465k9831l27656J49848L83789P7420J53526N96002L69395l40073l22167
39844A181718J50810l27918j325279q41784R99144J542152j94960j757471j051887
39835a625475O04937R09594o190m28562J35368P70904Q45355M83702k5404l54040
$$ plain form
39825 1310189 1074163 1075973 787586 -171389 -1290260 -1812956 -1677479 -1197689 -398411 570072
39815 570072 972199 378541 -450625 -485763 171199 650251 632389 430489 168236 -239313
39805 -239313 -618845 -810735 -1032156 -1334185 -1246816 -617692 -110695 -152995 -212376 73512
39795 73512 62704 -555585 -701861 428576 1633069 1274749 -192288 -1014795 -795801
39786 -795801 -458827 -83067 1051399 2367660 2168390 289399 -1360312 -1496762 -1015135
39777 -1015135 -1178119 -1786340 -2002200 -1766303 -1505251 -1305805 -1093370 -968202 -897371 -665013
39767 -665013 -352956 -244321 -242355 -138802 -290010 -1022386 -1564655 -848409 680969 1461310
39757 1461310 1104774 794225 1173873 1452921 1056463 553505 289189 -328714 -1339094
$$ packed form
39825A310189k36026J810k88387r58975j118871n22696J35477M79790P99278R68483
39815E70072M02127n93658q29166l5138O56962M79052j7862k01900k62253m07549
39805b39313l79532j91890k21421l02029Q7369O29124N06997m2300n9381K85888
39795G3512j0808o18289j46276J130437J204493l58320j467037q22507K18994
39786g95801L36974L75760J134466J316261j99270j878991j649711j36450M81627
39777a015135j62984o08221k15860K35897K61052J99446K12435J25168P0831K32358
39767f65013L12057J08635J966J03553j51208p32376n42269P16246J529378P80341
39757A461310l56536l10549L79648K79048l96458n02958k64316o17903j010380
$$ plain form
39748 -1339094 -1546905 -388490 886973 1077213 811659 1142763 1493910 638132 -1025904
39739 -1025904 -1892207 -1560748 -1283671 -1928666 -2775957 -2689470 -1616938 -511613 -204028
39730 -204028 -617593 -970858 -736177 -309849 -370906 -662881 -158212 1387959 2919838
39721 2919838 3509592 3384308 2960099 1885210 10533 -1529985 -1462842 -172706 806304
39712 806304 834899 571868 477773 145211 -640261 -1184454 -731718 538927 1736563 2128924
39702 2128924 1620820 720248 188171 467097 1353336 2329060 3055858 3357834 3079658
39693 3079658 2437498 2247415 3151178 4613310 5247971 4280810 2317773 595366 -201533
39684 -201533 -336123 -547716 -1233076 -1902072 -1569948 26078 1811012 2433446 1805483
$$ packed form
39748a339094k07811J158415J275463J90240k65554L31104L51147q55778j664036
39739a025904q66303L31459K77077o44995q47291Q6487J072532J105325L07585
39730b04028m13565l53265K34681M26328o1057k91975N04669J546171J531879
39721B919838N89754j25284m24209j074889j874677j540518O7143J290136R79010
39712H06304K8595k63031r4095l32562p85472n44193M52736J270645J197636L92361
39702B128924n08104r00572n32077K78926Q86239R75724P26798L01976k78176
39693C079658o42160j90083R03763J462132O34661r67161j963037j722407p96899
39684b01533j34590k11593o85360o68996L32124J596026J784934O22434o27963
$$ plain form
39675 1805483 1017417 775528 652164 84040 -638892 -910501 -793874 -756393 -689236 -8545
39665 -8545 1168535 1680946 618842 -1384163 -2629447 -2084034 -380541 881248 685909
39656 685909 -468744 -1102201 -343649 1006898 1380795 501544 -101267 882593 2670449
39647 2670449 3427596 2715146 1717857 1231702 863553 435357 621601 1485087 1800191
39638 1800191 906306 65433 709779 2305794 3351329 3627558 3831338 3677462 2359268
39629 2359268 670287 553650 2169574 3280004 2298056 429040 -156857 890136 2139316
39620 2139316 2392223 1738202 1063507 1131568 1858330 2305238 1839112 1180210 1450804 2318960
39610 2318960 2351829 1348513 827084 1651413 2637426 2399143 1320817 656376 737483
$$ packed form
39675A805483p88066k41889j23364n68124p22932k71609J16627L7481O7157O80691
39665h545J177080N12411j062104k003005j245284N45413J703493J261789j95339
39656F85909j154653o33457P58552J350547L73897q79251o02811R83860J787856
39647B670449P57147p12450r97289m86155l68149m28196J86244Q63486L15104
39638A800191q93885q40873O44346J596015J045535K76229K03780j53876j318194
39629B359268j688981j16637J615924J110430r81948j869016n85897J046993J249180
39620B139316K52907o54021o74695O8061P26762M46908m66126o58902K70594Q68156
39610B318960L2869j003316n21429Q24329R86013k38283j078326o64441Q1107
$$ plain form
39601 737483 1168988 1843847 2584963 2608574 1591671 603251 738618 1430670 1406233 769162
39591 769162 658637 1147059 1080797 132738 -440912 419143 2105565 3229830 3233864 2573228
39581 2573228 1823207 1183294 686864 462659 634299 1008516 1055538 463234 -378799 -852678
39571 -852678 -978551 -1182591 -1254839 -509499 767545 1178041 171919 -920506 -749601
39562 -749601 103531 201299 -497857 -844569 -490979 -224869 -427533 -512881 -23638 759466
39552 759466 1413473 1709879 1389984 493227 -183645 90962 809132 904320 485090 659874
39542 659874 1584244 2036772 1282323 85573 -650580 -1066094 -1496484 -1580905 -1131909 -965668
39532 -965668 -1752472 -2647161 -2242200 -634152 559269 313563 -572094 -663739 318954
$$ packed form
39601G37483M31505O74859P41116K3611j016903r88420J35367O92052k4437o37071
39591G69162j10525M88422o6262r48059n73650Q60055J686422J124265M034o60636
39581B573228p50021o39913m96430k24205J71640L74217M7022n92304q42033m73879
39571h52678j25873k04040p2248P45340J277044M10496j006122j092425J70905
39562g49601Q53132R7768o99156l46712L53590K66110k02664q5348M89243P83104
39552G59466O54007K96406l19895q96757o76872K74607P18170R5188m19230J74784
39542F59874R24370M52528p54449j196750p36153m15514m30390q4421M48996J66241
39532i65668p86804q94689M04961J608048J193421k45706q85657r1645R82693
$$ plain form
39523 318954 1363868 1538998 1049388 835338 1343833 1980985 1877163 963727 -9384
39514 -9384 -446041 -508458 -637975 -817644 -641473 -27938 490128 397568 -53740 -128581
39504 -128581 276689 344749 -367131 -862813 114050 2020566 2858020 1854958 570391
39495 570391 674262 1807028 2620338 2859441 3053161 2939803 1860279 397846 -9547
39486 -9547 840654 1608557 1355917 524428 -213018 -782688 -1051807 -570965 505814 1220339
39476 1220339 970448 51292 -1111303 -2210715 -2440164 -1029566 1196200 2274402 1760713
39467 1760713 1421358 2419195 3428821 2859483 1476871 1077353 1659208 1870098 1536048
39458 1536048 1644059 2126576 1807159 681915 235553 1009029 1697657 1397667 1010598
$$ packed form
39523C18954J044914J75130m89610k14050N08495O37152j03822r13436r73111
39514i384m36657o2417j29517j79669J76171O13535N18066r2560m51308p4841
39504a28581M05270O8060p11880m95682R76863J906516Q37454j003062j284567
39495E70391J03871J132766Q13310K39103J93720j13358j079524j462433m07393
39486i547Q50201P67903k52640q31489p37446n69670k69119M80842J076779P14525
39476A220339k49891r19156j162595j099412k29449J410598K225766J078202n13689
39467A760713l39355R97837J009626n69338j382612l99518N81855K10890l34050
39458A536048J08011M82517l19417j125244m46362P73476O88628k99990l87069
$$ plain form
39449 1010598 1350967 1425391 96570 -1656407 -1898259 -628718 220850 -339021 -1070231
39440 -1070231 -536765 857257 1654437 1355792 754157 652391 1059614 1552772 1762049
39431 1762049 1450025 685106 88959 368608 1288480 1589677 457879 -1236325 -1834923
39422 -1834923 -932192 264448 756961 1023186 1872374 2865147 2970035 2383918 2325678
39413 2325678 2903096 2639579 830966 -908794 -691122 933479 1846945 1479296 1233997
39404 1233997 1739299 1695333 311582 -916310 -403349 832075 602461 -1009409 -1760988
39395 -1760988 -706823 598281 836695 811138 1487595 1908517 746152 -1198587 -1990856
39386 -1990856 -1540233 -1594218 -2690581 -3085421 -1514066 584770 1035275 230444 725333
$$ packed form
39449A010598L40369P4424j328821j752977k41852J269541Q49568n59871p31210
39440a070231N33466J394022P97180k98645o01635j01766M07223M93158K09277
39431A762049l12024p64919n96147K79649R19872L01197j131798j694204n98598
39422a834923R02731J196640M92513K66225Q49188R92773J04888n86117n8240
39413B325678N77418k63517j808613j739760K17672J624601R13466l67649k45299
39404A233997N05302m3966j383751j227892N12961J235424k29614j611870p51579
39395a760988J054165J305104K38414k5557O76457M20922j162365j944739p92269
39386a990856M50623n3985j096363l94840J571355K098836M50505q04831M94889
$$ plain form
39377 725333 3489662 6169355 5993176 3424008 1523285 1910458 2895958 2189073 91540
39368 91540 -1280820 -1115070 -569290 -533609 -466043 171435 887974 1314119 2040488 3352500
39358 3352500 4245366 3778862 2492063 1391141 442858 -711882 -1447857 -1050211 -247081
39349 -247081 -239024 -664263 -220658 983394 1529354 1114058 984763 1638557 1909556 985091
39339 985091 -279857 -872548 -1048413 -1357054 -1470887 -949009 -165169 399169 851830
39330 851830 1113027 513387 -911610 -1792013 -1197434 -106322 94402 -294405 -79498
39321 -79498 616037 528234 -629623 -1706299 -1804880 -1216766 -569735 -104013 94456 96388
39311 96388 445504 1537374 2616886 2413808 991142 -40617 460468 1813237 2653460
$$ packed form
39377G25333K764329K679693j76179k569168j900723L87173R85500p06885k097533
39368I1540j372360J65750N45780L5681O7566O37478P16539M26145P26369J312012
39358C352500Q92866m66504j286799j100922r48283j154740p35975L97646Q03130
39349b47081Q057m25239M43605J204052N45960m15296j29295O53794K70999r24465
39339I85091j264948n92691j75865l08641j13833N21878P83840N64338M52661
39330H51830K61197n99640j424997q80403N94579J091112K00724l88807K14907
39321g9498O95535q7803j157857j076676r8581N88114O47031M65722J98469J932
39311I6388L49116J091870J079512k03078j422666j031759N01085J352769Q40223
$$ plain form
39302 2653460 2659332 2524259 2754355 3143465 3177220 2479241 1041256 -623160 -1699919
39293 -1699919 -1750793 -1115189 -524037 -451056 -870640 -1351598 -1244774 -99041 1797503
39284 1797503 3407146 3729421 2649663 986560 -234380 -558684 -299864 -50698 -10721
39275 -10721 119375 556110 996615 995069 583568 178774 -34759 -255899 -611788 -913140
39265 -913140 -924069 -575343 125623 1059657 1800849 1840002 1205195 581775 605671 1239983
39255 1239983 1984364 2419525 2354490 1775800 1012782 710203 1170012 1811260 1777366 1118578
39245 1118578 844272 1570207 2603988 2831934 2191396 1640464 1729166 1879345 1346523
39236 1346523 359548 -206747 -62096 127319 -350229 -1332330 -1962688 -1664739 -788393
$$ packed form
39302B653460N872j35073K30096L89110L3755o97979j437985j664416j076759
39293a699919n0874O35604N91152P2981m19584m80958J06824J145733J896544
39284A797503J609643L22275j079758j663103j220940l24304K58820K49166L9977
39275a0721J30096M36735M40505j546m11501m04794k13533k21140l55889l01352
39265i13140j0929L48726P00966R34034P41192L9153o34807o23420K3896O34312
39255A239983P44381M35161o5035n78690p63018l02579M59809O41248l3894o58788
39245A118578k74306P25935J033781K27946o40538n50932Q8702J50179n32822
39236A346523r86975n66295J44651J89415m77548r82101o30358K97949Q76346
$$ plain form
39227 -788393 -236164 -452331 -919409 -830356 -113785 595457 956877 1293594 1747215 1738066
39217 1738066 843121 -252767 -412095 546296 1728670 2304666 2153624 1548933 909646
39208 909646 792153 1402776 2129006 2266817 2163249 2787266 4145201 5127738 5141329 4807840
39198 4807840 4612152 4006600 2673289 1696978 2314836 4003762 4948243 4264723 2854539
39189 2854539 2092798 2442523 3382047 4017918 3666576 2379444 1049419 658887 1370346
39180 1370346 2561711 3570935 4080237 4023221 3606458 3295427 3324589 3336408 2934833 2419626
39170 2419626 2428282 2941107 3228854 2825051 2027909 1369184 1106419 1375410 2292520 3557158
39160 3557158 4331716 3983420 2850591 1897649 1565671 1303214 470610 -556216 -704597
$$ packed form
39227g88393N52229k16167m67078Q9053P16571P09242L61420L36717M53621r149
39217A738066q94945j095888j59328R58391J182374N75996j51042o04691o39287
39208I09646j17493O10623P26230J37811j03568O24017J357935R82537J3591l33489
39198D807840j95688o05552j333311r76311O17858J688926R44481o83520j410184
39189B854539p61741L49725R39524O35871l51342j287132j330025l90532P11459
39180A370346J191365J009224N09302n7016m16763l11031K9162J1819m01575n15207
39170B419626Q656N12825K87747m03803p97142o58725k62765K68991R17110J264638
39160C557158P74558l48296j132829r52942l31978k62457q32604j026826j48381
$$ plain form
39151 -704597 321553 1489372 1717961 1135180 461490 -243120 -1214965 -1824153 -1183229
39142 -1183229 118207 435946 -451551 -907894 -112294 573912 11620 -657249 35086
39133 35086 1340862 1699471 1470216 1913412 2349214 1118138 -980735 -1270765 453155
39124 453155 1233240 -413136 -2126780 -1600920 -140067 -72025 -834498 -407341 935086
39115 935086 1326997 808214 984120 1580410 594370 -1789242 -2628244 -674283 1419208
39106 1419208 1044347 -527324 -447196 1274732 2169001 1230081 -105609 -709556 -1150425
39097 -1150425 -1938153 -2339486 -1760288 -868133 -439383 -184238 395542 908840 804409
39088 804409 478017 637437 1083882 1150696 968319 1185932 1623266 1380241 386281 -297439
$$ packed form
39151g04597J026150J167819K28589n82781o73690p04610r71845o09188O40924
39142a183229J301436L17739q87497m56343P95600O86206n62292o68869O92335
39133C5086J305776L58609k29255M43196M35802j231076k098873k90030J723920
39124D53155P80085j646376j713644N25860J460853O8042p62473M27157J342427
39115I35086L91911n18783J75906N96290r86040k383612q39002J953961K093491
39106A419208l74861j571671Q0128J721928Q94269r38920j335690o03947m40869
39097a150425p87728m01333N79198Q92155M28750K55145N79780N13298j04431
39088H04409l26392J59420M46445O6814j82377K17613M37334k43025r93960o83720
$$ plain form
39078 -297439 -77701 297325 37975 -404709 -162299 578351 853285 359526 -235346 -293710
39068 -293710 208645 1009494 1766502 1982445 1446115 783170 855261 1532109 1806928 1253026
39058 1253026 505166 32744 -570119 -1497038 -1893163 -1029442 375272 1051998 922857
39049 922857 853859 1063534 1053749 919270 1246706 1603187 750153 -1099211 -1863150 -454909
39039 -454909 1353915 1336814 -59223 -714117 -163779 107463 -581399 -1219437 -1233167 -1425486
39029 -1425486 -2051974 -1885684 -385926 848964 343166 -819224 -592980 896371 1764296
39020 1764296 1410196 1088516 1451322 1546721 775892 86525 342116 888225 769695 300657
39010 300657 316693 666030 598536 144314 -4216 283987 467722 328941 183249 100018
$$ packed form
39078b97439K19738L75026k59350m42684K42410P40650K74934m93759n94872n8364
39068b93710N02355Q00849P57008K15943n36330o62945P2091O76848K74819n53902
39058A253026p47860m72422o02863r26919l96125Q63721J404714O76726j29141
39049I22857o8998K09675r785j34479L27436L56481q53034j849364p63939J408241
39039d54909J808824j7101j396037o54894N50338K71242o88862o38038j3730j92319
39029a425486o26488J66290J499758J234890n05798j162390K26244J489351Q67925
39020A764296l54100l21680L62806R5399p70829o89367K55591N46109j18530m69038
39010C00657J6036L49337o7494m54222j48530K88203J83735j38781j45692q3231
$$ plain form
39000 100018 -251148 -828174 -1028052 -581871 -99194 -333621 -1220744 -1992892 -2089079 -1669225
38990 -1669225 -1267338 -1130258 -964126 -318191 786681 1683672 1643947 652155 -534578
38981 -534578 -1164392 -1173386 -958360 -702617 -361342 -262787 -996536 -2263261 -2532464 -815077
38971 -815077 1536091 2020359 120678 -1985854 -2285706 -1245186 -500331 -465779 -471433
38962 -471433 -373432 -605149 -1148526 -1734699 -2570731 -3621813 -3827317 -2540385 -1094437
38953 -1094437 -1110175 -1798899 -1156095 488620 762695 -730303 -1587721 -627602 216488
38944 216488 -471511 -861329 965856 3396371 3542275 1555526 -92979 -526722 -795396
38935 -795396 -998753 -98478 1420562 1540349 -58104 -1120077 -56247 1842992 2439807
$$ packed form
39000A00018l51166n77026j99878M46181M82677k34427q87123p72148r6187M19854
38990a669225M01887J37080J66132O45935J104872Q96991l9725r91792j186733
38981e34578o29814q994K15026K55743L41275R8555p33749j266725k69203J717387
38971h15077K351168M84268j899681k106532k99852J040520P44855L4552n654
38962d71433R8001k31717n43377n86173q36032j051082k05504J286932J445948
38953a094437j5738o88724O42804J644715K74075j492998q57418R60119Q44090
38944B16488o87999l89818J827185K430515J45904j986749j648505m33743k68674
38935g95396k03357R00275J519040J19787j598453j061973J063830J899239N96815
$$ plain form
38926 2439807 1517059 470756 294987 852651 1537312 1925676 1992175 1900197 1480851 329331
38916 329331 -1156898 -1617204 -533639 602333 240296 -835653 -726101 517467 1052367
38907 1052367 305960 -279702 156868 639680 328661 -121807 -27105 120401 -173363 -415158
38897 -415158 -180449 123746 336629 1053440 2205219 2468882 1118453 -690850 -1491883
38888 -1491883 -1297825 -890919 -432113 172179 524918 438047 503225 1009676 1230039 737478
38878 737478 392213 915190 1512215 1183041 467028 491135 1050033 1089082 515764 109210
38868 109210 90469 165518 596505 1811850 3164734 3408773 2329544 779164 -710799
38859 -710799 -2153943 -3121855 -2876344 -1651384 -692324 -725113 -1178927 -1099997 -195302 1068055
$$ packed form
38926B439807r22748j046303j75769N57664O84661L88364O6499r1978m19346j151520
38916C29331j486229m60306J083565J135972l62037j075949J09552J243568N34900
38907A052367p46407n85662M36570M82812l11019m50468R4702J47506k93764k41795
38897d15158K34709L04195K12883P16811J151779K63663j350429j809303q01033
38888a491883J94058M06906M58806O04292L52739q6871O5178N06451K20363m92561
38878G37478l45265N22977N97025l29174p16013K4107N58898L9049n73318m06554
38868A09210j8741P5049M30987J215345J352884K44039j079229j550380j489963
38859g10799j443144r67912K45511J224960R59060l2789m53814P8930R04695J263357
$$ plain form
38849 1068055 1853129 1567758 601032 131212 649080 1206999 885640 349493 862164
38840 862164 2260023 3158576 2909042 2145625 1564415 1316023 1449286 1806060 1645963
38831 1645963 544124 -569536 -541237 128953 61121 -565394 -193159 1348469 2231543
38822 2231543 1378763 5850 -445085 -248148 -206592 -72804 506092 763243 78295
38813 78295 -510465 274500 1640260 1555634 -270192 -1812576 -1385382 352985 1535536
38804 1535536 1409412 904481 1161009 1967908 1958479 491579 -1068320 -757263 1309914
38795 1309914 2761565 1919143 -183809 -1513400 -1645222 -1435756 -1011699 197353 1724178
38786 1724178 2111534 985582 -280890 -432261 231897 748809 837065 770346 700940 726944
$$ packed form
38849A068055P85074k85371r66726m69820N17868N57919l21359n36147N12671
38840H62164J397859Q98553k49534p63417n81210k48392J33263L56774j60097
38831A645963j101839j113660K8299O70190o7832o26515L72235J541628Q83074
38822B231543q52780j372913m50935J96937M1556J33788N78896K57151o84948
38813G8295n88760P84965J365760q4626j825826j542384M27194J738367J182551
38804A535536j26124n04931K56528Q06899r429j466900j559899L11057K067177
38795A309914J451651q42422k102952j329591j31822K09466M24057J209052J526825
38786A724178L87356j125952j266472j51371O64158N16912Q8256o6719o9406K6004
$$ plain form
38776 726944 1061273 1611199 1843790 1463346 800968 279345 -7881 -24274 217635 193027
38766 193027 -734990 -2078015 -2377129 -1233390 -185337 -632020 -1782929 -1892311 -836983
38757 -836983 7503 100112 332903 1210929 1929510 1709429 858082 -14249 -813990 -1471223
38747 -1471223 -1569695 -1063689 -569637 -423727 -240784 135173 195200 -124205 78602 1262396
38737 1262396 2466727 2676478 2240268 1886338 1325915 204978 -458993 454534 1996927
38728 1996927 2138934 747935 -344812 -331799 -447093 -1477029 -2231856 -1538607 -166657
38719 -166657 507833 565102 948146 1689194 2056775 1919800 1766153 1675299 1268120 503215
38709 503215 -215021 -526664 -210338 803770 2005090 2426943 1801663 1037336 919314
$$ packed form
38776G26944L34329N49926K32591l80444o62378n21623k87226j6393K41909k4608
38766A93027r28017j343025k99114J143739J048053m46683j150909j09382J055328
38757h36983Q44486R2609K32791Q78026P18581k20081q51347q72331p99741o57233
38747a471223r8472N06006M94052J45910J82943L75957O0027l19405K02807J183794
38737A262396J204331K09751m36210l53930n60423j120937o63971R13527J542393
38728A996927J42007j390999j092747J3013j15294j029936p54827O93249J371950
38719a66657O74490N7269L83044P41048L67581j36975j53647r0854m07179p64905
38709E03215p18236l11643L16326J014108J201320M21853o25280p64327j18022
$$ plain form
38700 919314 981363 428290 -479286 -917393 -865947 -955971 -1272679 -1285804 -785509 -68067
38690 -68067 587271 895271 384681 -931751 -2082503 -2212697 -1740468 -1518977 -1376333
38681 -1376333 -704877 -45497 -506264 -1646910 -1587733 358648 2562814 3202100 2357360
38672 2357360 1298843 686326 336282 82464 -7746 45284 188178 481066 835765 907910
38662 907910 544725 54414 -182640 -91195 224531 661560 1084006 1381908 1544456 1458226
38652 1458226 928901 287694 457371 1669531 2618859 1967044 361325 -313500 450206
38643 450206 1331479 1379349 1078200 884302 369812 -448293 -481978 685036 1726501 1400855
38633 1400855 338541 -197153 -287902 -720997 -1238650 -955256 28121 875158 1453391
$$ packed form
38700I19314O2049n53073r07576m38107N1446r0024l16708j3125N00295P17442
38690f8067O55338L08000n10590j316432j150752j30194M72229K21491J42644
38681a376333O71456O59380m60767j140646N9177J946381K204166O39286q44740
38672B357360j058517o12517l50044k53818r0210N3030J42894K92888L54699P2145
38662I07910l63185m90311k37054R1445L15726M37029M22446K97902J62548q6230
38652A458226n29325o41207J69677J212160R49328o51815j605719o74825P63706
38643D50206Q81273M7870l01149j93898n14490q18105l3685J167014J041465l25646
38633A400855j062314n35694r0749m33095n17653K83394R83377Q47037N78233
$$ plain form
38624 1453391 2098047 2308652 1255883 -486352 -1250993 -531437 389209 353996 -310020
38615 -310020 -709588 -570087 -46721 708164 1292997 1156478 420987 -50334 207119 686709
38605 686709 817043 784371 1050842 1625521 2204227 2551719 2459859 1842414 1115111 914281
38595 914281 1211660 1354323 1210135 1440629 2189604 2387327 1159764 -675748 -1421365
38586 -1421365 -507458 1072313 2128577 2353828 2112907 1831103 1720310 1711327 1538247
38577 1538247 1049243 390452 -156501 -285928 331132 1591550 2423264 1581357 -535034
38568 -535034 -1761296 -718512 1257506 1839062 764107 -232026 -255553 -335578 -1332668
38559 -1332668 -2342571 -2108740 -964184 -261409 -435048 -670866 -321332 196734 56520
$$ packed form
38624A453391O44656K10605j052769j742235p64641P19556R20646l5213o64016
38615c10020l99568J39501N23366P54885N84833j36519p35491m71321K57453M79590
38605F86709J30334l2672K66471N74679N78706L47492r1860o17445p27303k00830
38595I14281K97379J42663j44188K30494P48975J97723j227563j835512p45617
38586a421365R13907J579771J056264K25251k40921k81804j10793q983j73080
38577A538247m89004o58791n46953j29427O17060J260418Q31714q41907k116391
38568e35034j226262J042784J976018N81556j074955r96133k3527q0025r97090
38559a332668j009903K33831J144556P02775j73639k35818L49534N18066j40214
$$ plain form
38550 56520 -866350 -1722234 -1523916 -337960 548820 82896 -1102744 -1415484 -466242
38541 -466242 468691 417786 41752 323164 923771 853259 105900 -444061 -389110 -79801
38531 -79801 115473 -2232 -633838 -1477728 -1533726 -436069 515364 -82938 -1536068 -1896292
38521 -1896292 -818913 116381 58837 35109 865054 1654860 1387800 649522 577455 1111734
38511 1111734 1463671 1515598 1629472 1740807 1726883 2077800 3125959 4120305 4106170 3252821
38501 3252821 2316445 1364853 216587 -383609 510201 2304739 3257095 2699527 1642239
38492 1642239 1018294 602273 58640 -129295 485824 1289230 1202662 40799 -1156270
38483 -1156270 -1060854 684442 2937330 3990552 3391662 2461958 2479146 2926390 2489598
$$ packed form
38550E6520r22870q55884J98318J185956Q86780m65924j185640l12740R49242
38541d66242R34933n0905l76034K81412O00607p0512p47359n49961N4951L09309
38531g9801J95274j17705o31606q43890n5998J097657R51433n98302j453130l60224
38521a896292J077379R35294n7544k3728Q29945P89806k67060p38278p2067N34279
38511A111734L51937N1927J13874J11335j3924L50917J048159R94346j4135q53349
38501C252821r36376r51592j148266o00196Q93810J794538R52356n57568j057288
38492A642239o23945m16021n43633j87935O15119Q03406q6568j161863j197069
38483a156270R5416J745296K252888J053222n98890r29704J7188M47244m36792
$$ plain form
38474 2489598 1258342 544772 696626 692775 139787 11175 734961 1094237 124546 -1105045
38464 -1105045 -918124 592346 1943560 2437633 2577110 2617663 2144458 1209277 643338
38455 643338 806630 955122 415867 -262734 1617 1286368 2413942 2268287 1000871
38446 1000871 -223962 -499014 46896 718821 1156249 1455353 1605993 1361302 798757
38437 798757 534999 1035989 1947108 2411442 1956238 904868 46193 28247 922149 2196085
38427 2196085 3112292 3190678 2416969 1340937 1036459 2308760 4405005 5168309 3455158
38418 3455158 939074 192853 1219747 1645430 601655 262432 2300037 4747129 4515428
38409 4515428 1915489 198917 920260 2254521 2329888 1854409 2246770 3040738 2897523
$$ packed form
38474B489598j231256p13570J51854l851n52988j28612P23786L59276r69691j229591
38464a105045J86921J510470J351214M94073J39477M0553m73205r35181n65939
38455F43338J63292J48492n39255o78601K64351J284751J127574j45655j267416
38446A000871j224833k75052N45910O71925M37428K99104J50640k44691n62545
38437G98757k63758N00990R11119M64334m55204j051370q58675j7946Q93902J273936
38427B196085R16207P8386p73709j076032l04478J272301K096245P63304j713151
38418C455158k516084p46221J026894M25683j043775l39223K037605K447092k31701
38409D515428k599939j716572P21343J334261P5367m75479L92361P93968j43215
$$ plain form
38400 2897523 2087901 2086441 3087280 3618406 2750126 1324353 592393 705545 1135526
38391 1135526 1764644 2761547 3767724 3978934 3078362 1677802 726823 624395 907384
38382 907384 786113 105268 -295589 441479 1800214 2090696 489545 -1652096 -2287537
38373 -2287537 -1150502 173273 561012 590089 1104409 1707368 1595951 1108613 1253247
38364 1253247 2018816 2362281 1926636 1665965 2393519 3587937 4186991 3939990 3374697
38355 3374697 2849464 2281349 1667199 1352228 1690088 2609564 3505315 3578810 2557437
38346 2557437 1148944 434354 644164 898197 384727 -599285 -1128641 -807611 17876
38337 17876 937635 1776818 2273955 2067897 1247693 557572 744852 1793309 2934831
$$ packed form
38400B897523q09622j460J000839N31126q68280j425773p31960J13152M29981
38391A135526O29118R96903J006177K11210r00572j400560r50979j02428K82989
38382I07384j21271o80845m00857P37068J358735K90482j601151k141641o35441
38373b287537J137035J323775L87739K9077N14320O02959j11417m87338J44634
38364A253247P65569L43465m35645k60671P27554J194418N99054k47001n65293
38355C374697n25233n68115o14150l14971L37860R19476Q95751P3495j021373
38346B557437j408493p14590K09810K54033n13470r84012n29356L21030Q25487
38337A7876R19759Q39183M97137k06058q20204o90121J87280J048457J141522
$$ plain form
38328 2934831 3329417 2668423 1283321 -136669 -985980 -1138239 -1024839 -1221567 -1832161
38319 -1832161 -2328067 -2113618 -1195974 -139169 592281 1002310 1266959 1375304 1213358
38310 1213358 777481 150868 -530736 -974705 -868404 -304536 194298 275846 113004 -24094
38300 -24094 -180982 -406534 -399406 100493 779336 974563 317748 -964290 -2060161 -1852185
38290 -1852185 120501 2694729 3908733 3313310 2572290 3053439 3872210 3473125 2176191
38281 2176191 1537208 1781542 1704887 926577 390227 509361 609938 541412 1066740 2099616
38271 2099616 2290148 1184333 229764 654696 1728628 2167718 1998668 1922562 1977134
38262 1977134 1952192 2063822 2125192 1181643 -814387 -2104804 -1306462 518821 1453894
$$ packed form
38328B934831L94586o60994j385102j419990q49311j52259J13400j96728o10594
38319a832161m95906K14449R17644J056805P31450M10029K64649J08345j61946
38310A213358m35877o26613o81604m43969J06301N63868M98834Q1548j62842j37098
38300b4094j56888k25552P128M99899O78843J95227o56815j282038j095871K07976
38290a852185J972686K574228J214004n95423p41020M81149Q18771l99085j296934
38281B176191o38983K44334p6655p78310n36350J19134J00577o8526N25328J032876
38271B099616J90532j105815r54569M24932J073932M39090j69050p6106N4572
38262A977134k4942J11630O1370r43549j996030j290417P98342J825283R35073
$$ plain form
38253 1453894 1413359 1581584 2024949 1780818 848686 230253 218726 323359 626066 1495069
38243 1495069 2211762 1747782 750714 728006 1268330 388744 -1962482 -3239725 -2141600
38234 -2141600 -773025 -1379138 -2906113 -2905652 -1430577 -595916 -972883 -954253 203935
38225 203935 1031369 342389 -724573 -474335 676899 827765 -559307 -1923928 -1877116
38216 -1877116 -917596 -246396 110176 895738 1912954 2120747 1471814 1245630 2019567
38207 2019567 2593729 1897184 905773 1308137 2887217 3725126 2832383 1185244 94368
38198 94368 -160623 144722 767701 1179669 739768 -269272 -649625 181400 1475142
38189 1475142 2377832 2956591 3450268 3433799 2536554 1298661 490761 118537 -140091
$$ packed form
38253A453894m0535J68225M43365k44131r32132o18433j1527J04633L02707Q69003
38243A495069P16693m63980r97068k2708N40324q79586k351226j277243J098125
38234b141600J368575o06113j526975M61J475075Q34661l76967J8630J158188
38225B03935Q27434o88980j066962K50238J151234J50866j387072j364621M6812
38216a877116R59520O71200L56572P85562J017216K07793o48933k26184P73937
38207B019567N74162o96545r91411M02364J579080Q37909q92743j647139j090876
38198I4368k54991L05345O22979M11968m39901j009040l80353Q31025J293742
38189A475142R02690N78759M93677j6469q97245j237893q07900l72224k58628
$$ plain form
38180 -140091 -60198 673844 1529960 1616505 984390 576771 837826 1122605 694756 -258424
38170 -258424 -926029 -884358 -497798 -341558 -419356 -203588 433184 715765 -24875 -1041389
38160 -1041389 -812869 762118 1828069 921945 -972140 -1741049 -989909 -329202 -892999
38151 -892999 -1803902 -1524836 136344 1950338 2681646 2106920 992848 452803 999553
38142 999553 1881584 1711577 178061 -1230498 -828227 1140115 2741705 2812501 2352822
38133 2352822 2987745 4678098 5800270 5293188 3842034 2757949 2437532 2364194 2083020
38124 2083020 1590974 1062338 750031 994023 1801218 2515777 2439095 1757207 1319662 1452684
38114 1452684 1574550 1195745 737842 917235 1651817 2102071 1748444 1033002 828930
$$ packed form
38180a40091P9893P34042Q56116Q6545o32115m07619K61055K84779m27849r53180
38170b58424o67605M1671L86560J56240p7798K15768O36772K82581p40640j016514
38160a041389K28520J574987J065951r06124j894085p68909P51140O60707n63797
38151h92999r10903K79066J661180J813994P31308n74726j114072n40045N46750
38142I99553Q82031j70007j533516j408559M02271J968342J601590P0796m59679
38133B352822O34923J690353J122172n07082j451154j084085l20417p3338k81174
38124B083020m92046n28636l12307K43992Q07195P14559p6682o81888m37545J33022
38114A452684J21866l78805m57903J79393P34582M50254l53627p15442k04072
$$ plain form
38105 828930 1493002 2571218 3333435 3451062 3144200 2819892 2735953 2977514 3511787 4122722
38095 4122722 4423149 4080657 3027608 1529877 261228 182985 1768220 4065726 5051379
38086 5051379 3504360 392847 -2033961 -2405539 -1130660 572223 1890365 2644713
38078 2644713 2923186 2827103 2403811 1720995 1100326 1130329 2118881 3543767 4339842 3807007
38068 3807007 2157419 324240 -629329 -236542 866552 1398143 800591 -69171 -52632
38059 -52632 798591 1444128 1385228 1181549 1386228 1748283 1791435 1595360 1563862 1763128
38049 1763128 1903682 1833994 1738841 1832944 1999213 1843316 1215632 630445 876666 2100279
38039 2100279 3570680 4486459 4641107 4188849 3384371 2879388 3500862 5056321 6016416
$$ packed form
38105H28930O64072J078216P62217J17627l06862l24308q3939K41561N34273O10935
38095D122722L00427l42492j053049j497731j268649p8243J585235K297506R85653
38086E051379j547019l111513k426808l71578J274879J702883J318142P54348
38078B644713K78473r6083m23292o82816o20669L0003R88552J424886P96075n32835
38068C807007j649588j833179r53569L92787J103094N31591n97552q69762J6539
38059e2632Q51223O45537n8900k03679K04679L62055M3152j96075l1498J99266
38049A763128J40554o9688r5153R4103J66269j55897o27684n85187K46221J223613
38039B100279J470401R15779J54648m52258q04478n04983O21474J555459R60095
$$ plain form
38030 6016416 5251117 3561399 2542204 2431755 2252130 1702099 1477862 1721310 1611189
38021 1611189 887179 545380 1410460 2921229 3907610 3878942 3101013 2039812 1131686
38012 1131686 595315 253072 6944 368941 1701863 3063190 2961899 1411018 42047
38003 42047 -80925 479669 963893 1440342 1812786 1353647 213549 -30906 1366512
37994 1366512 2723960 2119104 257995 -517933 492480 1790847 2147278 1926845 1811299
37985 1811299 1711854 1452410 1430905 1994558 2800222 3184269 2737521 1432847 -268331
37976 -268331 -1391384 -1171392 -3722 788306 306211 -1085922 -2237780 -2202259 -893148
37967 -893148 811021 1696483 1321173 409657 -83342 18211 347657 728309 1112851
$$ packed form
38030F016416p65299j689718j019195j10449j79625n50031k24237K43448j10121
38021A611189p24010l41799Q65080J510769R86381k8668p77929j061201r08126
38012A131686n36371l42243k46128L61997J332922J361327j01291j550881j368971
38003D2047j22972N60594M84224M76449L72444m59139j140098k44455J397418
37994A366512J357448o04856j861109p75928J010413J298367L56431k20433j15546
37985A811299r9445k59444k1505N63653Q05664L84047m46748j304674j701178
37976b68331j123053K19992J167670P92028m82095j392133j151858L5521J309111
37967h93148J704169Q85462l75310r11516m92999J01553L29446L80652L84542
$$ plain form
37958 1112851 1272940 1252403 1692256 2886438 3928116 3790371 2957871 2839046 3670298
37949 3670298 4234796 3748184 2740834 1772463 628260 -553968 -630757 996129 3036788
37940 3036788 3701515 2912922 1994965 1541627 922253 -93279 -625538 -192756 164443
37931 164443 -718760 -2171034 -2294444 -548433 1332197 1494725 284606 -402972 306743
37922 306743 1378265 1663104 1560691 2184065 3485191 4192446 3539366 2183044 1168489
37913 1168489 704896 431052 337760 741254 1575576 2394395 3049472 3727639 4246384 4052104
37903 4052104 3235360 2797365 3284576 3796644 3248158 2148189 1938223 2725980 3096789
37894 3096789 2463616 2127811 3203879 4759336 5161139 4285627 3087472 1816142 261061
$$ packed form
37958A112851J60089k0537M39853J194182J041678j37745q32500j18825Q31252
37949C670298N64498m86612j007350r68371j144203j182228p6789J626886K040659
37940C036788O64727p88593r17957m53338o19374j015532n32259M32782L57199
37931A64443q83203j452274j23410J746011J880630J62528j210119o87578P09715
37922C06743J071522K84839j02413O23374J301126P07255o53080j356322j014555
37913A168489m63593k73844r3292M03494Q34322Q18819O55077O78167N18745j94280
37903D052104q16744m37995M87211N12068n48486j099969k09966P87757L70809
37894C096789o33173l35805J076068J555457M01803q75512j198155j271330j555081
$$ plain form
37885 261061 -762956 -31688 1964667 3217489 2867781 2196406 2484313 3305620 3641632
37876 3641632 3433334 3149161 2809644 2344493 2109031 2170516 1780324 443794 -1048363
37867 -1048363 -1533461 -1015819 -503977 -625438 -1133332 -1582836 -1826755 -1864279 -1657883 -1196169
37857 -1196169 -642740 -432765 -972687 -1902371 -2060602 -932280 228060 -178007 -1726497
37848 -1726497 -2423650 -1613053 -809343 -1137486 -1637777 -1121271 -239898 -337602 -1264127 -1743853
37838 -1743853 -1280136 -461684 169000 525911 651659 781549 1276779 1875819 1684074
37829 1684074 532390 -482579 -503393 -38892 129450 100686 98778 -216098 -678556 -169792
37819 -169792 1534178 2784089 2340684 1300644 1132829 1206861 280056 -847777 -567674
$$ packed form
37885B61061j024017P31268J996355J252822l49708o71375K87907Q21307L36012
37876C641632k08298k84173l39517m65151k35462O1485l90192j336530j492157
37867a048363m85098N17642N11842j21461n07894m49504k43919l7524K06396M61714
37857a196169N53429K09975n39922r29684j58231J128322J160340m06067j548490
37848a726497o97153Q10597Q03710l28143n00291N16506Q81373r7704r26525m79726
37838a743853M63717Q18452O30684L56911J25748J29890M95230N99040j91745
37829A684074j151684j014969k0814M64501J68342k8764j908l14876m62458N08764
37819a69792J703970J249911m43405j040040j67815P4032r26805j127833K80103
$$ plain form
37810 -567674 594292 842660 302012 658861 1915645 2247229 1172266 219151 105868
37801 105868 -177848 -939211 -956969 69715 550219 -472094 -1808129 -2148577 -1767061
37792 -1767061 -1247659 -340257 883716 1465113 1182495 1094166 1543485 1457150 645098 737978
37782 737978 2432728 3837628 3357300 2404284 3120855 4890134 5439487 4336089 3027456
37773 3027456 2156452 1202001 369695 516566 1260618 1287431 640952 699689 1640016 1951483
37763 1951483 1001505 123152 290223 532173 -79352 -434091 897312 2950527 3371280
37754 3371280 1856033 643585 1219922 2328213 2260844 1658029 2338803 4101251 4710170
37745 4710170 3171795 1130730 356204 569924 857350 1588639 3233203 4494210 3751805
$$ packed form
37810e67674J161966K48368n40648L56849J256784L31584j074963r53115j13283
37801A05868k83716p61363j7758J026684M80504j022313j336035l40448L81516
37792a767061N19402R07402J223973N81397k82618q8329M49319q6335q12052R2880
37782G37978J694750J404900m80328r53016P16571J769279N49353j103398j308633
37773C027456q71004r54451q32306J46871P44052K6813o46479N8737R40327L11467
37763A951483r49978q78353J67071K41950o11525l54739J331403K053215M20753
37754C371280j515247j212448N76337J108291o7369o02815O80774J762448O08919
37745D710170j538375k041065p74526K13720K87426P31289J644564J261007p42405
$$ plain form
37736 3751805 1761219 801937 1408853 2041187 1889256 1722566 1734540 1008385 -152992
37727 -152992 208100 2587261 4631435 4418278 3227915 3250671 4202747 4350604 3643062
37718 3643062 3473434 4014135 4068207 3360823 2940461 3201822 3273366 2680817 2147266 2278376
37708 2278376 2563630 2164344 991016 -249727 -618363 311586 1732161 1993248 453316
37699 453316 -1460702 -1899965 -879200 87311 231410 164641 406356 598876 432024
37690 432024 278120 499185 866239 1006649 891082 666282 428841 255123 131702 -60416
37680 -60416 -205526 98992 865631 1423327 1335021 1125651 1426314 1875001 1666982 797405
37670 797405 -53030 -461922 -268846 840259 2696342 4012755 3595399 2001118 878367
$$ packed form
37736C751805j990586r59282O06916O32334j51931j66690J1974p26155j161377
37727a52992L61092K379161K044174k13157j190363K2756R52076J47857p07542
37718C643062j69628N40701N4072p07384m20362K61361P1544n92549n33551J31110
37708B278376K85254l99286j173328j240743l68636R29949J420575K61087j539932
37699D53316j914018m39263J020765R66511J44099o6769K41715J92520j66852
37690D32024j53904K21065L67054J40410j15567k24800k37441j73718j23421j92118
37680f0416j45110L04518P66639N57696q8306k09370L00663M48687k08019q69577
37670G97405q50435m08892J93076J109105J856083J316413m17356j594281j122751
$$ plain form
37661 878367 846875 1175577 1340227 1535466 1646860 1147188 282452 52659 629703 1027927
37651 1027927 827843 998601 2270631 3708420 3825027 2505028 1030364 560959 1144267
37642 1144267 1924631 1938516 974410 -126869 -310801 509560 1495642 1984424 1940180 1475867
37632 1475867 818232 728849 1872859 3533945 4073200 3109142 2147767 2432097 3263675
37623 3263675 3334439 2721285 2373367 2337578 1887165 1118553 1021105 1826411 2501702 2341419
37613 2341419 2126570 2993562 4668810 5588884 4721115 2761375 1388430 1590240 2901696
37604 2901696 4157170 4700618 4720734 4634999 4565448 4528452 4780484 5600620 6768647 7553925
37594 7553925 7378032 6423917 5480705 5156485 5307050 5330592 4997971 4819244 5494937 7130218
$$ packed form
37661H78367l1492L28702J64650J95239J11394m99672q64736k29793N77044L98224
37651A027927k00084J70758J272030J437789J16607j319999j474664m69405N83308
37642A144267P80364J3885r64106j101279j83932Q20361R86082M88782m4244m64313
37632A475867o57635q9383J144010J661086N39255r64058r61375K84330Q31578
37623C263675P0764o13154l47918l5789m50413p68612r7448Q05306O75291j60283
37613B341419k14849Q66992J675248R20074q67769j959740j372945K01810J311456
37604B901696J255474N43448K0116q5735o9551l6996K52032Q20136J168027P85278
37594G553925j75893r54115r43212l24220J50565K3542l32621j78727O75693J635281
$$ plain form
37584 7130218 9105672 10604007 11135595 10711577 9773544 8948034 8642515 8773250 8938003
37575 8938003 8858698 8606902 8424103 8393561 8333286 8064160 7777095 7941295 8679510 9430959
37565 9430959 9547886 9083655 8581696 8191913 7548790 6560183 5707700 5361960 5345602 5426050
37555 5426050 5691097 6103209 6239139 5971673 6001635 7135606 9180414 10954816 11360314
37546 11360314 10322083 8866882 8305828 9022081 10082835 10450625 10378779 10855952 11833743
37537 11833743 12202505 11764963 11861607 13270900 14687242 14430112 12866757 11945356 12815352
37528 12815352 14979394 17410992 19461590 20880032 21857393 22984006 24581006 26362502
37520 26362502 28224945 30744540 34195584 37765371 40640910 43261391 46537119 50446879
$$ packed form
37584G130218J975454J498335N31588m24018r38033q25510l05519J30735J64753
37575H938003p9305k51796j82799l0542o0275k69126k87065J64200P38215P51449
37565I430959J16927m64231n01959l89783o43123r88607q52483l45740j6358Q0448
37555E426050K65047M12112J35930k67466K9962J133971K044808J774402M05498
37546A1360314j038231j455201n61054P16253J060754L67790p1846M77173R77791
37537A1833743L68762m37542R6644J409293J416342k57130j563355r21401Q69996
37528A2815352K164042K431598K050598J418442R77361J126613J597000J781496
37520B6362502J862443K519595L451044L569787K875539K620481L275728L909760
$$ plain form
37512 50446879 54481440 58895761 64335152 70721083 77779213 86262425 97286763 110692115
37504 110692115 125406636 141332357 159594580 180956211 205205427 232143085 261972304
37497 261972304 294422382 328214865 361364027 391402926 415758864 432805761 442203961
37490 442203961 443575320 435802818 418782372 394851167 366968980 336413881 303921170
37483 303921170 271879044 242958040 217255893 193368243 171789008 154389555 140740665
37476 140740665 128189999 116009801 106248342 99581673 93533958 86314249 79568087 75473227
37468 75473227 73530288 72146411 71152319 70644731 69362153 66580066 64063843 63817518
37460 63817518 65097135 65789729 65659416 66117235 67681007 69712347 71998889 74766160
$$ packed form
37512E0446879M034561M414321N439391O385931P058130Q483212J1024338J3405352
37504A10692115J4714521J5925721J8262223K1361631K4249216K6937658K9829219
37497B61972304L2450078L3792483L3149162L0038899K4355938J7046897R398200
37490D42203961J371359p772502j7020446k3931205k7882187l0555099l2492711
37483C03921170l2042126k8921004k5702147k3887650k1579235j7399453j3648890
37476A40740665j2550666j2180198r761459o666669o047715p219709o746162m094860
37468G5473227j942939j383877r94092n07588j282578k782087k516223k46325
37460F3817518J279617O92594j30313M57819J563772K031340K286542K767271
$$ plain form
37452 74766160 77678282 80333476 83028429 85694782 87130938 86778098 86014671 85904111
37444 85904111 84908000 80963521 74847917 69254935 65285456 62036001 58948948 56241577
37436 56241577 53508888 50252405 47511110 46739047 47310723 47341505 46736792 47144462 49067966
37427 49067966 51437587 54003551 57593357 61724746 64494608 65410418 66029700 67184932
37419 67184932 67837718 67360994 66623501 65867133 63751924 59730524 55411543 52272038 49738802
37410 49738802 46781935 43758784 41364527 39255548 37027297 35178840 33838399 31892997
37402 31892997 28734848 25653914 24149554 23917278 23699041 23015303 21889791 20069246
37394 20069246 17822391 16383314 16270777 16237409 15152806 13727572 12986043 12351782 10938995
$$ packed form
37452G4766160K912122K655194K694953K666353J436156l52840p63427j10560
37444H5904111r96111l944479o115604n592982l969479l249455l087053k707371
37436E6241577k732689l256483k741295p72063N71676L0782o04713M07670J923504
37427D9067966K369621K565964L589806M131389K769862R15810O19282J155232
37419F7184932O52786m76724p37493p56368k115209m021400m318981l139505k533236
37410D9738802k956867l023151k394257k108979k228251j848457j340441j945402
37402C1892997l158149l080934j504360k32276k18237o83738j125512j820545
37394B0069246k246855j439077j12537l3368j084603j425234p41529o34261j412787
$$ plain form
37385 10938995 9515798 9233520 9421298 8743583 7732863 7931573 9093577 9577135 9192542
37376 9192542 9234808 9735244 9209118 7508143 6445444 6768564 6786594 5227737 3535383
37367 3535383 3783177 5705133 7369098 7836053 7660280 7369133 6847430 6056953 5364296
37358 5364296 5129264 5437721 6041377 6324878 5818363 4981123 4826189 5499111 6015442
37349 6015442 5726870 5106907 4637162 3991995 3003718 2345811 2380102 2390261 2009788 2309721
37339 2309721 4066974 5880196 5734818 3915928 2598681 2798832 3515512 3857129 4119428
37330 4119428 4403513 3984498 2804311 2108264 2730848 3936608 4716839 5054137 5137705
37321 5137705 4614185 3623434 3351126 4295045 5014952 4028770 2155859 1463707 2430333
$$ packed form
37385A0938995j423197k82278J87778o77715j010720J98710J162004M83558l84593
37376I192542M2266N00436n26126j700975j062699L23120J8030j558857j692354
37367C535383K47794J921956J663965M66955j75773k91147n21703p90477o92657
37358E364296k35032L08457O03656K83501n06515q37240j54934O72922N16331
37349F015442k88572o19963m69745o45167r88277o57907L4291J0159l80473K99933
37339B309721J757253J813222j45378j818890j317247K00151P16680L41617K62299
37330D119428K84085m19015j180187o96047O22584J205760P80231L37298Q3568
37321E137705n23520r90751k72308R43919P19907r86182j872911o92152R66626
$$ plain form
37312 2430333 3664975 4102434 3979232 3778888 3634136 3799946 4456689 5013998 4802550
37303 4802550 4427893 5147939 6841077 7913537 7412588 5985963 4599383 3646265 3507500
37294 3507500 4457892 5593826 5396398 3959649 3129413 3700443 4095293 2865872 967880
37285 967880 213167 762049 1602748 2368282 3084705 3096026 1988468 896822 1180293
37276 1180293 2323575 2813769 2595620 2842883 3622481 3752044 3014961 2646359 3299672
37267 3299672 4154875 4407023 4138363 3374619 1834487 117842 -356922 727980 2009742
37258 2009742 2365278 2147170 1988858 1829475 1843135 2811222 4529449 5224312 3825326
37249 3825326 1698861 825441 1254394 1713453 1764590 1774235 1521530 613419 -147084 417313
$$ packed form
37312B430333J234642M37459j23202k00344j44752J65810O56743N57309k11448
37303D802550l74657P20046J693138J072460n00949j426625j386580r53118j38765
37294C507500R50392J135934j97428j436749q30236N71030L94850j229421j897992
37285I67880p54713N48882Q40699P65534P16423J1321j107558j091646K83471
37276A180293J143282M90194k18149K47263P79598J29563p37083l68602O53313
37267C299672Q55203K52148k68660p63744j540132j716645m74764J084902J281762
37258B009742L55536k18108j58312j59383J3660R68087J718227O94863j398986
37249C825326k126465q73420M28953M59059N1137R645k52705r08111p60503N64397
$$ plain form
37239 417313 1839271 2531493 2310625 2584810 3753938 4332223 3447894 2491121 2999397
37230 2999397 4200155 4223548 2978921 2160631 2661178 3588143 4054843 4493199 5495046
37221 5495046 6401027 6030522 4329099 2414962 1185063 612078 348830 306125 488148
37212 488148 805326 1232965 1727064 1909195 1404081 656338 709689 1749632 2535749 1962991
37202 1962991 667073 189789 822210 1295771 699107 -250267 -257263 899563 2285989
37193 2285989 2987990 2896238 2532305 2508225 3114103 4149192 5073007 5418262 5163310 4773339
37183 4773339 4798052 5226697 5313436 4432429 3095040 2486123 2805561 2914403 2155547 1588256
37173 1588256 2409135 3892636 4279424 3355942 2649283 3053475 3746487 3763156 3255374
$$ packed form
37239D17313J421958O92222k20868K74185J169128N78285q84329r56773N08276
37230B999397J200758K3393j244627q18290N00547R26965M66700M38356J001847
37221E495046R05981l70505j701423j914137j229899n72985k63248m2705J82023
37212D88148L17178M27639M94099J82131n05114p47743N3351J039943P86117n72758
37202A962991j295918m77284O32421M73561n96664r49374o996J156826J386426
37193B285989P02001r1752l63933k4080O05878J035089R23815L45255k54952l89971
37183D773339K4713M28645Q6739q81007j337389o08917L19438J08842p58856n67291
37173A588256Q20879J483501L86788r23482p06659M04192O93012J6669n07782
$$ plain form
37164 3255374 2673749 1951224 1169047 943642 1414764 1780498 1518447 1145136 1099199 908475
37154 908475 304237 113479 955201 1925959 1798917 861557 342961 577690 989392 1418342
37144 1418342 2121532 2759481 2733804 2374146 2484689 2833345 2475362 1541151 1144929 1304875
37134 1304875 665141 -1046611 -1949334 -617316 1506891 1895866 427869 -609882 153185
37125 153185 1544228 1993741 1827464 2344848 3503384 3885408 2783216 1096923 -38031
37116 -38031 -419391 -124461 1178476 3299629 4762386 4331930 2947964 2706714 3970018
37107 3970018 5002358 4733261 4211690 4532254 4893341 4097064 2889633 3114925 4934238
37098 4934238 6404514 5909193 3946600 2328014 2282001 3419054 4188394 3564854 2456758
$$ packed form
37164C255374n81625p22525p82177k25405M71122L65734k62051l73311m5937j90724
37154I08475o04238j90758Q41722R70758j27042r37360n18596K34729M11702M28950
37144A418342P03190O37949k5677l59658J10543L48656l57983r34211l96222J59946
37134A304875o39734j711752r02723J332018K124207L88975j467997j037751P63067
37125A53185J391043M49513j66277N17384J158536L82024j102192j686293j134954
37116c8031l81360K94930J302937K121153J462757m30456j383966k41250J263304
37107C970018J032340k69097n21571L20564L61087p96277j207431K25292J819313
37098D934238J470276m95321j962593j618586m6013J137053P69340o23540j108096
$$ plain form
37089 2456758 2691568 4254221 4842117 3188635 1390765 2095258 4448369 5296585 3964764
37080 3964764 2993116 3724133 4091157 2242101 -67045 56117 2250487 3451765 2299245
37071 2299245 708254 802857 2119366 2696082 1820381 636563 366089 801026 849512
37062 849512 166526 -388561 -112310 351994 -84643 -1190448 -1561548 -581125 829372
37053 829372 1705375 2176233 2543894 2351487 1351752 549121 1039873 2266141 2665424
37044 2665424 1896299 1199875 1412650 1775453 1257156 240813 102249 1407385 3202245
37035 3202245 4139228 3848353 2971499 2166937 1577223 1294474 1709386 2848830 3714991
37026 3714991 3090283 1095617 -704894 -992576 13256 1149375 1639045 1488902 1029357
$$ packed form
37089B456758K34810J562653N87896j653482j797870P04493K353111Q48216j331821
37080C964764r71648P31017L67024j849056k309146J23162K194370J201278j152520
37071B299245j590991R4603J316509N76716q75701j183818k70474M34937M8486
37062H49512o82986n55087K76251M64304m36637j105805l71100R80423J410497
37053H29372Q76003M70858L67661j92407r99735q02631M90752J226268L99283
37044B665424p69125o96424K12775L62803n18297j016343j38564J305136J794860
37035C202245R36983k90875q76854q04562n89714k82749M14912J139444Q66161
37026C714991o24708j994666j800511k87682J005832J136119M89670j50143m59545
$$ plain form
37017 1029357 541457 184354 20828 141664 665951 1369406 1584577 1037858 537991
37008 537991 997466 1921726 1994829 1268415 1428590 3341718 5584607 6280964 5387485
36999 5387485 4193495 3443573 3047766 2920234 2920801 2482482 1417372 631201 915644 1484089
36989 1484089 960978 -481982 -1309567 -838752 45275 487014 730626 1277722 2006838
36980 2006838 2535717 2691543 2337496 1433379 493087 312017 1009469 1879172 2278823
36971 2278823 2142491 1675592 1194913 1205232 1922249 2765677 3018180 2842942 2867706 3001146
36961 3001146 2673042 2089197 2063621 2592699 2832313 2616445 2693035 3200181 3312743 2875990
36951 2875990 2958047 4021594 4856332 4301305 2930547 1988908 1630738 1346348 1268191
$$ packed form
37017A029357m87900l57103j63526J20836N24287P03455K15171n46719m99867
37008E37991M59475R24260P3103p26414J60175J913128K242889O96357q93479
36999E387485j193990p49922l95807j27532N67m38319j065110p86171K84443N68445
36989A484089n23111j442960q27585M70815Q84027M41739K43612N47096P29116
36980B006838N28879J55826l54047r04117r40292j81070O97452Q69703L99651
36971B278823j36332m66899m80679J0319P17017Q43428K52503j75238K4764J33440
36961C001146l28104n83845k5576N29078K39614k15868P6590N07146J12562m36753
36951B875990Q2057J063547Q34738n55027j370758r41639l58170k84390p8157
$$ plain form
36942 1268191 1745097 2207874 1801038 868189 612112 1370256 2254380 2495665 2244738
36933 2244738 1962278 1788332 1676072 1577098 1337248 794935 79489 -403329 -278223 523877
36923 523877 1540365 1882949 1137582 205841 437456 1691000 2262893 1266540 -12870
36914 -12870 -17773 834425 1008792 201814 -575062 -834258 -1063392 -1391372 -1145377 -21947
36904 -21947 1243730 1658153 845579 -785958 -2156968 -2108662 -687955 511914 246428
36895 246428 -553836 -64954 1658236 2739692 2329858 1715226 2098765 2808322 2583634
36886 2583634 1475931 476760 79310 136063 538701 1182280 1655014 1648682 1377026 1130424
36876 1130424 823441 398872 198246 462594 891885 1115605 1166082 1122531 804483 240021
$$ packed form
36942A268191M76906M62777m06836r32849k56077P58144Q84124K41285k50927
36933B244738k82460j73946j12260r8974k39850n42313p15446m82818J25106Q02100
36923E23877J016488L42584p45367r31741K31615J253544N71893r96353j279410
36914a2870m903Q52198J74367q06978p76876k59196k29134l27980K45995J123430
36904b1947J265677M14423q12574j631537j371010M8306J420707J199869k65486
36895B46428q00264M88882J723190J081456m09834o14632L83539P09557k24688
36886B583634j107703r99171l97450N6753M02638O43579M72734o332k71656k46602
36876A130424l06983m24569k00626K64348M29291K23720N0477m3551l18048n64462
$$ plain form
36866 240021 -84988 94701 406587 570129 981019 1964618 2933406 3006786 2195877 1332668
36856 1332668 983158 952404 745882 117727 -711026 -1119052 -631503 370989 912357
36847 912357 713983 704371 1715979 3151689 3674808 2973955 2074788 1900488 2207128 2195019
36837 2195019 1725172 1487893 1964439 2562031 2223989 983158 307087 1326601 3199490
36828 3199490 4143821 3794799 3319218 3229345 2626473 1135653 67208 578488 1808781
36819 1808781 2093176 1240122 376167 169946 462592 1144347 2087929 2549897 1933195
36810 1933195 957606 847273 1478827 1558544 620073 -350384 -393914 367107 1250571 1622975
36800 1622975 983734 -523552 -1668788 -1285844 89747 836574 506022 209888 679882
$$ packed form
36866B40021l25009J79689L11886J63542M10890R83599R68788P3380q10909q63209
36856A332668l49510l0754k06522o28155q28753m08026M87549J002492N41368
36847I12357j98374r612J011608J435710N23119p00853q99167j74300L06640j2109
36837B195019m69847k37279M76546N97592l38042j240831o76071J019514J872889
36828C199490R44331l49022m75581q9873o02872j490820j068445N11280J230293
36819A808781K84395q53054q63955k06221K92646O81755R43582M61968o16702
36810A933195r75589j10333O31554P9717r38471r70457m3530P61021Q83464L72404
36800A622975o39241j507286j145236L82944J375591P46827l30552k96134M69994
$$ plain form
36791 679882 1386182 1884380 2502738 3113943 2748117 1308535 309634 818686 1810033
36782 1810033 1758374 901423 630456 1370387 2353118 2956008 3066702 2591217 1766077 1518058
36772 1518058 2326899 3147521 2722239 1566515 1203523 1697296 1666724 853921 802038 2277965
36762 2277965 3699517 3355651 1990586 1675072 2768408 3598729 3077258 2140940 2122164
36753 2122164 2837454 3215797 3220473 4006274 6062322 8133502 8628384 7644837 6779972
36744 6779972 6963768 7336839 6658971 5093165 3818477 3280166 2821999 2093919 1802585
36735 1802585 2487701 3225804 2454502 29014 -2258960 -2499707 -632313 1676700 2815317
36726 2815317 2477343 1327412 109339 -606681 -354548 827812 2047907 2327796 1868076
$$ packed form
36791F79882P06300M98198O18358O11205l65826j439582r98901N09052R91347
36782A810033n1659q56951k70967P39931R82731O02890J10694m75485q25140k48019
36772A518058Q08841Q20622m25282j155724l62992M93773l0572q12803n1883J475927
36762B277965J421552l43866j365065l15514J093336Q30321n21471r36318j8776
36753B122164P15290L78343M676P85801K056048K071180M94882r83547q64865
36744F779972J83796L73071o77868j565806j274688n38311m58167p28080k91334
36735A802585O85116P38103p71302k425488k287974k40747J867394K309013J138617
36726B815317l37974j149931j218073p16020K52133J182360J220095K79889m59720
$$ plain form
36717 1868076 1881246 2859554 3706344 3224597 1945888 1547907 2557462 3575799 3087450
36708 3087450 1325100 -173164 -406072 296830 1115269 1691011 2048437 2050897 1443033
36699 1443033 407344 -346162 -307940 216263 545532 580344 879334 1701288 2480351 2617101
36689 2617101 2411094 2654424 3443565 3985564 3670252 2841701 2295834 2389411 2890054 3365200
36679 3365200 3374126 2537570 903265 -777639 -1568160 -1271964 -532705 115305 885268
36670 885268 2070630 3096201 2920764 1433668 -186336 -791612 -435304 120350 489196
36661 489196 658333 399677 -429143 -1192159 -1009307 8033 938861 1493054 2198849
36652 2198849 2947883 2680882 1249369 362005 1461517 3480850 4117030 2906283 1590977
$$ packed form
36717A868076J3170R78308Q46790m81747j278709l97981J009555J018337m88349
36708C087450j762350j498264k32908P02902Q18439N75742L57426K460o07864
36699A443033j035689p53506L8222N24203L29269L4812K98990Q21954P79063J36750
36689B617101k06007K43330P89141N41999l15312q28551n45867R3577N00643M75146
36679C365200Q926q36556j634305j680904p90521K96196P39259O48010P69963
36670H85268J185362J025571j75437j487096j620004o05276L56308N55654L68846
36661D89196J69137k58656q28820p63016J82852J017340R30828N54193P05795
36652B198849P49034k67001j431513q87364J099512K019333O36180j210747j315306
$$ plain form
36643 1590977 1521596 2097496 2052176 1115151 -54096 -718786 -465123 531638 1388436 1368971
36633 1368971 963371 1243823 2083148 2198783 1246512 457768 552056 538762 -292297 -697248
36623 -697248 470307 1703060 660784 -1892679 -2554294 -135181 2358568 1840868 -669663
36614 -669663 -1790259 -497713 976546 611509 -991844 -1999764 -1656033 -503826 712475
36605 712475 1546083 1762326 1474051 1211965 1441329 2084860 2700520 2929035 2620687 1820552
36595 1820552 877171 326754 397708 776654 1043041 1138971 1238439 1408193 1636812 1956451
36585 1956451 2267145 2286045 1972040 1725139 1777279 1669163 865601 -300018 -926666 -733912
36575 -733912 -295058 -56540 147507 427922 466769 207288 219720 823609 1411262 1254798
$$ packed form
36643A590977o9381N75900m5320r37025j169247o64690K53663R96761Q56798j9465
36633A368971m05600K80452Q39325J15635r52271p88744R4288j3294q31059m04951
36623f97248J167555J232753j042276k553463o61615K419113K493749n17700k510531
36614f69663j120596J292546J474259l65037j603353j007920L43731J152207J216301
36605G12475Q33608K16243k88275k62086K29364O43531O15660K28515l08348q00135
36595A820552r43381n50417P0954L78946K66387R5930R9468J69754K28619L19639
36585A956451L10694J8900l14005k46901N2140j08116q03562j165619o26648J92754
36575g33912M38854K38518K04047K80415L8847k59481J2432O03889N87653j56464
$$ plain form
36565 1254798 484615 -375846 -1280396 -2207778 -2383338 -1169366 472941 769223 -450524
36556 -450524 -1432773 -1009249 -89873 87370 -116146 231745 702838 186690 -1014627
36547 -1014627 -1433430 -722627 -121839 -376718 -690538 -344424 7483 -371141 -771473
36538 -771473 -42171 1452514 2108513 1186134 -329269 -1029979 -556170 302506 476319
36529 476319 -392417 -1434504 -1221929 578595 2478081 2698351 1236188 -265307 -543279
36520 -543279 142928 829889 971051 587340 20518 -209944 164792 722930 816897 490857
36510 490857 368350 675897 1082011 1462266 1961691 2259852 1787704 896382 767474 1786021
36500 1786021 2989377 3510397 3499702 3210156 2456921 1630969 1830871 3017311 3456826
$$ packed form
36565A254798p70183q60461r04550r27382j75560J213972J642307K96282j219747
36556d50524r82249M23524R19376J77243k03516L47891M71093n16148j201317
36547a014627m18803P10803O00788k54879l13820L46114L51907l78624m00332
36538g71473P29302J494685O55999r22379j515403p00710M73809Q58676J73813
36529D76319q68736j042087K12575J800524J899486K20270j462163j501495k77972
36520e43279O86207O86961J41162l83711n66822k30462L74736N58138R3967l26040
36510D90857j22507L07547M06114L80255M99425K98161m72148q91322j28908J018547
36500A786021J203356N21020j0695k89546p53235q25952J99902J186440M39515
$$ plain form
36491 3456826 2280050 1199872 2031257 3761932 4147506 3241955 2919982 3449411 3264575
36482 3264575 2204984 2182672 3861809 5166227 4325386 2349146 1065737 495945 -194526
36473 -194526 -635934 -22081 1058724 1368195 988636 973078 1505131 1889085 2006063 2326250
36463 2326250 2676640 2396623 1701177 1602807 2320127 2854920 2400485 1297326 345113
36454 345113 -127202 -274841 -343022 -422382 -323595 179253 764066 715675 121985 234052
36444 234052 1806213 3672637 4066919 2963209 1877397 1536905 1106459 -130447 -1610952
36435 -1610952 -2442314 -2466886 -1880246 -710774 691732 1397936 903431 -3929 -56126
36426 -56126 955120 1927309 1721096 384330 -970313 -1381897 -960894 -456989 -115283
$$ packed form
36491C456826j176776j080178Q31385J730675L85574r05551l21973N29429j84836
36482C264575j059591k2312J679137J304418q40841j976240j283409n69792o90471
36473a94526m41408O13853J080805L09471l79559j5558N32053L83954J16978L20187
36463B326250L50390k80017o95446r8370P17320N34793m54435j103159r52213
36454C45113m72315j47639o8181p9360R8787N02848N84813m8391n93690J12067
36444B34052J572161J866424L94282j103710j085812l40492m30446j236906j480505
36435a610952q31362k4572N86640J169472J402506P06204m94505r07360n2197
36426e6126J011246R72189k06213j336766j354643m11584M21003N03905L41706
$$ plain form
36417 -115283 488796 1377126 1659606 617272 -1213525 -2612786 -2927067 -2272250 -1076463
36408 -1076463 -68926 -85473 -1033115 -1610993 -980074 -101203 -333053 -1348641 -1799591
36399 -1799591 -1492267 -1277037 -1142860 -296356 919800 1187149 556139 591161 1594120
36390 1594120 1768436 173043 -1437415 -1169856 212520 742900 275672 225669 1056574
36381 1056574 1816584 1837722 1406865 934207 676073 1036210 1975790 2377810 1190590
36372 1190590 -938889 -2291130 -2232271 -1667777 -1403641 -1180281 -493579 591741 1738009
36363 1738009 2748675 3461745 3727450 3590860 3171902 2529274 1961377 1987383 2515792
36354 2515792 2625696 1907815 1352184 1895897 2752662 2533587 1540188 1283965 1867998
$$ packed form
36417a15283O04079Q88330K82480j042334j830797j399261l14281O54817J195787
36408a076463J007537j6547r47642n77878O30919Q78871k31850j015588m50950
36399a799591L07324K15230J34177Q46504J216156K67349o31010L5022J002959
36390A594120J74316j595393j610458K67559J382376N30380m67228n0003Q30905
36381A056574P60010K1138m30857m72658k58134L60137R39580M02020j187220
36372A190590k129479j352241N8859N64494K64136K23360O86702J085320J146268
36363A738009J010666P13070K65705j36590m18958o42628n67897K6006N28409
36354B515792J09904p17881n55631N43713Q56765k19075r93399k56223N84033
$$ plain form
36345 1867998 1705813 211837 -1021191 -570959 767084 1377341 1129902 1058962 1529563
36336 1529563 1982446 2070922 1950976 1698686 1390821 1545422 2521125 3546454 3276270
36327 3276270 1464792 -630351 -1663711 -1395652 -367293 854499 1719128 1623021 477529
36318 477529 -876378 -1405086 -1028954 -603235 -740683 -1125770 -1170442 -878085 -649422 -555786
36308 -555786 -371542 -209962 -485416 -1124134 -1403442 -862072 105910 879757 1359584 1689751
36298 1689751 1715790 1276738 689864 344069 70842 -481182 -1096643 -1285007 -1109363 -982742
36288 -982742 -811348 -225193 381287 77314 -1088477 -1812681 -1295538 -399780 -333582 -889143
36278 -889143 -937999 -278024 80984 -491046 -1314189 -1471816 -1157754 -1265099 -1854573 -1833818
$$ packed form
36345A867998j62185j493976j233028M50232J338043O10257k47439p0940M70601
36336A529563M52883Q8476j19946k52290l07865J54601R75703J025329k70184
36327C276270j811478k095143j033360K68059J028359J221792Q64629r6107j145492
36318D77529j353907n28708L76132M25719j37448l85087m4672K92357K28663R3636
36308e55786J84244J61580k75454o38718k79308N41370R67982P73847M79827L30167
36298A689751K6039m39052n86874l45795k73227n52024o15461j88364J75644J26621
36288i82742J71394N86155O06480l03973j165791p24204N17143Q95758O6198n55561
36278h89143m8856O59975L59008n72030q23143j57627L14062j07345n89474K0755
$$ plain form
36268 -1833818 -508960 1122832 1417913 290026 -613810 -277146 210005 -543438 -1839226
36259 -1839226 -1820037 -444565 282077 -623082 -1621929 -1168350 -147715 -299772 -1292803
36250 -1292803 -1224718 396049 2000445 2330502 1793482 1114174 247303 -637299 -523630
36241 -523630 933412 2262200 1895576 480357 98053 1369198 2687774 2555315 1468891
36232 1468891 880580 1157203 1435070 1103137 595343 670422 1426010 2207555 2296954 1624320
36222 1624320 860596 723710 1142516 1325139 790171 27192 -162683 297433 834278
36213 834278 1155135 1515751 2022334 2275554 2001252 1580606 1526289 1679955 1380555 399894
36203 399894 -625760 -805464 78057 1292370 1810438 1314048 527766 413717 1075756
$$ packed form
36268a833818J324858J631792K95081j127887r03836L36664M87151p53443j295788
36259a839226J9189J375472P26642r05159r98847M53579J020635j52057r93031
36250a292803O8085J620767J604396L30057n37020o79308q66871q84602J13669
36241e23630J457042J328788l66624j415219l82304J271145J318576j32459j086424
36232A468891n88311K76623K77867l31933n07794P5079P55588P81545Q9399o72634
36222A624320p63724j36886M18806J82623n34968p62979j89875M60116N36845
36213H34278L20857L60616N06583K53220k74302m20646n4317J53666k99400r80661
36203C99894j025654j79704Q83521J214313N18068m96390p86282j14049O62039
$$ plain form
36194 1075756 1718228 1693204 1212053 862794 804115 754546 517448 151273 -236391 -519060
36184 -519060 -432987 274010 1523878 2849015 3640254 3501614 2608022 1758326 1738034 2482263
36174 2482263 3181248 3295645 2997348 2498019 1689512 856129 878347 1890790 2451126
36165 2451126 1239007 -790289 -1316956 258588 2014787 2180272 1329966 1152718 2028399
36156 2028399 2861553 2769811 1926437 928207 170027 -133563 83608 630644 1241044 1848978
36146 1848978 2464554 2937638 3129548 3166512 3256559 3408369 3533182 3579932 3362960 2628611
36136 2628611 1635063 1268999 2072356 3421620 4209674 4137213 3779462 3568421 3362304
36127 3362304 2953328 2332583 1417053 173781 -876811 -966618 -132624 661744 769735
$$ packed form
36194A075756O42472k5024m81151l49259n8679m9569k37098l66175l87664k82669
36184e19060Q6073P06997J249868J325137P91239j38640q93592q49696k0292P44229
36174B482263O98985J14397k98297m99329q08507q33383K2218J012443N60336
36165B451126j212119k029296n26667J575544J756199J65485q50306j77248Q75681
36156B028399Q33154r1742q43374r98230p58180l03590K17171N47036O10400O07934
36146A848978O15576M73084J91910L6964R0047J51810J24813M6750k16972p34349
36136B628611r93548l66064Q03357J349264P88054p2461l57751k11041k06117
36127C362304m08976o20745r15530j243272j050592q9807Q33994P94368J07991
$$ plain form
36118 769735 609514 758852 940715 570729 -133067 -369084 123534 886079 1556645 2088018
36108 2088018 2178493 1404019 194695 -190004 779865 2043651 2330613 1853539 1770859
36099 1770859 2309609 2443364 1454964 -104843 -1255430 -1619751 -1326985 -607561 87600
36090 87600 177300 -331073 -670458 -306359 347286 614931 427094 9548 -669661 -1431946
36080 -1431946 -1456219 -294075 1024377 975661 -423003 -1551533 -1256090 -118663 479368
36071 479368 -210525 -1899099 -3482312 -3584589 -1778838 545240 1421170 619960 -215619
36062 -215619 73352 875373 1291854 1526112 1934676 1954679 1174049 460151 652984 949351
36052 949351 129805 -1205837 -1356247 -187571 719463 620089 461399 839445 980626
$$ packed form
36118G69735j60221J49338J81863l69986p03796k36017M92618P62545O70566N31373
36108B088018R0475p74474j209324l84699R69869J263786K86962m77074q2680
36099A770859N38750J33755r88400j559807j150587l64321K92766P19424O95161
36090H7600Q9700n08373l39385L64099O53645K67645j87837m17546o79209p62285
36080a431946k4273J162144J318452m8716j398664j128530K95443J137427N98031
36071D79368o89893j688574j583213j02277J805751K324078Q75930q01210q35579
36062b15619K88971Q02021M16481K34258M08564K0003p80630p13898J92833K96367
36052I49351q19546j335642j50410J168676R07034r9374j58690L78046J41181
$$ plain form
36043 980626 549966 700404 2050948 3079417 2178264 318650 -173688 1005971 1869861
36034 1869861 1189944 -21820 -510933 -585041 -1033542 -1547932 -1404564 -890480 -833726 -1212971
36024 -1212971 -1398286 -1445095 -1911133 -2469842 -2009258 -388768 1081227 1422072 1183027
36015 1183027 1146909 854381 -486968 -2287007 -3048345 -2338498 -1125237 -169918 766802
36006 766802 1909172 2752188 2858450 2533491 2159566 1556729 607838 -92931 47083
35997 47083 634167 737634 146272 -458103 -539560 -373145 -554660 -1197523 -1809996 -1872673
35987 -1872673 -1396915 -780212 -126001 905716 2271644 3065316 2590169 1572809 1290475
35978 1290475 1634597 1333004 231751 -226914 547105 1011988 -76647 -1362101 -795899
$$ packed form
36043I80626m30660J50438J350544J028469r01153j859614m92338J179659Q63890
36034A869861o79917j211764m89113p4108m48501n14390J43368N14084N6754l79245
36024a212971j85315m6809m66038n58709M60584J620490J469995L40845k39045
36015A183027l6118k92528j341349j800039p61338P09847J213261R55319R36720
36006G66802J142370Q43016J06262l24959l73925o02837r48891p00769J40014
35997D7083N87084J03467n91362o04375q1457J66415j81515o42863o12473o2677
35987a872673M75758O16703O54211J031717J365928P93672m75147j017360k82334
35978A290475L44122l01593j101253m58665P74019M64883j088635j285454N66202
$$ plain form
35969 -795899 1066652 1766357 637542 -298234 559130 2241041 2938205 2464838 1997708
35960 1997708 2220884 2653096 2431117 1231254 -325083 -1055969 -450887 528594 532062
35951 532062 -399894 -1012308 -732666 -305605 -427423 -941084 -1662433 -2724254 -3615954
35942 -3615954 -3211809 -1528888 -254925 -573632 -1503739 -1424283 -288277 812575 1380398
35933 1380398 1479448 722727 -1131330 -2885841 -2758752 -681634 1379408 1601358 16848
35924 16848 -1932023 -2766702 -1953033 -275288 772766 507952 -284001 -692459 -983583
35915 -983583 -1646621 -1952938 -963462 470554 466750 -1129656 -2471765 -2456472 -2007825 -2076815
35905 -2076815 -2114733 -1504776 -964994 -1222343 -1499673 -805670 144270 -94666 -1270170
$$ packed form
35969g95899J862551O99705j128815r35776Q57364J681911O97164m73367m67130
35960A997708K23176M32212k21979j199863j556337p30886O05082R79481L468
35951E32062r31956o12414K79642M27061j21818n13661p21349j061821q91700
35942c615954M04145J682921J273963l18707r30107P9456J136006J100852N67823
35933A380398R9050p56721j854057j754511J27089K077118K061042K21950j584510
35924A6848j948871q34679Q13669J677745J048054k64814p91953m08458k91124
35915i83583o63038l06317R89476J434016l804j596406j342109J5293M48647o8990
35905b076815l7918O09957N39782k57349k77330O94003R49940k38936j175504
$$ plain form
35896 -1270170 -1588792 -272576 1423927 2021259 1538012 950890 710624 363553 -653312
35887 -653312 -2162769 -3140769 -2571429 -648541 1111394 1383787 471146 -274834 -253688
35878 -253688 -126374 -539704 -1186164 -1543227 -1933801 -3149343 -5129263 -6603804 -6325832
35869 -6325832 -4455841 -2431058 -1438216 -1286423 -980791 -134026 663331 818013 485874
35860 485874 128647 -165337 -524831 -837379 -908948 -851392 -900808 -1053647 -1265895 -1732488
35850 -1732488 -2421832 -2538073 -1206575 1151015 2792538 2472474 953126 176502 966185
35841 966185 2065558 1771522 185117 -835568 -99556 1283458 1364459 -39712 -1249716
35832 -1249716 -1169133 -611926 -729221 -1213927 -993987 -7042 798687 940991 902089 1201085
$$ packed form
35896a270170l18622J316216J696503N97332m83247n87122k40266l47071j016865
35887f53312j509457r78000N69340J922888J759935K72393r12641p45980K1146
35878b53688J27314m13330o46460l57063l90574j215542j979920j474541K77972
35869f325832J869991K024783R92842J51793L05632Q46765P97357J54682l32139
35860D85874l57227k93984l59494l12548p1569N7556m9416j52839k12248m66593
35850a732488o89344j16241J331498K357590J641523l20064j519348p76624P89683
35841I66185J099373k94036j586405j020685P36012J383014Q1001j404171j210004
35832a249716Q0583N57207j17295m84706K19940R86945Q05729J42304l8902K98996
$$ plain form
35822 1201085 1775124 2349189 2785795 2981123 2903451 2761434 2724568 2543248 1868441 864082
35812 864082 110914 12094 576337 1475095 1974010 1335146 -136363 -1018034 -519175 285456
35802 285456 -3961 -888521 -653225 1000282 2551047 2951121 2745442 2561222 2070985
35793 2070985 1156553 653831 936541 924424 -366930 -2177878 -3025357 -2645271 -1814192
35784 -1814192 -892727 222388 1140975 1282893 1034842 1459723 2739938 3804288 3661204
35775 3661204 2410751 843234 -329697 -749524 -499864 -68325 191784 582231 1618987
35766 1618987 3081925 3985004 3613079 2249917 775863 -183664 -579319 -585105 -167024
35757 -167024 779683 1849985 2153903 1403566 595724 817740 1637863 1785542 1341411
$$ packed form
35822A201085N74039N74065M36606J95328p7672j42017l6866j81320o74807j004359
35812H64082p53168r8820N64243Q98758M98915o38864j471509q81671M98859Q04631
35802B85456k89417q84560K35296J653507J550765M00074k05679j84220m90237
35793B070985r14432n02722K82710j2117j291354j810948q47479L80086Q31079
35784a814192R21465J115115R18587J41918k48051M24881J280215J064350j43084
35775C661204j250453j567517j172931m19827K49660M31539K60109L90447J036756
35766A618987J462938R03079l71925j363162j474054r59527l95655n786M18081
35757a67024R46707J070302L03918p50337q07842K22016Q20123J47679m44131
$$ plain form
35748 1341411 1742498 3215993 3902108 2582654 810236 793390 2205982 2821385 1683262
35739 1683262 -79868 -1240815 -1579962 -1142081 -26873 979275 1003322 440562 400432
35730 400432 840333 763981 280804 642513 1858121 2185750 821806 -653396 -654682 114765
35720 114765 157500 -282109 144456 1475891 2353054 2063374 1243923 619053 278230 275876
35710 275876 838738 1716518 2178858 1966123 1621736 1637022 1795389 1613970 1013213 293234
35700 293234 -246912 -421426 -102399 662099 1476742 1758047 1287561 628332 684590 1561990
35690 1561990 2132974 1283644 -472694 -1320004 -322940 1326215 1725962 527718 -826482
35681 -826482 -1011040 -357610 -241548 -1268272 -2547886 -2867257 -2138271 -1210776 -520431
$$ packed form
35748A341411M01087J473495O86115j319454j772418j6846J412592O15403j138123
35739A683262j763130j160947l39147M37881J115208J006148K4047n62760m0130
35730D00432M39901p6352m83177L61709J215608L27629j363944j475202j286P69447
35720A14765M2735m39609M26565J331435Q77163k89680q19451o24870l40823k354
35710B75876N62862Q77780M62340k12735l44387J5286J58367j81419o00757p19979
35700B93234n40146j74514L19027P64498Q14643K81305m70486o59229N6258Q77400
35690A561990N70984q49330j756338q47310R97064J649155L99747j198244j354200
35681h26482j84558O53430J16062j026724j279614l19371P28986R27495O90345
$$ plain form
35672 -520431 275424 1254407 1789810 1608881 1389034 1631405 1817899 1516755 1359851 1788625
35662 1788625 1815790 576264 -711802 -223297 1574412 2569308 2196678 1653866 1103552
35653 1103552 -510117 -2445801 -2105480 726226 2556085 1109045 -1015435 -240833
35645 -240833 2481257 3219683 946741 -1386021 -1394159 14663 811472 396740 -664640
35636 -664640 -1705022 -2116105 -1718783 -1339701 -1936737 -3028128 -3096969 -1626763 303632
35627 303632 1409551 1181961 -284375 -2272441 -3449192 -3096250 -2167936 -1993998 -2302265
35618 -2302265 -1872002 -731171 -44610 -1639 419021 1498132 2271522 2189959 1739213
35609 1739213 1213601 393217 -406583 -552327 -505288 -1328118 -2614736 -2783356 -1733445
$$ packed form
35672e20431P95855R78983N35403j80929k19847K42371J86494l01144j56904M28774
35662A788625K7165j239526j288066M88505J797709R94896l72630n42812n50314
35653A103552j613669j935684L40321K831706J829859j447040k124480P74602
35645b40833K722090P38426k272942k332762q138J408822P96809m14732j061380
35636f64640j040382m11083L97322L79082n97036j091391o8841J470206J930395
35627C03632J105919k27590j466336j988066j176751L52942R28314J73938l08267
35618b302265M30263J140831O86561M2971M20660J079111P73390q1563m50746
35609A739213n25612q20384p99800j45744M7039q22830j286618j68620J049911
$$ plain form
35600 -1733445 -1162782 -1700191 -1904296 -999197 -385289 -1081516 -1682395 -610615 1180848
35591 1180848 1639413 573070 -645625 -1411563 -2074793 -2390017 -1591671 79547 1291741
35582 1291741 1127097 -160158 -1678850 -2490016 -2022050 -555211 1044120 2390557 3668336
35573 3668336 4437119 3665369 1675306 627534 1841831 3793063 4161645 2900864 1752238
35564 1752238 1499686 1350942 626941 -423016 -1315200 -1723128 -1456676 -932456 -1118221
35555 -1118221 -2149225 -2807820 -2334979 -1670819 -1665539 -1375105 116147 1420702 657783
35546 657783 -1321943 -2029345 -1175028 -766782 -1474233 -1650325 -377214 1116881 1809808
35537 1809808 2240450 2606580 1871960 -775 -1119105 -485070 184607 -789864 -2153652
$$ packed form
35600a733445N70663n37409k04105R05099O13908o96227o00879J071780J791463
35591A180848M58565j066343j218695p65938o63230l15224P98346J671218J212194
35582A291741j64644j287255j518692q11166M67966J466839J599331J346437J277779
35573C668336P68783p71750j990063j047772J214297J951232L68582j260781j148626
35564A752238k52552j48744p24001j049957q92184m07928K66452N24220j85765
35555a118221j031004o58595M72841O64160N280K90434J491252J304555p62919
35546F57783j979726p07402Q54317M08246p07451j76092J273111J494095O92927
35537A809808M30642L66130p34620j872735j118330O34035O69677r74471j363788
$$ plain form
35528 -2153652 -1595597 679743 2355538 2291447 1502808 1201493 1511086 2000989 2145118
35519 2145118 1344647 -359085 -1727484 -1523952 -131494 954917 1014794 528109 8147
35510 8147 -460218 -586020 106492 1402684 2355564 2365771 1800122 1490157 2002837 3213738
35500 3213738 4176045 3802812 2244891 1064890 1266756 1772177 991680 -590658 -922925
35491 -922925 593870 2201401 2281598 1286438 484635 92545 -344204 -705724 -612579 -371320
35481 -371320 -486013 -618830 -105297 736246 872464 67961 -874585 -1419703 -1784012 -1888010
35471 -1888010 -978798 1001018 2537434 2038068 -156890 -2111728 -2473844 -1577309 -537431
35462 -537431 -117324 -544690 -1544749 -2234712 -1788806 -676905 -473630 -1749669 -2860824
$$ packed form
35528b153652N58055K275340J675795o4091p88639l01315L09593M89903J44129
35519B145118q00471j703732j368399K03532J392458J086411N9877m86685n19962
35510H147m68365j25802O92512J296192R52880J0207n65649l09965N12680J210901
35500C213738R62307l73233j557921j180001K01866N05421p80497j582338l32267
35491i22925J516795J607531Q0197r95160q01803l92090m36749l61520R3145K41259
35481c71320j14693j32817N13533Q41543J36218q04503r42546n45118l64309j03998
35471a888010R09212J979816J536416m99366k194958j954838l62116Q96535J039878
35462e37431M20107m27366j000059o89963M45906J111901K03275j276039j111155
$$ plain form
35453 -2860824 -1877867 653681 2128908 1165571 -700014 -1097028 372909 2215898 3226858
35444 3226858 3493171 3432520 2972080 2054899 1192359 901173 938487 639450 -140646 -902411
35434 -902411 -1238032 -1164395 -688531 311852 1445743 1674638 516536 -968490 -1259071
35425 -1259071 -357932 248658 -224531 -796753 -436334 155077 -434010 -2047583 -2948449
35416 -2948449 -2046373 -90459 1532030 2262027 2301738 1895624 1244835 680230 421620
35407 421620 375127 414642 595401 903072 1106321 1068380 931588 816667 603669 178399
35397 178399 -328945 -686021 -787742 -737346 -846354 -1384713 -2063109 -2059669 -1039615 155742
35387 155742 497570 162688 75043 276777 -88579 -1095843 -1612086 -977139 32143
$$ packed form
35453b860824R82957K531548J475227r63337j865585l97014J469937J842989J010960
35444C226858K66313o0651m60440r17181q62540k91186L7314k99037p80096p61765
35434i02411l35621P3637M75864J000383J133891K28895j158102j485026k90581
35425a259071R01139O06590m73189n72222L60419N91411n89087j613573r00866
35416b948449R02076J955914J622489P29997L9711m06114o50789n64605k58610
35407D21620m6493L9515J80759L07671K03249l7941j36792j14921k12998m25270
35397A78399n07344l57076j01721N0396j09008n38359o78396L440J020054J195357
35387A55742L41828l34882q7645K01734l65356j007264n16243O34947J009282
$$ plain form
35378 32143 495418 541405 570714 353825 -222188 -468241 46268 591563 467875 228043
35368 228043 517980 601357 -392671 -1434821 -730376 1286834 2070028 420140 -1911724
35359 -1911724 -2734050 -2019745 -1134445 -750189 -648999 -709516 -898120 -757069 44189 839496
35349 839496 497710 -1158440 -3012361 -3770840 -3113260 -1777104 -730419 -268923 52157
35340 52157 541096 799600 501378 315746 1092978 2253162 2203076 631358 -851742
35331 -851742 -950902 -353541 -269292 -434388 124532 1133509 1445271 1063701 1228192 2320336
35321 2320336 3055062 2275662 556709 -623829 -669720 -238089 -235090 -948314 -1970119
35312 -1970119 -2583276 -2240931 -891149 993358 2553946 2851820 1591295 -228350 -987771
$$ packed form
35378C2143M63275M5987K9309k16889n76013k46053N14509N45295j23688k39832
35368B28043K89937Q3377r94028j042150P04445K017210P83194j649888k331864
35359a911724q22326P14305Q85300L84256J01190o0517j88604J41051Q01258P95307
35349H39496l41786j656150j853921p58479O57580J336156J046685M61496L21080
35340E2157M88939K58504k98222j85632P77232J160184n0086j571718j483100
35331h51742r9160N97361Q4249j65096N58920J008977L11762l81570J64491J092144
35321B320336P34726p79400j718953j180538m5891M31631K999p13224j021805
35312a970119o13157L42345J349782J884507J560588K97874j260525j819645p59421
$$ plain form
35303 -987771 -252721 676019 605308 85289 220511 596166 -60526 -1451328 -1770537 -484258
35293 -484258 717775 471072 -361629 -396568 59237 -113136 -801763 -1041831 -760119 -641681
35283 -641681 -728303 -618812 -676426 -1448465 -2101424 -1187726 908350 2067002 1435321 619666
35273 619666 1075962 1912522 1525463 169018 -626127 -443012 -247023 -601142 -1037273
35264 -1037273 -1195659 -1331280 -1427998 -845265 654537 2177989 2513906 1418041 -156556
35255 -156556 -947282 -461780 623033 1156715 752724 148280 144603 564344 689194 381956
35245 381956 147729 256307 458904 551367 644076 841437 1108559 1404547 1522582 1002678
35235 1002678 -216876 -1281851 -1294981 -574038 -233171 -611704 -1044727 -1140054 -1145782 -908658
$$ packed form
35303i87771P35050R28740p0711n20019J35222L75655o56692j390802l19209J286279
35293d84258J202033k46703q32701l4939M55805j72373o88627k40068K81712J18438
35283f41681q6622J09491n7614p72039o52959R13698K096076J158652o31681q15655
35273F19666M56296Q36560l87059j356445p95145J83115J95989l54119m36131
35264a037273j58386j35621r6718N82733J499802J523452L35917j095865j574597
35255a56556p90726M85502J084813N33682m03991o04444l677M19741J24850l07238
35245C81956k34227J08578K02597R2463R2709J97361K67122K95988J18035n19904
35235A002678j219554j064975j3130P20943L40867l78533m33023r5327n728K37124
$$ plain form
35225 -908658 216754 1920342 2685291 1816679 623605 569296 1207023 1157635 332167
35216 332167 -255488 -380899 -748314 -1373335 -1347833 -417790 542390 990998 1436647 2197109
35206 2197109 2582450 2047789 1241183 1034728 1167794 763583 -195383 -774610 -347973
35197 -347973 709746 1576043 1762336 1343016 710780 102425 -687290 -1862101 -2884645
35188 -2884645 -2782538 -1504091 -313420 -247194 -750253 -644548 12655 118349 -578319
35179 -578319 -997884 -484388 38811 -612786 -2122795 -3091198 -2854412 -2040930 -1405448
35170 -1405448 -940463 -386131 29411 -111465 -631823 -805289 -277545 387298 332784 -525992
35160 -525992 -1349580 -1368430 -779936 -393522 -521225 -638581 -257577 268827 179044 -645899
$$ packed form
35225i08658J125412J703588P64949q68612j193074n4309O37727m9388q25468
35216C32167n87655j25411l67415o25021K5502R30043R60180M48608M45649P60462
35206B197109L85341n34661q06606k06455J33066m04211r58966n79227M26637
35197c47973J057719Q66297J86293m19320o32236o08355p89715j174811j022544
35188b884645J02107J278447J190671O6226n03059J05705O57203J05694o96668
35179e78319m19565N13496N23199o51597j510009r68403K36786Q13482O35482
35170a405448M64985N54332M15542j40876n20358j73466N27744O64843n4514q58776
35160e25992q23588j8850N88494L86414j27703j17356L81004N26404q9783q24943
$$ plain form
35150 -645899 -1481799 -1624110 -1091034 -343246 371824 1097993 1721781 1795274 985548 -360832
35140 -360832 -1266840 -920561 472905 1723644 1725711 519637 -821436 -1305342 -803934
35131 -803934 211993 1290104 2133733 2477216 2239662 1722327 1374036 1409839 1803000
35122 1803000 2417141 2881465 2643551 1611777 527639 149115 244563 71573 -301691
35113 -301691 -95598 685867 1010776 559510 530275 1722220 2788695 1872355 -468148
35104 -468148 -1629798 -419780 1409022 1721589 803894 518331 1470677 2338619 1885222
35095 1885222 545570 -293186 64252 1081365 1769807 1677652 1171206 915489 1150451
35086 1150451 1516699 1556697 1236477 907077 856694 951823 675650 -355208 -1719496 -2248555
$$ packed form
35150f45899q35900j42311N33076P47788P15070P26169O23788P3493q09726j346380
35140c60832r06008L46279J393466J250739K067j206074j341073m83906N01408
35131h03934J015927J078111Q43629L43483k37554n17335l48291L5803L93161
35122A803000O14141M64324k37914j031774j084138l78524R5448j72990l73264
35113c01691K06093P81465L24909m51266k9235J191945J066475r16340k340503
35104d68148j161650J210018J828802L12567r17695k85563R52346Q67942m53397
35095A885222j339652q38756L57438J017113O88442r2155n06446k55717K34962
35086A150451L66248L9998l20220l29400n0383R5129k76173j030858j364288n29059
$$ plain form
35076 -2248555 -1232127 483111 1217537 445450 -576567 -507874 387126 829741 320042
35067 320042 -407036 -495768 169847 1168758 1997649 2278064 1968868 1402538 814236 42463
35057 42463 -899327 -1338260 -752357 210831 451147 27389 -57973 230503 -379103 -2308052
35047 -2308052 -3916666 -3550025 -1900793 -1014199 -1440707 -1778600 -924131 592709 1734259
35038 1734259 2190385 2027411 1174384 -36216 -634280 -170044 398305 -196338 -1811383
35029 -1811383 -2991760 -2634658 -962325 983271 2157795 1934098 462766 -1212443
35021 -1212443 -1944230 -1587352 -950543 -642627 -504734 -270007 -125289 -290765 -573853
35012 -573853 -735574 -866986 -1020130 -913741 -452008 -75539 -37202 216367 1195914 2251925
$$ packed form
35076b248555J016428J715238P34426p72087j022017O8693Q95000M42615n09699
35067C20042p27078q8732O65615R98911Q28891K80415l09196n66330n88302p71773
35057D2463r41790m38933N85903R63188K40316m23758q5362K88476o09606j928949
35047b308052j608614L66641J649232Q86594m26508l37893Q54469J516840J141550
35038A734259M56126j62974q53027j210600n98064M64236N68349n94643j615045
35029a811383j180377L57102J672333J945596J174524k23697j471332j675209
35021a212443p31787L56878O36809L07916J37893K34727J44718j65476k83088
35012e73853j61721j31412j53144J06389M61733L76469L8337K53569R79547J056011
$$ plain form
35002 2251925 2246661 1253999 599122 1030964 1785427 1836495 1229295 616859 198307 -161935
34992 -161935 -288942 10951 297854 -71720 -926707 -1340152 -748523 448349 1400423
34983 1400423 1556090 1012079 488842 749893 1605689 1811133 608656 -919364 -978117
34974 -978117 479458 1467095 478073 -1638872 -2896379 -2560165 -1640499 -1456217 -2349144
34965 -2349144 -3516312 -3603443 -1817387 1005249 2791366 2309581 554453 -587966 -691159
34956 -691159 -895518 -1841580 -2655379 -2349036 -1290581 -615353 -732673 -1075633 -1011253 -427257
34946 -427257 358370 754896 194138 -1124322 -1919497 -1008533 1060365 2269999 1429748
34937 1429748 -357517 -1090084 -290629 734679 834595 226861 -398300 -967469 -1571412
$$ packed form
35002B251925n264r92662o54877M31842P54463N1068o07200o12436m18552l60242
34992a61935j27007K99893K86903l69574q54987m13445N91629J196872R52074
34983A400423J55667n44011n23237K61051Q55796K05444j202477j528020n8753
34974i78117J457575R87637r89022k116945j257507L36214R19666J84282q92927
34965b349144j167168q7131J786056K822636J786117m81785j755128j142419j03193
34956f91159k04359r46062q13799L06343J058455O75228j17320l42960O4380N83996
34946d27257P85627L96526n60758j318460p95175R10964K068898J209634q40251
34937A429748j787265p32567P99455J025308R9916o07734o25161n69169o03943
$$ plain form
34928 -1571412 -1719638 -1036829 -283184 -557982 -1549239 -1701283 -357511 1326180 2058960
34919 2058960 1982173 1851399 1608434 847777 69755 177500 921493 1068876 215260 -661414
34909 -661414 -707785 -253219 41578 167334 300278 129869 -554876 -1085660 -549864 934247
34899 934247 2191268 2222130 1098759 -246491 -789131 -144961 1096470 1872772 1718305
34890 1718305 1112529 570999 -103712 -1134182 -1812631 -1156789 527529 1651692 1208131
34881 1208131 -61997 -764865 -533987 -50752 221819 595977 1428644 2395488 2790684
34872 2790684 2357851 1594682 1237671 1545365 2134132 2473256 2415196 2170069 1908483 1598839
34862 1598839 1166299 563140 -270890 -1192263 -1621303 -1026203 176949 763059 178304
$$ packed form
34928a571412j48226O82809P53645k74798r91257j52044J343772J683691P32780
34919B058960p6787j30774k42965p60657p78022J07745P43993J47383q53616q76674
34909f61414m6371M54566K94797J25756J32944j70409o84745n30784N35796J484111
34899I34247J257021L0862j123371j345250n42640O44170J241431P76302j54467
34890A718305o05776n41530o74711j030470o78449O55842J684318J124163m43561
34881A208131j270128p02868K30878M83235K72571L74158Q32667R66844L95196
34872B790684m32833p63169l57011L07694N88767L39124n8060k45127k61586l09644
34862A598839m32540o03159q34030r21373m29040N95100J203152N86110n84755
$$ plain form
34853 178304 -606431 -397813 437545 481117 -468287 -809495 620251 2676134 3238494
34844 3238494 1891281 225341 -327082 99987 639996 898862 911884 695288 406415
34835 406415 420549 736822 752310 130709 -508772 -331507 569020 1305261 1275948 649083
34825 649083 -42610 -366481 -261769 -227267 -921741 -2127364 -2520543 -1136235 1233422
34816 1233422 2821536 2839492 1900331 758230 -371216 -1240067 -1390361 -903066 -552726
34807 -552726 -872113 -1665871 -2621445 -3671443 -4535420 -4713568 -4288015 -3981795 -4051031 -3871258
34797 -3871258 -3021848 -1986264 -1304415 -857065 -556107 -869371 -1906798 -2781441 -2748952
34788 -2748952 -2287789 -2150266 -2070678 -1495806 -912892 -1100509 -1506279 -896897 485708
$$ packed form
34853A78304p84735K08618Q35358M3572r49404l41208J429746K055883N62360
34844C238494j347213j665940n52423M27069N40009K58866J3022k16596k88873
34835D06415J4134L16273J5488o21601o39481J77265R00527P36241k9313o26865
34825F49083o91693l23871J04712L4502o94474j205623l93179J384308K369657
34816A233422J588114J7956r39161j142101j129446q68851j50294M87295L50340
34807e52726l19387p93758r55574j049998q63977j78148M25553L06220o9236J79773
34797c871258Q49410J035584O81849M47350L00958l13264j037427q74643L2489
34788b748952M61163J37523P9588N74872N82914j87617m05770O09382J382605
$$ plain form
34779 485708 990634 56267 -806143 -160646 1359058 2010253 1110151 -538280 -1819068
34770 -1819068 -2134001 -1435337 -207232 637881 414753 -638592 -1567142 -1682962 -1223080
34761 -1223080 -954680 -1171574 -1284012 -651556 343722 665475 201763 177633 1420421
34752 1420421 2937322 3155288 2114375 1317450 1575767 2149857 2102062 1414112 510728
34743 510728 -341165 -801372 -504380 246034 569111 127662 -580129 -1269758 -2229216 -3213664
34733 -3213664 -3099616 -1464109 378260 910385 355202 78869 560800 1081864 1162448
34724 1162448 1107662 1030678 424544 -852849 -1926719 -1826552 -701384 345273 460992
34715 460992 -249675 -1085926 -1427132 -1008774 63535 1214252 1515810 484415 -1091944
$$ packed form
34779D85708N04926r34367q62410O45497J519704O51195r00102j648431j280788
34770a819068l14933O98664J228105Q45113k23128j053345r28550j15820M59882
34761a223080K68400k16894j12438O32456R95278L21753m63712k4130J242788
34752A420421J516901K17966j040913p96925K58317N74090m7795o87950r03384
34743E10728q51893m60207K96992P50414L23077m41449p07791o89629r59458r84448
34733c213664J14048J635507J842369N32125n55183k76333M81931N21064Q0584
34724A162448n4786p6984o06134j277393j073870J00167J125168J046657J15719
34715D60992p10667q36251l41206M18358J072309J150717L01558j031395j576359
$$ [...]
##END NTUPLES=NMR SPECTRUM
##END=
