##TITLE=31Pdec_SR84
 CDCl3, 24 sc
 3.09.2021
##JCAMPDX= 6.0         $$ Bruker NMR JCAMP-DX V2.0
##DATA TYPE= NMR SPECTRUM
##DATA CLASS= NTUPLES
##ORIGIN= UXNMR, Bruker Analytische Messtechnik GmbH
##OWNER= root
$$ XWIN-NMR		Version 3.5
$$ Fri Sep  3 09:48:33 2021 Russian Standard Time (UT+4h)  she@DPX200
##.OBSERVE FREQUENCY= 81.013821
##.OBSERVE NUCLEUS= ^31P
##.ACQUISITION MODE= SIMULTANEOUS
##.ACQUISITION SCHEME= undefined
##.AVERAGES= 24
##.DIGITISER RES= 16
##SPECTROMETER/DATA SYSTEM= spect
##.PULSE SEQUENCE= zgpg30
##.SOLVENT NAME= CD2Cl2
##.SHIFT REFERENCE= (INTERNAL, CD2Cl2, 0, 248.564)
##AUDIT TRAIL= $$ (NUMBER, WHEN, WHO, WHERE, WHAT)
$$ ##TITLE= Audit trail, XWIN-NMR		Version 3.5
$$ ##JCAMPDX= 5.01
$$ ##ORIGIN= Bruker BioSpin GmbH
$$ ##OWNER= she
$$ F:/spectra/data/she/nmr/P31/1/pdata/1/auditp.txt
$$ ##AUDIT TRAIL=  $$ (NUMBER, WHEN, WHO, WHERE, WHAT)
(   1,<2021-09-03 09:47:14.17 +0400>,<she>,<DPX200>,
      <created by zg, POWCHK disabled, PULCHK disabled
       configuration hash MD5:
       00 E9 B6 7A A2 85 ED C7 34 08 36 98 17 FE 4E 26
       data hash MD5: 32K
       DA 08 C7 3C 11 41 5D FB 2F D2 AD 80 8C 4E EA 8E>)
(   2,<2021-09-03 09:47:19.57 +0400>,<she>,<DPX200>,
      <Start of raw data processing
       efp BC_mod = 2 LB = 1 FT_mod = 6 PKNL = 1 PHC0 = -7755.288 PHC1 = 140.0703 SI = 64K 
       data hash MD5: 64K
       D8 49 FD F0 4D 35 C5 D8 81 2D FD 47 D0 0A 40 7B>)
(   3,<2021-09-03 09:47:58.39 +0400>,<she>,<DPX200>,
      <pk PHC0 = 172.2627 PHC1 = -465.2001 
       data hash MD5: 64K
       2F 3D 87 2D 64 E0 1E 12 BB 51 51 FB 84 B4 C0 BB>)
(   4,<2021-09-03 09:48:02.59 +0400>,<she>,<DPX200>,
      <abs ABSG = 5 
       data hash MD5: 64K
       BF 14 C6 3A 69 FA F8 49 64 3D 1C CB 0C 13 49 74>)
$$ ##END=
$$ 
$$ hash MD5
$$ F5 AF 93 17 92 43 01 50 0B 85 DC 18 E5 62 B9 67
##$RELAX= 
##$RELAX= 
##$RELAX= 
##$RELAX= 
##$RELAX= 
##$RELAX= 
##$RELAX= 
##$RELAX= 
$$ Bruker specific parameters
$$ --------------------------
##$DU= <F:/spectra>
##$EXPNO= 1
##$NAME= <P31>
##$PROCNO= 1
##$TYPE= <nmr>
##$USER= <she>
##$AMP= (0..31)
100 100 100 100 100 100 100 100 100 100 100 100 100 100 100 100 100 100 
100 100 100 100 100 100 100 100 100 100 100 100 100 100 
##$AQSEQ= 0
##$AQ_mod= 1
##$AUNM= <au_zg>
##$AUTOPOS= <>
##$BF1= 81.014009
##$BF2= 200.13
##$BF3= 200.13
##$BF4= 200.13
##$BF5= 200.13
##$BF6= 200.13
##$BF7= 200.13
##$BF8= 200.13
##$BYTORDA= 1
##$CFDGTYP= 0
##$CFRGTYP= 5
##$CHEMSTR= <none>
##$CNST= (0..31)
1 1 145 1 1 1 1 1 1 1 1 1 1 1 1 1 1 1 1 1 1 1 1 1 1 1 1 1 1 1 1 1 
##$CPDPRG= <waltz16>
##$CPDPRG1= <>
##$CPDPRG2= <waltz16>
##$CPDPRG3= <>
##$CPDPRG4= <mlev>
##$CPDPRG5= <mlev>
##$CPDPRG6= <mlev>
##$CPDPRG7= <mlev>
##$CPDPRG8= <mlev>
##$CPDPRGB= <>
##$CPDPRGT= <>
##$D= (0..31)
0 1 0 0 0 0 0 0 0 0 0 0.03 2e-05 3e-06 0 0 0 0 0 0 0 0 0 0 0 0 0 0 0 0 
0 0 
##$DATE= 1630648033
##$DBL= (0..7)
120 120 120 11 120 120 24 19 
##$DBP= (0..7)
150 150 150 150 150 150 150 150 
##$DBP07= 0
##$DBPNAM0= <>
##$DBPNAM1= <>
##$DBPNAM2= <>
$$ [...]
##$SUBNAM3= <"">
##$SUBNAM4= <"">
##$SUBNAM5= <"">
##$SUBNAM6= <"">
##$SUBNAM7= <"">
##$SUBNAM8= <"">
##$SUBNAM9= <"">
##$SW= 501.771253377433
##$SWIBOX= (0..15)
0 1 3 0 0 0 0 0 0 0 0 0 0 0 0 0 
##$SW_h= 40650.406504065
##$TD= 32768
##$TD0= 1
##$TE= 0
##$TE2= 300
##$TE3= 300
##$TEG= 300
##$TL= (0..7)
0 120 53 12 22 120 120 120 
##$TP= (0..7)
150 150 150 150 150 150 150 150 
##$TP07= 0
##$TPNAME0= <>
##$TPNAME1= <>
##$TPNAME2= <>
##$TPNAME3= <>
##$TPNAME4= <>
##$TPNAME5= <>
##$TPNAME6= <>
##$TPNAME7= <>
##$TPOAL= (0..7)
0.5 0.5 0.5 0.5 0.5 0.5 0.5 0.5 
##$TPOFFS= (0..7)
0 0 0 0 0 0 0 0 
##$TUNHIN= 0
##$TUNHOUT= 0
##$TUNXOUT= 0
##$USERA1= <user>
##$USERA2= <user>
##$USERA3= <user>
##$USERA4= <user>
##$USERA5= <user>
##$V9= 5
##$VALIST= <valist>
##$VCLIST= <CCCCCCCCCCCCCCC>
##$VD= 0
##$VDLIST= <DDDDDDDDDDDDDDD>
##$VPLIST= <PPPPPPPPPPPPPPP>
##$VTLIST= <TTTTTTTTTTTTTTT>
##$WBST= 1024
##$WBSW= 4
##$XGAIN= (0..3)
0 0 0 0 
##$XL= 0
##$YL= 0
##$YMAX_a= 1394
##$YMIN_a= -4325
##$ZGOPTNS= <>
##$ZL1= 120
##$ZL2= 120
##$ZL3= 120
##$ZL4= 120
##$ABSF1= 248.5645
##$ABSF2= -253.2056
##$ABSG= 5
##$ABSL= 3
##$ALPHA= 0
##$AQORDER= 0
##$ASSFAC= 0
##$ASSFACI= 0
##$ASSFACX= 0
##$ASSWID= 0
##$AUNMP= <proc_1d>
##$AZFE= 0.1
##$AZFW= 0.5
##$BCFW= 0
##$BC_mod= 2
##$BYTORDP= 0
##$COROFFS= 0
##$CY= -3
##$DATMOD= 1
##$DC= 0
##$DFILT= <>
##$DTYPP= 0
##$F1P= 0
##$F2P= 0
##$FCOR= 1
##$FTSIZE= 65536
##$FT_mod= 6
##$GAMMA= 0
##$GB= 0
##$INTBC= 1
##$INTSCL= 5.30512e-09
##$ISEN= 30
##$LB= 1
##$LEV0= 0
##$LPBIN= 0
##$MAXI= 10000
##$MC2= 0
##$MEAN= 0
##$ME_mod= 0
##$MI= 50
##$NCOEF= 0
##$NC_proc= -8
##$NLEV= 6
##$NOISF1= 182.463
##$NOISF2= 159.3651
##$NSP= 0
##$NTH_PI= 0
##$NZP= 0
##$OFFSET= 248.5645
##$PC= 4
##$PHC0= -7583.025
##$PHC1= -325.1298
##$PH_mod= 1
##$PKNL= yes
##$PPARMOD= 0
##$PSCAL= 0
##$PSIGN= 0
##$REVERSE= no
##$SF= 81.014009
##$SI= 65536
##$SIGF1= 159.3651
##$SIGF2= -187.1042
##$SINO= 113.3802
##$SIOLD= 16384
##$SREGLST= <1H.CDCl3>
##$SSB= 0
##$STSI= 65536
##$STSR= 0
##$SW_p= 40650.406504065
##$SYMM= 0
##$S_DEV= 0
##$TDeff= 32768
##$TDoff= 0
##$TI= <>
##$TILT= no
##$TM1= 0
##$TM2= 0
##$TOPLEV= 0
##$USERP1= <user>
##$USERP2= <user>
##$USERP3= <user>
##$USERP4= <user>
##$USERP5= <user>
##$WDW= 1
##$XDIM= 65536
##$YMAX_p= 489489940
##$YMIN_p= -118797354
$$ End of Bruker specific parameters
$$ ---------------------------------
##NTUPLES= NMR SPECTRUM
##VAR_NAME=  FREQUENCY,     SPECTRUM/REAL,   SPECTRUM/IMAG
##SYMBOL=    X,             R,               I
##VAR_TYPE=  INDEPENDENT,   DEPENDENT,       DEPENDENT
##VAR_FORM=  AFFN,          ASDF,            ASDF
##VAR_DIM=   65536,         65536,           65536
##UNITS=     HZ,            ARBITRARY UNITS, ARBITRARY UNITS
##FACTOR=    0.620285442955139, 1,           1
##FIRST=     20137.2065510759, 0,            0
##LAST=      -20513.1999529892, 0,           0
##MIN=       -20513.1999529892, -118797354,  0
##MAX=       20137.2065510759, 489489940,    0
$$ Real data points
##PAGE= N=1
##DATA TABLE= (X++(R..R)), XYDATA
$$ [...]
13041C342555K22491J053177l869299n530187n34032K774568m19054l158124L74809
$$ 3342555 3565046 4618223 748924 -4781263 -5315295 -2540727 -2959781 -6117905 -5743096
13032e743096M836841L403439j397814l339541k092863r65173m49482N99299J547816
$$ -5743096 -906255 2497184 1099370 -2240171 -4333034 -5298207 -5747689 -5148390 -3600574
13023c600574J808370K378505K905486J320329j664638k378113k90065P11744
$$ -3600574 -1792204 586301 3491787 4812116 3147478 769365 479300 1191044
13015A191044j089257k563474j498452J63408P52879J506705L025930L894269
$$ 1191044 101787 -2461687 -3960139 -3796731 -3043852 -1537147 1488783 5383052
13007E383052L987474M255937K988839j745801o083439m245746J174789J480049
$$ 5383052 9370526 13626463 16615302 14869501 8786062 4540316 5715105 7195154
12999G195154m232466p052067k811716J599397Q02154o38368J518763K620534
$$ 7195154 2962688 -4089379 -6901095 -5301698 -4499544 -5137912 -3619149 -998615
12991i98615j150771l641747J021049O713673M606566j835688k589723K466905
$$ -998615 -2149386 -5791133 -4770084 1943589 6550155 4714467 2124744 4591649
12983D591649M594254J200357j805907j772732k214763l519659j458045L267052
$$ 4591649 9185903 10386260 8580353 6807621 4592858 1073199 -384846 2882206
12975B882206L963174p35004l620071n69433L038867J999292n05491J06624J501602
$$ 2882206 6845380 6110376 2490305 1920872 4959739 6959031 6453540 6560164 8061766
12966H061766k90860k727257j195802K148592J535587k537209l953628r14884
$$ 8061766 7770906 5043649 3847847 5996439 7532026 4994817 1041189 126305
12958A26305J750634R59881l94863L44018Q69085j226745l389844k277826J69975
$$ 126305 1876939 2836820 2441957 2785975 3655060 2428315 -961529 -3239355 -3069380
12949c069380j54906k099862n29693M802574P211164K290615n084400o768118
$$ -3069380 -3224286 -5324148 -5853841 -1051267 6159897 8450512 3366112 -3402006
12941c402006j856096L096544L454011J622809J785973L252526J945457k983174
$$ -3402006 -5258102 -2161558 1292453 2915262 4701235 7953761 9899218 6916044
12933F916044p123376o092724j068841K604088J963261k91225N3621L017005M992827
$$ 6916044 -207332 -6300056 -7368897 -4764809 -2801548 -3092773 -3039152 -22147 4970680
12924D970680L990591J355082j496016m372063n571443k160858M519044P574323
$$ 4970680 8961271 10316353 8820337 4448274 -1123169 -3284027 1235017 8809340
12916H809340K740821m934008p050685k557411K286274L297688K253486J432833
$$ 8809340 11550161 6616153 -434532 -2991943 -705669 2592019 4845505 6278338
12908F278338r0283k987985m979857m110673j782414l87454j70759j47212j31969
$$ 6278338 6188055 3200070 -1779787 -5890460 -7672874 -8060328 -8231087 -8378299 -8510268
12899h510268k80722k09543J68989K34249j30930j96842L00813Q09683J055886
$$ -8510268 -8790990 -9000533 -8831544 -8597295 -8728225 -8925067 -8624254 -7814571 -6758685
12890f758685J127515O89078k93451n17802J045001L028415L252886J804961L00065
$$ -6758685 -5631170 -4942092 -5235543 -5753345 -4708344 -1679929 1572957 3377918 3677983
12881C677983r91840k527623k985236q23807K144414K450026K42199q44683N18872
$$ 3677983 2686143 158520 -2826716 -3650523 -1506109 943917 1186116 341433 860305
12872H60305J444467k72459k606668k187575J398502N252321N839474K076827
$$ 860305 2304772 2032313 -574355 -2761930 -1363428 3888893 9728367 11805194
12864A1805194l095158n243464l711838k102116k010949l96400L613326M571184
$$ 11805194 8710036 3466572 -245266 -2347382 -4358331 -4754731 -1141405 3429779
12856C429779p76410n759263k651144M545300N853339J212608o42076J837086
$$ 3429779 2653369 -3105894 -5757038 -1211738 4641601 5854209 5212133 7049219
12848G049219R22285m956576o962077j399217K988598l05303m950438l656616
$$ 7049219 7971504 3014928 -3947149 -5346366 -2357768 -2663071 -7613509 -11270125
12840a1270125k02330m19111n98952M360967R002201N353547k579521m260162
$$ -11270125 -11472455 -11891566 -12490518 -8129551 872650 6226197 3646676 -613486
12832f13486J101750N008269L801015J368894n57560l975209o984912m874779
$$ -613486 488264 5496533 9297548 10666442 10108882 6133673 -851239 -5726018
12824e726018P02861K925838P77913q4181J910515J883898j500025k782747P62056
$$ -5726018 -5023157 -2097319 -1319406 -1403587 506928 2390826 890801 -1891946 -1129890
12815a129890M450137M214001K017731J35348k780801o325407o065854j096332
$$ -1129890 3320247 7534248 9551979 9687327 6906526 581119 -5484735 -6581067
12807f581067K420726K55534k912992j051584L469216L977303Q8342k326853k93647
$$ -6581067 -4160341 -3904807 -6817799 -7869383 -4400167 -422864 -334522 -2661375 -2955022
12798b955022K993889L932195K758042J332421L50433m4960N59859J679444J481091
$$ -2955022 38867 3971062 6729104 8061525 8411958 8366998 8926857 10606301 12087392
12789A2087392j179005m851178o514696m499463k031M295816O492895N917192
$$ 12087392 10908387 6057209 -457487 -4956950 -4958981 -663165 5829730 11746922
12781A1746922K400644k966845o621118m969302O28972L900378Q76860m890672
$$ 11746922 14147566 11180721 4559603 -409699 219273 4119651 4996511 105839
12773A05839o809135l304867J318247K859590J201198j071306j552011J87672
$$ 105839 -6703296 -10008163 -8689916 -5830326 -4629128 -5700434 -7252445 -7064773
12765g064773K037985J380974j150428j780657R65971L484063K208597j063988
$$ -7064773 -5026788 -3645814 -4796242 -6576899 -5610928 -2126865 81732 -982256
12757i82256k107660k34346K045978L178101K870204M97839k998255l919070o46331
$$ -982256 -3089916 -3324262 -1278284 1899817 4770021 5267860 2269605 -1649465 -2295796
12748b295796K684242J830927q20477l90931K189775K218443m18487j749237j274185
$$ -2295796 388446 2219373 1398896 1007965 3197740 5416183 4997696 3248459 1974274
12739A974274j789971k487721j01188L135974J313515m187256m639665K191625
$$ 1974274 184303 -2303418 -2404606 731368 2044883 -2142373 -6782038 -4590413
12731d590413P081030L035611l982486m486045O65260L362699J086509j217136
$$ -4590413 2490617 5526228 1543742 -2942303 -2277043 1085656 2172165 955029
12723I55029m16146P48420n93395k834215k718957L9988K523119K096432n02775
$$ 955029 538883 1287303 693908 -2140307 -4859264 -4819276 -2296157 -199725 -702500
12714g02500j958855p14369P85518K5695j207301N5002K052421P60185k339461
$$ -702500 -2661355 -3375724 -2590206 -2564511 -3771812 -3716810 -1664389 -904204 -3243665
12705c243665j528124L168613M632208J75478l014872R26244O376535M352447
$$ -3243665 -4771789 -1603176 3029032 3204510 189638 1115882 7492417 11844864
12697A1844864l588794p555916l455969K739056M766479L213897J376743k54043
$$ 11844864 8256070 700154 -2755815 -16759 4749720 7963617 9340360 9086317
12689I086317k357320l427773j629945J560111K515086J50391k596666k714597
$$ 9086317 6728997 3301224 1671279 3231390 5746476 5896867 3300201 585604
12681E85604j090134q30726k280680k480124l08506J183363j25842j374626M96148
$$ 585604 -504530 -1335256 -3615936 -6096060 -6404566 -5221203 -5347045 -6721671 -6225523
12672f225523L050255K574803J253462L443630O618499M216291k701178n721885
$$ -6225523 -3175268 -600465 652997 4096627 10715126 14931417 12230239 6508354
12664F508354k513755m38587l465658n289298j003475L637558K191394j254855
$$ 6508354 3994599 3556012 90354 -5198944 -6202419 -2564861 -373467 -1628322
12656a628322J38599L560705K124893k082277j597651K736453L057904j529210
$$ -1628322 -1489723 2070982 4195875 2113598 515947 3252400 6310304 4781094
12648D781094l449141o0091K038090j117179m109401j678971K578248K314097
$$ 4781094 1331953 1271862 3309952 2192773 -1916628 -3595599 -1017351 1296746
12640A296746k089590n113025l686520O72272M713686N693410L010053n92543
$$ 1296746 -792844 -5905869 -9592389 -8920117 -4206431 1486979 4497032 3904489
12632C904489j626831l64031O5720r04165p41437R52821J445437J95374J41755
$$ 3904489 2277658 1913627 1979347 1075182 333745 1286566 2732003 2927377 3069132
12623C069132J863412J582902k306226n524742m155512m78965J184558Q55084
$$ 3069132 4932544 6515446 4209220 -1315522 -5471034 -5949999 -4765441 -3910357
12615c910357J043254J535499M50819j481846j830612l99788J168270K498020
$$ -3910357 -2867103 -1331604 -880785 -2362631 -4193243 -4593031 -3424761 -926741
12607i26741L948972M171514J587422k322364m291031l547978k211225j669073
$$ -926741 3022231 7193745 8781167 6458803 2167772 -1380206 -3591431 -5260504
12599e260504j095343L01965J647662J522277l70859k730710l435485j591483
$$ -5260504 -6355847 -6053882 -4406220 -2883943 -3254802 -5985512 -9420997 -11012480
12591a1012480Q38643R99855p03592p24296K155927M300245K479879r61256j462023
$$ -11012480 -10173837 -9173982 -9877574 -10601870 -8445943 -4145698 -1665819 -2627075 -4089098
12582d089098J136411L006473K228825N38093k96877k70113N05707J830572J864322
$$ -4089098 -2952687 53786 2282611 2820704 2523827 2253714 2759421 4589993 6454315
12573F454315r44625m233652l807574M3963K266329L00454k408875k166771l52692
$$ 6454315 5509690 1276038 -2531536 -2487573 -221244 79210 -2329665 -4496436 -4849128
12564d849128Q864l86524Q59581K747643K207028m11585j357154Q35393L178335
$$ -4849128 -4840264 -5226788 -4367207 -1619564 587464 175879 -1181275 -345882 2832453
12555B832453K554301m62773l050006l402743j782932J46379N75506n83606j215157
$$ 2832453 5386754 4923981 1873975 -1528768 -3311700 -3165321 -2589815 -3173421 -4388578
12546d388578J20114J551062N57037j389862l70702L475604N087225J827048k165372
$$ -4388578 -4268464 -2717402 -2160365 -3550227 -3920929 -445325 4641900 6468948 4303576
12537D303576j887391J380526K611385O03482j256253r27903j68580o83901j426994
$$ 4303576 2416185 3796711 6408096 7011578 5755325 4827422 4658842 3974941 2547947
12528B547947q99569M51683J382979J551847J126388K25374n62172m92537P925
$$ 2547947 1648378 2100061 3483040 5034887 6161275 6386649 5824477 5331940 5339865
12519E339865k89988j374544j782689q26510M07813P15319J18530p35330j219490
$$ 5339865 5049877 3675333 1892644 1066134 1473947 2189266 2307796 1572466 352976
12510C52976o31896J098950K493667J864286k68744j659762j266041N202J311131
$$ 352976 -278920 820030 3313697 5177983 4909239 3249477 1983436 1988638 3299769
12501C299769K443710K364704j43545l663425m588292j638942K161590L231919
$$ 3299769 5743479 8108183 7964638 4301213 -287079 -1926021 235569 3467488
12493C467488J255381j752949m057328m535281k472255J152288L521973K723479
$$ 3467488 4722869 2969920 -1087408 -5622689 -8094944 -6942656 -3420683 -697204
12485f97204j29999k296178k029123L63981K768671K727935L23831j103950N41486
$$ -697204 -827203 -3123381 -5152504 -4788523 -2019852 708083 1031914 -72036 469450
12476D69450K235916K56912k851132j439030L344735M060721r15771l841177j50774
$$ 469450 2705366 2962278 111146 -1327884 2016851 6077572 5161801 1320624 1169850
12467A169850L507469K54638n145613m087003J517399K799921j233139l139437
$$ 1169850 4677319 4931957 -213656 -4300659 -2783260 16661 -1216478 -4355915
12459d355915l21130J818483Q41273R88983L397669K529497l305118o738873k410995
$$ -4355915 -4677045 -2858562 -2017289 -1028306 2369363 4898860 1593742 -5145131 -7556126
12450g556126M107845M900070J211028m69759R63063J694642P01457O1558k17565
$$ -7556126 -3448281 1451789 2662817 2193058 3156121 4850763 5552220 5613778 5396213
12441E396213j423571j969450J92896K644546J673746j248863k020545j223731
$$ 5396213 3972642 2003192 2196088 4840634 6514380 5265517 3244972 2021241
12433B021241k269789l589378n58292M704876M144102l369865q389830m488160
$$ 2021241 -248548 -3837926 -4396218 308658 4452760 1082895 -7306935 -11795095
12425a1795095J907479J552680l511496l817847K705999Q212572P058358K950650
$$ -11795095 -9887616 -8334936 -11846432 -15664279 -12958280 -4745708 2312650 5263300
12417E263300J813949L220714K633883j049070m164436l726032j328625p48640
$$ 5263300 7077249 10297963 12931846 11882776 7718340 3992308 2663683 1915043
12409A915043k743120l755368p75481L566450L629550r56788l518113L79233N638429
$$ 1915043 -828077 -4583445 -5358926 -1792476 1837074 880286 -2637827 -2258594 3379835
12400C379835M660183r69975k777068J129861K959825k040125p604710o253674
$$ 3379835 8040018 7070043 4292975 5422836 8382661 6342536 -1262174 -7515848
12392g515848p05993J398189l20876j48089K762162L201178k78083k405973J0875
$$ -7515848 -8221841 -6823652 -7144528 -7292617 -4530455 -1329277 -1607360 -4013333 -4002458
12383d002458L112540K675822J92095j001008r68618j130552r07200K32523P78503
$$ -4002458 -889918 1785904 1977999 976991 8373 -1122179 -2029379 -1796856 -1018353
12374a018353K44272P76534K783723K819309o92522l594887k130587P84802M48413
$$ -1018353 -774081 2453 2786176 5605485 4912963 1318076 -812511 -27709 420704
12365D20704j734577j068553K118439L314806J653999N01049O45077p04444l615125
$$ 420704 -1313873 -2382426 -263987 3050819 4704818 5205867 5850944 5146500 1531375
12356A531375m301505j740169K05376o36847j114713J573404M852603M644104
$$ 1531375 -2770130 -4510299 -4304923 -4941770 -6056483 -4483079 369524 5013628
12348E013628J190631j971343k700166j539672P37P19116N76082R99828K771527
$$ 5013628 6204259 4232916 1532750 -6922 -6185 712931 1289013 2288841 5060368
12339E060368L845622J876103j491401k417567q12492j59403j178150q69572J058391
$$ 5060368 8905990 10782093 9290692 6873125 6060633 5901230 4723080 3853508 4911899
12330D911899P01255k779211m386797j311273K042093J574961M19894K430126
$$ 4911899 5613154 2833943 -1552854 -2864127 -822034 752927 1172821 3602947
12322C602947L860272p14442p511749p339759O12332P111603N868266P52437j913196
$$ 3602947 7463219 6748777 -762972 -8102731 -7490399 -378796 5489470 6241907 4328711
12313D328711j588511j003597r37494j202081k672983m700839l804503J489016
$$ 4328711 2740200 1736603 799109 -402972 -3075955 -7776794 -11581297 -10092281
12305a0092281P064110P837036M031284o8849j812220j731048r62412j48463n6988
$$ -10092281 -3028171 4808865 8840149 8771300 6959080 5228032 4265620 4117157 4060169
12296D060169q20697j239419o77740m17915j222595j353789M17478J805049N00061
$$ 4060169 3239472 2000053 1322313 904398 -318197 -1671986 -1254508 550541 1050602
12287A050602j073327R04066M483319L791416j377561m035350n47068L415352
$$ 1050602 -22725 881341 5364660 9156076 7778515 3743165 3196097 6611449
12279F611449J933696j629109p46587K655843J223582m724202o598675j418388
$$ 6611449 8545145 6916036 6169449 8825292 10048874 5324672 -1274003 -2692391
12271b692391L015111P82457k798818q16639L297436J887594l675503n408888
$$ -2692391 322720 1105177 -1693641 -2510280 787156 2674750 -1000753 -6409641
12263f409641j979128K33064j080318j084474J952654K784698r70863l582202
$$ -6409641 -8388769 -8155705 -9236023 -10320497 -8367843 -5583145 -6554008 -10136210
12255a0136210p00207L180563K566447q7858j8653O72769k551364o780232m894955
$$ -10136210 -10836417 -7655854 -5089407 -5177265 -5195918 -4523149 -7074513 -13854745 -18749700
12246a8749700K720118P843785O023963J458565p00381n36648j37428K28840L66976
$$ -18749700 -16029582 -8185797 -2161834 -703269 -1403650 -1940298 -2077726 -1848886 -1481910
12237a481910q44260k371898r71963L387671N768012K745114k428061m255269
$$ -1481910 -2326170 -4698068 -5670031 -2282360 3485652 6230766 3802705 -452564
12229d52564k239538l24440m75281l58201K316282N750160N885614J548225l662367
$$ -452564 -2692102 -3016542 -3491823 -3850024 -1533742 4216418 10102032 11650257 7987890
12220G987890n307299l129851o16510J46702N96853J845036J881509q71608l773810
$$ 7987890 2680591 -449260 -1065770 -919068 -322215 1522821 3404330 2532722 -1241088
12211a241088l149487L58541L024809L254191K029801l82546l917074n841306
$$ -1241088 -4390575 -4032034 -1007225 2246966 4276767 3894221 -22853 -5864159
12203e864159l174729K049430M460742K626546L28021K20117Q32855O81148O73799
$$ -5864159 -9038888 -6989458 -2528716 97830 425851 645968 1478823 2159971 2833770
12194B833770J114047O84776j87753P31784K845266K537825q65274l696241m112651
$$ 2833770 3947817 4632593 4444840 5176624 8021890 10559715 9694441 5998200 1885549
12185A885549m436073n299741l376809J844030M904460K366982j259129n00350
$$ 1885549 -2550524 -7850265 -11227074 -9383044 -4478584 -2111602 -3370731 -3871081
12177c871081K863894L846344K171409M66289j414082m054725m186231M15542
$$ -3871081 -1007187 2839157 5010566 5476855 4062773 8048 -4178183 -3762641
12169c762641M826233L129381j764833k274491J681140L146318L7264k343967
$$ -3762641 1063592 4192973 2428140 153649 1834789 4981107 5018371 2674404
12161B674404j350863o33836j808713j204736J815691J663518l559475o448989
$$ 2674404 1323541 689705 -1119008 -2323744 -508053 1155465 -2404010 -8852999
12153h852999r51328P164207P701217K19200o237535n611221o09181L270064L866068
$$ -8852999 -9804327 -2640120 5061097 5280297 -957238 -6568459 -7177640 -3907576 -41508
12144d1508K106898q8644q26787J33475P07253m67634j336795M91801L179425
$$ -41508 2065390 1976746 1149959 1283434 1990687 1523053 186258 678059 3857484
12135C857484K733157p89801k902337r91558K332424L279027J518809o78491j841397
$$ 3857484 6590641 5800840 2898503 1906945 4239369 7518396 9037205 8358714 6517317
12126F517317k122246j972935j516603p78464K34852J300831J628820N48867j219967
$$ 6517317 4395071 2422136 905533 127069 361921 1662752 3291572 3840439 2620472
12117B620472k027945j479482j052544j759076k300901r32515J518493K368657
$$ 2620472 592527 -886955 -1939499 -3698575 -5999476 -6931991 -5413498 -3044841
12109c044841R47227k68560N84574J772745P94766j248103j222977N39316K45298
$$ -3044841 -2097614 -2366174 -1781600 -8855 785911 -462192 -1685169 -1145853 -900555
12100i00555k795505l768846N78523N912690N702858N71729k766149j227595J248604
$$ -900555 -3696060 -7464906 -6886383 -973693 4729165 5300894 2534745 1307150 2555754
12091B555754P61195j192776j605960j022364j536241k545840j847981N40128
$$ 2555754 3316949 2124173 518213 -504151 -2040392 -4586232 -6434213 -5894085
12083e894085K377680K153143J84840k218007l234702j521001J766876L353168
$$ -5894085 -3516405 -1363262 -1178422 -3396429 -6631131 -8152132 -6385256 -3032088
12075c032088J750853p61404j568910j143934r91355l17000K182100M607457L609129
$$ -3032088 -1281235 -2042639 -3611549 -4755483 -5746838 -6063838 -3881738 725719 4334848
12066D334848l12090k651013q35706K413823K981686N45989j872715k330114j882992
$$ 4334848 4022758 1371745 536039 2949862 5931548 6477537 4604822 2274708 391716
12057C91716k070290k186854m30078K644926L655356N66099l836068m689629j055751
$$ 391716 -1678574 -3865428 -4295506 -1650580 2004776 2570875 -1265193 -5954822 -7010573
12048g010573L004568L728461J818333L75544P48180J910269K359516J062668
$$ -7010573 -4006005 -277544 1540789 1916333 2664513 4574782 6934298 7996966
12040G996966k128528n403352n607689j788983K755661L844456J338911r96768
$$ 7996966 5868438 465086 -5142603 -6931586 -4175925 -331469 1007442 10674
12032A0674l69827J873712K274797n11897m093235m910871k247121R56585J674731
$$ 10674 -359153 1514559 3789356 3277459 -815776 -5726647 -7973768 -7017183 -5342452
12023e342452J37703j438811j969070j305980J398012N742356P651608L525620
$$ -5342452 -5204749 -6643560 -8612630 -9918610 -8520598 -2778242 4873366 8398986
12015H398986l248990n266884j640590L72491l194360o299583k385773M831325
$$ 8398986 5149996 -116888 -1757478 -1384987 -4579347 -10878930 -13264703 -8433378
12007h433378O696055K302296j372255m73532J672648J615451N00549K70579J82775
$$ -8433378 -1737323 564973 -807282 -1280814 391834 2007285 2507834 2778413 2961188
11998B961188q36388j859437j666484m03693J182654K141106J250183j107056
$$ 2961188 2124800 265363 -1401121 -1804814 -622160 1518946 2769129 1662073
11990A662073k014826Q7786K043145K98563k964196k872053J31560J155962n62379
$$ 1662073 -352753 -264967 1778178 2076741 -887455 -3759508 -3627948 -2471986 -3034365
11981c034365n14423K664944M337478J749913j427942j641503q40789j529409
$$ -3034365 -3548788 -883844 3453634 5203547 3775605 2134102 1293313 -236096
11973b36096j763060K65083J330806j678177n321736m097274J068019M424975
$$ -236096 -1999156 -1734073 -403267 -2081444 -7403180 -11500454 -10432435 -6007460
11965f007460L827913K108297J083866l61500k300800k769465j354020J52359
$$ -6007460 -2179547 -71250 1012616 651116 -1649684 -4419149 -5773169 -5620810
11957e620810J084694K294256L095656J753799n52641l74452K375675L469169
$$ -5620810 -4536116 -2241860 853796 2607595 2054954 1680502 4056177 7525346
11949G525346O90081k663747k886350j106945n36333j224847j030736J9467O1208
$$ 7525346 8215427 5551680 2665330 1558385 1022052 -202795 -1233531 -1214064 -1152856
11940a152856p69659m86031P55801L56378k039589k752785Q58412N652863N918743
$$ -1152856 -1922515 -2408546 -1652745 -1296367 -3335956 -6088741 -5230329 422534 6341277
11931F341277P65142m350484m167168J69036K882923P78671l050829l332856O39049
$$ 6341277 7106419 2755935 -1411233 -1242197 1640726 2419397 -631432 -3964288 -3325239
11922c325239M063358K901297o68421j269947J828906L298133l95418n033127
$$ -3325239 738119 3639416 2970995 1701048 3529954 6828087 6432669 1399542
11914A399542m114604J633232M990640K454766j341554j265127R04202M01204
$$ 1399542 -2715062 -1081830 3908810 6363576 5022022 3756895 4661097 5062301
11906E062301k385352k556280J490029N349270M439400m65498m620842m452214
$$ 5062301 2676949 120669 1610698 6959968 11399368 10933870 6313028 1860814
11898A860814o28481K823681K303677j573555m429424l337578m36794L92369q20206
$$ 1860814 1232333 4056014 6359691 4786136 356712 -2980866 -3417660 -3025291 -3845497
11889c845497n89577K281878M536728L015236q96967l003322j501377R50081N31751
$$ -3845497 -4435074 -2153196 2383532 5398768 4501801 1498479 -2898 947183 1478934
11880A478934k873482m949224j955476M083870P099713M091735j670994n112363
$$ 1478934 -1394548 -6343772 -8299248 -4215378 2884335 6976070 5305076 192713
11872A92713m358485l89368M845484P947790N357044j637096o221760m113882
$$ 192713 -4165772 -4555140 290344 8238134 13595178 11958082 5736322 1622440
11864A622440M80522J061053j854715k782877m72070J028773k23880j545756r44272
$$ 1622440 2102962 3164015 1309300 -1473577 -1945647 -916874 -1140754 -2686510 -3630782
11855c630782J79854M88915N57219O28963K97668M51408J788556K082191p21971
$$ -3630782 -3450928 -2962013 -2404794 -1775831 -1478163 -1026755 761801 2843992 2122021
11846B122021l731399k668980P84467J353783q01465o24974K103523J754294k671680
$$ 2122021 -1609378 -4278358 -3493891 -2140108 -2941573 -3566547 -1463024 291270 -2380410
11837b380410m406687K06859N255493M352500j70912k287900j172649R2545L31040
$$ -2380410 -6787097 -6580238 -1324745 3027755 2856843 568943 -603706 -511161 -180121
11828a80121k86j144062k082735j76760L668944M116329m11123l769342j085100
$$ -180121 -180407 -1324469 -3407204 -3583964 84980 4201309 3790186 20844 -1064256
11819a064256L378868L031420r19367k584884j071703k52924j190644j276352
$$ -1064256 2314612 5346032 4426665 1841781 770078 517154 -673490 -1949842
11811a949842K17882J210786Q21352J51345q9469K34821J139449R98720k170580
$$ -1949842 -1731960 -521174 300178 451523 362054 596875 1736324 2735044 564464
11802E64464n767476l962601K801820N905703R98914m430375k668436J830114
$$ 564464 -5203012 -9165613 -6363793 -458090 540824 -3889551 -6557987 -4727873
11794d727873O00387m060674l383246K484468N011248J671295j502302j496897
$$ -4727873 -4127486 -8188160 -11571406 -9086938 -4075690 -2404395 -3906697 -5403594
11786e403594j496816j898550Q99343N156880M160714j473571k762675K632908
$$ -5403594 -6900410 -8798960 -7899617 -2742737 1417977 -55594 -2818269 -185361
11778a85361N324752m01742o583606m452995J734813K743934q43747j731098J063135
$$ -185361 5139391 4737649 -1845957 -6298952 -4564139 -1820205 -2663952 -4395050 -3331915
11769c331915K272647P32146K19434J112310r7410k931756k629809J153009K732415
$$ -3331915 -1059268 -327122 -107688 1004622 907212 -2024544 -4654353 -3501344 -768929
11760g68929l31157l008186j155397J712574O46700k143252q03410M227023O074217
$$ -768929 -1100086 -4108272 -5263669 -3551095 -2904395 -5047647 -5851057 -1624034 4450183
11751D450183J590583l854648m062180k89564J727011K52695j393916j065505
$$ 4450183 6040766 2186118 -1876062 -2165626 -438615 -185920 -1579836 -2645341
11743b645341k87759j95508N07578K033778K002824k86350j650870P4716K066825
$$ -2645341 -2933100 -3128608 -2621030 -587252 1415572 1129222 -521648 -446932 1619893
11734A619893P76943k403157l362187j243585J268662K077329R88119j375638
$$ 1619893 2396836 -6321 -3368508 -4612093 -3343431 -1266102 -277983 -1653621
11726a653621l031883j228055L195727M735239M63046m583104m114287K17330
$$ -1653621 -4685504 -5913559 -2717832 2017407 2480453 -2102651 -6216938 -5999608
11718e999608K314143J696570K580838M336329J677648m783802p053574j872177
$$ -5999608 -3685465 -1988895 591943 4928272 6605920 1822118 -5231456 -7103633
11710g103633L559686K526082j273336o38557L442033M065325k79701l611798
$$ -7103633 -3543947 -1017865 -2291201 -2929758 512275 4577600 4297899 686101
11702F86101j503494L227864N090625K496848j785529m364750l784572p77340
$$ 686101 -817393 2410471 7501096 9997944 8212415 3847665 63093 -714247
11694g14247K293405K632949o22217m543967m361366R80777O145375N009959j197534
$$ -714247 1579158 4212107 3589890 -954077 -5315443 -4334666 1810709 6820668 5623134
11685E623134m888331k099705K589583L228860L14805k025247k802808l522028
$$ 5623134 734803 -1364902 1224681 4453541 4768346 2743099 -59709 -3581737
11677c581737l700326k039448J2719N81812J147060L256804M005169M19372l973723
$$ -3581737 -7282063 -9321511 -9308792 -8726980 -7579920 -4323116 -317947 101425 -3872298
11668c872298l475785N66783J881222m42536j260048J222717L038064K218793
$$ -3872298 -7348083 -6781300 -4900078 -5342614 -6602662 -5379945 -2341881 -123088
11660a23088J548648K190938J677555j02400N6158J793245O13616l433784m072601
$$ -123088 1425560 3616498 5294053 5191653 5247811 7041056 7654672 4220888 148287
11651A48287Q09926M468898J530387l680913m358719j206044N58359j41641m02272
$$ 148287 958213 5427111 6957498 3276585 -1082134 -2288178 -1729819 -1871460 -2273732
11642b273732P55341J793159K080319J922261P62228j637823l739429l936841
$$ -2273732 -1518391 274768 2355087 4277348 5039576 3401753 -337676 -4274517
11634d274517k026333J701482N976977P099097K418537m155634n488989j226666
$$ -4274517 -6300850 -4599368 1377609 8476706 10895243 6739609 1250620 23954
11626B3954J570548m63427k256495J63961K700028Q28097k121927o58393L576282
$$ 23954 1594502 1131075 -1125420 -961459 1738569 2566666 444739 -213654 3362628
11617C362628M656137J312185k702166m625827m103681j100936K923732M096043
$$ 3362628 8018765 9330950 6628784 2002957 -2100724 -3201660 -277928 3818115
11609C818115P06330l441897l917661j283668J520255L898451N656864M171146
$$ 3818115 4524445 1082548 -2835113 -4118781 -2598526 1299925 6956789 11127935
11601A1127935j286026n444221l032159L043499N084762J085432l353009l268082
$$ 11127935 9841909 4397688 1365529 4409028 9493790 10579222 7226213 3958131
11593C958131P7253K304867J164735k093005m487359l980873j289554J187743
$$ 3958131 4035384 6340251 7504986 5411981 924622 -3056251 -4345805 -3158062
11585c158062K113502J583754m27476l262453m029907p74829L310719L566888
$$ -3158062 -1044560 539194 111718 -3150735 -7180642 -7955471 -4644752 -1077864
11577a077864J287660J622718M292134L736654o42727k805650p91389p7521k707058
$$ -1077864 209796 1832514 6124648 9861302 9218575 6412925 5621536 5544015 2836957
11568B836957k663564K552850N285787o2490o777061o274124j198827J117630
$$ 2836957 173393 2726243 8012030 7949540 1172479 -5101645 -6300472 -5182842
11560e182842J237479L301232M290486o89385o745973n068861K028609M100472
$$ -5182842 -3945363 -644131 3646355 2956970 -3789003 -8857864 -6829255 -2728783
11552b728783m15010k390965J902486M800585O92269m678583l603476K167824
$$ -2728783 -3143793 -5534758 -3632272 1168313 1860582 -2818001 -6421477 -4253653
11544d253653N018362K090554k425407l535522q59710J744789J093813j127598
$$ -4253653 764709 2855263 429856 -3105666 -3965376 -2220587 -1126774 -2254372
11536b254372p90121K038233K922751Q19939K22368K485799J996061l627116o866657
$$ -2254372 -3044493 -1006260 1916491 2736430 2958798 5444597 7440658 3813542 -3053115
11527c053115j819609M294179J459099o313952o569300J777257P033772L314860
$$ -3053115 -4872724 -578545 880554 -5433398 -12002698 -10225441 -3191669 123191
11519A23191j866349j263312J828510J585380p39903p65889J370705K285565O59366
$$ 123191 -1743158 -3006470 -1177960 407420 -332483 -1098372 272333 2557898 3217264
11510C217264j984863l352225j915619J232006K341214l37707l281766k540049
$$ 3217264 1232401 -2119824 -4035443 -2803437 -462223 -799930 -4081696 -6621745
11502f621745M90880K345860L324493M700795L894806p15054l844393l74376M787392
$$ -6621745 -6130865 -3785005 -460512 4240283 8135089 7420035 3575642 3201266 7988658
11493G988658L175404l407043n765610k419852o87221k859616k854034J732287
$$ 7988658 11164062 7757019 1991409 -428443 -1115664 -3975280 -6829314 -5097027
11485e097027N131434L766375J459716J401991J733585J601741K955098M209913
$$ -5097027 34407 3800782 5260498 6662489 8396074 9997815 12952913 17162826
11477A7162826J059525m513093n469922j724502n55867l033629j900143L589672
$$ 17162826 18222351 13709258 8239336 6514834 5958967 2925338 1025195 4614867
11469D614867L771057m506712r845021l728426N268219N017426j654674l468579
$$ 4614867 8385924 3879212 -5965809 -9694235 -4426016 591410 -1063264 -4531843
11461d531843J034594L530384M59639l057701k447044J198345M367193M030610
$$ -4531843 -3497249 33135 492774 -2564927 -5011971 -3813626 553567 4584177
11453D584177p48028n913018m712249K825197P451841K875037m783132n902412
$$ 4584177 3836149 -2076869 -6789118 -3963921 3487920 6362957 1579825 -4322587
11445d322587q63183K621810J799243N97180J232755J590349M67891m59527R690
$$ -4322587 -5185770 -2563960 -764717 -167537 1065218 2655567 3123458 2663931 2673621
11436B673621J325963K714675L104717J102723k452497m187914k723202o54883
$$ 2673621 3999584 6714259 9818976 10921699 8469202 4281288 1558086 903203
11428I03203j03986k8323J35021j098816k887826j670549J951410K178726k373042
$$ 903203 799217 770894 905915 -192901 -3080727 -4751276 -2799866 -621140 -2994182
11419b994182m772344m75301M754275L804854r86590k910354j350438J66054J542794
$$ -2994182 -7766526 -8241827 -3487552 317302 -669288 -3579642 -4930080 -4764026 -3221232
11410c221232L977325M415795J81969m209961k821812J937219L099273J71766
$$ -3221232 756093 5171888 5353857 1143896 -1677916 259303 3358576 3530342
11402C530342j539392n79775k28325j005641k00479J623760J001207j616715k141053
$$ 3530342 1990950 1411175 1182850 177209 -23270 1600490 2601697 984982 -1156071
11393a156071l2564J049686o1853o40751L09106N17644r38362k227229k241534
$$ -1156071 -1188635 -138949 -200802 -841553 -532447 -14803 -953165 -3180394 -5421928
11384e421928j407936N41015L573869N052025K604164j689460l918086l630178
$$ -5421928 -6829864 -6288849 -2714980 2337045 4941209 3251749 -666337 -4296515
11376d296515k593588n85713K919877N233753L764093O87048p09116j586479l903572
$$ -4296515 -6890103 -7475816 -4555939 677814 4441907 5128955 4419839 2833360 -1070212
11367a070212m555402j22040N396755N487433J620621L75334J699914m22820n856787
$$ -1070212 -5625614 -5747654 -350899 5136534 6757155 7132489 8832403 8409583 2552796
11358B552796p028969j518321L614219L200583R81245J188698J158407k217124
$$ 2552796 -4476173 -5994494 -2380275 820308 1801553 2990251 4148658 1931534
11350A931534n212080k843160K585225M570629J539990k157697k898062j265544
$$ 1931534 -3280546 -6123706 -3538481 1032148 2572138 414441 -2483621 -3749165
11342c749165M91420J307283J330986P80368n83381k605006l410200p68377L819980
$$ -3749165 -3257745 -1950462 -619476 160892 -422489 -3027495 -6437695 -7206072 -3386092
11333c386092M933621J49178n167715m159020K188224O826711O449904L933966
$$ -3386092 1547529 1696707 -3471008 -7630028 -5441804 1384907 7834811 11768777
11325A1768777J568791j820670n960362p192399l796966R70986L185880K321724
$$ 11768777 13337568 11516898 5556536 -1635863 -5432829 -4461843 -1275963 1045761
11317A045761l7672k136056k003482R16504L583009K475267r74060k169771m87671
$$ 1045761 1008089 -1127967 -3131449 -2214945 1368064 3843331 2869271 699500 211829
11308B11829K73588j163662j666717K11098J824028J788867K257179L668598K679174
$$ 211829 485417 -678245 -2344962 -2133864 -309836 1479031 3736210 7404808 10083982
11299A0083982j753589n166456l902370m88147O63067p01825k065002k169018
$$ 10083982 8330393 3163937 -738433 -1226580 -563513 -1265338 -3330340 -5499358
11291e499358p03816K651651N918642M971446p52639n786792n148236n20151L121014
$$ -5499358 -6203174 -3551523 2367119 7338565 6585926 799134 -4349102 -4869253 -1748239
11282a748239M031737L436396J683033j206513l113440j962646P80180J904033
$$ -1748239 2283498 5719894 7402927 6196414 3082974 1120328 1900508 3804541
11274C804541O79168j319542l130397m383252l837041r18378K309792L360303
$$ 3804541 4483709 3164167 33770 -4349482 -8186523 -9104901 -6795109 -3434806
11266c434806K526126J596797P91227m35916j018313J89799J575632P48750j263563
$$ -3434806 -908680 688117 1479344 1043428 25115 214914 1790546 2539296 1275733
11257A275733j171709J345898K927276J527782r69553k102349j942931j426958
$$ 1275733 104024 1449922 4377198 5904980 4935427 2833078 890147 -536811
11249e36811j56540J965511K812640M81683l166686m145082j554243J325267J693365
$$ -536811 -693351 1272160 4084800 4566483 1399797 -2745285 -4299528 -2974261 -1280896
11240a280896M46830m89357j369133k733659k572349R23947M907142M612043P48804
$$ -1280896 -834066 -1323423 -2692556 -5426215 -7998564 -7074617 -2167475 2444568 3193372
11231C193372n77705L075318O182279L161117l230667n773530k722335Q20300
$$ 3193372 2615667 5690985 11873264 15034381 11803714 6030184 3307849 4128149
11223D128149O06251j985782l241033j886696M25108J554009J055651N48162J599531
$$ 4128149 4734400 2748618 -492415 -2379111 -1954003 -399994 655657 1203819 2803350
11214B803350L221596L069910J241873R9242k10540k074721m827465l889513J410789
$$ 2803350 6024946 9094856 10336729 10435971 10225431 8150710 3323245 -566268 844521
11205H44521M428756M38354n408638n376352m67955K462213J798428J617915L006312
$$ 844521 5273277 5711631 302993 -5073359 -5541314 -3079101 -1280673 337242 3343554
11196C343554K988776J361974Q04704M34075l004537p470568p196544k523188
$$ 3343554 6332330 7694304 8499008 8933083 5928546 -1542022 -8738566 -11261754
11188a1261754R8757r28887j03556M404737O769752L769711M40045R46858J740062
$$ -11261754 -11162997 -12091884 -12195440 -7790703 -1020951 2748760 3188805 4135663 5875725
11179E875725q81185l577918k288309M83835O90554n03460p24614j559811l752550
$$ 5875725 4994540 1416622 -871687 -387852 302702 -200758 -925372 -2485183 -6237733
11170f237733l029119K411509N794266J204864n473857m078399M442599R480342
$$ -6237733 -9266852 -6855343 -1061077 143787 -5330070 -9408469 -4965870 4514472
11162D514472O160559J52945k919764m097025n301556m528098k69373M289499
$$ 4514472 10675031 10827976 7908212 3811187 -1490369 -6018467 -6287840 -1998341
11154a998341M927064J526181k376647l358400q58228K193051J924133j718729
$$ -1998341 2928723 4454904 2078257 -1280143 -2138371 54680 1978813 260084
11146B60084m321796l065251p90783j032800k164222q04272J862910K459313J741962
$$ 260084 -4061712 -7126963 -7917746 -8950546 -11114768 -11919040 -10056130 -7596817 -5854855
11137e854855K708792M202830K715706o55506j618348k45688k89244j499865j97510
$$ -5854855 -3146063 1056767 3772473 3116967 1498619 1252931 963687 -536178 -733688
11128g33688K415421R76961l643527l736393K332540N719600Q81943m650348j794673
$$ -733688 1681733 2658694 -984833 -4721226 -2388686 3330914 4212857 -437491 -2232164
11119b232164N387708N749410j967389p844516n620580m1141K107197J107533
$$ -2232164 3155544 8904954 6937565 -906951 -6527531 -6568672 -4461475 -3353942
11111c353942J162134K996663L696817J804853p68345j716667j260894j255109
$$ -3353942 -2191808 804855 4501672 6306525 5538180 3821513 2560619 1305510
11103A305510j909306r64275K497020M803338J621104m818163o819087j516056
$$ 1305510 -603796 -1568071 928949 5732287 7353391 2535228 -4283859 -5799915
11095e799915M286442L180304k609154n009564j699630J887881J498692o93492
$$ -5799915 -1513473 1666831 -942323 -5951887 -7651517 -5763636 -4264944 -4958436
11087d958436p82064J437016L467240L534613J694887l93547n58949R63677O54542
$$ -4958436 -5740500 -4303484 -836244 2698369 4393256 3999709 3440760 4404437 5058979
11078E058979l146385n743388j654466O027328Q113723K114701m097268l916350
$$ 5058979 1912594 -3830794 -5485260 542068 8655791 10770492 6673224 2756874
11070B756874n97088j4164j138099L5064J826652k70331m613083m943075k98367
$$ 2756874 2159786 2145622 1007523 1042587 2869239 2598908 -2014175 -6957250 -7255617
11061g255617L519973K908630P06950K40328P31887O45761P84696J596643J343873
$$ -7255617 -3735644 -827014 -120064 120264 852151 1497912 2282608 3879251 5223124
11052E223124n09723j421120J68573J743407L67091k745425l924540j913506J119956
$$ 5223124 4713401 3292281 3460854 5204261 5571352 2825927 -1098613 -3012119 -1892163
11043a892163K578498J883018M05148k45337p2665m50833j462522j105723J082319
$$ -1892163 686335 2569353 2974501 2729164 2656499 2205666 743144 -362579 719740
11034G19740J860774r53817l715239j710686K803861L331109n66172k607140k75697
$$ 719740 2580514 1626697 -2088542 -3799228 -995367 2335742 1769570 -837570 -1113267
11025a113267J561651r4620j237744R23471J973497j700751n336547l290517J087203
$$ -1113267 448384 353764 -883980 39491 2012988 312237 -5024310 -8314827 -7227624
11016g227624J024920k116952j592285K637007L676013m59392l257978O7151N561080
$$ -7227624 -6202704 -8319656 -9911941 -7274934 -3598921 -4058313 -7316291 -7249140 -1688060
11007a688060O683840K739670j698427k762322o23225J429173N52943k017968
$$ -1688060 4995780 7735450 6037023 3274701 2651476 4080649 4633592 2615624
10999B615624k190471P25576K083169p60490l212069o87213K834441P76249m284532
$$ 2615624 425153 1150729 3233898 2473408 -738661 -1425874 1408567 2184816 -2099716
10990b099716l800030K606895N945181K260995j457100N29486L474535R11790
$$ -2099716 -5899746 -3292851 2652330 4913325 3456225 3985711 7460246 8372036
10982H372036m295196m697948L28343M651636M430934J452525j205120k286229
$$ 8372036 4076840 -621108 -292765 4358871 8789805 10242330 9037210 6750981
10974F750981j852862r34853j016326j862807j312735J195751L120572K524226
$$ 6750981 4898119 3963266 2946940 1084133 -228602 967149 4087721 6611947
10966F611947P04462n96059j594555k200053r05550J552554J236394k936273n744241
$$ 6611947 7316409 6720350 5125795 2925742 2020192 3572746 4809140 1872867 -3871374
10957c871374k401296M125395O964466M306887P7841k563095l694581l601735
$$ -3871374 -6272670 -2147275 4817191 9124078 9201919 6638824 2944243 -657492
10949f57492j871478M62626J462699J055743N25581j44407j563819k466098j170646
$$ -657492 -2528970 -2066344 -603645 452098 977679 833272 -730547 -3196645 -4367291
10940d367291J165876J994857J407677J343551J441870m47635l756470n187173
$$ -4367291 -3201415 -1206558 201119 1544670 2986540 2538905 -1217565 -6404738
10932f404738l622141j249105P73857L671281O854507O649186J690883l761311
$$ -6404738 -10026879 -11275984 -10502127 -6830846 23661 6672847 8363730 4602419
10924D602419m835768j969555Q96108J836352J662078R29124l83893j203986n80645
$$ 4602419 -233349 -2202904 -1306796 529556 2191634 3120758 2736865 1532879 952234
10915I52234L7054j165794k642073j379859J562853J620430k134568m649555j939029
$$ 952234 989288 -176506 -2818579 -4198438 -2635585 -1015155 -3149723 -7799278 -9738307
10906i738307L289970O064461N769625M546014K247184j942072n102475l794513
$$ -9738307 -6448337 -383876 5385749 9931763 12178947 10236875 5134400 1339887
10898A339887o25601j090138l940118k140852M976279Q535398L101982m468521
$$ 1339887 714286 -375852 -4315970 -6456822 -1480543 7054855 10156837 5688316
10890E688316n125718n24034J499136l22322r87751N06908L20725j587320q63832
$$ 5688316 562598 38564 1537700 1215378 227627 734535 1055260 -532060 -1395892
10881a395892K377298K585273j204884k502125J832930N308682J687184m688477
$$ -1395892 981406 3566679 2361795 -140330 1692600 7001282 8688466 3999989
10873C999989n065008P67184M551568J490986l912637m865857q80594K748019
$$ 3999989 -1065019 -297835 4253733 5744719 1832082 -3033775 -3914369 -1166350
10865a166350K107858q59300j430377J335657L125074O05472l185912k967365
$$ -1166350 941508 82208 -1348169 -12512 3112562 3718034 532122 -2435243
10857b435243O90134K100367o13464k672683n63389K296983J259479k197597l161324
$$ -2435243 -1745109 355258 -258206 -2930889 -3494278 -1197295 62184 -2135413 -5296737
10848e296737p50703J568782J773970J274668J511446J968827J776675Q52766
$$ -5296737 -6047440 -4478658 -2704688 -1430020 81426 2050253 3826928 4679694
10840D679694o45956k200602k594862j399907j50517j94887k02438J852045M757056
$$ 4679694 4033738 1833136 -761726 -2161633 -2312150 -2507037 -2709475 -857430 3899626
10831C899626M902022J341075k615927l844901l108714k726634k554459q65063
$$ 3899626 8801648 10142723 7526796 3681895 573181 -2153453 -4707912 -5572975
10823e572975J708070K241517M1689j797136q82994J031804J518048J871109M205947
$$ -5572975 -3864905 -1623388 -1581699 -3378835 -4261829 -3230025 -1711977 159132 4365079
10814D365079N952767K636243l959081o494414k691903Q65925j048690m181700
$$ 4365079 10317846 12954089 8995008 2500594 -191309 674616 -374074 -4555774
10806d555774k138386L055202M526446J494337p34501p6752M20794l72114O3384
$$ -4555774 -6694160 -3638958 887488 2381825 1647324 1570572 1991366 1619252 1682636
10797A682636J764901J139210k319904m105597j719290J548203K171916J050386
$$ 1682636 3447537 4586747 2266843 -1838754 -3558044 -2009841 162075 1212461
10789A212461K93552k17944o11349M89387K659912K683363m81045l261930k670935
$$ 1212461 1506013 1288069 676720 1166107 3826019 6509382 6028337 2766407 95472
10780I5472o09139k22181j045581p71475O82109J756144J891198J131832j001590
$$ 95472 -513667 -735848 -1781429 -2552904 -1870795 -114651 1776547 2908379 1906789
10771A906789l964562n233458l073568R76976L914157M299617K559189j0675j582036
$$ 1906789 -2057773 -7291231 -10364799 -9387823 -5473666 -1174049 1385140 1374465 -207571
10762b07571r68413O06183O27439j220716k627008k177901j078684o98746o23104
$$ -207571 -1175984 -569801 57638 -1163078 -3790086 -5967987 -7046671 -7745417 -8368521
10753h368521l8350P42235Q89977p723j585927k224550p9351L762406N040506
$$ -8368521 -8406871 -7664636 -6774659 -6782382 -8368309 -10592859 -10672210 -6909804 -1869298
10744a869298J805328k002079j879517N60976O30306j693505k341262k59540J666505
$$ -1869298 -63970 -2066049 -3945566 -3384590 -2754284 -4447789 -6789051 -7048591 -5382086
10735e382086K250749K999580L662199K278980l19807j367490j275900k408116
$$ -5382086 -3131337 -131757 3530442 5809422 5489615 4122125 2846225 438109
10727D38109l342621p05555L512491L464686j172769m292633k795012n4923J128136
$$ 438109 -2904512 -3610067 -97576 3367110 2194341 -2098292 -4893304 -4948227 -3820091
10718c820091J961995K675559J324233p70136L16619L283624K186109l049476
$$ -3820091 -1858096 817463 2141696 1371560 1688179 4971803 7157912 4108436
10710D108436n003079p26243L042479P97783l429957l670486r93135M44058N20617
$$ 4108436 -894643 -1620886 1421593 2219376 -1210581 -4881067 -5874202 -5430144 -4909527
10701d909527J241890K428184L324019M133012L418106p52453n282512m284153
$$ -4909527 -3667637 -1239453 2084566 6217578 9635684 8883231 3600719 -683434
10693f83434J266198L730678Q15641j407312k90478j284837o276460p762233j233010
$$ -683434 582764 4313442 5129083 3721771 3431293 2146456 -4130004 -11892237 -13125247
10684a3125247O253623P346178N260244N291314M289951j868260p855993o312089
$$ -13125247 -6871624 474554 5734798 11026112 15316063 13447803 5591810 -720279
10676g20279o9402K747189J094621m87233j058251k096182j603751J798784L208033
$$ -720279 -789681 1957508 3052129 2564896 1506645 -589537 -2193288 -394504 2813529
10667B813529j283317n927926l248299L298540M475851J077k229584J33070J376508
$$ 2813529 1530212 -4397714 -7646013 -4347473 128378 129455 -2100129 -1967059 -590551
10658e90551j068755k540965N177K848674J874890j331869k372091J00855L060055
$$ -590551 -1659306 -4200271 -4195094 -1346420 528470 -803399 -3175490 -3074635 -14580
10649a4580K558908j439611l979312j171271L412555L012371j993245m466071
$$ -14580 2544328 1104717 -2874595 -4045866 -633311 2379060 385815 -4080256
10641d080256j680722J602936K400173K881562K667881j804453p242744m673462
$$ -4080256 -5760978 -4158042 -1757869 1123693 3791574 1987121 -5255623 -9929085
10633i929085M755813Q028178O46162n087892p31695M014853n89695o201760j527919
$$ -9929085 -5173272 2854906 3501068 -1586824 -2318519 1696334 1106639 -5095121 -6623040
10624f623040O572583M633071m049571n989456p15029J150073j701093j274696
$$ -6623040 -50457 4582614 533043 -5456413 -6171442 -5021369 -6722462 -7997158
10616g997158K131784N97445m216184k230074O082890Q773454K525365k138897
$$ -7997158 -5865374 -5267929 -9484113 -11714187 -5631297 3142157 5667522 3528625
10608C528625Q85321M399243J881515k396217k634821n13472J90372k10936m55932
$$ 3528625 4413946 8813189 10694704 8298487 5663666 5150194 5340566 5129630 4673698
10599D673698r95104j209417J68537J415685M69130j32896K311501L873009j83288
$$ 4673698 3678594 2469177 2637714 4053399 4522529 4389633 6701134 10574143 10390855
10590A0390855n619620m767192N76630K119017q95119j591516J501649K554572
$$ 10390855 4771235 4043 580673 2699690 1804571 213055 1714704 4269276
10582D269276j42815j626412l47893q66445m480642n928888j997849L398145M916008
$$ 4269276 4126461 2500049 2152156 1285711 -3194931 -9123819 -11121668 -7723523 -2807515
10573b807515J812054k415115l150221J191430N774906M001503k241973l759307
$$ -2807515 -995461 -3410576 -6560797 -5369367 405539 4407042 2165069 -1594238
10565a594238J402368M035429m50099l664346N53199M570498Q73860m206922k624947
$$ -1594238 -191870 3843559 3393460 -270886 282313 4852811 5726671 1519749 -1105198
10556a105198R08592l96363j625438K802213N758664L91010m968067j252265L620409
$$ -1105198 -196606 -592969 -2218407 583806 6342470 6733480 1765413 513148 4133557
10547D133557q87533p668124n147478J038972k6514k787544K603877Q152266J947029
$$ 4133557 3246024 -4422100 -9569578 -8530606 -8557120 -11344664 -8740787 -588521 1358508
10538A358508p029919l455268N693274L871494m079171k255199M985369K394542
$$ 1358508 -5671411 -9126679 -3433405 438089 -3641082 -5896281 -910912 1483630
10530A483630m754940q21676P278371J627279r876880m981336J0594814J1005313
$$ 1483630 -3271310 -4092986 3185385 4812664 -5064216 -10045552 549262 11554575
10522A1554575l442212p936162R51407K359013o064444m768008O618495P387641
$$ 11554575 8112363 176201 1127608 3486621 -2577823 -7345831 -727336 6660305
10514F660305k574606k283923P064547L367440r937948o893629R098806Q197395
$$ 6660305 4085699 1801776 8866323 12233763 2295815 -4597814 4500992 12698387
10506A2698387p962542p535941Q120456M482532j5924993j2230449J4888516J7701407
$$ 12698387 4735845 -2800096 5320360 9802892 -6122101 -18352550 -3464034 14237373
10498A4237373q184996j1534553J4276937J2943556k0961686j7415151L1559239
$$ 14237373 6052377 -5482176 8794761 21738317 776631 -16638520 14920719
10491A4920719L2791395l2250453k6462774J22968651K43910665J33611737j21370195
$$ 14920719 47712114 15461661 -11001113 111967538 355878203 489489940 368119745
10484C68119745k38322498j26898867J7089643K5553979l3182219k9887634J5803034
$$ 368119745 129797247 2898380 19988023 45542002 12359783 -17527851 -1724817
10477a724817J6359025j6731537j4960214J4546025J4798890j0277536j1740918
$$ -1724817 14634208 -2097329 -17057543 -2511518 12287372 2009836 -9731082
10470i731082R472973J1472091o668125r298373M844612M985234r030194q331894
$$ -9731082 -258109 11213982 4545857 -4752516 92096 5077330 -3952864 -12284758
10462a2284758P589404J0647365k843172q575337q33915K218479k385483M99553
$$ -12284758 -4695354 5952011 3108839 -5466498 -6300413 -4081934 -6467417 -5967864
10454e967864R394451O970148n022326p041284K381574N246264j729943l356814
$$ -5967864 3426587 10396735 5374409 -1666875 714699 5960963 4231020 874206
10446H74206L098383L714723l530708m603490L254026O410149O60127k203075
$$ 874206 3972589 7687312 4156604 -446886 2807140 9217289 9877416 7674341
10438G674341K216730L413286l174255p782818m157122J181253K089485Q52062
$$ 7674341 9891071 13304357 10130102 2347284 -1809838 -628585 1460900 2312962
10430B312962n7657j717742k739512n87433J584370l08504k509561M0446L153943
$$ 2312962 2255305 537563 -2201949 -2789382 -1205012 -1513516 -4023077 -3982631 -828688
10421h28688R79247j868161J256740N057444J326899m545292k185016M368571
$$ -828688 150559 -1717602 -460862 4596582 5923481 1378189 -806827 3561744
10413C561744L194692l974105m803758J711067M418359K14873k223221N68190
$$ 3561744 6756436 2782331 -2021427 -310360 4107999 4322872 2099651 2667841
10405B667841K151174j47914j355955q5646n51055k436728j031689K302514J749300
$$ 2667841 4819015 4671101 3315146 3229500 2678445 241717 -789972 1512542 3261842
10396C261842j356482n75123K990134K576097r24486o84957K064204k39605o032722
$$ 3261842 1905360 1330237 4320371 6896468 5971982 5287025 7351229 7111624 1078902
10387A078902n501761J973905N762239J760376j750745M50498K524307k61139
$$ 1078902 -4422859 -2448954 3313285 5073661 3322916 3773414 6297721 6036582
10379F036582l389395k685142j629974l313866l991114m22180L682434L778512
$$ 6036582 2647187 -37955 -1667929 -4981795 -8972909 -9395089 -5712655 -1934143
10371a934143J143208p32496j274660j115092J99051K288271L433899L196163
$$ -1934143 -790935 -1523431 -2798091 -3913183 -3714132 -1425861 2008038 5204201
10363E204201K316298M76407k199120l050736n84579K036180J698631J91780m58703
$$ 5204201 7520499 7996906 5797786 2747050 2162471 4198651 5897282 6089062 5630359
10354E630359k447511n761800l865128N320939J0894335L224429q864024r271149
$$ 5630359 3182848 -2578952 -6444080 -1123141 9771194 12995623 4131599 -5139550
10346e139550P34675N062141j091445n001110R66054P254075M162899l048541
$$ -5139550 -4404875 657266 -434179 -5435289 -4469235 2784840 6947739 3899198
10338C899198m561859p38741K029749J941026O31927j865526m558704l828425
$$ 3899198 -662661 -1401402 628347 2569373 3201300 1335774 -3222930 -7051355
10330g051355M31312K992775J917914K085308N598521O514267J066128m476653
$$ -7051355 -6620043 -3627268 -1709354 375954 5974475 12488742 13554870 9078217
10322I078217l523846j09320j631445n784737m200199L543293Q722635O026306
$$ 9078217 5554371 5445051 3813606 -1971131 -6171330 -2628037 6094598 12120904
10314A2120904k56662l587005k778341o44506N15128J24062j260828k279232j934002
$$ 12120904 11864242 8277237 5498896 4854390 5369518 5493580 4232752 1953520 19518
10305A9518p99014K8919O41030J557653K139302J651567J151385J983583K722673
$$ 19518 -779496 -750577 -109547 1448106 3587408 5238975 6390360 8373943 11096616
10296A1096616L72010m691538p630903m941428M89164K863815J156430j81787
$$ 11096616 11468626 6777088 -853815 -5795243 -5306079 -2442264 -1285834 -1467621
10288a467621J419158K746286O16512k277309j545231J581802K338289K25231
$$ -1467621 -48463 2697823 3314335 1037026 -508205 1073597 3411886 3637117
10280C637117j099384r52682k082613l707832j325758M720452P640453M194314
$$ 3637117 2537733 1585051 -497562 -4205394 -5531152 -810700 6829753 11024067
10272A1024067m08360j250079o52010j859534k433583K20453K518179M58792l026993
$$ 11024067 10615707 9365628 8713618 6854084 4420501 4640954 7159133 7617925 4590932
10263D590932l085209j054524r38460j804780o81989O84110o76673k094411L09260
$$ 4590932 1505723 451199 -487261 -2292041 -2974030 -2289920 -2966593 -5061004 -4751744
10254d751744L274678R16521m520259n265487m51346K839980J124419j244797
$$ -4751744 -1477066 -560545 -5080804 -10346291 -10797637 -7957657 -6833238 -8078035
10246h078035n09912J436230K217346K572198K863501J750912j1994K18682J716473
$$ -8078035 -8587947 -7151717 -4934371 -2362173 501328 2252240 2240246 2458928 4175401
10237D175401O98439k862471m263242j551157J378251J260591J00725Q13050K453267
$$ 4175401 4873840 2011369 -2251873 -3803030 -2424779 -1164188 -1063463 -250413 2202854
10228B202854K548938R94669p19566j728183j652138m28993P67808N36994n05940
$$ 2202854 4751792 5746461 5026895 3298712 1646574 1217581 1985389 2522383 2016443
10219B016443p21669l99358r91366j885809j163846P78373J791915J819055K469566
$$ 2016443 1294774 895416 -95950 -1981759 -3145605 -2367232 -575317 1243738 3713304
10210C713304L031732J127191k343752l303282o50572J705860O26968j938793
$$ 3713304 6745036 7872227 5528475 2225193 1574621 3280481 3907449 1968656
10202A968656k490141j003326P660l35432m63107Q20726K418637K257592M0473
$$ 1968656 -521485 -1524811 -1517151 -1852583 -2315690 -1494964 923673 3181265 3221738
10193C221738j971680j555155N03162J355404j14003k242229l362084l346587
$$ 3221738 1250058 -305097 198065 1553469 1439466 -802763 -4164847 -7511434
10185g511434k185424K18744K360089K291992J006195J190196K245911J027943
$$ -7511434 -9696858 -9478114 -7118025 -4826033 -3819838 -2629642 -383731 644212
10177F44212j683988j083146L310992N289101J328223l477547l249209J78574
$$ 644212 -1039776 -2122922 1188070 6477171 7805394 4327847 1078638 1257212
10169A257212J593272N36573k85692o17378j219438n18276J979974K564256r88370
$$ 1257212 2850484 3387057 3101365 2483987 1264549 746273 2726247 5290503 4302133
10160D302133m263243k457265J748046K601611L51869m66070P85343P63892j456946
$$ 4302133 38890 -2418375 -670329 1931282 2283151 1817081 2602424 3366316 1909370
10151A909370l484589l718822k071941J264138M201010L319126m32489j340613
$$ 1909370 -1575219 -5294041 -7365982 -6101844 -1900834 1418292 985803 -354810
10143c54810J832390K454661k872703p087024l772646J815805J888722n83101
$$ -354810 1477580 3932241 1059538 -6027486 -9800132 -7984327 -6095605 -6678706
10135f678706J531399N527212L709226k078084l632441j099796j281063l315384
$$ -6678706 -5147307 379905 4089131 2011047 -1621394 -2721190 -4002253 -7317637
10127g317637q6599O614703O877134j5207l420629M36061K187683l629341q519895
$$ -7317637 -7404236 -789533 6087601 6072394 2651765 3087826 5275509 1646168 -6873727
10118f873727m370673L308001N080686J852871N98794K267617K572193P09690
$$ -6873727 -11244400 -7936399 -2855713 -1002842 -404048 1863569 4435762 5145452
10110E145452k38103O81996J552789J329004M04575j071021k757848l529490k918403
$$ 5145452 4907349 5589345 7142134 8471138 8875713 7804692 5046844 1517354 -1401049
10101a401049j581193O2373J605129J678715m5855j144035l0510P64729r73150
$$ -1401049 -2982242 -2919869 -1314740 363975 318120 -825915 -856425 -91696 -1064846
10092a064846k192229N97657M497841M692356K753433K887630K913136j790413
$$ -1064846 -3257075 -2659418 1838423 6530779 9284212 12171842 15084978 13294565
10084A3294565p569589o374761L94114L102903m85665k313189J311026L844630
$$ 13294565 5724976 -649785 -255671 2847232 2361567 48378 1359404 5204034
10076E204034J027146j734034L30329L244124K215121n85248j799494k979343
$$ 5204034 6231180 4497146 4827475 8071599 10286720 9701472 7901978 4922635
10068D922635n342348n242354n20104M359254M559789J312143j739992l455533
$$ 4922635 -419713 -5662067 -6182171 -1822917 2736872 4049015 2309023 -1146510
10060a146510l361174o41801K150800N37219m008233m326530J418783O250338
$$ -1146510 -4507684 -5149485 -2998685 -2461466 -6469699 -10796229 -9377446 -3127108
10052c127108N153600J745659L99501m10661k306092k289561Q02394K252610n39933
$$ -3127108 2026492 3772151 4171652 3760991 1454899 -834662 -32268 2220342 1680409
10043A680409k718612l08324K658454J422476j274881p00850J665483K013968
$$ 1680409 -1038203 -1346527 1311927 2734403 1459522 758672 2424155 4438123
10035D438123J394565K468268L304445Q66253k739710l412656j605630o00077
$$ 4438123 5832688 8300956 11605401 12471654 9731944 6319288 4713658 4113581
10027D113581r15544r22012m65064j14630O03538J333615L15816k081253k987644
$$ 4113581 3198037 2276025 1810961 1696331 2299869 3633484 3949300 1868047 -1119597
10018a119597j949996j640699k172946m69044K861113K793771j257924l127481
$$ -1119597 -3069593 -4710292 -6883238 -7352282 -4491169 -1697398 -2955322 -6082803
10010f082803k562K634772O75873j496180P83663L960783K532111j658344k922581
$$ -6082803 -6085365 -3450593 -2774720 -4270900 -3487237 473546 3005657 1347313 -1575268
10001a575268l61131K528746L190662P29109m481810q425204n832745J653362
$$ -1575268 -1936399 592347 3783009 4512118 30308 -8394896 -14227641 -12574279
9993a2574279N631062K725504n91498J064714L940079L183696J128974J224554
$$ -12574279 -6943217 -4217713 -4809211 -3744497 195582 3379278 4508252 5732806
9985E732806R80729k080657m135408j889921O08973p67934k423730l9899K816262
$$ 5732806 6713535 4632878 497470 -1392451 -783478 -1551412 -3975142 -4015041 -1198779
9976a198779J268282j441533J97680L677350K891850j318652l610347l380914
$$ -1198779 69503 -1372030 -1174350 2503000 5394850 4076198 465851 -2915063
9968b915063l301161k205059K195214O551791N930105K043747Q5778J76560q22791
$$ -2915063 -6216224 -8421283 -6226069 325722 6255827 8299574 8385352 8561912 7739121
9959G739121k022928m91934K132024K126562K50656o70860j573702l976143m630178
$$ 7739121 5716193 5224259 7356283 9482845 9733501 9062641 7488939 3512796 -1117382
9950a117382n44765M153430L880501P88843N80419K332046P55067l810794n900193
$$ -1117382 -1662147 2491283 6371784 7160627 7741046 10073092 10828159 7017365 1117172
9941A117172l887082j032494R95479K807414L061746J10812l510803m027457k102825
$$ 1117172 -2769910 -3802404 -2806925 489 3062235 3173047 -337756 -4365213 -6468038
9932f468038n46007Q84442L265704M540815L099852J544065J747471R12277k086982
$$ -6468038 -7014045 -6129603 -2863899 1676916 4776768 6320833 8068304 8980581 6893599
9923F893599k464813J856597M167898m34788n233429k292345L706857L173166
$$ 6893599 4428786 6285383 10453281 10018493 4785064 2492719 6199576 9372742
9915I372742k128478k802342J782914L484297Q702k599103j722715j228119k209585
$$ 9372742 7244264 4441922 6224836 9709133 9717835 7118732 5396017 4167898 1958313
9906A958313q38604L190734M680948J054521m055318o065336l460954K306738
$$ 1958313 1119709 4310443 8991391 10045912 5990594 -74742 -3535696 -1228958
9898a228958O695257M737221k030798n759511l295271l01324j02605K042462P307832
$$ -1228958 5466299 10203520 8172722 2413211 -882060 -1183384 -1285989 756473 8064305
9889H064305P527112j04864n048588j039748J959821l404131o417947J629901
$$ 8064305 15591417 15486553 10437965 9398217 11358038 7953907 1535960 3165861
9881C165861Q297419J868119m490414L623047J1248823P3885j1040496N474769
$$ 3165861 11463280 13331399 8840985 12464032 23712855 23786740 12746244 18221013
9873A8221013K6796513K744224n7643719q0222414k8692971L8364365M8672731
$$ 18221013 45017526 47761750 -9881969 -90104383 -118797354 -80432989 -31760258
9866c1760258J1908899j0405175J183376J2946846N142551l090661K610151P901218
$$ -31760258 -19851359 -30256534 -29073158 -16126312 -10983761 -14074422 -11464271 -3563053
9858c563053P15021p097656l106511M977239N216499m3882l025623l649384m280739
$$ -3563053 -2848032 -9945688 -13052199 -8074960 -2858461 -2902343 -5927966 -9577350 -13858089
9849a3858089k997243J41050J61425l308531l084291L572566R099177P257851
$$ -13858089 -16855332 -16714282 -16552857 -19861388 -22945679 -19373113 -10273936 -3016085
9841c016085K324413R98192K275978J268134k293066m796816m430328k039173
$$ -3016085 -691672 306520 2582498 3850632 1557566 -3239250 -7669578 -9708751
9833i708751J108077L603602L861012J545222j916895m218108k952978K204464
$$ -9708751 -8600674 -4997072 -1136060 409162 -1507733 -5725841 -8678819 -6474355
9825f474355O646552M146180l960845p811985k040094N354588L883888m070436
$$ -6474355 172197 4318377 357532 -7454453 -9494547 -4139959 -256071 -4326507
9817d326507p119048j384259N656683O918265L102793j779361n031199m765351
$$ -4326507 -11445555 -12829814 -7173131 -254866 2847927 1068566 -3962633 -8727984
9809h727984r05802K768449K537338J18831n65354J497p60310j276813R88329
$$ -8727984 -9633786 -6865337 -4327999 -4209168 -4774522 -4773025 -5533335 -6810148 -5821819
9800e821819K548462j387611o772468m883761L452255P824191L959445m73796
$$ -5821819 -3273357 -4660968 -11433436 -16317197 -12864942 -5040751 -1081306 -1555102
9792a555102R71328L941036J987734k820489m199395j285353J762903K271071
$$ -1555102 -583774 3357262 5344996 2524507 -1674888 -2960241 -1197338 1073733
9784A073733P04287j336860j625279J160211M200021K730602k417655m397505
$$ 1073733 1778020 441160 -1184119 -23908 4176113 6906715 4489060 91555
9776I1555m00573L318334Q44448m152424m518790r17533K12912k121765k162431
$$ 91555 -309018 3009316 3853764 -298660 -4817450 -5734983 -5522071 -7643836 -9806267
9767i806267K301605N638697L114925j754662k750431j9067J348587j50156p45389
$$ -9806267 -7504662 -1865965 1248960 -505702 -3256133 -3275200 -1926613 -2076769 -2822158
9758b822158J519817L129570Q81648k542294k498626N21419K042252O84309o57669
$$ -2822158 -1302341 1827229 2708877 166583 -2332043 -1810624 231628 915937 258268
9749B58268p26562j852248m430981m424276M00370N596812N556089J359739j252501
$$ 258268 -468294 -2320542 -6751523 -11175799 -10775429 -5178617 377472 1737211 484710
9740D84710k89975O31595j291288l850167l333089L13090L479341L160055K32150
$$ 484710 194735 826330 -464958 -4315125 -7648214 -7335124 -3855783 -695728 -463578
9731d63578j650985l82276K095187K617389J169181J61800J4233j105274k924404
$$ -463578 -2114563 -2496839 -401652 2215737 3384918 3546718 3560951 2455677 -468727
9722d68727k595212J13875J414355m93874k161052o12839J619179R62982j142365
$$ -468727 -3063939 -2950064 -1535709 -2029583 -4190635 -4803474 -3184295 -2221313 -3363678
9713c363678j011513J150151K321821J787814R25554k00678j789640j765612J158566
$$ -3363678 -4375191 -3225040 -903219 884595 1810149 1609471 -180169 -1945781 -787215
9704g87215L585434J532371k829741l783300p74230R85920j059402l212938j888194
$$ -787215 2798219 4330590 1500849 -2282451 -3056681 -2070761 -3130163 -6343101 -8231295
9695h231295R97162J421267j037260l291006k801954Q8784K886659L277702J493451
$$ -8231295 -7234133 -5812866 -6850126 -10141132 -12943086 -12854302 -9967643 -6689941 -5196490
9686e196490K12796J232448L052063L049314Q92733j869290m204434n405043l932339
$$ -5196490 -4983694 -3751246 -699183 2350131 3242864 1373574 -2830860 -8235903 -12168242
9677a2168242O72736N419530O248790K791883j341278k902049j862781k08679
$$ -12168242 -11495506 -6075976 172814 2964697 1623419 -1278630 -3141411 -3350090
9669c350090M59830P3828k73998K8297M6467r14285j184222R49436L321490K276147
$$ -3350090 -2890260 -2816432 -3090430 -3062133 -3015666 -3929951 -5114173 -4164737 -843247 1432900
9659A432900r18206j191937J728731K099814j889912l940482j30090L237660p07286
$$ 1432900 514694 -677243 1051488 3151302 1261390 -2679092 -2809182 428478 -278808
9650b78808p346000o830540Q85875O367467M776975Q68910m92893o98918k171153
$$ -278808 -7624808 -14455348 -13569473 -7202006 -2425031 -1556121 -2049014 -2747932 -4919085
9641d919085l286342j653800J634429L578963K805352M98730o24824J202170L900882
$$ -4919085 -8205427 -9859227 -8224798 -4645835 -1840483 -1341753 -1966577 -764407 3136475
9632C136475L175655j085522l554363j548419K77660k058726m282693r41755M395606
$$ 3136475 6312130 5226608 1672245 123826 401486 -1657240 -5939933 -6881688 -2486082
9623b486082M199296r45423m001966k868514j105627P43253M748764P678544M025794
$$ -2486082 1713214 767791 -3234175 -6102689 -7208316 -6465063 -1716299 5962245 9988039
9614I988039k988778m149803J066736L487147k94057k984316m35192J302033j945331
$$ 9988039 6999261 2849458 3916194 7403341 7109284 4124968 3689776 4991809 3046478
9605C046478m277711n98154L742470K074438k571242l600048j547428p81290j011801
$$ 3046478 -1231233 -1829387 1913083 3987521 1416279 -2183769 -3731197 -4512487 -5524288
9596e524288K97064J660429P58011l06098O97498J001834j676372l318010j56858
$$ -5524288 -5227224 -3566795 -2808784 -3114882 -2417384 -1415550 -3091922 -6409932 -6566790
9587f566790L553563J902008k531843k926624N53374K122905P92661R45563L347933
$$ -6566790 -3013227 -1111219 -3643062 -6569686 -6016312 -3893407 -3100746 -2155183 1192750
9578A192750L630444K50048k860222k746155j075389j62580K93910J407162L002718
$$ 1192750 4823194 5073242 2213020 -533135 -1608524 -1771104 -1477194 -70032 2932686
9569B932686L714700J668609l341160p029951l854276M190462P175580M45365
$$ 2932686 6647386 8315995 4974835 -2055116 -5909392 -1718930 5456650 5902015
9561E902015p191677n437041K109790L692346k404996o115154k090313K793334
$$ 5902015 -1289662 -6726703 -4616913 -924567 -3329563 -9444717 -11535030 -8741696
9553h741696J641468j828342m44807M797242O716072K668951k276808k630172
$$ -8741696 -7100228 -8928570 -9373377 -4576135 2139937 4808888 2532080 -98092
9545i8092P17594K320763l75482l396139j710736K840490L227954k227901o285800
$$ -98092 619502 2940265 2564783 -831356 -2542092 298398 3526352 1298451 -4987349
9536d987349l149010K724920L571798j90062k251530j121890o80781j509823N9445
$$ -4987349 -8136359 -5411439 -1839641 -2029703 -4281233 -5403123 -6083904 -7593727 -7534282
9527g534282L920269M945972J437729j756277p66565K092002K794203P65101k136303
$$ -7534282 -3614013 1331959 2769688 1013411 246846 2338848 5133051 5898152 3761849
9518C761849l886469k631591J412427M224065K282880j855939l048609j565328
$$ 3761849 -124620 -2756211 -1343784 2880281 5163161 3307222 258613 -1306715
9510a306715j606696k808247p31731L985389N180853J417245j404855o9331J299173
$$ -1306715 -2913411 -5721658 -6453389 -2468000 2712853 4130098 2725243 2655912 3955085
9501C955085l42633j861593j117327j371603l920805l975472O99117M333825K409397
$$ 3955085 3612452 1750859 633532 -738071 -4658876 -8634348 -7935231 -3601406 -1192009
9492a192009o21266M58710K534878R42436j054987J566156N274405L470568j828107
$$ -1192009 -1813275 -1354565 1180313 2122749 1067762 2633918 7908323 11378891 9550784
9483I550784l726606k574548l816325o056394k781355M403086N993290j70375
$$ 9550784 5824178 3249630 -566695 -6623089 -9404444 -5001358 991932 821557
9475H21557m850468j958349K927474L241948J367426J697806J712211k324314
$$ 821557 -4028911 -5987260 -3059786 182162 1549588 3247394 4959605 2635291
9467B635291o510185m523968J641928M187369J355371o29338K063858M927702
$$ 2635291 -3874894 -8398862 -6756934 -2569565 -1214194 -1843532 220326 5148028
9459E148028J969458n532760j0169895o868329J698319P924699O790214N04395
$$ 5148028 7117486 1584726 -8585169 -15453498 -13755179 -5830480 959734 1464129
9451A464129m315433l674118M76603L622039L608874J607780j33796k88438P88002
$$ 1464129 -2851304 -6525422 -6048819 -2426780 1182094 2789874 2656078 2367640 3155642
9442C155642J350120Q7964j909342k145207n4796K133120K514734J847241J708751
$$ 3155642 4505762 4593726 2684384 539177 484381 2617501 5132235 6979476 8688227
9433H688227J839788Q52016j275723k869300k517706n67412J187575J103863n72307
$$ 8688227 10528015 11380031 10104308 7235008 4717302 4149890 5337465 6441328 5869021
9424E869021j668297n78078J506122K053055N07146j521454l018684m192998m341609
$$ 5869021 4200724 3622646 5128768 7181823 7688969 6167515 3148831 -1044167 -5385776
9415e385776k102659J256129K033599m64840j697859J898818O845396O725483
$$ -5385776 -7488435 -6232306 -4198707 -4663547 -6361406 -4462588 2382808 9108291
9407I108291J191127l524241l291762r31501p36241j991419j133369J974110L763795
$$ 9108291 10299418 6775177 3483415 2551914 1815673 -175746 -1309115 664995 4428790
9398D428790K352264k54052j740729k259222k551122k018699m81483L22090p20682
$$ 4428790 6781054 6527002 4786273 2527051 -24071 -2042770 -2524253 -2202163 -2922845
9389b922845j715684m86619J697594K099387J126100J365234K544403J710752
$$ -2922845 -4638529 -5125148 -3427554 -1328167 -202067 1163167 3707570 5418322
9381E418322j117175k007730O45944L233123K481656j55743k262286m279292o113152
$$ 5418322 4301147 2293417 2939361 6172484 8654140 8498397 6236111 1956819 -4156333
9372d156333m414549J864406O986068N370325J47022j623105R4729m05823l554893
$$ -4156333 -8570882 -6706476 279592 5649917 5796939 4173834 4268563 3862740 307847
9363C07847l287821K133320O194908L889140j338697l830277l154713j758200
$$ 307847 -2979974 -846654 5348254 9237394 7898697 4068420 913707 -844493
9355h44493l91902L95938j046746l616923k936775J629183M414380K106397m03381
$$ -844493 -1236395 -840457 -1887203 -5504126 -8440901 -6811718 -2397338 -290941 -694322
9346f94322J753115M579693J743342m000769m306225J595139N601315K861685
$$ -694322 1058793 5638486 7381828 3381059 -925166 669973 6271288 9132973
9338I132973k281424m019303k407532n53820N15170J297402J481387N87229j042360
$$ 9132973 6851549 2832246 424714 -129106 386064 1683466 3164853 3752082 2709722
9329B709722k896158m116427k976644P54025L593979K132804j384956j587945
$$ 2709722 -186436 -4302863 -7279507 -6525482 -2931503 -798699 -2183655 -3771600
9321c771600J792645L182000j23641l512619j948324K755335M941546K704907
$$ -3771600 -1978955 1203045 1079404 -2433215 -4381539 -1626204 3315342 6020249
9313F020249q66378k527156k081229j205725r13280m49963J351215L373905K324566
$$ 6020249 5153871 2626715 545486 -660239 -1573519 -2023482 -672267 2701638 5026204
9304E026204k563354o622705m990100L73827L275211K281009J650936K910237
$$ 5026204 2462850 -4159855 -9149955 -8776128 -5500917 -3219908 -1568972 1341265
9296A341265K090461k196214m479288p22968M419101M282726J86707j481259M78473
$$ 1341265 3431726 1235512 -3243776 -3966744 452357 4735083 4921790 3440531 3919004
9287C919004J389142p77723k642591j738880j58855l85519j590532j768241o40476
$$ 3919004 5308146 4530423 1887832 148952 -9903 -395422 -1985954 -3754195 -4394671
9278d394671Q16093J586171R04764p11052j115319M84349J325086r05956l242148
$$ -4394671 -3578578 -1992407 -1087643 -1798695 -2914014 -2429665 -1104579 -2010535 -5252683
9269e252683j157035L665638M878362J127493j995805j198929j10103j613676
$$ -5252683 -6409718 -2744080 2134282 3261775 1265970 67041 -43062 -1656738
9261a656738k212568J018153L757043J273643k728135j838254J840646J086536
$$ -1656738 -3869306 -2851153 905890 2179533 -548602 -2386856 -546210 540326
9253E40326l470664l671858K072674N116119N58497m350742j776867M283176M905372
$$ 540326 -2930338 -6602196 -4529522 586597 1145094 -3205648 -4982515 -699339 4206033
9244D206033J99777k387167p05538K42119j565753j869376J376941L559736P39235
$$ 4206033 4405810 2018643 1313105 1555224 -10529 -1879905 -502964 3056772 3796007
9235C796007l963768n058325k065915J261607K476136K016203J011024K66839
$$ 3796007 -167761 -5226086 -7292001 -6030394 -3554258 -1538055 -527031 -260192
9227b60192N19960J680678K283465Q88180k222265n012091m979632j202523L815633
$$ -260192 259768 1940446 4223911 5112091 2889826 -2122265 -7101897 -8304420 -4488787
9218d488787N572875K640695j157982j870905n61822j02638L59716K600076L489984
$$ -4488787 1084088 3724783 2566801 695896 134074 31436 391152 2991228 6481212
9209F481212q80735o411556m851972K909640O703329K651654r88068J810608M640117
$$ 6481212 5600477 -811079 -5663051 -2753411 3949918 6601572 5613504 7424112 12064229
9200A2064229K49228o439923o541947j725326J71185r27904O88080L803874J829046
$$ 12064229 12313457 5873534 -668413 -2393739 -2222554 -3150458 -2462378 1341496 3170542
9191C170542l865701m447036J283967L982209r17003n770309l518569J545310
$$ 3170542 -695159 -5142195 -3858228 123981 -793022 -6563331 -10081900 -8536590
9183h536590K146511m61054n98219J716142K146167K40884m01585J402829L037361
$$ -8536590 -6390079 -6851133 -7449352 -5733210 -3587043 -3346159 -3747744 -2344915 692446
9174F92446K451304J91093k272121l613595k972481j113863r2105m92703o88880
$$ 692446 3143750 3334843 1062722 -2550873 -5523354 -6637217 -6729322 -7222025 -7910905
9165g910905K74737J327940J710839J936642J586922o55733l656876l970806q43560
$$ -7910905 -7636168 -6308228 -4597389 -2660747 -1073825 -1729558 -5386434 -9357240 -10200800
9156a0200800K251768K600664J382421L78166o76713j644749p94475J690046K672339
$$ -10200800 -7949032 -5348368 -3965947 -3587781 -4264494 -5909243 -6703718 -5013672 -2341333
9147b341333Q84852p57047L7609J504778J640108J561735K237618J725511j012257
$$ -2341333 -1456481 -2213528 -2175919 -671141 968967 2530702 4768320 6493831 5481574
9138E481574l037740j677535J181282K242211J271121n00312l005100n116073
$$ 5481574 2443834 766299 1947581 4189792 5460913 4960601 1955501 -3160572
9130c160572l452084K584937P650483O442661L91630n089407p174957o029763
$$ -3160572 -6612656 -4027719 3622764 10065425 10457055 5367648 -1807309 -7837072
9122g837072k130259K556697L897285P36851k054869k98121K692790J288319l106826
$$ -7837072 -9967331 -7410634 -3513349 -2776498 -4831367 -5129488 -2436698 -1148379 -4255205
9113d255205l984942L50025M729187M720695J282053k237351l581663k106371
$$ -4255205 -8240147 -7890122 -3160935 1559760 2841813 604462 -2977201 -5083572
9105e083572P54834J939511M03705j072771m03142J00448j840107l496401j549396
$$ -5083572 -4328738 -2389227 -1985522 -3058293 -3461435 -3360987 -5201094 -8697495 -10246891
9096a0246891J355143M56574k715042k322674K349756N948146N368622K903033
$$ -10246891 -8891748 -8435174 -11150216 -13472890 -11123134 -5174988 193634 3096667
9088C096667Q50985j105503k539835j821845K00446J021714J181311K898016M227552
$$ 3096667 3947652 2842149 302314 -1519531 -1319085 -297371 883940 3781956 8009508
9079H009508R43752n208241p059651k506640K248537K312895L57212J48678L81669
$$ 8009508 8953260 3745019 -3314632 -5821272 -3572735 -1259840 -902628 -753950 -372281
9070c72281p62713q08391J984392L617457K78310m337457l773470J434829M754361
$$ -372281 -1134994 -1943385 41007 3658464 3936774 -400683 -4174153 -2739324 2015037
9061B015037L192513J72593q91729o49744o78594p63566p28550j370175j944547
$$ 2015037 5207550 5380143 4488414 3838670 3160076 2396510 1667960 297785 -1646762
9052a646762j785M088693N410592O04392o106849p071515j219239M215074L252175
$$ -1646762 -1648547 2440146 7850738 8455130 2348281 -4723234 -5942473 -1727399 1524776
9043A524776j503672l781427k272934r0478J605117L672366M122166O9474n150744
$$ 1524776 21104 -3760323 -6033257 -6123735 -4518618 -846252 3275914 3345388 -1805356
9034a805356m243559K659977O453678K447465k432452j244543J757876p30779
$$ -1805356 -6048915 -3388938 3064740 5512205 3079753 1835210 3593086 2862307
9026B862307o050844o339700k026659r7475j278828J68647M468666N141875J087813
$$ 2862307 -3188537 -9528237 -11554896 -11652371 -12931199 -12762552 -8293886 -3152011 -2064198
9017b064198o73195K747046M850846J048046l504153k857309K13610k9659k536669
$$ -2064198 -2737393 9653 4860499 5908545 2404392 -452917 -239307 -268966 -2805635
9008b805635k025236K213373N777986N399557J622476k958765n214924l224903
$$ -2805635 -4830871 -2617498 3160488 8560045 10182521 7223756 2008832 -1216071
9000a216071J278936M203741L960670K399769O98719j602444l154967j607731
$$ -1216071 62865 4266606 8227276 10627045 11325764 9723320 6568353 4960622
8992D960622J212747P22614k482376k648243J185857K649910j237188m498878
$$ 4960622 6173369 6895983 4413607 1765364 2951221 5601131 4363943 -134935
8984a34935k186696J396075O22623j879896q54628J835183J108008j714321j401029
$$ -134935 -2321631 -925556 -302933 -2182829 -3037457 -1202274 -94266 -1808587 -3209616
8975c209616J669768K321602m89655k497186j164500J815713M178075M429120
$$ -3209616 -1539848 781754 292099 -2205087 -3369587 -1553874 2624201 7053321
8967G053321J238523l817608n352251j060583L477537K538772p85022l04912K223600
$$ 7053321 8291844 4474236 -878015 -1938598 1538939 4077711 3292689 2987777 5211377
8958E211377N52253m006562m083099O58783K390749j419365l624504R9527L737529
$$ 5211377 5763630 1757068 -2326031 -1667248 723501 -695864 -4320368 -4220841 -483312
8949d83312J146722l941367m446763p43917J573527P97808j66656K61067R90029
$$ -483312 663410 -3277957 -7724720 -8468637 -6895110 -6097302 -6263958 -6002891 -5012862
8940e012862J409767J676404R61499j200850k895838j976289Q55053L346005M592174
$$ -5012862 -3603095 -1926691 -965192 -2166042 -5061880 -7038169 -6183116 -2837111 1755063
8931A755063M520112K394781j534432m514344m216527k035513q77438p62801N32320
$$ 1755063 6275175 8669956 7135524 2621180 -1595347 -3630860 -4508298 -5271099 -4738779
8922d738779L061446L904412J216606k999211m944856k836173J592565M673754
$$ -4738779 -1677333 2227079 3443685 444474 -4500382 -7336555 -5743990 -1070236
8914a070236L970595N27957k119047j552421J195255L032400J886392j703228
$$ -1070236 2900359 3428316 1309269 -243152 952103 3984503 5870895 4167667
8906D167667n071452n232135j426926L463320N129939K293335j854820l320695
$$ 4167667 -903785 -6135920 -7562846 -4099526 1030413 3323748 1468928 -1851767
8898a851767j485213J167103K439451K197165J230167j05184j587625k362360
$$ -1851767 -3336980 -2169877 269574 2466739 3696906 3591722 2004097 -358263
8890c58263j525991L65803J266508O4378j411386l40446K985826M936079L290621
$$ -358263 -1884254 -1518451 -251943 -187565 -1598951 -1939397 1046429 5982508 9273129
8881I273129J43434j527644j965234k725981k742441k14686K596022J311316l239855
$$ 9273129 9416563 7888919 5923685 3197704 455263 240577 2836599 4147915 908060
8872I08060m618949L5859M887128L316851k325314m071713q2275K750256q19176
$$ 908060 -3710889 -3675030 1212098 4528949 2203635 -1868078 -1950353 799903 -19273
8863a9273o392207n903072J130016O858209N499581M42687j066053K266158M657065
$$ -19273 -6411480 -12314552 -11184536 -4326327 1173254 1615941 549888 2816046 7473111
8854G473111J516514m476812p021176l840500J393096L831405K135809j329834
$$ 7473111 8989625 4512813 -2508363 -6348863 -4955767 -1124362 1011447 -318387
8846c18387l199249j777704J652655L892318L086519Q47538P9882J027700J162590
$$ -318387 -3517636 -5295340 -3642685 249633 3336152 4183690 4263572 5291272 6453862
8837F453862q52598l063774l081666j461921o47416j331917j600133K00567L000288
$$ 6453862 5601264 2537490 -544176 -2006097 -2653513 -3985430 -5585563 -5384996 -2384708
8828b384708M101455K298978o68304j857302o4757L116448M939061L793098R0639
$$ -2384708 1716747 4015725 3347421 1490119 1425362 4541810 9480871 13273969 13364608
8819A3364608m171546o384818m984285j225866J352172N49159j765828j966827
$$ 13364608 9193062 2808244 -2176041 -3401907 -2049735 -1500576 -3266404 -5233231
8811e233231M64118K213473P64021k091406k656292k1778L208626M223659K518713
$$ -5233231 -4769113 -2555640 -1791619 -3883025 -6539317 -6561095 -3352469 871190 3389903
8802C389903n10935k896380l055274j042433Q61256L75042j496938j231976K160456
$$ 3389903 2878968 -17412 -3072686 -4115119 -3253863 -2878821 -4375759 -5607735 -3447279
8793c447279M895044L242734r97640k786262r29620N45523j349604m267428m191130
$$ -3447279 1447765 4690499 3692859 906597 -23023 522500 -827104 -5094532 -9285662
8784i285662q10826K987162N100316N237966L316361m92071m462064o128738m520983
$$ -9285662 -10096488 -7109326 -2009010 3228956 6545317 6053246 1591182 -4537556 -9058539
8775i058539p03049L218009M974442L576552Q89760j56175J8147k052008o403597
$$ -9058539 -9761588 -6543579 -1569137 2007415 2897175 2741000 2759147 707139 -5696458
8766e696458p550514k501093L178845K833622j000014q41399L247395L980213
$$ -5696458 -13246972 -15748065 -12569220 -9735598 -10735612 -11577011 -8329616 -4349403
8758d349403k95878k292941K039519O608687N072968L92920j305361n32402j561114
$$ -4349403 -4645281 -6938222 -4898703 1709984 6782952 7175872 5870511 5338109 3776995
8749C776995m111851m552421k460007r6513K078650M016892L196527j123577l857593
$$ 3776995 -334856 -4887277 -7347284 -7443797 -5365147 -1348255 1848272 724695 -3132898
8740c132898p52446L842390L225959k62881J039120O356535O624255n52480o424608
$$ -3132898 -3885344 -42954 3183005 2920124 3959244 10315779 16940034 16387554 9962946
8731I962946m995936j682308k564809l720632Q36002P088888O367685o51741m690594
$$ 9962946 4967010 3284702 719893 -3000739 -2164737 4924151 11291836 10640095 5949501
8722E949501j772132K133241J390072j816587k869017j677806p55923n96625n85846
$$ 5949501 4177369 6310610 7700682 5884095 3015078 1337272 581349 -15276 -601122
8713f01122j396012k947350k514143J320074M657546K601334l002457m691022
$$ -601122 -1997134 -4944484 -7458627 -6138553 -1481007 1120327 -1882130 -6573152
8705f573152O70128O990592O511167l14071n707493m344108R40184L688952J600199
$$ -6573152 -5903024 1087568 7598735 7284664 1577171 -2766937 -1826753 1862199 3462398
8696C462398j859300k537102l39230J699893J889993J599268K128554K009594
$$ 3462398 1603098 -934004 -1273234 426659 2316652 3915920 6044474 8054068
8688H054068l93499k983537k177498J016642J479619k013134l949642n22947L518582
$$ 8054068 7660569 4677032 2499534 3516176 4995795 2982661 -966981 -1489928 2028654
8679B028654J738857l473243m058173J272900N085157K550865k186728l416040
$$ 2028654 3767511 294268 -3763905 -2491005 2594152 5145017 2958289 -457751
8671d57751j613490l14526q5902M23491J028845J195975J651544J888238n06913
$$ -457751 -2071241 -2385767 -2471669 -2048178 -1019333 176642 1828186 3716424 3209511
8662C209511n001483o474279k252258K857286L020595l46192j649918K99199K204004
$$ 3209511 -1791972 -8266251 -10518509 -7661223 -4640628 -4986820 -6636738 -6337539 -4133535
8653d133535K746447L360732L553628J130906k869673m436360k276328Q46698
$$ -4133535 -1387088 1973644 5527272 6658178 3788505 -647855 -2924183 -2077485
8645b077485K648195L199804K262845q18924l914058l196024J059951L538361
$$ -2077485 570710 3770514 6033359 5214435 1300377 -1895647 -835696 2702665
8637B702665P62899m010421n063909j446902K346788K167992j142591l339582
$$ 2702665 3465564 -544857 -5608766 -7055668 -4708880 -2540888 -3683479 -7023061
8629g023061k230581j24121J32365j55876K090046N488568N174071Q64355j678908
$$ -7023061 -9253642 -9377763 -9245398 -9401274 -7311228 -1822660 3351411 4215766 2536858
8620B536858K10617J532124j503207m099425q26702M248604L620051j122343k184830
$$ 2536858 2747475 4279599 2776392 -1323033 -2149735 2098869 5718920 4596577 2411747
8611B411747R43928J061626l547251n736530j708294K728467K061349p65433q68852
$$ 2411747 3355675 4417301 870050 -4866480 -6574774 -3846307 -1784958 -2550391 -3419243
8602c419243P45593J174240J604429L601620M206750P37510l215892k635270P62718
$$ -3419243 -2673650 -1499410 105019 3706639 7913389 8650899 5435007 2799737 3562455
8593C562455J170342k160219m219619k275601O17686R30763n74587r18646Q06826
$$ 3562455 4732797 2572578 -1647041 -3922642 -3304956 -2374193 -2948780 -3867426 -3060600
8584c060600K787760K974861J252881n93133q51939L25625J500513J843222J403182
$$ -3060600 -272840 2702021 3954902 3361769 2509830 2835455 4335968 6179190 7582372
8575G582372L8028k187943l814012l262726j315261j79960p7316Q37751K916313
$$ 7582372 7620400 5432457 1618445 -1644281 -2959542 -3139502 -3216818 -2379067 537246
8566E37246L978287K524164k71769k502023l530706l555207k894859j951192n14707
$$ 537246 4515533 7039697 6767928 4265905 735199 -2820008 -5714867 -7666059 -8180766
8557h180766K228565N379177N663719J806200k277237k325278k2671R0631j590928
$$ -8180766 -5952201 -573024 5090695 6896895 4619658 2294380 2271709 2362340 771412
8548G71412p38208K807170M264770J766639j163983k055859k373143k568379m94304
$$ 771412 33204 2840374 7105144 8871783 7707800 5651941 3278798 710419 216115
8539B16115L188949M078072R65909j998712k359432k440689l031528j054385L018842
$$ 216115 3405064 7483136 8449045 6450333 4090901 1650212 -1381316 -2435701 583141
8530E83141K980058k850170o389837j375090O074014O197086Q7969l027643l9245
$$ 583141 3563199 713029 -5676808 -7051898 -977884 5219202 5307171 2279528 2240283
8521B240283L040778J426811k530547m457881l479788j520510n09363p47836m10208
$$ 2240283 5281061 6707872 4177325 -280556 -3760344 -5280854 -5790217 -6538053 -6948261
8512f948261K118047M578858K933885j572868k676282J002021K786190r92874
$$ -6948261 -4830214 -251356 2682529 1109661 -1566621 -564600 2221590 1228716
8504A228716l985883m69483M006253J577622m013326l217005L200309N374809
$$ 1228716 -2757167 -3226650 779603 2357225 -1656101 -4873106 -1672797 3702012
8496C702012L26644m558982m284198j807618L20791L499915O085800L013020m243939
$$ 3702012 4028656 -530326 -4814524 -6622142 -6301351 -2801436 3284364 6297384 2053445
8487B053445o842287j883228K441245k504l689849j382853L992342N143189K270951
$$ 2053445 -4788842 -6672070 -4230825 -4233329 -7923178 -9306031 -5313689 -170500 2100451
8478B100451R08692J778216Q76938k318108l945872k440015k76339Q51961J832378
$$ 2100451 3009143 4787359 5664297 3346189 -599683 -3039698 -3316037 -2464076 -631698
8469f31698K932970K672750L98744k479572l825962k022619K706495O796065N617210
$$ -631698 2301272 4974022 5372766 2893194 -932768 -2955387 -248892 6547173 12164383
8460A2164383n39408n410959m371064k48019J640660J054628J035980J336822
$$ 12164383 11624975 6214016 1842952 1594933 3235593 4290221 5326201 6663023
8452F663023o99227m015058m479989j653601N26422M47023Q06746K439151J654520
$$ 6663023 5963796 1948738 -2531251 -4184852 -3658430 -3211407 -2404661 34490 1689010
8443A689010l184101p016409m390783K425039O239454M429357J182974N31282
$$ 1689010 -1495091 -8511500 -12902283 -10477244 -4237790 191567 1374541 1905823
8435A905823J474220J212624l23037j422682j757622k026090j800063l89624Q00264
$$ 1905823 3380043 4592667 4269630 2846948 1089326 -936764 -2736827 -3126451 -2326187
8426b326187l38286k652597k148427K247739N912999L982636j956738n573823
$$ -2326187 -2664473 -5317070 -7465497 -5217758 695241 4677877 2721139 -2852684
8418b852684l736344K47409J855392R69353N68191J811927K927065K417706J065377
$$ -2852684 -6589028 -6341619 -4486227 -3516874 -2948683 -1136756 1790309 4208015 5273392
8409E273392J99382l71793j532470k802244k562523m42803J709259J924372M09822
$$ 5273392 5472774 5100981 3568511 766267 -1796256 -2239059 -529800 1394572 1804394
8400A804394j116974j774364j986144j917825r52179R84804K814541L457630K647856
$$ 1804394 687420 -1086944 -3073088 -4990913 -5943092 -4958288 -2143747 1313883 3961739
8391C961739N16425k336737m237712l581050j070235P85637Q45322J85904n08177
$$ 3961739 4478164 2141427 -2096285 -5677335 -6747570 -5961933 -5116611 -4930707 -5438884
8382e438884j811818k965222j532062K511629N318039M262353J733704J004434
$$ -5438884 -7250702 -10215924 -11747986 -9236357 -3918318 344035 2077739 3082173
8374C082173J259703M29767N3796K316124M317275J361461m655272o516045k202180
$$ 3082173 4341876 4771643 4825439 7141563 11458838 12820299 8165027 1648982 -553198
8365e53198J997287J012139k041045j768463J349546L009899J976506M37054m83417
$$ -553198 1444089 2456228 415183 -1353280 -3734 3006165 4982671 5419725 4936308
8356D936308j382624j862296q08606J050730J778239J143548N96495P29377Q16593
$$ 4936308 3553684 1691388 882782 1933512 3711751 4855299 5451794 6181171 6997764
8347F997764M38087k24946j128494j877897j518902m08574p64981l181584m324397
$$ 6997764 7435851 7210905 6082411 4204514 2685612 2277038 1512057 -1669527 -5993924
8338e993924j194502L591586M578269J119627j787592p82218J804860K505469
$$ -5993924 -7188426 -3596840 981429 2101056 313464 -468754 1336106 3841575
8330C841575J421284J10945j709415m088906m217565o5860M793937M573781n05215
$$ 3841575 5262859 5373804 3664389 -424517 -4642082 -4707942 85995 4659776 4154561
8321D154561l762148j126272L319199L490558j00291j819731M35195K546275Q82784
$$ 4154561 392413 -733859 2585340 6075898 5975607 4155876 4591071 7137346 8020130
8312H020130k138234j741040K131234M649844K653311j497202l533861k636360
$$ 8020130 5881896 4140856 6272090 10921934 13575245 12078043 8544182 5907822
8304E907822j370526j360311j336885J17924J791052J378675q52796j767251O21246
$$ 5907822 4537296 3176985 1840100 1958024 3749076 5127751 4274955 2507704 3128950
8295C128950L939635L630300j567338p365750q098962k974115K890410M251383
$$ 3128950 7068585 10698885 9131547 1765797 -6333165 -9307280 -6416870 -2165487
8287b165487J635252J6484J966915M409802L266240q25692l801253l861911k788086
$$ -2165487 -530235 -513751 1453164 5862966 9129206 8303514 4502261 640350 -2147736
8278b147736j902245k58409K212217L086233J006350j639474j895009j45620J395544
$$ -2147736 -4049981 -4308390 -2096173 990060 1996410 356936 -1538073 -1683693 -288149
8269b88149K185505K760734K435493O39602p72962J96423K017968J542192j075302
$$ -288149 1897356 4658090 7093583 7733185 6960223 7156646 9174614 10716806 9641504
8260I641504k777794k527308k195407k527105j928835J27606J843283J970603
$$ 9641504 6863710 4336402 2140995 -386110 -2314945 -2187339 -344056 1626547
8252A626547R96276q71570l616644n094476k698975J907242L763428J448269j090726
$$ 1626547 2622823 1751253 -1865391 -6959867 -9658842 -7751600 -3988172 -2539903 -3630629
8243c630629q25181N70028Q54991N19298j61394k408186m585043k031773M865985
$$ -3630629 -4455810 -3885782 -3030791 -2511493 -2672887 -5081073 -9666116 -11697889 -6831904
8234f831904Q050707K728953m065829k841721M227925O816852K069763k348845
$$ -6831904 1218803 3947756 -118073 -2959794 1268131 8084983 10154746 7805901
8226G805901j225231J041694q16852m382288m413334j233704P92227J58265r58706
$$ 7805901 6580670 7622364 6805512 2423224 -1990110 -3223814 -2431587 -2273322 -3232028
8217c232028j089820q50176p09086l48966J46486N95975J600690L250937L845216
$$ -3232028 -4321848 -5172024 -5881110 -6230076 -6083590 -5487615 -3886925 -635988 3209228
8208C209228K060594m02653r45864l71808j769168m671029m375843N56303M080160
$$ 3209228 5269822 4867169 3921305 3549497 1780329 -2890700 -7266543 -6710240 -2630080
8199b630080P08982m755256k531005O845439J0711852J846075r573891r162267
$$ -2630080 -1921098 -6676354 -9207359 -2361920 8349932 10196007 622116 -8540151
8191h540151J500445P709892K832718m117674l726975J273411L425985K144086
$$ -8540151 -7039706 670186 3502904 -614770 -4341745 -3068334 357651 2501737
8183B501737J343002J407183L93117p46270l79286m19987k570780l474511K69541
$$ 2501737 3844739 5251922 5645039 4898769 4519483 4099496 1528716 -1945795 -1676254
8174a676254M873240L730287k481760o422412m199176Q84098M406113N192526
$$ -1676254 3196986 6927273 4445513 -1976899 -6176075 -5291977 -885864 4306662
8166D306662L416538n39514m406271n220982l040090n66890P28583J251981J004060
$$ 4306662 7723200 7183686 2777415 -2443567 -5483657 -6050547 -5321964 -4069983 -3065923
8157c065923L1098J00226K273931L846032J529712l204499n751376m388953j074009
$$ -3065923 -3034825 -2934599 -660668 3185364 4715076 1510577 -4240799 -8629752 -9703761
8148i703761K378983M947967M765525J231194k472384l129364k104208j995957
$$ -9703761 -7324778 -2376811 2388714 3619908 1147524 -1981840 -4086048 -6082005
8140f082005j321667J943689M237939R46867m554625m321762J970367O271874
$$ -6082005 -7403672 -5459983 -1222044 -275177 -4829802 -9151564 -7181197 -909323
8132i09323M400644J086713Q50616J482634r4886j946568j205804O69286M92802
$$ -909323 3491321 4578034 5428650 6911284 6816398 4869830 3664026 4333312 4826114
8123D826114j968698m405272m525240j300940L451751N028592J193444l322059
$$ 4826114 2857416 -1547856 -6073096 -7374036 -3922285 1106307 2299751 -1022308
8115a022308k490484K084174L858076J636978j47267n48437k761738n478316l328585
$$ -1022308 -3512792 -1428618 2429458 4066436 3919169 3370732 608994 -4869322 -8197907
8106h197907K357443L394087j592445l729694J311788N537014K072614l356893
$$ -8197907 -5840464 -2446377 -4038822 -7768516 -6456728 -919714 1152900 -2203993
8098b203993k594444J630271J882295j085025j469841M19083l6019k099185j163292
$$ -2203993 -4798437 -3168166 -1285871 -2370896 -3840737 -3421654 -3457673 -5556858 -6720150
8089f720150K102920K603795k99056k264455j620599q79020j124167p61719N71254
$$ -6720150 -4617230 -2013435 -2312491 -4576946 -6197545 -7076565 -8200732 -8962451 -8391197
8080h391197J732508K735871L477918J871308k238098m052980n5744N426790N740632
$$ -8391197 -6658689 -3922818 -444900 1426408 -811690 -4864670 -4920414 506376 6247008
8071F247008J549212j235240r58244r71393k398967k907939j951063j104487M2301
$$ 6247008 7796220 6560980 5602736 4631343 2232376 -675563 -2626626 -3731113 -3688812
8062c688812K510869L688501P21349l087146k145686J953366K216808k490444
$$ -3688812 -1177943 2510558 3231907 144761 -2000925 -47559 2169249 -321195
8054c21195n595538l325667K53843Q18334j28940M59157K149908L119200L115333
$$ -321195 -5916733 -9242400 -8988557 -8170223 -8299163 -7840006 -5690098 -2570898 544435
8045E44435K258774M59904r05869m74102k13812k731818n443974l200207K883107
$$ 544435 2803209 3263113 2357244 1883142 1669330 -1062488 -6506462 -9706669 -6823562
8036f823562N785833L117199L41074J096172J507040j858497m945135k593901
$$ -6823562 -1037729 2079470 2420544 3516716 5023756 3165259 -1779876 -4373777
8028d373777K939177N557743L923491J248522o49250k085773k548386j583339
$$ -4373777 -1434600 4123143 8046634 9295156 8645906 6560133 4011747 2428408
8020B428408q11789j173951m91194K217088K951167j504171o587473n218823J208284
$$ 2428408 1616619 442668 -48526 2168562 5119729 3615558 -2971915 -8190738 -6982454
8011f982454M277743J320855q60830K489536O118154L338724k907788m368978
$$ -6982454 -2704711 -1383856 -2244686 244850 6363004 9701728 6793940 2424962
8003B424962j0569L025409O67065k720779k103727P62962J172029j165257k758374
$$ 2424962 2414393 5439802 6106867 3386088 1282361 2045323 3217352 2052095 -706279
7994g06279k061341n53681O38636J564935J618733K32147j055351l45391J300288
$$ -706279 -2767620 -3321301 -2682665 -1117730 501003 733150 -322201 -667592 632696
7985F32696J477462O76171J128310K000351L66484k883313l340485m15734J108555
$$ 632696 2110158 2786329 3914639 5914990 6281474 3398161 57676 -358058 750497
7976G50497r58622k302844L76924L246662J651210j754243j182011K774294M223192
$$ 750497 -208125 -2510969 -2134045 1112617 2763827 1009584 -172427 2601867 6825059
7967F825059J385802j335000j011315k44943j770626l430822j542389L007939
$$ 6825059 8210861 6875861 5864546 5619603 3848977 418155 -1124234 1883705
7959A883705N118951J915562l080829l807283M35954L385843J87423n124151m985928
$$ 1883705 7002656 8918218 5837389 2030106 2466060 5851903 6039326 915175 -4070753
7950d070753K42082K682666n09501k600196J384942O174308M850545j81389k065306
$$ -4070753 -3828671 -1146005 -1655506 -4255702 -2870760 3303548 8154093 7972704 5907398
7941E907398p37927j195315l505633l012530P50511L249845K739211J679622N83105
$$ 5907398 5169471 3974156 468523 -2544007 -1793496 1456349 4195560 5875182 6458287
7932F458287k289822m883917k676743K689091L702594j646985n884394k943525
$$ 6458287 4168465 -715452 -3392195 -703104 2999490 1352505 -4531889 -7475414
7924g475414L211844N350393L296909K160313L412563L222818r74440o201113
$$ -7475414 -4263570 1086823 4383732 6544045 9956608 13179426 12204986 6003873
7916F003873p139134k257138L897374N082525N13940l923669l209072L81540J524506
$$ 6003873 -1135261 -3392399 504975 5587500 6101440 2177771 -1031301 -649761 874745
7907H74745J58890N86761L464223M592102K167602m12046n33873r9404j139663
$$ 874745 1033635 1620396 5084619 9676721 11844323 11432277 10898404 10799000 9659337
7898I659337k207002j785870j514670l004019m250723k223962K555102O211210
$$ 9659337 7452335 5666465 4151795 1147776 -3102947 -5326909 -2771807 3439403
7890C439403N507856P96111m114989n116870k039031J099999J475223R82602J908372
$$ 3439403 8947259 9743370 5628381 511511 -1527520 -427521 1047702 2030304 3938676
7881C938676K176657n95981l165238j059299K882645J847451l520629n304269
$$ 3938676 6115333 5519352 2354114 1294815 4177460 6024911 2504282 -2799987
$$ [...]
##END NTUPLES=NMR SPECTRUM
##END=
