##TITLE=31Pdec_SR83 Gly
 CDCl3, 24 sc
 1.09.2021
##JCAMPDX= 6.0         $$ Bruker NMR JCAMP-DX V2.0
##DATA TYPE= NMR SPECTRUM
##DATA CLASS= NTUPLES
##ORIGIN= UXNMR, Bruker Analytische Messtechnik GmbH
##OWNER= root
$$ XWIN-NMR		Version 3.5
$$ Wed Sep  1 14:01:33 2021 Russian Standard Time (UT+4h)  she@DPX200
##.OBSERVE FREQUENCY= 81.013821
##.OBSERVE NUCLEUS= ^31P
##.ACQUISITION MODE= SIMULTANEOUS
##.ACQUISITION SCHEME= undefined
##.AVERAGES= 124
##.DIGITISER RES= 16
##SPECTROMETER/DATA SYSTEM= spect
##.PULSE SEQUENCE= zgpg30
##.SOLVENT NAME= CD2Cl2
##.SHIFT REFERENCE= (INTERNAL, CD2Cl2, 0, 248.564)
##AUDIT TRAIL= $$ (NUMBER, WHEN, WHO, WHERE, WHAT)
$$ ##TITLE= Audit trail, XWIN-NMR		Version 3.5
$$ ##JCAMPDX= 5.01
$$ ##ORIGIN= Bruker BioSpin GmbH
$$ ##OWNER= she
$$ F:/spectra/data/she/nmr/P31/1/pdata/1/auditp.txt
$$ ##AUDIT TRAIL=  $$ (NUMBER, WHEN, WHO, WHERE, WHAT)
(   1,<2021-09-01 13:58:32.78 +0400>,<she>,<DPX200>,
      <continue with go, POWCHK disabled, PULCHK disabled
       configuration hash MD5:
       00 E9 B6 7A A2 85 ED C7 34 08 36 98 17 FE 4E 26
       data hash MD5: 32K
       FD 06 04 3B 44 EE C7 CC AA AF DF C8 94 26 39 93>)
(   2,<2021-09-01 13:58:34.56 +0400>,<she>,<DPX200>,
      <Start of raw data processing
       efp BC_mod = 2 LB = 1 FT_mod = 6 PKNL = 1 PHC0 = -7616.881 PHC1 = -182.327 SI = 64K 
       data hash MD5: 64K
       F6 0F 64 4B D6 38 8A 5F 21 AF 07 31 58 21 2B 2D>)
(   3,<2021-09-01 13:59:57.32 +0400>,<she>,<DPX200>,
      <pk PHC0 = -390.2774 PHC1 = 666.3983 
       data hash MD5: 64K
       C2 BA 76 3A 62 BF 02 A7 64 B3 E8 F8 B0 27 7F A3>)
(   4,<2021-09-01 14:00:08.04 +0400>,<she>,<DPX200>,
      <pk PHC0 = 0.8021299 PHC1 = 0 
       data hash MD5: 64K
       82 43 B2 9E C4 F5 76 AE 17 22 46 AF 56 23 56 BE>)
(   5,<2021-09-01 14:00:46.79 +0400>,<she>,<DPX200>,
      <pk PHC0 = 423.3553 PHC1 = -739.8011 
       data hash MD5: 64K
       44 38 36 98 73 63 C4 A7 5B 41 2E AF 20 85 76 FC>)
$$ ##END=
$$ 
$$ hash MD5
$$ C3 77 11 82 3D 39 6B 93 AB 12 05 E1 EB 7A 66 75
##$RELAX= 
##$RELAX= 
##$RELAX= 
##$RELAX= 
##$RELAX= 
##$RELAX= 
##$RELAX= 
##$RELAX= 
$$ Bruker specific parameters
$$ --------------------------
##$DU= <F:/spectra>
##$EXPNO= 1
##$NAME= <P31>
##$PROCNO= 1
##$TYPE= <nmr>
##$USER= <she>
##$AMP= (0..31)
100 100 100 100 100 100 100 100 100 100 100 100 100 100 100 100 100 100 
100 100 100 100 100 100 100 100 100 100 100 100 100 100 
##$AQSEQ= 0
##$AQ_mod= 1
##$AUNM= <au_zg>
##$AUTOPOS= <>
##$BF1= 81.014009
##$BF2= 200.13
##$BF3= 200.13
##$BF4= 200.13
##$BF5= 200.13
##$BF6= 200.13
##$BF7= 200.13
##$BF8= 200.13
##$BYTORDA= 1
##$CFDGTYP= 0
##$CFRGTYP= 5
##$CHEMSTR= <none>
##$CNST= (0..31)
1 1 145 1 1 1 1 1 1 1 1 1 1 1 1 1 1 1 1 1 1 1 1 1 1 1 1 1 1 1 1 1 
##$CPDPRG= <waltz16>
##$CPDPRG1= <>
##$CPDPRG2= <waltz16>
##$CPDPRG3= <>
##$CPDPRG4= <mlev>
##$CPDPRG5= <mlev>
##$CPDPRG6= <mlev>
##$CPDPRG7= <mlev>
##$CPDPRG8= <mlev>
##$CPDPRGB= <>
##$CPDPRGT= <>
##$D= (0..31)
$$ [...]
##$SUBNAM2= <"">
##$SUBNAM3= <"">
##$SUBNAM4= <"">
##$SUBNAM5= <"">
##$SUBNAM6= <"">
##$SUBNAM7= <"">
##$SUBNAM8= <"">
##$SUBNAM9= <"">
##$SW= 501.771253377433
##$SWIBOX= (0..15)
0 1 3 0 0 0 0 0 0 0 0 0 0 0 0 0 
##$SW_h= 40650.406504065
##$TD= 32768
##$TD0= 1
##$TE= 0
##$TE2= 300
##$TE3= 300
##$TEG= 300
##$TL= (0..7)
0 120 53 12 22 120 120 120 
##$TP= (0..7)
150 150 150 150 150 150 150 150 
##$TP07= 0
##$TPNAME0= <>
##$TPNAME1= <>
##$TPNAME2= <>
##$TPNAME3= <>
##$TPNAME4= <>
##$TPNAME5= <>
##$TPNAME6= <>
##$TPNAME7= <>
##$TPOAL= (0..7)
0.5 0.5 0.5 0.5 0.5 0.5 0.5 0.5 
##$TPOFFS= (0..7)
0 0 0 0 0 0 0 0 
##$TUNHIN= 0
##$TUNHOUT= 0
##$TUNXOUT= 0
##$USERA1= <user>
##$USERA2= <user>
##$USERA3= <user>
##$USERA4= <user>
##$USERA5= <user>
##$V9= 5
##$VALIST= <valist>
##$VCLIST= <CCCCCCCCCCCCCCC>
##$VD= 0
##$VDLIST= <DDDDDDDDDDDDDDD>
##$VPLIST= <PPPPPPPPPPPPPPP>
##$VTLIST= <TTTTTTTTTTTTTTT>
##$WBST= 1024
##$WBSW= 4
##$XGAIN= (0..3)
0 0 0 0 
##$XL= 0
##$YL= 0
##$YMAX_a= 2493
##$YMIN_a= -5137
##$ZGOPTNS= <>
##$ZL1= 120
##$ZL2= 120
##$ZL3= 120
##$ZL4= 120
##$ABSF1= 0
##$ABSF2= 0
##$ABSG= 0
##$ABSL= 0
##$ALPHA= 0
##$AQORDER= 0
##$ASSFAC= 0
##$ASSFACI= 0
##$ASSFACX= 0
##$ASSWID= 0
##$AUNMP= <proc_1d>
##$AZFE= 0.1
##$AZFW= 0.5
##$BCFW= 0
##$BC_mod= 2
##$BYTORDP= 0
##$COROFFS= 0
##$CY= -3
##$DATMOD= 1
##$DC= 0
##$DFILT= <>
##$DTYPP= 0
##$F1P= 0
##$F2P= 0
##$FCOR= 1
##$FTSIZE= 65536
##$FT_mod= 6
##$GAMMA= 0
##$GB= 0
##$INTBC= 1
##$INTSCL= 5.30512e-09
##$ISEN= 30
##$LB= 1
##$LEV0= 0
##$LPBIN= 0
##$MAXI= 10000
##$MC2= 0
##$MEAN= 0
##$ME_mod= 0
##$MI= 50
##$NCOEF= 0
##$NC_proc= -9
##$NLEV= 6
##$NOISF1= 182.463
##$NOISF2= 159.3651
##$NSP= 0
##$NTH_PI= 0
##$NZP= 0
##$OFFSET= 248.5645
##$PC= 4
##$PHC0= -7583
##$PHC1= -255.7298
##$PH_mod= 1
##$PKNL= yes
##$PPARMOD= 0
##$PSCAL= 0
##$PSIGN= 0
##$REVERSE= no
##$SF= 81.014009
##$SI= 65536
##$SIGF1= 159.3651
##$SIGF2= -187.1042
##$SINO= 113.3802
##$SIOLD= 16384
##$SREGLST= <1H.CDCl3>
##$SSB= 0
##$STSI= 65536
##$STSR= 0
##$SW_p= 40650.406504065
##$SYMM= 0
##$S_DEV= 0
##$TDeff= 32768
##$TDoff= 0
##$TI= <>
##$TILT= no
##$TM1= 0
##$TM2= 0
##$TOPLEV= 0
##$USERP1= <user>
##$USERP2= <user>
##$USERP3= <user>
##$USERP4= <user>
##$USERP5= <user>
##$WDW= 1
##$XDIM= 65536
##$YMAX_p= 414367220
##$YMIN_p= -477311473
$$ End of Bruker specific parameters
$$ ---------------------------------
##NTUPLES= NMR SPECTRUM
##VAR_NAME=  FREQUENCY,     SPECTRUM/REAL,   SPECTRUM/IMAG
##SYMBOL=    X,             R,               I
##VAR_TYPE=  INDEPENDENT,   DEPENDENT,       DEPENDENT
##VAR_FORM=  AFFN,          ASDF,            ASDF
##VAR_DIM=   65536,         65536,           65536
##UNITS=     HZ,            ARBITRARY UNITS, ARBITRARY UNITS
##FACTOR=    0.620285442955139, 1,           1
##FIRST=     20137.2065510759, 0,            0
##LAST=      -20513.1999529892, 0,           0
##MIN=       -20513.1999529892, -477311473,  0
##MAX=       20137.2065510759, 414367220,    0
$$ Real data points
##PAGE= N=1
##DATA TABLE= (X++(R..R)), XYDATA
$$ [...]
12800h997087J3122670J1780958k658989j6847220j3196183J610628L776389q592780
12792b0001614j0067813P524978J5485355m252575k1385866j978758L1705604
12785b970689L0599195m421628k5074437j3188070k656874j3551072j7384389
12778d8647964P349654L1164642J9820002j0263291k0312748p106145M367549
12771b3628301O044371P979633R068513J321864p099021m222138N95136o649988
12763a6589931j4429368l528967J5918857J8772862P216995L740413R120137M799406
12755B5020404p018130n137056Q456560P863532j0626479k0168640q848737L616910
12747f841636M404402N804887J2564938Q154123r966999j6990231k258698R466146
$$ plain form
12800 -8997087 4125583 15906541 13247552 -3599668 -16795851 -15185223 -11408834 -20001614
12792 -20001614 -30069427 -22544449 -7059094 -11311669 -32697535 -34676293 -2970689
12785 -2970689 27628506 23206878 -1867559 -15055629 -17712503 -31263575 -48647964
12778 -48647964 -41298310 -10133668 9686334 -576957 -20889705 -27995850 -23628301
12771 -23628301 -17583930 -9604297 -535784 786080 -6312941 -10535079 -9939943 -16589931
12763 -16589931 -31019299 -34548266 -18629409 143453 7360448 11100861 20220998 25020404
12755 25020404 18002274 12865218 21321778 29185310 18558831 -1609809 -10458546 -6841636
12747 -6841636 -2437234 3367653 15932591 24086714 14119715 -2870516 -5129214 4336932
12739D336932o8198j1999898o162823M219241K029448M54663J4524477K4874265
12731C2208107P822114j8727154j9777855L80123P525976m671810q256126P251336
12723C754711J6487073R12561k2223178k6954640j1467988Q230288J9769526J9191286
12715G699639P997607o006465j3973709j5536906j5094166j0843990O77451J2256673
12707c2823866J2841945M929985K27858j8568m037053j0322730p654486M334160
12699c2522755J2217466R540193M400610L062944J996704K16309L382942R808133
12691A2102546P612189o367174j7640507j2658644L234716J3921911J1231316
12684A1436353m8609r534095r415575k87575Q961516J0621217N868521r99512
$$ plain form
12739 4336932 4268734 -7731164 -13893987 -9674746 -7645298 -7190635 7333842 32208107
12731 32208107 40030221 21303067 1525212 1905335 9431311 4759501 -3496625 3754711
12723 3754711 20241784 21154345 -1068833 -28023473 -39491461 -31261173 -11491647 7699639
12715 7699639 15697246 9690781 -4282928 -19819834 -34914000 -45757990 -45080539 -32823866
12707 -32823866 -19981921 -15051936 -14824078 -14842646 -18879699 -29202429 -36856915 -32522755
12699 -32522755 -20305289 -10765096 -6364486 -3301542 -1304838 -1088529 2294413 12102546
12691 12102546 19714735 13347561 -4292946 -16951590 -13716874 205037 11436353
12684 11436353 11387744 1853649 -7561926 -7849501 1112015 11733232 17601753 16602241
12676A6602241r734165j7673323j4725070K074731J6396046J1390797m776106
12669d44849j0015170m02429Q432866Q245271M599329j144213j1869938j7319527
12661a9918660l673818J7133675J6724043n371754j7291386m103526J1062724
12654e438702R481994O254845J5341812J7998814l234977k5584705j7163244J1107817
12646H763654K1659546O782197p368522o789398l944990p022389p978441m579917
12638d78260n478908r069079l674659P286310O754886m564997n420560J0021084
12630d624183K0416487J1668197k890456q886938j1236058j2845564m66037K6046772
12622A7182220L5553635O877203k9798700k7976033P519495K5254630R53049l0058348
$$ plain form
12676 16602241 6868076 -10805247 -25530317 -23455586 -7059540 4331257 -444849
12669 -444849 -10460019 -10862448 -2429582 5815689 10415018 9270805 -2599133 -19918660
12661 -19918660 -23592478 -6458803 10265240 4893486 -12397900 -16501426 -5438702
12654 -5438702 4043292 10298137 25639949 43638763 40403786 14819081 -2344163 8763654
12646 8763654 30423200 37205397 29836875 23047477 19102487 12080098 4101657 -478260
12638 -478260 -5957168 -15026247 -18700906 -11414596 -4659710 -9224707 -14645267 -4624183
12630 -4624183 15792304 27460501 24570045 15683107 4447049 -8398515 -8864552 17182220
12622 17182220 52735855 59613058 29814358 1838325 9357820 34612450 35565499 5507151
12614E507151k6960009J060829J5949424O476594m833400j587255O568372N742091
12606G923797j513832m950071k324078J900833M701745M716234J137603k806836
12598H785395k007874J597516P22212l709010k306994M819746M816956m768799
12590G949148p309403M362710J0076892n258980j9981296p207711J6293208J2326942
12582A1251510j3995439j8075931J0933118L0244613J3833641o351096R08798
12575B8749214J1500368p721141l4489919k5087618J0296025K1650300j381159
12568C516070j8032802m947805J3714881J3639035M233335Q20390r36257o578322
12560E428525p801921m99497N909140P375617J0675508J3812999O153844p011517
$$ plain form
12614 5507151 -21452858 -20392029 -4442605 2033989 -2799411 -4386666 2181706 7923797
12606 7923797 6409965 1459894 -864184 1036649 5738394 10454628 11592231 8785395
12598 8785395 6777521 8375037 9097249 5388239 3081245 7900991 12717947 7949148
12590 7949148 639745 5002455 15079347 9820367 -10160929 -17368640 -1075432 11251510
12582 11251510 -2743929 -20819860 -9886742 20357871 34191512 27840416 28749214
12575 28749214 40249582 32528441 -1961478 -27049096 -16753071 4897229 3516070
12568 3516070 -14516732 -19464537 -5749656 7889379 12122714 12943104 12006847 5428525
12560 5428525 -2373396 -2872893 3036247 10411864 21087372 34900371 41054215 34042698
12552C4042698q049119m8557n072339k2897882k6134641o562971J0043550Q716085
12544a5963176O599785J2344604N540520j8582064k5317925M830226L4337719
12537C789689K1939319j2442856k0544339p5792J1370675J413193o424911j008190
12529a983212K133003m160428p227439j865101J784903k84678k686367o517882
12521b0807201j3171520r413815J2455869K8741771J3109102j6422878j8732254
12514b4240926N853931J5933904l333350j8812521p017923J0339869P484405n928415
12506a9721026r055336l438270k03843J289919L010325k23795l433569Q376096
12498b3399499K8051248K4864755n629992k3348143j698801K7516042K0839234
$$ plain form
12552 34042698 25993579 25945022 20872683 -2025199 -28159840 -34722811 -24679261 -15963176
12544 -15963176 -9363391 2981213 8521733 -10060331 -35378256 -30548030 3789689
12537 3789689 25729008 13286152 -7258187 -7333979 4036696 5449889 -975022 -1983212
12529 -1983212 149791 -4010637 -11238076 -13103177 -11318274 -11602952 -14289319 -20807201
12521 -20807201 -33978721 -43392536 -30936667 -2194896 10914206 -5508672 -24240926
12514 -24240926 -18386995 -2453091 -5786441 -24598962 -31616885 -21277016 -13792611 -19721026
12506 -19721026 -28776362 -32214632 -32418475 -31128556 -28118231 -28342026 -31775595 -23399499
12498 -23399499 4651749 29516504 23886512 538369 -1160432 26355610 47194844
12491D7194844j1565077k6351600j3311607Q77123L656180P950139J5222612Q853228
12483C2525842r634011j4269258L587328J7355931M436505k0458283k8215030
12476a4670976j4239661K561772Q337749O066755M156272N243607N618044O13290
12468C686852q297155j1878991l672800Q803025J1470747K706709m410889j044037
12460b636539N958374O374178K049463K574067R679401J3291904L846565j4704420
12452B6432993k6383221j9202311M36791J2999654P622518n723042r964581k059438
12444a5840637O465757O974096K985674J619299L369781L420646r78833o961159
12436A054624q573829l168761L800021L469487m377995q759325k411913N626873
$$ plain form
12491 47194844 35629767 9278167 -4033440 -3156317 499863 8450002 23672614 32525842
12483 32525842 22891831 8622573 12209901 29565832 34002337 13544054 -14670976
12476 -14670976 -28910637 -26348865 -18011116 -11944361 -7788089 -2544482 3073562 3686852
12468 3686852 -4610303 -16489294 -20162094 -11359069 111678 2818387 -1592502 -2636539
12460 -2636539 3321835 9696013 11745476 14319543 23998944 37290848 41137413 26432993
12452 26432993 49772 -19152539 -18715748 -5716094 1906424 -3816618 -13781199 -15840637
12444 -15840637 -9374880 -2400784 584890 2204189 5573970 8994616 8015783 1054624
12436 1054624 -7519205 -10687966 -6887945 -3418458 -7796453 -16555778 -18967691 -13340818
12428a3340818J406974j2232405j6777161l366649J3760599J6152222N581101
12421h816137q81430L138875N185642m393057j4372899p657967J1054173J7998814
12413A256014L441500j2999965r939036N155453Q818288k137370p607443K199546
12405a1813013J1530651N821054m911198m070121L564996P81984j1798900j4806037
12397b5700584n84733J3577507J0103213m450082j0864484n032607m63246m520675
12389b7935691o354793M987779K0582828K1824712P001550o061493n985997k418739
12381E640156p008536j2862500o888909N855018P728501l975405j2727373q403636
12373c2642684q53577j256648l793799L478243J7771047K2939263J0116786j0208071
$$ plain form
12428 -13340818 -11933844 -24166249 -40943410 -44310059 -30549460 -14397238 -8816137
12421 -8816137 -9697567 -6558692 -1373050 -5766107 -20139006 -27796973 -16742800 1256014
12413 1256014 4697514 -8302451 -18241487 -13086034 -4267746 -6405116 -14012559 -11813013
12405 -11813013 -282362 5538692 627494 -3442627 122369 904353 -10894547 -25700584
12397 -25700584 -26285317 -12707810 -2604597 -7054679 -17919163 -22951770 -23415016 -27935691
12389 -27935691 -34290484 -29302705 -8719877 13104835 20106385 14044892 8058895 5640156
12381 5640156 -1368380 -14230880 -21119789 -15264771 -7536270 -11511675 -24239048 -32642684
12373 -32642684 -33496261 -34752909 -38546708 -35068465 -17297418 5641845 15758631 5550560
12365E550560j8816309r278230L650861K030657r729346r100767R882011K2996178
12357b814385J1342230o686987l464686J1159782N042888j9361547k3456718N101629
12349b3137794K8749080J6915464r141534j4121704j360247L231911l469315o343904
12341h678043n076924q243723o490123J3060898L2990421K2671675j1632812k8915012
12333c13643j0995190J3892756J5106980q18852r169606l637918L320377K779526
12325A0164430l359021r602508j0719527l594127Q235910J6377182J6958889J3218424
12317C7679652Q310502K307885l412064n752509m238579p77590K845517L146155
12309D0108969l471563j1937147j0569974L22186M184368n941116j2140240L66182
$$ plain form
12365 5550560 -13265749 -22543979 -18893118 -16862461 -26591807 -35692574 -25810563 -2814385
12357 -2814385 8527845 1840858 -1623828 9535954 14578842 -4782705 -28239423 -23137794
12349 -23137794 5611286 22526750 13385216 -736488 -2096735 1135176 -2334139 -8678043
12341 -8678043 -13754967 -21998690 -28488813 -15427915 17562506 40234181 28601369 -313643
12333 -313643 -11308833 2583923 17690903 16872051 7702445 4064527 7384904 10164430
12325 10164430 6805409 -2797099 -13516626 -17110753 -8874843 7502339 24461228 37679652
12317 37679652 45990154 48298039 44885975 39133466 34894887 34117297 36962814 40108969
12309 40108969 36637406 24700259 14130285 14452471 18636839 12695723 555483 921665
12301I21665J4874726P210969j3302755j6473658Q12381J1469014L725238k848620
12293F388960N899257J6009365J1754504o36971r154253j3945891j5789662p490925
12285f965616Q848156J5305013M017420q279721o783966j354771n003549p603798
12277g820832O029756K4578817K2288348k455490k3766138k3603933j0962130
12270a5711602k407750o5714L382016Q678183Q969686J692365o135444o593205
12262h191465r78450L194932L576837M006127L600718m032762j5720485j6358320
12254c0902868j668769J1044184R305271O597720J6370173K1799415J739468k5655367
12246H629227k3317652N403583J9552219N099037p812163j792171Q10671j2597466
$$ plain form
12301 921665 15796391 23007360 9704605 -6769053 -5956672 5512342 9237580 6388960
12293 6388960 12288217 28297582 40052086 39415115 30260862 16314971 525309 -6965616
12285 -6965616 1882540 17187553 21204973 12925252 6141286 4786515 -217034 -7820832
12277 -7820832 -1791076 22787741 45076089 42620599 18854461 -4749472 -15711602
12270 -15711602 -18119352 -18185066 -14803050 -6124867 2844819 4537184 -1598260 -8191465
12262 -8191465 -9169915 -5974983 -2398146 1607981 5208699 1175937 -14544548 -30902868
12254 -30902868 -32571637 -21527453 -12222182 -5624462 10745711 32545126 34284594 8629227
12246 8629227 -14688425 -9284842 10267377 15366414 7554251 5762080 6572751 -6024715
12238f024715j5093693R710600K9576360J3999076j2326946j0212758Q465894
12231A8093818M861504j7898994k2691004m506834M760452l730108k815252J6023285
12223g903133K3269492L140699j6396526p965430J3005858J5305630k170551j5733697
12215D552342j2497200J31757J0361994J1343451K009006r846951j1735699j266385
12207f947685R850372J0579877J258374j1642398k0524103j6447654J894726J8224183
12199a3754308J4144493l467663r090783L703539J2450928K044272j0960248m775121
12191i704891J4378779K3117477J3378362k765313j3081474j4959481j0274859
12184H8600l305597o18432l328743l058366O213942J6691078J5552134J900073
$$ plain form
12238 -6024715 -21118408 -11407808 18168552 32167628 19840682 9627924 18093818
12231 18093818 22955322 5056328 -17634676 -22141510 -17381058 -21111166 -23926418 -7903133
12223 -7903133 15366359 18507058 2110532 -5854898 7150960 22456590 20286039 4552342
12215 4552342 -7944858 -7813101 2548893 13892344 15901350 6054399 -5681300 -6947685
12207 -6947685 2902687 13482564 14740938 3098540 -17425563 -33873217 -31978491 -13754308
12199 -13754308 390185 -3077478 -12168261 -8464722 3986206 6030478 -4929770 -9704891
12191 -9704891 4673888 27791365 41169727 38404414 25322940 10363459 88600
12184 88600 -3216997 -3835429 -7164172 -10222538 -4008596 12682482 28234616 30134689
12176C0134689j2420893j6526974r614135P34020M904813j191061j1604228j5902203
12168c1485972j0089706J646244J4178721K3142553K1598392O262206j2289763
12161A2962675j7670234q367843J222623K373468R12031J395518j468592q662309
12153a7302663r697436O80217J1980335J3802508R197108L172623o716616j6870357
12145a1754281j2229757Q966772K1408653N449083j9427929j9632271K550134
12138b4669596J3365498M35661r737627M876619K7949334K9880972Q185846j4562217
12130C5724490k1576258j4504087k313397P501897R092879J363707q854826j3708500
12122g274095j3004973j0614884o224208J389428O124173K50569j1202765j2611539
$$ plain form
12176 30134689 17713796 1186822 -8427313 -7693293 -2788480 -3979541 -15583769 -31485972
12168 -31485972 -41575678 -39929434 -25750713 -2608160 18990232 25252438 12962675
12161 12962675 -4707559 -13075402 -11852779 -9479311 -8567280 -7171762 -8640354 -17302663
12153 -17302663 -27000099 -26319882 -14339547 -537039 8660069 11832692 5116076 -11754281
12145 -11754281 -23984038 -15017266 6391387 11840470 -7587459 -27219730 -24669596
12138 -24669596 -11304098 -10868437 -20606064 -15729445 12219889 42100861 50286707 35724490
12130 35724490 14148232 -355855 -2669252 4832645 13925524 15289231 6434405 -7274095
12122 -7274095 -20279068 -30893952 -37118160 -35728732 -29604559 -29353990 -40556755 -53168294
12114e3168294J365152J6417719J7335984Q273969L674021M694855Q7786r761536
12106a1080344q622306P484534J6348293J044100j8348362r396385K1724614L3099665
12098C2253809O099856k6847966k8213769m903816J0288097Q656636Q435328J5846414
12090B1614589J3943649n505220k3525767j8684000M296251K1407157J6821645
12083C0368304l537213k0354566j8832033k372974J1001377R753569K148141J087611
12075I262216L061594l177921j2128108o424196J2370598K0081009N160278j2734514
12067A5470956j2301405j029684R57905o294333o343500M797184J3994627J2832649
12059B2084399O301655m32170p985843j3650271j0887752j758484K421603k632288
$$ plain form
12114 -53168294 -51803142 -35385423 -18049439 -9775470 -6101449 -1406594 -1318808 -11080344
12106 -11080344 -19702650 -12218116 4130177 5174277 -13174085 -22570470 -845856 32253809
12098 32253809 38353665 11505699 -16708070 -21611886 -11323789 -2667153 5768175 21614589
12090 21614589 35558238 30053018 6527251 -12156749 -7860498 13546659 30368304
12083 30368304 26831091 6476525 -12355508 -14728482 -3727105 6026464 8174605 9262216
12075 9262216 12323810 9145889 -2982219 -9406415 2964183 23045192 28205470 15470956
12067 15470956 3169551 2139867 3097772 -3196561 -9540061 -4742877 9251750 22084399
12059 22084399 28386054 27953884 19968041 6317770 -4569982 -6328466 -3906863 -6539151
12051f539151p690027m415659L281135P552172P889331Q028467P942619M849706
12043B0898593j863458j0536747j8091266j9016807r346720N625300J3960843
12036a8370262J1044584M769057K878534K156229l755835j1733671j2279357k645867
12028b7936588R429192J3913404O928803o018749j2349260l098166J4447322K1171726
12020A6487684R416610n324321n264927M095712L114088j0766237j8223158p490361
12012a3954910Q093600J0679779K518211k481344j825432l333487n891462R14940
12004e280105J5851746K0815788M760124j8139821k4555332r813243J0025591
11997f335252J8895356J3096546k881389j9500558k1995748k667030K2568202
$$ plain form
12051 -6539151 -14229178 -18644837 -15363702 -7811530 77801 8106268 16048887 20898593
12043 20898593 19035135 8498388 -9592878 -28609685 -37956405 -32331105 -18370262
12036 -18370262 -7325678 -2556621 321913 2478142 -1277693 -13011364 -25290721 -27936588
12028 -27936588 -18507396 -4593992 2334811 -3683938 -16033198 -19131364 -4684042 16487684
12020 16487684 25904294 20579973 15315046 19410758 22524846 11758609 -6464549 -13954910
12012 -13954910 -5861310 4818469 7336680 4855336 3029904 -303583 -6195045 -5280105
12004 -5280105 10571641 31387429 36147553 18007732 -6547600 -16360843 -6335252
11997 -6335252 12560104 25656650 22775261 3274703 -18721045 -21388075 1180127
11990A180127K5694038L139178j5073538o348424J0318215L341536j9962896k1960418
11982a9672182O130993K7972991J6355480q084475j3441970m670354n516103j2359326
11974a3284946k769764J9059054K3877021N164730j0843378r906455r257084j8734274
11966a6695096j7112074R321949L3490278K4209100l352215q834380J1637979
11959C2665541K1069776n18564k7272043k7315673n608713R639434O894560j011626
11951H542692k204122j557134q128665j6942477j2547579Q519955K7244466K3469700
11943B6396836L601155p999443n384081p247631j8904305j5295408J5891896L9149071
11935C0208090J5697699l1333123m1074917k733911K8917122J7343919n430536
$$ plain form
11990 1180127 26874165 30013343 14939805 8591381 18909596 22251132 2288236 -19672182
11982 -19672182 -13541189 14431802 30787282 22702807 9260837 4590483 -925620 -13284946
11974 -13284946 -16054710 3004344 26881365 32046095 21202717 11296262 2039178 -16695096
11966 -16695096 -33807170 -24485221 9005057 33214157 29861942 21027562 32665541
11959 32665541 53735317 53216753 25944710 -1370963 -6979676 2659758 9554318 8542692
11951 8542692 6338570 4781436 -3347229 -20289706 -32837285 -24317330 2927136 26396836
11943 26396836 29997991 21998548 16614467 9366836 -9537469 -24832877 -8940981 30208090
11935 30208090 45905789 14572666 -26502251 -29236162 -319040 17024879 11594343
11928A1594343Q44268J8119237O382759k4233851k9277533m106362R878523o299003
11920a7097619k2480676j2677289O528359J0306855M291051M888966P738676K355779
11912a6145898k506284L964449Q336219o096900k3288588j2559300K0674054L6074533
11904H452285J5621495j1637548j4996364m577077p206969k0194371j7449295
11897e1987844N956315K3413089J5069703n072320j0897825J301258J3474742
11890h742882J3266673O176060J146071k533137q379414j2115402p360056J829552
11882a6712535L932617m040936j1890531r969509l36261Q892894J2908537J0027828
11874g187896O44586p825740m331668R057014J3805585K36617j3938821p052998
$$ plain form
11928 11594343 12438611 30557848 36940607 12706756 -16570777 -20677139 -10798616 -17097619
11920 -17097619 -39578295 -52255584 -45727225 -35420370 -31129319 -26240353 -18501677 -16145898
11912 -16145898 -18652182 -14687733 -6351514 -12448414 -35737002 -48296302 -27622248 8452285
11904 8452285 24073780 12436232 -2560132 -7137209 -14344178 -34538549 -51987844
11897 -51987844 -46031529 -22618440 -7548737 -12621057 -23518882 -22217624 -8742882
11890 -8742882 4523791 10699851 11845922 9312785 933371 -11182031 -18542087 -16712535
11882 -16712535 -12779918 -16820854 -28711385 -38680894 -39017155 -30124261 -17215724 -7187896
11874 -7187896 -6543310 -14369050 -18700718 -9643704 4161881 4398498 -9540323 -16593321
11866a6593321J2962656J9828593Q659373j085654j817702p496707k0931331k2655193
11858b9129286o240373N470467j019890m503897J1940888K5388371J0566156j2188452
11850B83984q548425R431700L806450j9905045j9778825O868722J5118378q010975
11842b0734036j6738342J4010318L9519255J6557663k3894728k5821351N555746
11835a1545475K1896274J1397186K940439N291655N3055r697098j55352K0715480
11827D0896164J5514557j7588368l3676301j1956543J0665832J169068j8410531
11820a3386122j3200802P406949J1967232K0586n067452O39872J077615o783058
11812a7325180r877773l471003N752693J4734542K1127378J4592877o765196k1388930
$$ plain form
11866 -16593321 -3630665 16197928 24857301 23771647 21953945 14457238 -6474093 -29129286
11858 -29129286 -35369659 -29899192 -30919082 -35422979 -23482091 1906280 12472436 283984
11850 283984 -8264441 1167259 4973709 -14931336 -34710161 -27841439 -12723061 -20734036
11842 -20734036 -37472378 -23462060 16057195 32614858 8720130 -17101221 -11545475
11835 -11545475 10350799 21747985 24688424 29980079 30033134 20336036 20180684 40896164
11827 40896164 56410721 38822353 5146052 -6810491 3855341 5024409 -13386122
11820 -13386122 -26586924 -19179975 -7212743 -7192157 -12259609 -11619737 -10542122 -17325180
11812 -17325180 -27202953 -30673956 -24921263 -10186721 10940657 25533534 18768338 -2620592
11804b620592j0409404J0289729J1247641m970421j0295023L63924K359002j1939651
11796a5974795j5006696J1169668M0502736L5854536l81364l1120879l1143640
11789f100434r865447Q441165J1275865L671797k619367k183427q3612k619601
11781h3061o455395l889310K315323P64742r178707j2438934K84047J6975794
11773a1705501K0046629R479973o01513k929180k977825n662371o713068J00041
11765i62815J2584962K0101252J4327701P96482l910120O956479J6002763J713000
11757F7609704k7092687l6046502j2574309J2539613Q181650j1462008j0784680
11750i629219J0533623J8907115K830862r451836J922507J6786920J0770315n465729
$$ plain form
11804 -2620592 -13029996 -2740267 8507374 3536953 -6758070 -6394146 -4035144 -15974795
11796 -15974795 -30981491 -19811823 20690913 56545449 56164085 25043206 -6100434
11789 -6100434 -15965881 -7524716 3751149 7422946 4803579 2620152 2536540 -83061
11781 -83061 -6538456 -10427766 -8112443 -7347701 -16526408 -28965342 -28681295 -11705501
11773 -11705501 8341128 17821101 17219588 14290408 11312583 5650212 -1062856 -962815
11765 -962815 11622147 31723399 46051100 46847582 42937462 49893941 65896704 67609704
11757 67609704 40517017 4470515 -8103794 4435819 12617469 1155461 -9629219
11750 -9629219 904404 19811519 22642381 13190545 15113052 31899972 42670287 37204558
11742C7204558q308086q30507j306456p713404m888509L012852l33942r347530
11734G488976l590758J1747027Q272103j6722937k9792237j2887180Q572045Q260486
11726a8652475j894725k99670M394128o335278k1453000j6574911L216627J1643668
11718d5955636N044420L948371J3829170J7469414P953043j617269n056593j0404885
11710a4789965j5619302o871719J1606399J6180516K670634l676071R090345J7458868
11702A6049705K441154j6596461j3091731M819869J1327444M114782o5493K080074
11694A1079343O32594l530064j548643K692821j065955q033237o622877j818608
11686h214626n608645j0115959K044635K3709213K9018183J4044976J520526J001233
$$ plain form
11742 37204558 28896472 28065965 26759509 19046105 14157596 17170448 16836506 7488976
11734 7488976 3898218 15645245 23917348 7194411 -22597826 -35485006 -26912961 -18652475
11726 -18652475 -20547200 -20846870 -16452742 -22788020 -44241020 -60815931 -57599304 -45955636
11718 -45955636 -40911216 -36962845 -23133675 -5664261 2288782 671513 -4385080 -14789965
11710 -14789965 -30409267 -37280986 -25674587 -9494071 -6823437 -10499508 -1409163 16049705
11702 16049705 18490859 1894398 -11197333 -6377464 4949980 9064762 8999269 11079343
11694 11079343 11711937 8181873 6633230 9326051 8260096 226859 -6396018 -8214626
11686 -8214626 -13823271 -23939230 -21894595 1814618 30832801 44877777 46398303 47399536
11678D7399536m062781j9975842k5336942p319308J1672627O350205j2747835
11671d020340j7517083m912887M196949P72762k553653L830881J2499324J2812869
11663E108822M476851n927160j2018593r911702j632239L797256n1649p692248
11655b3850662r141503l975252O12470L244982R162015J7307436J7330253L669159
11647A4358898j4341370k1449352j2690112K329133J0337326Q477065O610196
11640f368216J3511181K2505889J8107957j355439j7621866j5649200l752742
11633I377564l21605p876984j3640805j1081514n442234M63417R033112J4469508
11625e019541M270895j8729483l1219987j7172429J0366653K6103142K1930078
$$ plain form
11678 47399536 43336755 23360913 -1976029 -9295337 2377290 8727495 -4020340
11671 -4020340 -21537423 -26450310 -22253361 -21480599 -24034252 -20203371 -7704047 5108822
11663 5108822 9585673 3658513 -8360080 -18271782 -19904021 -16106765 -16158414 -23850662
11655 -23850662 -32992165 -36967417 -36354947 -33109965 -23947950 -6640514 10689739 14358898
11647 14358898 17528 -21431824 -34121936 -31792803 -21455477 -12978412 -6368216
11640 -6368216 7142965 29648854 47756811 46401372 28779506 13130306 9377564
11633 9377564 9055959 1178975 -12461830 -23543344 -28985578 -28522161 -19489049 -5019541
11625 -5019541 -748646 -19478129 -50698116 -67870545 -57503892 -31400750 -9470672
11618i470672Q887859j278248m054634J067774Q374690O063664p968008j6168391
11610a4545966k954033J8212182J8675331m848807k4597862k1403585q945252
11603d0407992p808116j3995791r631553P324705K1660058K2792170J3196139
11596f870380m35493j1000107r820878M829469J9780602J9253201L881989j2109322
11588G509081j9189995j7221642o938708Q749828J7720499R396459o685890r052317
11580a5712685O123762J9196846J5529815M236160M98557K834154p72310j2645031
11572A9289268k2029039j8388792k493600J2709095J1976310m504598j5196970
11565a8638326j619083K1950184K1418335r576346l5699012k5609603P009451
$$ plain form
11618 -9470672 -582813 -1861061 -5915695 -4847921 3526769 9590433 1622425 -14545966
11610 -14545966 -17499999 712183 19387514 14538707 -10059155 -31462740 -40407992
11603 -40407992 -48216108 -62211899 -71843452 -64518747 -42858689 -20066519 -6870380
11596 -6870380 -7305873 -18305980 -28126858 -23297389 -3516787 15736414 19618403 7509081
11588 7509081 -11680914 -28902556 -35841264 -27091436 -9370937 25522 -6660368 -15712685
11580 -15712685 -9588923 9607923 25137738 29373898 29872455 32706609 31934299 19289268
11572 19289268 -2739771 -21128563 -23622163 -10913068 1063242 -3441356 -18638326
11565 -18638326 -20257409 1692775 23111110 13534764 -22164248 -47773851 -40764400
11558d0764400K5587874J8819890N027663j812164n851227j1062808j1582744
11551b1637916m722962K658372N583433O205357M687886k418173j1144265j0583137
11543c1371405l09354M853514l760780j2471764k655579K0627076L1269906J5659640
11535B1841254p940513j2098184M081338J4942496M814287j0325763p635423Q175635
11527A5855127J2742837q80282j3854775j2130257m800949m514435q086967p613084
11519b3282785n045548l475610J603946R434690P260276q439351j8678814q128889
11511d8752085Q708736Q661342l565770m040105J1395174K1360023J1463373q277472
11503c046784j9729617j4095955N752058K5636326K6745044O992897j0860097
$$ plain form
11558 -40764400 -15176526 3643364 8671027 6858863 1007636 -10055172 -21637916
11551 -21637916 -26360878 -23702506 -18119073 -11913716 -7225830 -9644003 -20788268 -31371405
11543 -31371405 -31680759 -26827245 -30588025 -43059789 -45715368 -25088292 6181614 21841254
11535 21841254 13900741 1802557 5883895 20826391 25640678 15314915 7679492 15855127
11527 15855127 28597964 27717682 13862907 1732650 -3068299 -7582734 -15669701 -23282785
11519 -23282785 -28328333 -31803943 -30199997 -20765307 -13505031 -21944382 -40623196 -48752085
11511 -48752085 -40043349 -31382007 -34947777 -38987882 -27592708 -6232685 5230688 -3046784
11503 -3046784 -22776401 -36872356 -31120298 -5483972 21261072 28253969 17393872
11496A7393872q354294K150402J99477p681211l805828L090946p124886k1847271
11488b5978793j0566877J7104787J7800243j1967425k1291430J3604057M4583171
11481B3287733K4981863j5889913k0371905O473573J0634384j9446933l4020544
11474b4351742j815863M0033937L8193110n421140m0740312l4664972n869010
11467c4635992O910169l548257p673446J2900787L1574843J3757038k3762761
11460d477619k8603082P664933L0572117M936648k8584529j7809788J7611602
11453a8689718K0490289j0074850k0919510N916129K8209315J6459510m406957
11446A6984208n450601K209328p29432n449412J012823P540922K837512J29967
$$ plain form
11496 17393872 9039578 11189980 11389457 3708246 -97582 2993364 -4131522 -25978793
11488 -25978793 -36545670 -19440883 -1640640 -13608065 -34899495 -21295438 23287733
11481 23287733 48269596 32379683 12007778 18481351 29115735 9668802 -24351742
11474 -24351742 -26167605 13866332 52059442 46638302 5897990 -28766982 -34635992
11467 -34635992 -27725823 -31274080 -38947526 -26046739 5528104 19285142 -4477619
11460 -4477619 -33080701 -25415768 5156349 10092997 -18491532 -36301320 -18689718
11453 -18689718 1800571 -8274279 -29193789 -23277660 4931655 21391165 16984208
11446 16984208 11533607 13742935 13013503 7564091 8576914 16117836 18955348 19085315
11438A9085315J0262584J5090749k852161k5393682k4119134m212986P061809
11431e077506K605041l067953m543729r047022j5395454j4842338q352949j763277
11423e9485187Q595806K3849194K7126064O563128j6215015j1678377J0122318
11416a1122069J2629728q230670j6941243K727702K1025967J1716290o539870
11409E265835m270252J0081244P394944j2013807j8789783j019422J8427764J5737250
11401B0813773l319337j5177567q427608O456493J1987022K792327r643826j0848432
11393e367155p39424P478059N823351M33812j470443l252354r398888j3001740
11385a9494782m257428J2658668K2275621J6489500K227147q894315j1680270
$$ plain form
11438 19085315 29347899 44438648 41586487 16192805 -7926329 -12139315 -5077506
11431 -5077506 -2472465 -5540418 -10084147 -19131169 -34526623 -49368961 -57721910 -59485187
11423 -59485187 -50889381 -27040187 85877 6649005 -9566010 -21244387 -11122069
11416 -11122069 1507659 -6723011 -23664254 -20936552 89415 11805705 5265835
11409 5265835 995583 11076827 18471771 6457964 -12331819 -13351241 5076523 20813773
11401 20813773 17494436 2316869 -6110739 345754 12332776 15125103 5481277 -5367155
11393 -5367155 -6106579 1371480 7194831 7628643 6158200 2905846 -6493042 -19494782
11385 -19494782 -23752210 -11093542 11182079 27671579 29898726 21004411 9324141
11378I324141q720036o156214p306851p331728J767907J6857429K1266288M804511
11370B4505447j9225684k7337236j3641621N343046J2131989N051398n856964
11363a9029625j0382754m430548P841137J6611160J5645498Q073104k87879q045693
11355E994400j2976095q062257O330602J4182488K949778j4503106j5177523m3696
11347b1305409Q239059K025583j181259Q403554J5031019N973486m677424p6224
11339A2432385R549221M429223j0012960j1774069P01767O442459k907400j0540772
11331a680146l309516P685694O068632n257496j1024568o042552R10709J561858
11323a1087385k460883m003836R08739R109701J3488238J0342159K784850l929796
$$ plain form
11378 9324141 604105 -5552109 -12858960 -20190688 -18422781 -1565352 19700936 24505447
11370 24505447 5279763 -22057473 -35699094 -30356048 -18224059 -13172661 -19029625
11363 -19029625 -29412379 -33842927 -26001790 -9390630 6254868 14327972 14040093 5994400
11355 5994400 -6981695 -15043952 -8713350 5469138 8418916 -6084190 -21261713 -21305409
11347 -21305409 -13066350 -11040767 -12222026 -3818472 11212547 17186033 12508609 12432385
11339 12432385 21981606 26410829 16397869 4623800 5325567 11768026 8860626 -1680146
11331 -1680146 -4989662 2696032 8764664 3507168 -7517400 -13559952 -12649243 -11087385
11323 -11087385 -13548268 -17552104 -16643365 -7533664 5954574 16296733 19081583 15151787
11315A5151787p395098o437624o5507P244999N713919o428589j5732041r842971
11307a7791125M117740R957450O812646P187724J2119285P662627r189089k0145314
11299G31944j1798388L371986O196669r26024j783420N234691N737326m539889
11291B224895j0860395k852063P753043L828553j0995270j6251463l458284J1634169
11283a8976815J1016849n26655k926385R753643K0069605J1290367r618636k1375930
11275a293957j4281120K570012J5656733J8277953R669250n604723j6162842j2047837
11267c216531K194407J0892448O966965K33990J865867Q655002R525441K139103
11259C9256692m982375n010263o48693J485022k67112k219521k227673k945306
$$ plain form
11315 15151787 7756689 1319065 1253558 8498557 14212476 7783887 -7948154 -17791125
11307 -17791125 -13673385 -3715935 3096711 10284435 22403720 30066347 20877258 731944
11299 731944 -11066444 -7694458 -1497789 -2423813 -4207233 1027458 6764784 2224895
11291 2224895 -8635500 -11487563 -3734520 94033 -10901237 -27152700 -30610984 -18976815
11283 -18976815 -7959966 -8486621 -11413006 -1659363 18410242 29700609 20081973 -1293957
11275 -1293957 -15575077 -13005065 2651668 20929621 30598871 24994148 8831306 -3216531
11267 -3216531 -1022124 9870324 16837289 17071279 18937146 27592148 37117589 39256692
11259 39256692 34274317 29264054 28615361 30100383 29833271 27613750 25386077 22440771
11251B2440771n898107n864928K409241J3039049J3887930M631165j481009O89500
11243D3853612j517623j5519830k4874388j1987699J0695137J5266325n74018
11236A5341516j2320906q656784n108266j1072321j1129533N795645K2174629
11229d976020J7083012j434231j0766518p904978o829823j0273471p444463K814712
11221b9731780P922617K275547n103651o372004l795955O9466P590598J6825677
11213a0319485J8429272P748865p640959j7053381j7433158j2121323m914198
11206d3304367J387181N136599P464940J0823358J4677318J5336644J0451246
11199B1972919J548728p073239j0297958n887739J127253J908180m438688p862687
$$ plain form
11251 22440771 16542664 10677736 13086977 26126026 40013956 44645121 43164112 43853612
11243 43853612 42335989 26816159 1941771 -10045928 649209 15915534 15341516
11236 15341516 3020610 -5636174 -10744440 -21816761 -32946294 -27150649 -4976020
11229 -4976020 12106992 10672761 -93757 -7998735 -14828558 -25102029 -32546492 -29731780
11221 -29731780 -21809163 -19533616 -24637267 -31009271 -34805226 -34735760 -27145162 -10319485
11213 -10319485 8109787 15858652 8217693 -8835688 -26268846 -38390169 -43304367
11206 -43304367 -41917186 -36780587 -29315647 -18492289 -3814971 11521673 21972919
11199 21972919 23521647 16448408 6150450 262711 1389964 3298144 -1140544 -9003231
11191i003231k042417M084850q73442j0910529q888042P062646J7608842Q670586
11183E709263q030959j1385648l64694O408575j010682j0267264o848964L787570
11175b2002803N617335k485351n088201N403872J6558092J3826286o01801j4641380
11167c413951k1980873k1325287r761909J0076318K3398054J8435561L852508
11160g19579k841295M80293K960371K041405L904050O116210O20241p187483m707617
11151F66596K425178l470897j7765683j4742427Q269626J9591492K533020j4413629
11143a6906724j473105K3982365K4477991M27231j3859556m553796N208714m622180
11135A2680940k2277622k4224313o113738J5096025K0657843P269973j0518574
$$ plain form
11191 -9003231 -11045648 -6960798 -7834240 -18744769 -27632811 -20570165 -2961323 5709263
11183 5709263 -2321696 -13707344 -14072038 -7663463 -8674145 -18941409 -25790373 -22002803
11175 -22002803 -16385468 -18870819 -23959020 -18555148 -1997056 11829230 11227429 -3413951
11167 -3413951 -25394824 -46720111 -56482020 -46405702 -23007648 -4572087 -719579
11160 -719579 -3560874 -3080581 -120210 1921195 5825245 11941455 12561696 5374213 666596
11151 666596 3091774 -379123 -18144806 -32887233 -24617607 -5026115 -2493095 -16906724
11143 -16906724 -18379829 5602536 30080527 30507758 16648202 12094406 17303120 12680940
11135 12680940 -9596682 -33820995 -39934733 -24838708 -4180865 3089108 -7429466
11128g429466j5447333o554247L120356P513766J1892300J3949463K378329j6425669
11120g002501j5667358J0547008K8674531J2865365j3270997j3114142N605442
11113H637348Q022957p869739j1862723L095974J0376489j524724j0599362k324203
11105d047983O909750K025637n522741j440283P222717P867730K405804k364705
11097A3055926p048029j1034300q143826k68780J019045n634299o873724K575094
11089b2352893J0164774O504951n26997m04048N979744J2185466J2499881J529602
11081B5580480j6607900k2278309m930496J2124795J003574k1198093j1372368
11074c7678317K7948708M2115140N761114l4825037k9273573N858179K0668811
$$ plain form
11128 -7429466 -22876799 -29431046 -26310690 -18796924 -6904624 7044839 9423168 -7002501
11120 -7002501 -22669859 -12122851 16551680 29417045 16146048 3031906 8637348
11113 8637348 16660305 8790566 -3072157 23817 10400306 8875582 -1723780 -4047983
11105 -4047983 2861767 4887404 -635337 -2075620 5147097 13014827 15420631 13055926
11097 13055926 6007897 -5026403 -13170229 -13439009 -12419964 -18054263 -24927987 -22352893
11089 -22352893 -12188119 -5683168 -6210165 -6614213 -634469 11550997 24050878 25580480
11081 25580480 8972580 -13305729 -18236225 -6111430 -5107856 -26305949 -37678317
11074 -37678317 -9729609 32385531 38146645 3321608 -25951965 -20093786 575025
11067E75025O735094l978960K872676R500056L940737l008102r50697N494082
11059B1179911Q628911P225139K978278j636231m285191p426907j4025582j5711754
11051c073426j138887J9228485J8930102m719863k1994738j4999735k566659l244516
11043a3579237m051072Q767443J7436755L260376j5496078j2034217L216959K613178
11035i865893j0297335j1496541j649501q9100m176152M003312J7392061J2316901
11027c862248o246923r364122N908571J2216667O28041o594182J447529P291793
11019A425126K74820o543182n250433o192391j1681755q130607M827278Q135178
11011b3135966k738370p862286J919687R944156N635677J263227M393801L798749
$$ plain form
11067 575025 7310119 3331159 6203835 15703891 19644628 16636526 15685829 21179911
11059 21179911 29808822 37033961 40012239 38376008 34090817 26663910 12638328 -3073426
11051 -3073426 -4212313 15016172 33946274 29226411 7231673 -7768062 -10334721 -13579237
11043 -13579237 -17630309 -8862866 8573889 11834265 -3661813 -15696030 -12479071 -9865893
11035 -9865893 -20163228 -31659769 -33309270 -33398370 -37574522 -33571210 -16179149 -3862248
11027 -3862248 -10109171 -19473293 -13564722 -1348055 -720014 -7314196 -5866667 1425126
11019 1425126 1699946 -4843236 -10093669 -16286060 -27967815 -36098422 -31271144 -23135966
11011 -23135966 -25874336 -33736622 -31816935 -21872779 -16237102 -14973875 -10580074 -6781325
11003f781325m260737o139825K32881j036161q449862J564235K7252887L0848830
10995C3230923n4428k2876000n864315J6806037L64789l3807166l1192643P207434
10987c6185369K7870512R662955j0900441m834273J0102188J0830824O216090
10980A2762486R967923R858979q597174l0056878k8480665o368135R096593M393163
10972b7423708n672358l024516Q724531J1636884l24773j1332205l488748J8019547
10964a2885346K8552622J4371844j0304187k2274385j6302445m534826K979754
10957b0396969N829587O271613O283764R246244J4845146J4426180N67320k0177776
10949A6895109l2030333k6272663p168262J4476976K6919979K1709903J903219
$$ plain form
11003 -6781325 -11042062 -17181887 -16949006 -17985167 -26435029 -24870794 2382093 33230923
10995 33230923 33176495 10300495 4436180 21242217 21607006 -12200160 -43392803 -36185369
10987 -36185369 -8314857 1348098 -9552343 -14386616 -4284428 6546396 12762486
10980 12762486 22730409 32589388 23992214 -6064664 -34545329 -40913464 -31816871 -27423708
10972 -27423708 -33096066 -36120582 -27396051 -15759167 -16083940 -27416145 -30904893 -12885346
10964 -12885346 15667276 30039120 19734933 -2539452 -18841897 -23376723 -20396969
10957 -20396969 -14567382 -8295769 -2012005 7234239 22079385 36505565 37072885 16895109
10949 16895109 -15135224 -41407887 -48576149 -34099173 -7179194 14530709 16433928
10942A6433928j5918276j6242363j311650J1729107R384364n315522j6132460
10935a7372872r130755J0673208K0124898M474072j9567645k2392193k759095
10928c5950382J0183951R92783j0409945l736007R225789P346243m361861o122481
10920c2831910L803807J1503722J1614386P298983k272364j2573892o238082J9294817
10912d00533L1945736N010458l5315224m0079263q283206J3980620M827379o934087
10904c5248120M309680K2342969K1967235O133721r471175k0298631k2941208
10897c3205529q391244J5891841K3063025N224637j0728866m959470N120865l70680
10889h355421p396652L348655J6284340N762873j6510900j7482138L671664J5752318
$$ plain form
10942 16433928 515652 -15726711 -17038361 -5309254 4075110 -1240412 -17372872
10935 -17372872 -26503627 -15830419 4294479 8768551 -10799094 -33191287 -35950382
10928 -35950382 -25766431 -24773648 -35183593 -38919600 -29693811 -22347568 -26709429 -32831910
10920 -32831910 -29028103 -17524381 -5909995 1388988 -883376 -13457268 -19695350 -400533
10912 -400533 31545203 36555661 1240437 -38838826 -47122032 -33141412 -28314033 -35248120
10904 -35248120 -30938440 -8595471 13371764 19505485 10034310 -10264321 -33205529
10897 -33205529 -41596773 -25704932 -2641907 2582730 -8146136 -13105606 -7984741 -8355421
10889 -8355421 -15752073 -12403418 3880922 9643795 -6867105 -24349243 -20677579 -4925261
10881d925261O020842m828622l40656J0108714J3127442R097990K007604p114416
10873B3153637j1914923n133404N786340O214963j256398j8375J1474076J5545608
10865D3851524M025510r968967j4065844j0486847l148477Q231086J5610244O318209
10857D0366438j3147355j9485473p937385j338355j1542378j7615963j485591
10850c2186062J8697517J6614381N67044k109836Q362322O420938j3054929k3879840
10842b0568465r614797J1914349J6493217M724229p460898j2313414j0385763
10835b7211542j248112J0639923J1540246m173056k0157812j7734178k968633
10828e1313164L553617p46292M14120J0607640J2835133Q39101o038461N270189
$$ plain form
10881 -4925261 1095581 -3733041 -4073697 6035017 19162459 28260449 30268053 23153637
10873 23153637 11238714 6105310 11891650 18106613 16850215 16831840 28305916 43851524
10865 43851524 47877034 37908067 23842223 13355376 10206899 18437985 34048229 40366438
10857 40366438 27219083 7733610 -203775 -1542130 -13084508 -30700471 -32186062
10850 -32186062 -13488545 3125836 3692880 1583044 9945366 16366304 3311375 -20568465
10842 -20568465 -30183262 -18268913 -1775696 2948533 -4512365 -16825779 -27211542
10835 -27211542 -28459654 -17819731 -6279485 -10452541 -30610353 -48344531 -51313164
10828 -51313164 -47759547 -48505839 -48091719 -37484079 -24648946 -23809845 -29848306 -24578117
10820b4578117J6365376O543746r887200m619199J6303111J9234365k583960j7102796
10812c24674n481049Q143062j873892k0111575j5829914Q419644K3285836J6709055
10804A2936493L955341j171793q20416o23223k775013r889306j9138163j7236083
10796c4762163J608066J9857896J8790513Q453263J0844951J9700155P895429
10789E2388110k4410833m1884456k4077023N171334J3833782M425030J658981
10782a2895075J2887253K1169142J2283069o619538j7074108j2142487n383410
10775g775154j2566315k5754257j9978709P919584K7748010J9599304O028167
10768d779370J3609472K4955036Q258244k2194999k4409548n56268M608471j8882426
$$ plain form
10820 -24578117 -8212741 -1668995 -11556195 -16175394 127717 19362082 16778122 -324674
10812 -324674 -5805723 2337339 463447 -19648128 -35478042 -27058398 -3772562 12936493
10804 12936493 16891834 15720041 14899625 14276402 11501389 1612083 -17526080 -34762163
10796 -34762163 -33154097 -13296201 5494312 13947575 24792526 44492681 52388110
10789 52388110 27977277 -13907179 -37984202 -32812868 -18979086 -14554056 -12895075
10782 -12895075 -7822 21161320 33444389 26824851 9750743 -2391744 -7775154
10775 -7775154 -20341469 -46095726 -66074435 -58154851 -30406841 -10807537 -4779370
10768 -4779370 8830102 33785138 42043382 19848383 -4561165 -5117433 -508962 -19391388
10760a9391388k7896468q52053K4927421J6380418m486701m723228Q118833J2692946
10752D769780J2834806J5008113L954140k2862465l2423300o157232K1628277
10745c247881J5058787p816340j2702749o798272j2049311j5486956J090676J3755249
10737b8196797m100750k4069790n936102K7984500K8418658N410224N179726J9261500
10729B3951169k34561m1858017l9984252J3123243M6841092K4107363p388387
10722A8557650m841437N738079o198924j6823505n5938J8670619R042520j0571763
10714A3517301j1087376k806658n932499r856855j396198L840130m074882k051927
10706a9848964K0834980L1028838N144323k2487337j3065208J2532027J2721745
$$ plain form
10760 -19391388 -47287856 -48139909 -23212488 -6832070 -11318771 -16041999 -7923166 4769780
10752 4769780 17604586 32612699 36566839 13704374 -18718926 -24876158 -3247881
10745 -3247881 11810906 3994566 -8708183 -15506455 -27555766 -43042722 -41952046 -28196797
10737 -28196797 -32297547 -56367337 -62303439 -34318939 -5900281 -490057 4689669 23951169
10729 23951169 23716608 -18141409 -58125661 -45002418 1838674 25946037 18557650
10722 18557650 13716213 19454292 13255368 -3568137 -3624075 15046544 24089064 13517301
10714 13517301 2429925 -376733 -6309232 -16166087 -17562285 -13722155 -17797037 -19848964
10706 -19848964 986016 32014854 37159177 14671840 1606632 14138659 26860404
10699B6860404m648774n044689O942711J107498j7920048j9188490k805496K761466
10691a1935418o190978n809409Q212287J3861379L019014q253850r455184m954252
10683b1506411L102456J3646907J5312399K543535o934712K845752J6247149Q883239
10675C4140314j3283366k5742525k1882244j0432411O050877K1971043J8546002
10668I367690o594293k2444766r568372M998754n446292j7409756m81163K1734751
10660b5843447J1226140j1664157j806109K4904369J4479737k5845835l1776447
10653d6325749R803989L6952482J5224506j1733291l882346J1964106Q91291j6453051
10645c558063o419575J5912579J5986653j275523o790849J326488K175358p757436
$$ plain form
10699 26860404 22211630 17166941 24109652 25217150 7297102 -11891388 -14696884 -11935418
10691 -11935418 -18126396 -23935805 -15723518 -1862139 1156875 -7096975 -16552159 -21506411
10683 -21506411 -18403955 -4757048 10555351 13098886 6164174 9009926 25257075 34140314
10675 34140314 20856948 -4885577 -26767821 -37200232 -31149355 -9178312 9367690
10668 9367690 2773397 -19671369 -29239741 -24240987 -29687279 -47097035 -47578198 -25843447
10660 -25843447 -14617307 -26281464 -28087573 -3183204 11296533 -14549302 -46325749
10653 -46325749 -36521760 430722 15655228 3921937 39591 12003697 12894988 -3558063
10645 -3558063 -9977638 5934941 21921594 20646071 13855222 15181710 17357068 9599632
10637I599632j3469774j0540101q058985r544774j0535646q205377p52145J3031659
10629c8475511K5515786K4875808J3468377N196472J527269q636112k1975430
10622A496659j9766262q79223J1074543L351142q884010j1018827q109408m708895
10614c7444281O764817K3570735K5097411M618659j4276412j0012233P678164
10607E996860J6092861R736962j383524q147518o157240K871117P036831l800062
10599B2246287j9551037k0434665n713484P678811J2344162J3487474J0284500
10592B0342048J342567J083594J7598521K3452403r169181n0855485m4425535
10585d0631068O483882L5740227J3016498j5974335r738963P338558j843378k3090409
$$ plain form
10637 9599632 -3870142 -14410243 -22469228 -32014002 -42549648 -50755025 -51507170 -38475511
10629 -38475511 -12959725 11916083 25384460 30580932 32108201 23472089 1496659
10622 1496659 -18269603 -19148826 -8074283 -4723141 -13607151 -24625978 -32735386 -37444281
10614 -37444281 -30679464 -7108729 17988682 22607341 8330929 -1681304 5996860
10607 5996860 22089721 31826683 30443159 22295641 16138401 19009518 26046349 22246287
10599 22246287 2695250 -17739415 -23452899 -15774088 -3429926 10057548 20342048
10592 20342048 21684615 22768209 40366730 63819133 54649952 3794467 -40631068
10585 -40631068 -34147186 1593041 14609539 -1364796 -11103759 -3765201 -5608579 -28698988
10577b8698988k2381978k770926J1620474J8246558K5477723K5515405J1370921
10570C8379189k766166n884669q997879j5556072n378249K4217381L6608924R166525
10562F9788984k4752053k4671788l502068J415659r257985p750041P112940J1120835
10554A9504483j542693j3298784j4343687q942507N17191J0896643J1029457j672986
10546B147117j1294809p695780k125347k930399k23335Q526588P132481n850719
10538a2314203n468028J5573828K7143259J1483631n620846k547871L87183j4617973
10530A4018980k2791663k506246J8573269R076226j0134691l871521J6062596
10523A8426950J6911721K947068j655579o98745r341421j6512355r013732l849685
$$ plain form
10577 -28698988 -51080966 -53851892 -42231418 -23984860 1492863 27008268 38379189
10570 38379189 35613023 29728354 20730475 5174403 -203846 24013535 60622459 69788984
10562 69788984 45036931 20365143 16863075 18278734 9020749 1270708 8383648 19504483
10554 19504483 17961790 4663006 -9680681 -18623188 -18105997 -7209354 3820103 2147117
10546 2147117 -9147692 -16843472 -18968819 -21899218 -22122553 -13595965 -6463484 -12314203
10538 -12314203 -17782231 -2208403 24934856 36418487 30797641 28249770 28636953 14018980
10530 14018980 -8772683 -11278929 7294340 16370566 6235875 2364354 18426950
10523 18426950 35338671 38285739 36630160 35931415 26589994 10077639 1063907 -2785778
10515b785778j2908078j0602983J6778942L0584084K271728k7336857j3208049
10508a7206991J3308692J28039k9869544j8746185K3066984L6263953J1848120
10501A8793068q517723r466855m363670J2051514L8833900L3788224j5684020
10494F5434438l6527991J8021303O2889696J5420461l1304342N4236047J73591843
10487C21761455R2605765j75839660l23270717j71012606P2893676J24831768
10481e8030319J0396229m7233866J2190748N4732405J5706773j8827142P041945
10474b4023227L2076598N278651l1069732k7886206k350514J2580734J7717446
10467a7676250J8420960O464310q965091m475095J1675985O593804j8050826k4234538
$$ plain form
10515 -2785778 -15693856 -26296839 -9517897 21066187 23337915 -3998942 -17206991
10508 -17206991 -3898299 -3770260 -33639804 -52385989 -29319005 6944948 18793068
10501 18793068 10275345 808490 -3555180 8496334 47330234 81118458 65434438
10494 65434438 28906447 46927750 109817446 125237907 93933565 148169612 321761455
10487 321761455 414367220 238527560 -84743157 -255755763 -182862087 -58030319
10481 -58030319 -47634090 -94867956 -82677208 -27944803 -12238030 -31065172 -24023227
10474 -24023227 8053371 13332022 -17737710 -45623916 -47974430 -35393696 -17676250
10467 -17676250 744710 7209020 -1756071 -6231166 5444819 12038623 -6012203 -30246741
10459c0246741j304834J7788551J2119365r17280l898967k976653m378241k906305
10451a6721105k76565l965574o446045M260354J6147933P443814j4486443k1580832
10443c5624463q909844L056823O257545J0998409J6289144Q473856r226529j6528196
10435b5213255p817026K054830M166693M060042M946260L794982K003900K396396
10427i607178J220188k591250j577075L710820K50499j1424867j1532915J897904
10419b9653874K358678j6240598j8727485J1178032L1982328R635035j9268711
10412b8736595n085223K9611993K7827136n577254j7561696o13011K680745j6341521
10404a3795426j8910541N110855J8155816M279405p107841j307435j19930p681717
$$ plain form
10459 -30246741 -31551575 -13763024 -1643659 -2560939 -6459906 -9436559 -13814800 -16721105
10451 -16721105 -16997670 -20963244 -27409289 -23148935 -7001002 442812 -14043631 -35624463
10443 -35624463 -44534307 -41477484 -35219939 -24221530 -7932386 541470 -8685059 -25213255
10435 -25213255 -33030281 -30975451 -26808758 -22748716 -17802456 -14007474 -12003574 -9607178
10427 -9607178 -8386990 -10978240 -12555315 -8844495 -8593996 -20018863 -31551778 -29653874
10419 -29653874 -27295196 -43535794 -62263279 -51085247 -19102919 -9467884 -28736595
10412 -28736595 -33821818 -4209825 23617311 18040057 478361 -134650 2546095 -13795426
10404 -13795426 -32705967 -27595112 -9439296 -5159891 -12267732 -13575167 -13695097 -21376814
10396b1376814K830639K8129989K3608041j9409902m5607429j9066761K0431960
10389c0460277K3165761J392945p212127l343324o286374p246910Q972465K4166941
10381C149100J4862247l422796l702595L311959p096594k1142283q007624J8975476
10373c073110J5936248j8419845l5043962r543366K1222369J7216383p432797
10366a9138080j2823876O021747J8313928O539434j2582905j7160729p871359
10359c8701840J425617N453763P509768O522316j011703q683640n002235P083042
10351b5404912J0204245j987300j3583948r458364L809751J0881013Q703094K497277
10343a4339144o000739j2569774p069039Q135014J1947773m331885j7041528n261040
$$ plain form
10396 -21376814 -18546175 9583814 33191855 13781953 -31825476 -50892237 -30460277
10389 -30460277 -7294516 -5901571 -13113698 -16457022 -22743396 -29990306 -21017841 3149100
10381 3149100 18011347 14588551 10885956 14197915 7101321 -14040962 -22048586 -3073110
10373 -3073110 12863138 -5556707 -40600669 -50144035 -28921666 -11705283 -19138080
10366 -19138080 -31961956 -25940209 -7626281 -1086847 -13669752 -30830481 -38701840
10359 -38701840 -37276223 -31822460 -24312692 -17790376 -18802079 -27485719 -32487954 -25404912
10351 -25404912 -15200667 -17187967 -30771915 -40230279 -36420528 -25539515 -16836421 -14339144
10343 -14339144 -20339883 -32909657 -39978696 -31843682 -19895909 -24227794 -41269322 -46530362
10335d6530362J2187529O158262j1741572o500341J9828974K8401882O261147
10328H065519j3889071p193228Q480716P931890l504523p879254n289627n812030
10320a9089608q636768o789235k8005Q370596J5932334J6430874N338058p655047
10312C873199q923822l935406q129945j5198035k946490K4841290L4324487J1021751
10304C4927029j6276100j6880261K302600J5892083J5696962Q996533N03820o374708
10296C8787958n809161q47908l468700j3558685j5389700l372550Q855859J2623364
10288A7820477J4041747J2156930m101936k6001901k4317067M266150K2758572
10281A6622972Q313214j1516103n511743R523166P89872k1660731k1320397L830712
$$ plain form
10335 -46530362 -34342833 -28184571 -39926143 -46426484 -26597510 1804372 8065519
10328 8065519 -5823552 -13016780 -4536064 3395826 -108697 -7987951 -13277578 -19089608
10320 -19089608 -27726376 -34515611 -34543616 -26173020 -10240686 6190188 11528246 3873199
10312 3873199 -5050623 -8986029 -17115974 -32314009 -35260499 -10419209 23905278 34927029
10304 34927029 18650929 1770668 4073268 19965351 35662313 44658846 45162666 38787958
10296 38787958 32978797 32130889 28662189 15103504 -286196 -3658746 5197113 17820477
10288 17820477 31862224 44019154 39917218 13915317 -10401750 -6135600 16622972
10281 16622972 24936186 13420083 7908340 17431506 18221378 -3439353 -24759750 -20929038
10273b0929038K0331215J4243565O314553R602053R025054o546854k1573472j8318032
10265g850956l793906K991713j767890n953501k118297K737308n30414p483972
10257b3769915m179821J1093302J9736871P054632j3398299j6744994k998115
10250b3206339N775734K494154J885482P246983J818382j6404086k3199251p698212
10242e1287153P283458M457034O22221J1241212J7829446K872576j1277482K311585
10234a5947103K3954303J6085677j2669805k0692077l191468K180850j7207622
10227b7487245k6262906k661267K3735099J7991532n903581r681522J0137514
10220b0132376K0461995L417336j8113143j3984558J1413775K5323424J0494594
$$ plain form
10273 -20929038 -597823 13645742 19960295 29562348 38587402 32040548 10467076 -7850956
10265 -7850956 -11644862 -8653149 -10421039 -16374540 -18492837 -15755529 -16285943 -23769915
10257 -23769915 -27949736 -16856434 2880437 9935069 -3463230 -20208224 -23206339
10250 -23206339 -17430605 -14936451 -13050969 -5803986 -3985604 -20389690 -43588941 -51287153
10242 -51287153 -44003695 -39546661 -38924440 -27683228 -9853782 -6981206 -18258688 -15947103
10234 -15947103 8007200 24092877 11423072 -9269005 -12460473 -10279623 -27487245
10227 -27487245 -53750151 -56411418 -32676319 -14684787 -20588368 -30269890 -20132376
10220 -20132376 329619 3746955 -14366188 -28350746 -16936971 8386453 18881047
10213A8881047j2770358j6488795l810936J053555n397856k832960J1086683R588969
10205f90651j6650380l4828590j8362922Q849115J0565508l599908N81502K0027192
10197c4109134K1167755J239042o433281Q974991J8646191N650906q982683o813809
10189f60022m14621l072914m458230K932955L911655j0413053k0897102j0776000
10181d3847332N990653R608753N493336O988704P806181k971282j5486984j3639929
10173d0057900j094840R056687J5613585J9257091R533504j3272673k2124296
10166b3088842N91150K7185396J9895677j0454991k0517492k551094P338993p766613
10158i367816j8652474r05228K5105026K7562839Q308395q600569j2054506o310864
$$ plain form
10213 18881047 6110689 -10378106 -14189042 -13135487 -18533343 -21366303 -10279620 -690651
10205 -690651 -17341031 -52169621 -70532543 -61683428 -51117920 -54717828 -54136326 -34109134
10197 -34109134 -12941379 -11702337 -18135618 -9160627 9485564 15136470 6153787 -660022
10189 -660022 -1074643 -4147557 -8605787 -5672832 -1761177 -12174230 -33071332 -43847332
10181 -43847332 -37856679 -28247926 -22754590 -15765886 -7959705 -10930987 -26417971 -40057900
10173 -40057900 -41152740 -32096053 -16482468 2774623 12308127 -964546 -23088842
10166 -23088842 -22497692 4687704 24583381 14128390 -6389102 -8940196 -1601203 -9367816
10158 -9367816 -28020290 -28925518 -3820492 23742347 32050742 23450173 11395667 5084803
10150E084803L714024J0105680J853531j4923369j5484388N382653J5899369n857340
10142E774963k9948356j5613249K1796672K9762200k84670j9946626j334449K0447225
10134A0653710O420272k4741736k9594351o720003R464977O372359L839056J1056186
10126a3249530J1565440j923143r952563K255622J9155482J7507612o46206j4123739
10118A0588975j2643001n641007m448595p714974o366572K887558J2183700J1119206
10110c4710L66969p219850k521112P523649J0099181M863736K505259O458989
10102B2042111O928835m047351j9540621k4425420j2173967P220917J6035842
10095g959654P360976n811876n855666N798553J1156170L391957m031961k491600
$$ plain form
10150 5084803 8798827 18904507 20758038 5834669 -9649719 -4267066 11632303 5774963
10142 5774963 -24173393 -39786642 -17989970 11772230 11487560 -8459066 -9793515 10653710
10134 10653710 17073982 -7667754 -37262105 -43982108 -34517131 -28144772 -24305716 -13249530
10126 -13249530 -1684090 -3607233 -13559796 -11304174 7851308 25358920 24712714 10588975
10118 10588975 -2054026 -7695033 -12143628 -19858602 -26225174 -23337616 -11153916 -34710
10110 -34710 332259 -6887591 -9408703 -1885054 8214127 13077863 15583122 22042111
10102 22042111 28970946 24923595 5382974 -19042446 -31216413 -23995496 -7959654
10095 -7959654 -598678 -6410554 -12266220 -6467667 4688503 8080460 4048499 1556899
10087A556899k806368j1530093j3430172J928089J5635038Q288576l984350M400161
10079E7780K0677435J2958537j0562949r699863J7499099K4002549j0568271m2469853
10071A894464l0113154L985656J3860924n28988o699986P23409j106585j5947884
10063c3932144k2494295j3649449n076896k228206Q080599K6602640L2003144
10056a0694607J4348740n369020m590739Q732071J0573253k340656q600964M767157
10048F825235K0860314J5121883p990101j7516797K30202J8543867P409007k0558770
10040B2924840k7521880p177882Q379024J499809o379614L569919J4236008L714189
10032A3244413j6474518k1420382j1757553m980610k621104N954299J6985867
$$ plain form
10087 1556899 -1249469 -12779562 -26209734 -24281645 -8646607 -358031 -4342381 57780
10079 57780 20735215 33693752 23130803 13430940 30930039 54932588 44364317 1894464
10071 1894464 -28218690 -24233034 -10372110 -10901098 -17601084 -16877675 -17984260 -33932144
10063 -33932144 -56426439 -70075888 -75152784 -77380990 -69300391 -42697751 -10694607
10056 -10694607 3654133 -1714887 -6305626 2426445 12999698 10659042 2058078 6825235
10048 6825235 27685549 42807432 34817331 17300534 17530736 36074603 43483610 22924840
10040 22924840 -4597040 -11774922 -3395898 -1896089 -8275703 -4705784 9530224 13244413
10032 13244413 -3230105 -24650487 -36408040 -41388650 -44009754 -38055455 -21069588
10025b1069588J6384751M927112l375107l778228k334061m02495L977845N052407
10017f17364k605189j0558793p142064M527393J3437183J7209474J7919453J2229431
10009D4399524M14723o972310o171499q987383j9076058j9052578j179675J1403449
10001e221807K80415j3913153n192645J0944656L915952j5828710j3151826R194806
9993b8972312J4271226m170638j1610918N156808J5903578K813795q133247M519013
9985a0222695J8696634Q360480j0695599q979584O443238N975423j1764850j8106600
9977b0293553n56290J7830847J1126900j5482156l2676147k0590405R796260K8599980
9969b2244564K0152704L13905m988127O813898J5190614P754127m992539r259286
$$ plain form
10025 -21069588 -4684837 242275 -3132832 -6911060 -9245121 -9647616 -5669771 -617364
10017 -617364 -3222553 -13781346 -20923410 -16396017 -2958834 14250640 32170093 44399524
10009 44399524 44814247 37841937 31670438 22683055 3606997 -15445581 -16625256 -5221807
10001 -5221807 -4941392 -18854545 -24047190 -13102534 -9186582 -25015292 -38167118 -28972312
9993 -28972312 -14701086 -18871724 -30482642 -25325834 -9422256 -6608461 -14741708 -10222695
9985 -10222695 8473939 16834419 6138820 -2840764 3602474 9577897 -2186953 -20293553
9977 -20293553 -20849843 -3018996 8107904 -7374252 -40050399 -60640804 -50844544 -22244564
9969 -22244564 -2091860 -1777955 -6766082 47816 15238430 22992557 18000018 8740732
9961H740732o924147p432025j1866748j3319206o917958N476881J6249379J6600615
9953F07523N334900p692447j2285398q957232l180467N041387J5859211K0027132
9945A4754609Q191262j2574087k3697993j6291509J109924J4010029J4553952
9938E6187O411592J435815N194662N581679j0128854k7043758j6385182J5580915
9930a9296944K4624103p046087l6988422k2685322J4794983K5886502P048870
9923a3662317m998406K424016P790897K645505J909225O725726L43042j4726951
9915a1549263j4877774L089493J4370485O829527l304301k918999O24121m58528
9907h195239l308925o942068j2746242j3701741m726353L467923K878239N879264
$$ plain form
9961 8740732 1816585 -5615440 -17482188 -30801394 -37719352 -32242471 -15993092 607523
9953 607523 5942423 -1750024 -14035422 -22992654 -26173121 -21131734 -5272523 14754609
9945 14754609 22945871 10371784 -13326209 -29617718 -28507794 -14497765 56187
9938 56187 6467779 7903594 13098256 18679935 8551081 -18492677 -34877859 -19296944
9930 -19296944 5327159 -1718928 -38707350 -61392672 -46597689 -20711187 -13662317
9923 -13662317 -18660723 -16236707 -8445810 -5800305 -3891080 2834646 3177688 -11549263
9915 -11549263 -26427037 -23337544 -8967059 -2137532 -5441833 -8360832 -7736711 -8195239
9907 -8195239 -11504164 -18446232 -31192474 -44894215 -49620568 -46152645 -43274406 -37395142
9899c7395142J8880154K0552260p75596j5265883J209290J8432831J869654k0896752
9891a3389184o668895K1609085J3930996j3922381j1080976J0088733J731945
9884B299323j6987394M524333L1111524p781997o3731105k7543842M9407271j0092506
9876c8794393j94375309k38661889n479882K63899651K65684246N3412600p9021944
9869B6663080l2430555K7847828l511386l3691042R614915M5188389M794583m0562971
9861C912841j6303016K7276686J7366078j6976413j4822848P969740O892658m277799
9853A1037927N111386J3049915q759695k9589589j0900600K0552187J6942420
9846A7443951j0453401j7499713j990206O001882J922893J523238J060411r064017
$$ plain form
9899 -37395142 -18514988 2037272 1261676 -14004207 -12794917 5637914 7507568 -13389184
9891 -13389184 -20058079 1551006 15482002 1559621 -9521355 567378 2299323
9884 2299323 -14688071 -10163738 20947786 13165789 -50565316 -78109158 -28701887 -38794393
9876 -38794393 -233169702 -471831591 -477311473 -213411822 52272424 105685024 26663080
9869 26663080 -5767475 22080353 18568967 -15122075 -5507160 39681229 44475812 3912841
9861 3912841 -12390175 14886511 32252589 15276176 453328 8423068 15315726 11037927
9853 11037927 16149313 29199228 20439533 -9150056 -20050656 501531 17443951
9846 17443951 6990550 -10509163 -12499369 -6497487 -4574594 -3051356 -1990945 -11054962
9838a1054962j3050390L476184J8071996N969269j3010255n787309J7232667K1468037
9830B3315237N651545m825894o518367j4634751k2511806r524584J5843976K2805649
9822I601005P291346l403035L375365R427960P36142j1047943j0751817r66375
9814D262648P272437R368967O556916J100413m349118q356884j0895446r958977
9806d999044m703399k597568j0660496j8258798p182358J7056383K6971025J4044131
9798I669876J649982M561406M894109j1510485k3600951q342005J7698945K2350429
9790A7371306O794792k530608R31037O90768p128365q221180k77236Q60149r883596
9781a392933j5870901m440939J3871934J9466710O404256j3141279k0835797r142890
$$ plain form
9838 -11054962 -24105352 -20629168 -2557172 3412097 -9598158 -15385467 1847200 23315237
9830 23315237 28966782 24140888 17622521 2987770 -19524036 -29048620 -13204644 9601005
9822 9601005 16892351 13489316 16864681 26292641 27028783 15980840 5229023 4262648
9814 4262648 11535085 20904052 27460968 28561381 24212263 15855379 4959933 -4999044
9806 -4999044 -9702443 -12300011 -22960507 -41219305 -48401663 -31345280 -4374255 9669876
9798 9669876 11319858 15881264 20775373 9264888 -14336063 -22678068 -4979123 17371306
9790 17371306 24166098 21635490 22566527 23257295 16128930 7907750 7630514 8490663 -1392933
9781 -1392933 -17263834 -21704773 -7832839 11633871 18038127 4896848 -15938949 -25081839
9773b5081839R259626J4012928K466573p648200n263323J48003J69386L274141
9765h662705J4217787J7434649J958250j4225879r708641M368808K035726j3711522
9757f293527j5842110J642193J4515291O970667q026741j3520614j0095201m174182
9749c4824224M961883J6151292K0003569J1707246q17699q391005j0341550q676264
9741a0226752l513981J567747Q33016k871358l28595O744770M171954j1133745
9733a4756944j9754667n356242J7718166K0240424m27500j3774653J545770K5288124
9725A0722478K2614395m963169j9641718k062041J9090426R095260k0705531k9656539
9717a5506439p171753J5671387J4823721K765181n55918J255842l679851j0312575
$$ plain form
9773 -25081839 -15822213 -1809285 657288 -6990912 -12254235 -12106232 -11936846 -8662705
9765 -8662705 5555082 22989731 24947981 10722102 1013461 5382269 7417995 -6293527
9757 -6293527 -22135637 -20493444 -5978153 992514 -7034227 -20554841 -30650042 -34824224
9749 -34824224 -29862341 -13711049 6292520 17999766 17182067 8791062 -1550488 -10226752
9741 -10226752 -13740733 -12172986 -11339970 -14211328 -14539923 -7795153 -3623199 -14756944
9733 -14756944 -34511611 -39867853 -22149687 -1909263 -2336763 -16111416 -14565646 10722478
9725 10722478 33336873 28373704 8731986 6669945 25760371 34855631 14150100 -15506439
9717 -15506439 -22678192 -7006805 7816916 10582097 10026179 11282021 7602170 -2710405
9709b710405p439886L41143J644957q8336P054224K0904470K5843106J4315507
9701E9864780m395521j5756227j2707838k30680P290857r06022j6974520k0668741
9693d483912n135488J3605357J8020658Q432681m161266j1507483q912440K325330
9685H183437P915095n694356k4493916j7637099J4244376K9793349N381002k5833803
9677h141915k2106547M448500J1016217p304715j5438099P64846J5646520J1615603
9669i499590O073105J5422794K4339110J1987820j3126864k6105829j9950349
9662a0859803q137203j168661K884209P296571Q947415L691066o141670j1740578
9654a5228654n737928Q389076J6842256R412192q573331k2132063k2362979j2236036
$$ plain form
9709 -2710405 -10150291 -9809148 -8164191 -8252527 -1198303 19706167 45549273 59864780
9701 59864780 55469259 39713032 27005194 26774514 34065371 33159349 16184829 -4483912
9693 -4483912 -9619400 3985957 22006615 30439296 26278030 14770547 5858107 8183437
9685 8183437 16098532 10404176 -14089740 -31726839 -17482463 12310886 17691888 -8141915
9677 -8141915 -30248462 -25799962 -14783745 -22088460 -37526559 -36761713 -21115193 -9499590
9669 -9499590 -3426485 11996309 36335419 48323239 35196375 9090546 -10859803
9662 -10859803 -18997006 -20165667 -17281458 -9984887 -1037472 2653594 -3488076 -15228654
9654 -15228654 -20966582 -12577506 4264750 13676942 5103611 -17028452 -39391431 -51627467
9646e1627467L54776R936348J5071760J6380025J3093650L182010r252724j1402277
9638a4263899K755920J7641388J2633549o638778j3168029J506632J4572099P751663
9630B2790545p281251j2387786r317889o118388J026488J2916649J4881405Q29637
9622A7339410r718485j483549R586079M231395o168079k961864K927020p676910
9614F075017k1318431j1454624J3081631J9428806L047218j0543460j0574214
9607a2258057q242890m379459Q930383J8392579M684944j5054326o955786J7956804
9599C074192J4607649j8580949l0910734k940462K0582960O965783j2229763j208696
9591b0640020J8988431J4040909j435340M907630K2349125J9098994J388179m60605
$$ plain form
9646 -51627467 -51272691 -41336343 -26264583 -9884558 3209092 6391102 -2861622 -14263899
9638 -14263899 -11507979 6133409 18766958 12128180 -1039849 466783 15038882 22790545
9630 22790545 15509294 3121508 -6196381 -12314769 -11288281 1628368 16509773 17339410
9622 17339410 7620925 6137376 15723455 19954850 13786771 10824907 13751927 6075017
9614 6075017 -15243414 -26698038 -13616407 5812399 8859617 -1683843 -12258057
9607 -12258057 -20500947 -24880406 -15950023 2442556 7127500 -7926826 -14882612 3074192
9599 3074192 17681841 -899108 -31809842 -34750304 -14167344 -7201561 -19431324 -20640020
9591 -20640020 -1651589 12389320 10953980 15861610 38210735 57309729 58697908 58237303
9583E8237303J1175119P639711j2504249k2624663j5739643j0369661j0856671
9576D957246k562866J2327332J3052174j180255o794362L090493O919426o078548
9568B3730640j6300654p719143M775408m37126j8412509k5469475j0248212J4588329
9560c5492742K6353918J4085361q451413j4306854L624438J9066802O793760j8850391
9552g177121k2979127k255273J1228322O15444j2139803n168583Q735478O538517
9544b2602146o384220o838171P401433J4245724K049564j2785674r638337Q250166
9536b6301661J9936191J5142442M760820J550915J669520m972145j3264246p932510
9528i410674R988504J9704206J0028630m975977r617947q256133r515082p022781
$$ plain form
9583 58237303 69412422 77052133 64547884 41923221 26183578 15813917 4957246
9576 4957246 2394380 14721712 27773886 26593631 19799269 22889762 29809188 23730640
9568 23730640 7429986 -289157 4486251 4049125 -14363384 -39832859 -50081071 -35492742
9560 -35492742 -9138824 4946537 -3504876 -17811730 -14187292 4879510 11673270 -7177121
9552 -7177121 -30156248 -32411521 -21183199 -20567755 -32707558 -37876141 -29140663 -22602146
9544 -22602146 -28986366 -35824537 -28423104 -14177380 -12127816 -24913490 -34551827 -26301661
9536 -26301661 -6365470 8776972 13537792 15088707 16758227 11786082 -1478164 -9410674
9528 -9410674 577830 20282036 30310666 25334689 15716742 7460609 -2054473 -9077254
9520i077254M630498J1332147J228874r242200j25517J3118628R67507k5905009
9512a3072326k5278399R295998L2615733J4919205j4433405j5365208M067000
9505g251402J0115619M06379L24576J4355462J8938278L843979j1025932p586599
9497B2120360M966608O759301o039339k0440233k3378227j2912479J721539Q613952
9489a8588518N731252L597321J0469012J9035553J5958672R63898j3251332j7815017
9481F100841j4603811q111009n81717N059598O627610P009885R297614R483231
9473B0282242K970037m536331m152450K84088k669780j1388076j1990967k792789
9465a3994026L71787q743582j2995234N76703J5816750J0807215n266932m714694
$$ plain form
9520 -9077254 -4446756 6885391 8114265 -1127935 -1253452 11865176 12832683 -13072326
9512 -13072326 -38350725 -29054727 3561006 18480211 4046806 -11318402 -7251402
9505 -7251402 2864217 3270596 3595172 17950634 36888912 40732891 29706959 22120360
9497 22120360 27086968 33846269 27806930 7366697 -16011530 -28924009 -27202470 -18588518
9489 -18588518 -12857266 -9259945 1209067 20244620 36203292 37167190 23915858 6100841
9481 6100841 -8502970 -16613979 -17195696 -12136098 -5508488 1501397 10799011 20282242
9473 20282242 23252279 18715948 14563498 14847586 12177806 789730 -11201237 -13994026
9465 -13994026 -13622239 -22365821 -35361055 -34784352 -18967602 -8160387 -13427319 -18142013
9457a8142013J2948353J7290690m588420k4365364j3958091J2264913K0526455
9450A976523O746997n805175q332271j2913696j8191345n069411K2736562K8821056
9442I969240l394217l7043764l0075346M665283K2120822J2454270N576764J4233830
9434a493118J6293801L48504j1835873m370583N934271K134924l845480J735601
9426D902047O316509k311842o630395R938589K4159864M614202l1212077l5561220
9418b5784323k649100K2543871J3847730j578477M896978J6446382L767666k3173412
9410H317315k9641025p730068J6834002K3368783J6075914O526662j588099o618789
9402B5544695m629454K502531M773554l923179j6204078j7866129l671542J4395733
$$ plain form
9457 -18142013 -5193660 12097030 7508610 -16856754 -30814845 -18549932 1976523
9450 1976523 8723520 2918345 -5413926 -18327622 -36518967 -41588378 -18851816 9969240
9442 9969240 6575023 -30468741 -60544087 -55878804 -33757982 -21303712 -15726948 -1493118
9434 -1493118 14800683 15149187 3313314 -1057269 4877002 7011926 3166446 4902047
9426 4902047 11218556 8906714 2276319 12214908 36374772 40988974 9776897 -25784323
9418 -25784323 -28433423 -5889552 7958178 6379701 11276679 27723061 31490727 8317315
9410 8317315 -21323710 -29053778 -12219776 11149007 27224921 33751583 32163484 25544695
9402 25544695 20915241 23417772 28191326 24268147 8064069 -9802060 -13473602 922131
9394I22131J7055479l15902j8623843j6117098L447451J5831907R828545j07475
9386A1921195N41960N921270N443635L011933M974042K805067j2396749k7279873
9378e057520k0138985N519972K1992519J3566468n829349j4786292q966419K043730
9370a1655876R840247J1642324P393368p73002q652085j1551931n447338Q593215
9362f11078J7953967O372922k1907645l6416053j5598201J9365075K7446112K958243
9354d36658j6546432l623094K1707568K2695528l625901k6182678k1536061K428645
9346b5119083K2216986K3348853P989166j0666367j7755384p654770R906054J7811492
9338B0076947Q786336p013553j4167411j0124650o129792q768470q632855L846071
$$ plain form
9394 922131 17977610 17661708 -962135 -17079233 -13631782 2200125 12028670 11921195
9386 11921195 12463155 18384425 23828060 26839993 31814035 34619102 22222353 -5057520
9378 -5057520 -25196505 -19676533 2315986 15882454 10053105 -4733187 -13699606 -11655876
9370 -11655876 -1815629 9826695 17220063 16447061 7794976 -3756955 -9204293 -611078
9362 -611078 17342889 23715811 1808166 -34607887 -50206088 -30841013 -3394901 -436658
9354 -436658 -16983090 -20606184 1101384 23796912 20171011 -6011667 -27547728 -25119083
9346 -25119083 -2902097 20446756 28435922 17769555 14171 -7640599 2265455 20076947
9338 20076947 28863283 21849730 7682319 -2442331 -8572123 -17340593 -25973448 -22127377
9330b2127377J7521173J2015074r215133j7617593l95609J7829802J1014181q867016
9322A57502j2282904J404791P182474k794310j1208124r862858r899726j2860513
9314e0163668l543867J7539418K4698735N708515j6445622j8096714o833460M40922
9306d6695741P145371K0397295K5833703Q271004j6577103k0617865n106161M176671
9298b3172826j597754n206138M524159J6652874J8463982J1934076M169561l421082
9290B2346852j0577959j3220011p737959M317282J5522209J5293123Q01388j2960451
9282A3784474p898511Q089961P139856j3927568k1552481K492328K5294937J0506137
9274B3929133k1977050k5042443K403751J7885508N036612q241785m938388l506639
$$ plain form
9330 -22127377 -4606204 7408870 -1806263 -19423856 -19819465 -1989663 9024518 157502
9322 157502 -12125402 -10720611 -3538137 -6332447 -17540571 -27403429 -37303155 -50163668
9314 -50163668 -53707535 -36168117 -11469382 -5760867 -22206489 -40303203 -47136663 -46695741
9306 -46695741 -39550370 -19153075 6680628 14951632 -1625471 -22243336 -27349497 -23172826
9298 -23172826 -24770580 -29976718 -25452559 -8799685 9664297 21598373 25767934 22346852
9290 22346852 11768893 -1451118 -9189077 -4871795 10650414 25943537 26744925 13784474
9282 13784474 5885963 13975924 21115780 7188212 -14364269 -11871941 13422996 23929133
9274 23929133 1952083 -23090360 -20686609 -2801101 2235511 -6006274 -10944662 -14451301
9266a4451301j4224984j6122470K037573J7010283J1241079K909587R806736J5779827
9258A3986330K998458j1657119o102554O065997Q25936j0726118k100845J8011423
9250A1301508J7616596l165536j1621606J990381J0205452k034460j2492312k619717
9242I180306R643655P37082j9120033k2560352n930559J0169117J2749902P993895
9234B863013M520607K603611N95083l61466J89213J211079K481478K569187k110595
9225A4561210j0347921j3303156o550527M20027k575263q191008j173727J4294564
9217a2865801J4497351r369860l2189632k4429103Q343116L1597324K4561051
9210A44446J335040j2116820p932240K371974O132036J524574l305763J273693
$$ plain form
9266 -14451301 -28676285 -44798755 -42761182 -25750899 -14509820 -11600233 -1793497 13986330
9258 13986330 16984788 5327669 -774885 5291112 6117048 -4609070 -6709915 11301508
9250 11301508 28918104 25752568 14130962 16121343 26326795 24292335 11800023 9180306
9242 9180306 18823961 19561043 441010 -22119342 -28049901 -17880784 -5130882 2863013
9234 2863013 7383620 9987231 10582314 10220848 10410061 11621140 14102618 16671805 14561210
9225 14561210 4213289 -9089867 -15640394 -15220367 -17795630 -25986638 -27160365 -12865801
9217 -12865801 1631550 -7738310 -39927942 -64357045 -56013929 -24416605 144446
9210 144446 1479486 -10637334 -18569574 -16197600 -10065564 -8540990 -11846753 -10573060
9202a0573060J4571524K2163476J2235758n481791r990464L04794M597600o056456
9194B1771381j2036954K321534J8840526J1747617r519230j3064514M925690J4064133
9186C9050183j460019j8385417j2391240M218074L608744j4643774k5090949j4819580
9178c9913978J137424M879129n22867m17817P753194J1572874L442243p217478
9170a9287276p763141j181617K10373l318581Q40937J3315991J7545230P555100
9162G917016J165889J0291335J7291811K956607j8384507j9634446m880742m03508
9154c680545q594008o738552Q198117J1184548o339934j8791862p668599J0196307
9146b2234528J2887173N278482J954124J571314k211770m015224M65236K434989
$$ plain form
9202 -10573060 3998464 26161940 38397698 32915907 22925443 23230237 27827837 21771381
9194 21771381 9734427 12055961 30896487 42644104 33124874 20060360 24986050 39050183
9186 39050183 37590164 19204747 6813507 11031581 14640325 -3449 -25094398 -39913978
9178 -39913978 -38776554 -33897425 -34420292 -34838109 -27084915 -15512041 -12069798 -19287276
9170 -19287276 -27050417 -28232034 -28021661 -31340242 -30499305 -17183314 361916 7917016
9162 7917016 9082905 19374240 36666051 39622658 21238151 1603705 -3277037 -3680545
9154 -3680545 -12274553 -19013105 -10814988 369560 -5970374 -24762236 -32430835 -22234528
9146 -22234528 -9347355 -4068873 -2114749 -543435 -2755205 -6770429 -6305193 -3870204
9138c870204k714358l557901O479425J4550859R968942J646587q79710l564967
9130A8058673r844090r135709j51675p86549j5171086j8033159L903848K2956639
9122h203108J2599491q349582q521587L751126J100517j0992621p892674M274367
9114b2234071N01725j1287042r98436K4319259K4092328p763181k8765253j4160569
9106c6295240Q943737J1010100J386672j358725k738592j0545539j1118620N564247
9098c5151960K1502073J6589012p42903j0371954r288113l644405Q883899K7143126
9090A4918775L3281234J4093928j5416354k8788436j9885863l895606L710103
9083a982219k280755j6298025k2725930r963044R717833J1886817k253423l996468
$$ plain form
9138 -3870204 -6584562 -10142463 -3663038 10887821 20856763 22503350 21623640 18058673
9130 18058673 8214583 -921126 -1072801 -1859350 -17030436 -35063595 -31159747 -8203108
9122 -8203108 4396383 -3953199 -12474786 -8723660 -7623143 -18615764 -26508438 -22234071
9114 -22234071 -21732346 -33019388 -34017824 -9698565 14393763 6630582 -22134671 -36295240
9106 -36295240 -27351503 -16341403 -14954731 -16313456 -19052048 -29597587 -40716207 -35151960
9098 -35151960 -13649887 2939125 2196222 -8175732 -17463845 -21108250 -12224351 14918775
9090 14918775 48200009 62293937 46877583 18089147 -1796716 -5692322 -1982219
9083 -1982219 -4262974 -20560999 -43286929 -53249973 -43532140 -31645323 -33898746 -37895214
9075c7895214J6033521K8108696J0202148j3614863r847441J2181710J8371296
9068B3539853M250211m906580k21949P19459j0246988j8325408j3318954m031904
9060b2542260J517834P368874J3951446J1874329O1489p561384k981463K924427
9052D613292j961212j2234556j4113307n467519K737671J793097m132692l239832
9044c2005058Q324201J7571859Q439809j3134735k0241108p13607K1485689J7547550
9036G274600m601872j3563383l077937K119765q332486j1114459J0243258L2712102
9028A1659588K5316976m182904k0604384j0475075N928107R097751K057939n850680
9020A2947318j4105641k0199725j2358874J1906659L1736140K4347966l852192
$$ plain form
9075 -37895214 -21861693 6247003 16449151 2834288 -7013153 5168557 23539853
9068 23539853 27790064 22883484 22661535 23380994 13134006 -5191402 -18510356 -22542260
9060 -22542260 -21024426 -13655552 295894 12170223 12231712 4670328 1688865 4613292
9052 4613292 2652080 -9582476 -23695783 -29163302 -26425631 -24632534 -28765226 -32005058
9044 -32005058 -23680857 -6108998 2330811 -10803924 -31045032 -31758639 -10272950 7274600
9036 7274600 2672728 -10890655 -13968592 -11848827 -20181313 -31295772 -21052514 11659588
9028 11659588 36976564 32793660 12189276 1714201 7642308 16740059 18797998 12947318
9020 12947318 -1158323 -21358048 -33716922 -21810263 9925877 34273843 30421651
9013C0421651k2432946j3343901R834495K1746666J4541129J472672l336156j528880
9005C7374730n328538j8134362k5515046j1781849J5739638K9913687J6170124
8998C8438384r633202k4466692k6116344k2924926r638735K0632771M7346951
8991A3638207L8336112j019730k6831986j6575884J513715l303207j8155157j5631224
8983b8029154j745847K3674o388910R83609J8621022K1264208M823895r303830
8975B48667j0658561p520545j222492J2302639J7640804l944956l2101743k4799118
8967e0055305J4149262L1307958L266144k6771039j7696593Q208915Q814275r080956
8959c7857339q468763J3680342K5821106J4425077k095518q225136p997360p581961
$$ plain form
9013 30421651 7988705 -5355196 4479299 26225965 40767094 42239766 38903610 37374730
9005 37374730 32046192 13911830 -11603216 -23385065 -7645427 22268260 38438384
8998 38438384 28805182 4338490 -21777854 -44702780 -54341515 -33708744 13638207
8991 13638207 51974319 50954589 24122603 7546719 9060434 5757227 -12397930 -28029154
8983 -28029154 -29775001 -29751327 -36140237 -35156628 -16535606 4728602 9552497 248667
8975 248667 -10409894 -17930439 -19152931 -6850292 10790512 6845556 -25256187 -50055305
8967 -50055305 -35906043 -4598085 -1331941 -28102980 -45799573 -37590658 -28776383 -37857339
8959 -37857339 -46326102 -32645760 -6824654 7600423 5504905 -2720231 -10717591 -18299552
8951a8299552o418323n143846l923596K492206J2879567J3161584j654594j3405724
8943b0312278p835504J140702k489757n067395J2432328L4224515K9399387K009635
8935D3501633j5209963j1875374p510357r778370m029767J0595976J1979270o713403
8927A0959645k1388551j3594673L441049Q646045L81576j1548493j9810722j5530092
8919e8444216P467149L3671271L3585835L223610k4944238k3997360n164840O468827
8911b8133962Q234383J2006185J6148506Q562124r353606k1144860j6142697J75250
8903b9648677J4373303J5809405L788254r577147r351220M151238J4341909R922494
8895A3809559j586984p487394p048122p037842q548273p604086l892815j067568
$$ plain form
8951 -18299552 -24717875 -29861721 -33785317 -31293111 -18413544 -5251960 -6906554 -20312278
8943 -20312278 -28147782 -27007080 -29496837 -34564232 -22131904 12092611 41491998 43501633
8935 43501633 28291670 16416296 8905939 -872431 -4902198 5693778 17673048 10959645
8927 10959645 -10428906 -24023579 -20582530 -11936485 -11554909 -23103402 -42914124 -58444216
8919 -58444216 -50977067 -17305796 16280039 19503649 -5440589 -29437949 -34602789 -28133962
8911 -28133962 -19899579 -7893394 8255112 16817236 7463630 -13681230 -29823927 -29648677
8903 -29648677 -15275374 534031 4322285 -5254862 -14606082 -10454844 3887065 13809559
8895 13809559 12222575 4735181 -2312941 -9350783 -17899056 -25503142 -29395957 -30463525
8887c0463525q88069j667854n15003M317158J0469356J2069218P525849L090417
8879C937547K379554j304992j1885553j7156649m261117J6344569K1297986P249053
8871A6600398o426273q275947o558236o988896j855117J0171686J4720796M218026
8863A5606437q277058j0306560q388366j1094120r537170P083791K6862047K5758558
8855B7707559O76263k2756572j8359264J1122720L4952628K5073505j2452997
8848D5963842m0500782l1186559K676396K5930936K2859474N485525j1696958
8841A9531874k3228224k2750811o942708R531630P868795m221634k468105J1467287
8833a1211896J0412825q221676j1105901J4476509L0714235N493158l2008256
$$ plain form
8887 -30463525 -31351594 -33019448 -33534451 -29217293 -18747937 -6678719 847130 3937547
8879 3937547 6317101 5012109 -6873444 -24030093 -28291210 -11946641 9351345 16600398
8871 16600398 10174125 1898178 -4660058 -11648954 -13504071 -3332385 11388411 15606437
8863 15606437 7329379 -2977181 -11365547 -22459667 -31996837 -24913046 1949001 27707559
8855 27707559 28383822 5627250 -12732014 -1609294 33343334 58416839 45963842
8848 45963842 5463060 -25723499 -23047103 2883833 25743307 31228832 19531874
8841 19531874 -3696350 -26447161 -33389869 -23858239 -15989444 -20211078 -22679183 -11211896
8833 -11211896 -799071 -9020747 -20126648 -5650139 25064096 30557254 -1451002
8826a451002k9569608J2773086M4317795L3443385J429151j4893329p349844M171599
8818D2871233R46233j3521202j8789357m767060J0529374L930329j5833605j8288446
8810a2922501J83958J0379656J800126J278208K0513951K6711976j723920k8954277
8802A7267177j5423238J3902457Q133524k4891400l1942771k302059J8822823
8795a6433487P065633r124124n327478L125286J506838M382282J9180183K2213872
8787B6589005P485j9873928j0740482Q560415M266811j8147204k4905266o364145
8779d0607309J3851146J7174987R963787M548746K067861j720270p538149j2872530
8771a5131731j2883431j660700J9388842L5785732L1335655O808127j8303741
$$ plain form
8826 -1451002 -31020610 -18247524 26070271 59513656 60942807 46049478 38699634 42871233
8818 42871233 43817466 30296264 11506907 6739847 17269221 21199550 5365945 -12922501
8810 -12922501 -12738543 -2358887 -558761 719447 21233398 47945374 46221454 17267177
8802 17267177 1843939 15746396 23879920 -1011480 -32954251 -35256310 -16433487
8795 -16433487 -9367854 -18491978 -23819456 -20694170 -19187332 -14805050 4375133 26589005
8787 26589005 26596490 6722562 -4017920 4542495 8809306 -9337898 -34243164 -40607309
8779 -40607309 -26756163 -9581176 382611 4931357 6999218 5278948 -2259201 -15131731
8771 -15131731 -28015162 -29675862 -10287020 25498712 56834367 63642494 45338753
8764D5338753k5038890j3352070Q62986N292003K273384j979582r826217k1857938
8756a8287571k2224122K881893L2865808K9234445o340809k5172967l077873J8663120
8748H541924j333067l3371179k2303247J9674701K9261140o066424k9678573r155553
8740d4430278J6730164R182904r736345l706529J6113341J7885215M036067k170834
8732C903705l9923k499703l825780O682015J5369526M379881j2704741j0608199
8724F56781L667458K546947j4088752j9169567m687154P617315N580839M207926
8716a3668207J4159524K0023488N708885j6799203k1675545m239189J2972610
8709c517637R273218q630539j6741339o456622M598351P60048o250257K799527
$$ plain form
8764 45338753 20299863 6947793 7810779 13102782 15376166 13396584 3570367 -18287571
8756 -18287571 -40511693 -37629800 -4763992 24470453 18129644 -7043323 -10121196 8541924
8748 8541924 7208857 -26162322 -48465569 -28790868 470272 -5596152 -35274725 -44430278
8740 -44430278 -27700114 -18517210 -28253555 -31960084 -15846743 2038472 6074539 3903705
8732 3903705 3863782 1364079 -2461701 4220314 19589840 23969721 11264980 656781
8724 656781 4324239 6871186 -7217566 -26387133 -31074287 -23456972 -17876133 -13668207
8716 -13668207 491317 20514805 26223690 9424487 -12251058 -16490247 -3517637
8709 -3517637 5755581 -2874958 -19616297 -26072919 -21474568 -20714520 -26964777 -24165250
8701b4165250J9733878J9708334K927536n153335K042238J897582j3935597k1245483
8693a8190097n763377R927766N297319l365825N147421J7938283J1904686o595028
8685A6301148j7219641j9440614j9870074q432348J8274503L2103779J1404156
8678A3120909j5426952q119845J9517420K0350243q910988k3849250o196507J0339928
8670H24958o39348j8837155j6228710K46017O675325j740793j1143173r656696
8662e0499575L510638J7737833J7237886r918j4163897r378195L010898O600615
8654b5953715Q298492J6882646J3646708j6030950l9717741j6996069K8792514
8647c1078115L5324936l469769k8727700j1400892R301005K417589m600301J3603322
$$ plain form
8701 -24165250 -4431372 15276962 18204498 13051163 15093401 16990983 3055386 -18190097
8693 -18190097 -23953474 -14025708 -8728389 -12094214 -6946793 10991490 22896176 16301148
8685 16301148 -918493 -20359107 -40229181 -48661529 -30387026 1716753 13120909
8678 13120909 -2306043 -10425888 9091532 29441775 20530787 -3318463 -9514970 824958
8670 824958 185610 -18651545 -34880255 -34634238 -27958913 -29699706 -40842879 -50499575
8662 -50499575 -46988937 -29251104 -12013218 -12023136 -26187033 -35565228 -32554330 -25953715
8654 -25953715 -17655223 -772577 12874131 -3156819 -42874560 -59870629 -31078115
8647 -31078115 4246821 777052 -27950648 -39351540 -30050535 -27632946 -32233247 -18629925
8639a8629925K7662285O691416k2176635j7416403Q680010J5477884J293866m012155
8631b429657M886888P302938L8814k66564P259882O347492m979173j1879949q885972
8622b605301l530715J363003O739179N632111o411087j7082145j2907511n2861
8614b8855327P467275Q139584N524275k907247j2127104n255854J6609935K3934905
8606A2530442L318231j3202263M362365L1667883K4905989j0922331l2379081
8599B0281235k4159600j0533861o294755p50772Q861005R069527N3777j689659
8591e163103M926235L750267n639550n555014N874552J0496205L834871J498084
8583A4022547P527913P470302k056752p167485m437151m694872o258451L283688
$$ plain form
8639 -18629925 9032360 15723776 -6452859 -23869262 -15189252 288632 1582498 -2429657
8631 -2429657 2457231 9760169 9798983 9532419 16792301 23139793 18160620 6280671 -2605301
8622 -2605301 -6136016 -4773013 1966166 7598277 1187190 -15894955 -28802466 -28855327
8614 -28855327 -21388052 -13248468 -7724193 -10631440 -22758544 -28014398 -11404463 12530442
8606 12530442 15848673 2646410 7008775 38676658 63582647 52660316 20281235
8599 20281235 -3878365 -14412226 -20706981 -21457753 -12596748 -3527221 -3473444 -5163103
8591 -5163103 -236868 3513399 -2126151 -7681165 -1806613 8689592 12524463 14022547
8583 14022547 21550460 29020762 26964010 19796525 15359374 10664502 4406051 7689739
8575G689739J5824688R008272j1351557j3534290P047993J7309765J674382j3372063
8567B0296929p901471j123723j1325247k0582954q499707J0401464J3218294N563948
8559D7533K704537n07848j0828651j2480692N523328J9845444N574301j9239949
8551i361997j7770142R820027K9713442K4309700N988701j1449288k3271648k1309631
8543a3330836j797650J7390631J5119058j157504q174414m845293p880064j5545837
8535b0221909r732810P201686J2527503K859579p30869O889141M883843j2367116
8527h690952j9230354j345685J7342124J2254359l938954o484768P50388j470035
8519a0813877j0092892o526345P212173R365141n145880j5578549p632815O364512
$$ plain form
8575 7689739 23514427 32522699 21171142 7636852 14684845 31994610 33668992 20296929
8567 20296929 12395458 11271735 -53512 -20636466 -29136173 -18734709 -5516415 47533
8559 47533 2752070 2244222 -8584429 -21065121 -15541793 4303651 9877952 -9361997
8551 -9361997 -27132139 -17312112 12401330 36711030 42699731 31250443 7978795 -13330836
8543 -13330836 -15128486 2262145 17381203 16223699 8049285 3203992 -4676072 -20221909
8535 -20221909 -29954719 -22753033 -10225530 -7365951 -8096820 -1207679 3676164 -8690952
8527 -8690952 -27921306 -29266991 -11924867 329492 -3609462 -10094230 -9343842 -10813877
8519 -10813877 -20906769 -27433114 -20220941 -10855800 -16001680 -31580229 -39213044 -32848532
8511c2848532Q165155p80353m829656L172203J3925447J4189576K655514p735782
8503d086428m701167O830115R616262k055025j3332249j0631759j436628l5483
8495a9832362l642884l44833O029065J019463j1973827j2443069L671842J5420454
8487b2096151J0973945N820303J2022423J3490428n323832k5830463j9379789
8480c0323136P332849K1375850J1284757m692674j3678758j8732908j5347881
8473d2781901O274017L0572780K6402221k037258j3938336K523320P944294j8062964
8465c103827l1698066N344130N1029603L8284661j9109566m4203870j3137658
8458a6594593J6995474N965068j3262375l439405J2695537j66663k3862822j8117919
$$ plain form
8511 -32848532 -24683377 -25463730 -30293386 -27121183 -13195736 993840 3649354 -4086428
8503 -4086428 -8787595 -1957480 7658782 5603757 -7728492 -18360251 -19796879 -19832362
8495 -19832362 -23475246 -23820079 -17791014 -16771551 -28745378 -41188447 -37516605 -22096151
8487 -22096151 -11122206 -5301903 6720520 20210948 14887116 -10943347 -30323136
8480 -30323136 -22990287 -1614437 9670320 4977646 -8701112 -27434020 -42781901
8473 -42781901 -36507884 -5935104 20467117 18429859 4491523 7014843 14959137 -3103827
8465 -3103827 -34801893 -29457763 21571840 59856501 40746935 -3456935 -16594593
8458 -16594593 400881 6365949 -6896426 -10335831 2359706 2193043 -21669779 -39787698
8450c9787698J1195252K4271069J0857933l413021m663267l433652l536218L840587
8442d669015J3605184P916428j1543308k1507581j2910291k234024q38534R41787
8434c1239354R656342J3358142M222184l885638K693714J3101484P987004r356320
8426F537558j6408244l507736J3309930J4713215K101107p733560o220758j738195
8418A053317l456272o032218M58778J0781574R413365l795129r603981J470608
8410B90042J2638962P006972m663779k047750R443674O124313j4310904k6359471
8402a1877941j4545383N222901J1664426O106927J544716k02618l930227m788320
8394a0805519M754670J6673979J4514586p10787q636434R61095J1590848M047398
$$ plain form
8450 -39787698 -28592446 -4321377 6536556 3123535 -1539732 -4973384 -8509602 -4669015
8442 -4669015 8936169 16852597 5309289 -16198292 -29108583 -31342607 -32181141 -31239354
8434 -31239354 -21583012 -8224870 -4002686 -7888324 -5194610 7906874 15893878 6537558
8426 6537558 -9870686 -13378422 -68492 14644723 16745830 9012270 2791512 1053317
8418 1053317 -2402955 -8435173 -7976395 2805179 12218544 8423415 -1180566 290042
8410 290042 12929004 19935976 15272197 13224447 22668121 28792434 14481530 -11877941
8402 -11877941 -26423324 -21200423 -9535997 -3429070 -1884354 -2086972 -6017199 -10805519
8394 -10805519 -6050849 10623130 25137716 24426929 15790495 16751590 28342438 32389836
8386C2389836j3531639j5838165K386608J7298222R428278r651496j5927525o394419
8378A59700K217465J214569j957446j341732J66370K094469P047355Q003515n258423
8369A2345842k2729988j9506261O679623K6302789J9569882L925850K288826O979159
8361C5855722j29836j1304519p237191N730346N345261o864208q463313L630987
8353A6563249Q084156l203712j2779514r016795k068526m62940K460391R067630
8345H643939Q264618l103508j1018775p310479j928230k239574p92905N385154
8337d099760M636936p071606j4009486n195071P773135J1517117J0068975Q429053
8329A2049293j569394k0120674k5388674m384236J9770625J7913501j734407q277802
$$ plain form
8386 32389836 18858197 3020032 5406640 22704862 32133140 22481644 6554119 159700
8378 159700 2377165 3591734 1634288 292556 458926 2553395 9600750 17604265 12345842
8369 12345842 -10384146 -29890407 -23210784 3092005 22661887 26587737 28876563 35855722
8361 35855722 35725886 24421367 17184176 22914522 28259783 21395575 12932262 16563249
8353 16563249 24647405 21443693 8664179 -352616 -2421142 -2884082 -423691 8643939
8345 8643939 16908557 13805049 2786274 -4524205 -6452435 -8692009 -9484914 -4099760
8337 -4099760 537176 -6534430 -20543916 -25738987 -17965852 -6448735 3620240 12049293
8329 12049293 10479899 -9640775 -35029449 -39413685 -19643060 -1729559 -3463966 -11741768
8321a1741768L966042J1997981L703387q007221j0989106q527010n374612m45104
8313b5417411L706196K576663J966526J0336631J9217482J1441082r793622k0861989
8305f828442j0254898Q095594J7616535J6094019O409797r164734k0057344j3456950
8297a1546423L660283Q691447l005697j0117793j93341J0547259N458957o534041
8289c039349r407850m152034K820216J4284205K5366305J5149206j8416843l7279868
8281a4676012j1682870K7124114K4455295j6207234l6353198r605856K3435557
8274a3510204K2932879N720030M797642J1710163p85750k3725714k3865735O2627
8266a6664062J4455610L822267r623743n626324O089072Q929575N273633M560608
$$ plain form
8321 -11741768 -7775726 4222255 7925642 -81579 -11070685 -19597695 -24972307 -25417411
8313 -25417411 -21711215 -19134552 -17168026 -6831395 12386087 23827169 14033547 -6828442
8305 -6828442 -17083340 -8987746 8628789 24722808 31132605 21967871 1910527 -11546423
8297 -11546423 -7886140 805307 -2200390 -12318183 -12511524 -1964265 3494692 -3039349
8289 -3039349 -12447199 -16599233 -13779017 505188 25871493 41020699 22603856 -14676012
8281 -14676012 -26358882 765232 25220527 9013293 -27339905 -36945761 -13510204
8274 -13510204 9422675 15142705 19940347 31650510 30864760 7139046 -16726689 -16664062
8266 -16664062 -2208452 1613815 -8009928 -13636252 -7547180 1382395 6656028 11216636
8258A1216636M575230j0845m168394k054722K73130m654470j0262040m760098
8250i845573Q547357J2805242K06141j6511308j9136602n765887P841214Q767214
8242a3092202K672116K394290N464915k171644j7888877j8234655M508701K2439896
8234a3907460J1080137r845761o165223J3713189J2691390q842942j0139118J7740582
8226F324794K9581918O45281k6107101p128443K8674527K5370616j0786769k6197105
8218B0377718q358176K220496j2680060k1725373m142119J5889329J5378012Q174534
8210A5134361J0422705R586918n141344j5967965q923737k450320j2960725k0376390
8202c0676497k467292K1391313J9316171j9062m782936M334099Q35897j3171420
$$ plain form
8258 11216636 15791866 15781021 11612627 9557905 9831035 5176565 -5085475 -9845573
8250 -9845573 -1298216 11507026 11713167 -4798141 -23934743 -29700630 -21859416 -13092202
8242 -13092202 -10420086 -8025796 -2560881 -4732525 -22621402 -40856057 -36347356 -13907460
8234 -13907460 -2827323 -12673084 -18838307 -5125118 7566272 -1276670 -11415788 6324794
8226 6324794 35906712 36551993 10444892 3316449 31990976 57361592 46574823 20377718
8218 20377718 12019542 14240038 1559978 -20165395 -24307514 -8418185 6959827 15134361
8210 15134361 25557066 35143984 30002640 14034675 5110938 2660618 -10300107 -30676497
8202 -30676497 -33143789 -11752476 7563695 7544633 2761697 7095796 7931693 -5239727
8194e239727p730855J7752281K6239180M122492j4521108n571970M645547j2676984
8186G018856l4758334k1846910J5760611L0602487J0255024q057564K23732J1832960
8178A1030862J58985j9443395j6674097L497901R989316m506675j4289833k288215
8170c2525151J6229671J9673073Q750636k210499o655927o450424l332678j014932
8162g536231n133078j0984397l765054J6772079K6097348P137631j9255059j9003100
8154a5669861O733778K3184015J1318287j0002598j6332349q301156M23147O088204
8146b558533J1674002J4125157Q525533k330790j1368386j4094007q284135L918756
8138c92403J1304604L460831j1877560j6036227p068481k098715o846642m970239
$$ plain form
8194 -5239727 -12970582 4781699 31020879 35143371 20622263 15050293 19695840 7018856
8186 7018856 -27739478 -49586388 -33825777 -3223290 7031734 -1025830 -802098 11030862
8178 11030862 11189847 -8253548 -24927645 -21429744 -11440428 -15947103 -30236936 -32525151
8170 -32525151 -16295480 3377593 12128229 9917730 3261803 -3188621 -6521299 -7536231
8162 -7536231 -12669309 -23653706 -27418760 -10646681 15450667 22588298 3333239 -15669861
8154 -15669861 -8936083 14247932 25566219 15563621 -768728 -9069884 -8646737 -2558533
8146 -2558533 9115469 23240626 31766159 29435369 18066983 3972976 -4311159 -392403
8138 -392403 10912201 14373032 2495472 -13540755 -20609236 -22707951 -29554593 -34524832
8130c4524832J1255641K2655238J3044240k763442k786108O533174L498820j1663521
$$ plain form
8130 -34524832 -23269191 -613953 12430287 9666845 6880737 13413911 16912731 5249210
$$ [...]
##END NTUPLES=NMR SPECTRUM
##END=
