##TITLE=31Pdec_SR83 Gly'_1
 CDCl3, 124 sc
 2.09.2021
##JCAMPDX= 6.0         $$ Bruker NMR JCAMP-DX V2.0
##DATA TYPE= NMR SPECTRUM
##DATA CLASS= NTUPLES
##ORIGIN= UXNMR, Bruker Analytische Messtechnik GmbH
##OWNER= root
$$ XWIN-NMR		Version 3.5
$$ Thu Sep  2 12:18:59 2021 Russian Standard Time (UT+4h)  she@DPX200
##.OBSERVE FREQUENCY= 81.013821
##.OBSERVE NUCLEUS= ^31P
##.ACQUISITION MODE= SIMULTANEOUS
##.ACQUISITION SCHEME= undefined
##.AVERAGES= 124
##.DIGITISER RES= 16
##SPECTROMETER/DATA SYSTEM= spect
##.PULSE SEQUENCE= zgpg30
##.SOLVENT NAME= CD2Cl2
##.SHIFT REFERENCE= (INTERNAL, CD2Cl2, 0, 248.564)
##AUDIT TRAIL= $$ (NUMBER, WHEN, WHO, WHERE, WHAT)
$$ ##TITLE= Audit trail, XWIN-NMR		Version 3.5
$$ ##JCAMPDX= 5.01
$$ ##ORIGIN= Bruker BioSpin GmbH
$$ ##OWNER= she
$$ F:/spectra/data/she/nmr/P31/1/pdata/1/auditp.txt
$$ ##AUDIT TRAIL=  $$ (NUMBER, WHEN, WHO, WHERE, WHAT)
(   1,<2021-09-02 12:17:59.23 +0400>,<she>,<DPX200>,
      <continue with go, POWCHK disabled, PULCHK disabled
       configuration hash MD5:
       00 E9 B6 7A A2 85 ED C7 34 08 36 98 17 FE 4E 26
       data hash MD5: 32K
       8F 51 73 C6 66 6C 93 F7 57 91 45 7D 92 EE 3F 01>)
(   2,<2021-09-02 12:18:01.51 +0400>,<she>,<DPX200>,
      <Start of raw data processing
       efp BC_mod = 2 LB = 1 FT_mod = 6 PKNL = 1 PHC0 = -7760.114 PHC1 = 140.0703 SI = 64K 
       data hash MD5: 64K
       95 E9 DF D0 B0 42 AE 30 9E C4 FF 2D 82 AD F4 B8>)
(   3,<2021-09-02 12:18:18.51 +0400>,<she>,<DPX200>,
      <pk PHC0 = 4.826163 PHC1 = 0 
       data hash MD5: 64K
       F1 F8 5E 42 24 D9 56 75 11 85 D9 12 6C B4 3D C1>)
(   4,<2021-09-02 12:18:28.70 +0400>,<she>,<DPX200>,
      <abs ABSG = 5 
       data hash MD5: 64K
       90 9E 70 B6 24 60 AF CC 46 B8 50 E1 06 93 3F 72>)
$$ ##END=
$$ 
$$ hash MD5
$$ 09 B1 FA 4B 19 9C DE 09 53 4B D9 F8 61 99 3A A9
##$RELAX= 
##$RELAX= 
##$RELAX= 
##$RELAX= 
##$RELAX= 
##$RELAX= 
##$RELAX= 
##$RELAX= 
$$ Bruker specific parameters
$$ --------------------------
##$DU= <F:/spectra>
##$EXPNO= 1
##$NAME= <P31>
##$PROCNO= 1
##$TYPE= <nmr>
##$USER= <she>
##$AMP= (0..31)
100 100 100 100 100 100 100 100 100 100 100 100 100 100 100 100 100 100 
100 100 100 100 100 100 100 100 100 100 100 100 100 100 
##$AQSEQ= 0
##$AQ_mod= 1
##$AUNM= <au_zg>
##$AUTOPOS= <>
##$BF1= 81.014009
##$BF2= 200.13
##$BF3= 200.13
##$BF4= 200.13
##$BF5= 200.13
##$BF6= 200.13
##$BF7= 200.13
##$BF8= 200.13
##$BYTORDA= 1
##$CFDGTYP= 0
##$CFRGTYP= 5
##$CHEMSTR= <none>
##$CNST= (0..31)
1 1 145 1 1 1 1 1 1 1 1 1 1 1 1 1 1 1 1 1 1 1 1 1 1 1 1 1 1 1 1 1 
##$CPDPRG= <waltz16>
##$CPDPRG1= <>
##$CPDPRG2= <waltz16>
##$CPDPRG3= <>
##$CPDPRG4= <mlev>
##$CPDPRG5= <mlev>
##$CPDPRG6= <mlev>
##$CPDPRG7= <mlev>
##$CPDPRG8= <mlev>
##$CPDPRGB= <>
##$CPDPRGT= <>
##$D= (0..31)
0 1 0 0 0 0 0 0 0 0 0 0.03 2e-05 3e-06 0 0 0 0 0 0 0 0 0 0 0 0 0 0 0 0 
0 0 
##$DATE= 1630570515
##$DBL= (0..7)
120 120 120 11 120 120 24 19 
##$DBP= (0..7)
150 150 150 150 150 150 150 150 
##$DBP07= 0
##$DBPNAM0= <>
##$DBPNAM1= <>
$$ [...]
##$SUBNAM3= <"">
##$SUBNAM4= <"">
##$SUBNAM5= <"">
##$SUBNAM6= <"">
##$SUBNAM7= <"">
##$SUBNAM8= <"">
##$SUBNAM9= <"">
##$SW= 501.771253377433
##$SWIBOX= (0..15)
0 1 3 0 0 0 0 0 0 0 0 0 0 0 0 0 
##$SW_h= 40650.406504065
##$TD= 32768
##$TD0= 1
##$TE= 0
##$TE2= 300
##$TE3= 300
##$TEG= 300
##$TL= (0..7)
0 120 53 12 22 120 120 120 
##$TP= (0..7)
150 150 150 150 150 150 150 150 
##$TP07= 0
##$TPNAME0= <>
##$TPNAME1= <>
##$TPNAME2= <>
##$TPNAME3= <>
##$TPNAME4= <>
##$TPNAME5= <>
##$TPNAME6= <>
##$TPNAME7= <>
##$TPOAL= (0..7)
0.5 0.5 0.5 0.5 0.5 0.5 0.5 0.5 
##$TPOFFS= (0..7)
0 0 0 0 0 0 0 0 
##$TUNHIN= 0
##$TUNHOUT= 0
##$TUNXOUT= 0
##$USERA1= <user>
##$USERA2= <user>
##$USERA3= <user>
##$USERA4= <user>
##$USERA5= <user>
##$V9= 5
##$VALIST= <valist>
##$VCLIST= <CCCCCCCCCCCCCCC>
##$VD= 0
##$VDLIST= <DDDDDDDDDDDDDDD>
##$VPLIST= <PPPPPPPPPPPPPPP>
##$VTLIST= <TTTTTTTTTTTTTTT>
##$WBST= 1024
##$WBSW= 4
##$XGAIN= (0..3)
0 0 0 0 
##$XL= 0
##$YL= 0
##$YMAX_a= 2874
##$YMIN_a= -3413
##$ZGOPTNS= <>
##$ZL1= 120
##$ZL2= 120
##$ZL3= 120
##$ZL4= 120
##$ABSF1= 248.5645
##$ABSF2= -253.2056
##$ABSG= 5
##$ABSL= 3
##$ALPHA= 0
##$AQORDER= 0
##$ASSFAC= 0
##$ASSFACI= 0
##$ASSFACX= 0
##$ASSWID= 0
##$AUNMP= <proc_1d>
##$AZFE= 0.1
##$AZFW= 0.5
##$BCFW= 0
##$BC_mod= 2
##$BYTORDP= 0
##$COROFFS= 0
##$CY= -3
##$DATMOD= 1
##$DC= 0
##$DFILT= <>
##$DTYPP= 0
##$F1P= 0
##$F2P= 0
##$FCOR= 1
##$FTSIZE= 65536
##$FT_mod= 6
##$GAMMA= 0
##$GB= 0
##$INTBC= 1
##$INTSCL= 5.30512e-09
##$ISEN= 30
##$LB= 1
##$LEV0= 0
##$LPBIN= 0
##$MAXI= 10000
##$MC2= 0
##$MEAN= 0
##$ME_mod= 0
##$MI= 50
##$NCOEF= 0
##$NC_proc= -7
##$NLEV= 6
##$NOISF1= 182.463
##$NOISF2= 159.3651
##$NSP= 0
##$NTH_PI= 0
##$NZP= 0
##$OFFSET= 248.5645
##$PC= 4
##$PHC0= -7755.288
##$PHC1= 140.0703
##$PH_mod= 1
##$PKNL= yes
##$PPARMOD= 0
##$PSCAL= 0
##$PSIGN= 0
##$REVERSE= no
##$SF= 81.014009
##$SI= 65536
##$SIGF1= 159.3651
##$SIGF2= -187.1042
##$SINO= 113.3802
##$SIOLD= 16384
##$SREGLST= <1H.CDCl3>
##$SSB= 0
##$STSI= 65536
##$STSR= 0
##$SW_p= 40650.406504065
##$SYMM= 0
##$S_DEV= 0
##$TDeff= 32768
##$TDoff= 0
##$TI= <>
##$TILT= no
##$TM1= 0
##$TM2= 0
##$TOPLEV= 0
##$USERP1= <user>
##$USERP2= <user>
##$USERP3= <user>
##$USERP4= <user>
##$USERP5= <user>
##$WDW= 1
##$XDIM= 65536
##$YMAX_p= 303697522
##$YMIN_p= -358122173
$$ End of Bruker specific parameters
$$ ---------------------------------
##NTUPLES= NMR SPECTRUM
##VAR_NAME=  FREQUENCY,     SPECTRUM/REAL,   SPECTRUM/IMAG
##SYMBOL=    X,             R,               I
##VAR_TYPE=  INDEPENDENT,   DEPENDENT,       DEPENDENT
##VAR_FORM=  AFFN,          ASDF,            ASDF
##VAR_DIM=   65536,         65536,           65536
##UNITS=     HZ,            ARBITRARY UNITS, ARBITRARY UNITS
##FACTOR=    0.620285442955139, 1,           1
##FIRST=     20137.2065510759, 0,            0
##LAST=      -20513.1999529892, 0,           0
##MIN=       -20513.1999529892, -358122173,  0
##MAX=       20137.2065510759, 303697522,    0
$$ Real data points
##PAGE= N=1
##DATA TABLE= (X++(R..R)), XYDATA
$$ [...]
13011d109258M01858K54484J88038J073023k59666l860845l588394K856352P900529
13002H56121N226951L68948J607032N815016L725497l968440p027974j836672
12994D766479L470546K063420k575279m154252k451912m23024J363385K736998
12986D796361J360580l061528n949754l876510q4345O88322k26196J480984M615865
12977b56221L528462k399393o390916l419770K840892N260772K474826o60920
12969I77732n07889J036772K89159k627914l887327j115673L363231N331696L715709
12960F575496J173576k28364j680282m550682o516109l833072K486977N965831
12952f06629K123462n222869p913398l200654L375246N531642L683602K557030
$$ plain form
13011 -4109258 -3707400 -3452916 -3264878 -2191855 -2451521 -6312366 -9900760 -7044408 856121
13002 856121 6083072 6452020 8059052 13874068 17599565 13631125 6603151 4766479
12994 4766479 8237025 10300445 7725166 3570914 1119002 695978 2059363 4796361
12986 4796361 6156941 3095413 -2854341 -6730851 -6815196 -6126874 -6353070 -4872086 -256221
12977 -256221 3272241 872848 -5518068 -8937838 -6096946 -836174 1638652 977732
12969 977732 469843 1506615 1795774 -832140 -4719467 -5835140 -2471909 2859787 6575496
12960 6575496 7749072 7520708 5840426 1289744 -5226365 -9059437 -6572460 -606629
12952 -606629 1516833 -3706036 -11619434 -14820088 -11444842 -5913200 -2229598 327432
12944C27432L539030L274752j32851l474300l027481r1144J067467n90862k020584
12935a128541j189872K63053L96482J15004J054468K412912K400724J593384J883243
12926G800857K434519J36336m734169o652890j764434N313316N963544j028339
12918G468740p050756m762773K281934N012038J253773k514419j343671J854461
12910B199327K007248o16218j912956k60748K023538K271582R1300k696263l343939
12901b37129q84993J533664l19977n069778n907456j98531N406721M075584q76140
12892b478035j194503L382811N312785J781530j496879p41570j1813k645242m174980
12883b265896K2890N365904L880626l227970o369894j003141O078382O027010
$$ plain form
12944 327432 3866462 7141214 7008363 3534063 506582 415438 1482905 892043 -1128541
12935 -1128541 -2318413 -2055360 -1658878 -1543874 -489406 1923506 4324230 5917614 7800857
12926 7800857 10235376 10371712 5637543 -1015347 -2779781 2533535 8497079 7468740
12918 7468740 417984 -4344789 -2062855 2949183 4202956 1688537 344866 2199327
12910 2199327 4206575 3590357 1677401 1416653 3440191 5711773 5803073 3106810 -237129
12901 -237129 -1122122 411542 91565 -4978213 -10885669 -11084200 -5677479 -1601895 -2478035
12892 -2478035 -3672538 -289727 5023058 6804588 5307709 4566139 4554326 1909084 -2265896
12883 -2265896 -2243006 3122898 7003524 3775554 -2594340 -3597481 2480901 8507911
12875H507911p22019n592959k756883M055276O549477K277490k698144k691735
12867F928414n22235k338688o512649m983318L259556Q101324K323025o936225
12859f80796p590914R17913Q193627P443222J730899l396176n954625n565738
12851d902588k193010J492394J850061k32497m68459J416458J099674k116301
12843d054268k816217J838339O618293N468843k07002m636193n277319l206954
12835f272478N66954M518981N114177Q53494l938517l924056j2443K490660J701820
12826A098592M27044K92499l41796k055440k533885n69471J667465K044591J270113
12817A299712O31048m47795k576039m148685l179400l37670J654351J169597r18762
$$ plain form
12875 8507911 7785892 2192933 -563950 3491326 10040803 12318293 9620149 6928414
12867 6928414 6406179 4067491 -2445158 -7428476 -4168920 3932404 6255429 -680796
12859 -680796 -8271710 -7353797 839830 8283052 10013951 6617775 663150 -4902588
12851 -4902588 -7095598 -5603204 -3753143 -3985640 -4454099 -3037641 -1937967 -4054268
12843 -4054268 -6870485 -5032146 1586147 7054990 6847988 2211795 -3065524 -6272478
12835 -6272478 -5705524 -1186543 3927634 4781128 842611 -3081445 -3093888 -603228 1098592
12826 1098592 1525636 1818135 1476339 -579101 -3112986 -3682457 -2014992 29599 1299712
12817 1299712 1930760 1482965 -1093074 -5241759 -8421159 -8758829 -7104478 -5934881 -6853643
12808f853643k497759k115089j45378J510941J573301J222572K395103M117699
12800g92253K934904j670336m804971k013837L877940N567988R12260m234854
12792b23159m229762q61906N81245o37725j013438M97034J320463Q31200J573796
12783b162252L381578J917678l487751n853655o9600P461132O225584k789676
12775D623038p307587j077512P066605N868574k923593q260805n323513j54914
12767g489707N55110k185920l305247j067405K041071L477982L052132J957915
12759b964069J210569J070621J187838J117654P92098M25372Q3907m33687j324013
12750A166290k344514k546481j024953J336470J725022j239715m402535k904337
$$ plain form
12808 -6853643 -9351402 -11466491 -11611869 -10100928 -8527627 -7305055 -4909952 -792253
12800 -792253 2142651 472315 -4332656 -6346493 -2468553 3099435 4011695 -223159
12792 -223159 -4452921 -5314827 -4733582 -5371307 -6384745 -5887711 -4567248 -3736048 -2162252
12783 -2162252 1219326 3137004 -350747 -6204402 -6274002 1187130 7412714 4623038
12775 4623038 -2684549 -3762061 3304544 9173118 6249525 -2011280 -7334793 -7489707
12767 -7489707 -6934597 -9120517 -12425764 -13493169 -11452098 -7974116 -4921984 -2964069
12759 -2964069 -1753500 -682879 504959 1622613 2414711 2840083 2923990 2490303 1166290
12750 1166290 -1178224 -3724705 -4749658 -3413188 -1688166 -2927881 -7330416 -10234753
12742a0234753L201804P735968N418147j797588p224644o798828k178722K165767
12734i712849L100466J002597p29816P33954L753574L831456K38573j962435R34171
12725A189691N056009L956355j942222n662091l175619J789232L256442j40073
12717D327724m891209o622644l603689J655709M157631J835245j345751l76470
12709d863454L663278N199251K291908j417687l068315l781976m365002l086462
12701i428459K9960J631541O18171O36234L634747N588811K926005j076744j511160
12692C049106J78505n61154k878658k035322J799025L213502M12166j899559o5230
12683A212381L328808M007883J686691j042254k417763k238832j252985j017577
$$ plain form
12742 -10234753 -7032949 703019 6121166 4323578 -2901066 -9699894 -11878616 -9712849
12734 -9712849 -6612383 -5609786 -6339602 -5605648 -1852074 1979382 2217955 255520 1189691
12725 1189691 6245700 10202055 8259833 2597742 -577877 1211355 4467797 4327724
12717 4327724 -563485 -7186129 -10789818 -9134109 -4976478 -3141233 -4486984 -4863454
12709 -4863454 -1200176 3999075 6290983 4873296 1804981 -1976995 -6341997 -9428459
12701 -9428459 -9398499 -7766958 -7148787 -6512553 -2877806 2711005 5637010 4560266 3049106
12692 3049106 3227611 2666457 -212201 -2247523 -448498 2765004 3177170 1277611 1212381
12683 1212381 4541189 8549072 10235763 9193509 6775746 4536914 3283929 2266352
12675B266352k342488l559822k622989m73982O99139J635363M193630O076157
12667E871360K914763l861238p219630m253733Q8023J215353P84068J299344J090953
12658b070737r69852j564687R83763K100146j447260m355244n08074O209307P143326
12649E520688K123344j390233q57418r40267l152082k793717J644654M626996
12641D781965K515374r63005j943266k322333m032525l717169J329400O767476
12633B415917O665037K019671j578298k211160k342033l044296k580952k60923
12625i17037K152753K922422J856678j48118j557236j388857r43030k208843l765761
12616c997029j700148L863445P269319M913186K09803k100557k292704k509134
$$ plain form
12675 2266352 -76136 -3635958 -6258947 -6732929 -6033790 -4398427 -204797 5871360
12667 5871360 8786123 4924885 -2294745 -6548478 -6460455 -5245102 -4461034 -3161690 -2070737
12658 -2070737 -3040589 -4605276 -3621513 -1521367 -2968627 -7323871 -7831945 -1622638 5520688
12649 5520688 7644032 6253799 5396381 4456114 1304032 -1489685 154969 4781965
12641 4781965 7297339 6334334 4391068 2068735 -1963790 -5680959 -4351559 2415917
12633 2415917 9080954 11100625 9522327 7311167 4969134 1924838 -656114 -917037
12625 -917037 1235716 4158138 6014816 5866698 4309462 2920605 1977575 -231268 -3997029
12616 -3997029 -5697177 -1833732 5435587 10348773 10558576 8458019 6165315 3656181
12608C656181j805414O93551J741063j137914m082012k427213J220021J306703
12600h35034q51662N45121N009943N882391J399945k590181k330687q04024o55853
12591D769959q6748J252053l13116n017758o401626p77254N706961N439168K67206
12582D838845k405842j061137m99845k448419k920672L08661L466414K313410
12574A591415j840555m180139k440461J118881K910616J718338p77136k359577
12566d258618k418620j490614K93604K806977M494805L534382O79228j263820
12558B377324j343958j420057k286910j725435J507120M179113K240520l027664
12550E00053n731401k637188K748937M695096K248856m46788n98471n98463l258648
$$ plain form
12608 3656181 1850767 2544318 4285381 3147467 -934545 -3361758 -2141737 -835034
12600 -835034 -1686696 -1141575 3868368 9750759 11150704 8560523 6229836 5425812 4769959
12591 4769959 4683211 5935264 5622148 604390 -5797236 -6574490 -867529 4571639 4838845
12582 4838845 2433003 1371866 872021 -1576398 -4497070 -4188409 -721995 1591415
12574 1591415 -249140 -4429279 -6869740 -5750859 -2840243 -1121905 -1899041 -4258618
12566 -4258618 -6677238 -8167852 -7874248 -5067271 -572466 2961916 3641144 2377324
12558 2377324 1033366 -386691 -2673601 -4399036 -2891916 1287197 3527717 500053
12550 500053 -5231348 -7868536 -5119599 -424503 1824353 1377565 779094 180631 -3078017
12541c078017n561568j942730O091334R502402L876450l417423l506377J127491
12533C091562J576379k595926k939842L116008O999237K238766n246024n993903
12525B46257m19724L149175N11104m380200n918030k667827K627598N632247L770287
12516B550887q47980l116753r70959K335660L069880J059296k369658o394864
12508d684491q530101n085428K890635Q389865O995929K649760Q69390P21073
12500D216632j209504l082997q29594L707476M693929J288158j679968j577226
12492E526906n70618l27745K34367J195236N81720j826848l583802l227926j564481
12483c563191O87121L096321L813238J529377j225831q63622J435919J074824
$$ plain form
12541 -3078017 -8639585 -10582315 -4490981 5011421 8887871 5470448 1964071 3091562
12533 3091562 4667941 2072015 -867827 2248181 9247418 11486184 6240160 246257
12525 246257 -173467 2975708 3486812 -893388 -6811418 -9479245 -6851647 -1219400 2550887
12516 2550887 1702907 -1413846 -2384805 -49145 3020735 4080031 1710373 -4684491
12508 -4684491 -13214592 -18300020 -15409385 -7019520 -23591 2626169 3495559 4216632
12500 4216632 3007128 -75869 -905463 2802013 7495942 8784100 7104132 5526906
12492 5526906 4956288 4628543 4862910 6058146 6639866 4813018 1229216 -1998710 -3563191
12483 -3563191 -2876070 220251 4033489 5562866 4337035 3473413 4909332 5984156
12475E984156k652626n155017l283554O17139K625270J896496L19536Q9187K030567
12466B471154M186830K870664k189709n530306k845968J617977J93979o473498
12458e698877r370786l686940M844755Q300345N747280J353112j782505k529984
12450b823600l81891L088498L964353L54088m522142n736065j963297L542908
12442d477148N812914K023528n180249q620867m047343L675490N771019Q59158
12434d183498l619934j886472L369050O235121M844460J207891k052451k629405
12426A284762R4203K876051J615708k274299l057342N24045L160973J701283j83875
12417E741509P72731J750665k32795k446169j755341p26429k538463m249802j636416
$$ plain form
12475 5984156 3331530 -1823487 -5107041 -4489902 -1864632 31864 351400 440587 2471154
12466 2471154 6657984 9528648 7338939 1808633 -1037335 580642 774621 -5698877
12458 -5698877 -15069663 -18756603 -13911848 -5611503 135777 1488889 -293616 -2823600
12450 -2823600 -3205491 -116993 3847360 4201448 -320694 -6056759 -8020056 -4477148
12442 -4477148 1335766 3359294 -1820955 -10441822 -14489165 -10813675 -5042656 -4183498
12434 -4183498 -7803432 -9689904 -6320854 -85733 4758727 5966618 3914167 1284762
12426 1284762 1378965 4255016 5870724 3596425 539083 1063128 4224101 5925384 5741509
12417 5741509 6514240 8264905 8032110 5585941 3830600 3104171 565708 -3684094 -5320510
12408e320510K813930L509412O33787j317775j623386k882617l987107j030705
12400i204971M799204P185483L617699j352766k943274j250096J368787L214303
12392E434369K613972j001547m387629l272069J251239L568180J555003j154024
12384D607494j933888k610067m027410k933990K029551O020608M292984o33952
12376D811330k855683j610426r54923k375514k867348n59300K083001K078925
12368b249938J45207n61117J448956M230248M305786L09501m824378o051091j616960
12359d863786M484389O733408M038840O9202j493988j65288K187369L080721N76130
12350A4646997m686924q321639n859350J320963O266343M304263j499102m578953
$$ plain form
12408 -5320510 -2506580 1002832 1636619 318844 -1304542 -4187159 -8174266 -9204971
12400 -9204971 -4405767 2779716 6397415 5044649 2101375 851279 2220066 5434369
12392 5434369 8048341 7046794 2659165 -612904 638335 4206515 5761518 4607494
12384 4607494 2673606 63539 -3963871 -6897861 -4868310 1152298 5445282 4811330
12376 4811330 1955647 345221 -609702 -2985216 -5852564 -6411864 -4328863 -2249938
12368 -2249938 -2104731 -2665848 -1216892 3013356 7319142 7628643 2804265 -3246826 -4863786
12359 -4863786 -379397 6354011 10392851 10462053 8968065 8802777 10990146 14070867 14646997
12350 14646997 9960073 1638434 -4220916 -2899953 3366390 7670653 6171551 1592598
12342A592598k527160J727032M427852L854162K89420l581925l534020J235516
12334C483475N119961K560353l317332m274966N30958K671910k350830p335039
12326b911510m146375L682142O337965J899006k712514k947532r77253N78442
12318a197629J680197J156331k711044o543419m024566L873689P698618K172674
12310B104851n976464p302141j757743L459871M242516K327796K50486j157441
12302c808269j175754O30721K700439K777818R00714o71820k04087J801024L013836
12293E964622J320244k369842m166592k177175J84258n51207j529145J718677
12285a606160N894960L563124l691636n659473K52812L843997j294357o519673
$$ plain form
12342 1592598 -934562 792470 5220322 9074484 9363904 5781979 2247959 3483475
12334 3483475 8603436 11163789 7846457 3571491 4102449 6774359 4423529 -2911510
12326 -2911510 -7057885 -3375743 2962222 4861228 2148714 -798818 -1776071 -1197629
12318 -1197629 482568 1638899 -1072145 -7615564 -11640130 -7766441 -67823 2104851
12310 2104851 -3871613 -11173754 -12931497 -9471626 -5229110 -2901314 -2650828 -3808269
12302 -3808269 -4984023 -4353302 -1652863 1124955 2025669 1353849 1149762 2950786 5964622
12293 5964622 7284866 4915024 748432 -1428743 -1244485 -1795692 -3324837 -1606160
12285 -1606160 4288800 7851924 4160288 -1499185 -1246373 2597624 1303267 -5216406
12277e216406k071188O684668P889171J594419k463554j327811o61112k121935
12269B306252j228652J976098J578646l122895n339027k099604J254787P51798
12261c922597m36145Q64701K559395K586126K561624K864450O98565l719105n472834
12252a415820k636453O29249J560595K605843M635491L769800q90561l770617
12244D487527j951625m47323k739415l695223Q56520M739329P85518o060203n396670
12235i421565K340601O911341M105907J00137l17730O2501j436905k237877m62174
12226c55764J033278K36612l44255Q93013J172397q61920j410018J622429L174648
12217E160420j282731o549587l958862M816492Q649459K776133m266373l290708
$$ plain form
12277 -5216406 -7287594 -602926 7286245 8880664 6417110 5089299 4428187 2306252
12269 2306252 1077600 3053698 4632344 1509449 -3829578 -5929182 -4674395 -3922597
12261 -3922597 -4358742 -3494041 -934646 1651480 4213104 7077554 7776119 4057014 -1415820
12252 -1415820 -4052273 -3423024 -1862429 743414 5378905 9148705 8258144 4487527
12244 4487527 2535902 2088579 -650836 -4346059 -3489539 1249790 2035308 -4024895 -9421565
12235 -9421565 -7080964 -169623 3936284 4036421 3718691 3781192 2344287 106410 -355764
12226 -355764 677514 914126 569871 1462884 2635281 1773361 363343 1985772 5160420
12217 5160420 3877689 -2671898 -6630760 -1814268 6835191 9611324 5344951 2054243
12209B054243K640065M047025p40376m773385m019463j699738o06017J010304
12201b087342L262950J865674l733299o045324L6677P699935P062012j39894l836952
12192D084437j538722n99904m171455n691117r01466M236513L346249k68707k6200
12183a530372L235985M027160J530931o82941j387834j865677j580328M72615
12175B219539J946365K33796k266447j484519J172896Q25497k525113l634872
12167c512858l47088L186444K908632P8761j642363j170740l58953j117070l054043
12158e029278l394224p2761M472839N020564N96184l510106l270109j452606j769124
12149h408621j891412J822351O195147N187175M501k556457j129833j043182m049516
$$ plain form
12209 2054243 4694308 8741333 8000957 3227572 -791891 -2491629 -3097646 -2087342
12201 -2087342 1175608 3041282 -692017 -6737341 -6700664 999271 8061283 7921389 4084437
12192 4084437 2545715 1945811 -2225644 -7916761 -8818227 -4581714 -1235465 -1504172 -1530372
12183 -1530372 1705613 5732773 7263704 6580763 5192929 3327252 1746924 2219539
12175 2219539 4165904 4399700 2133253 648734 1821630 2647127 122014 -3512858
12167 -3512858 -3859946 -673502 2235130 2313891 671528 -499212 -858165 -1975235 -5029278
12158 -5029278 -8423502 -8496263 -4023424 997140 1593324 -1916782 -5186891 -6639497 -8408621
12149 -8408621 -10300033 -8477682 -2282535 2904640 2909141 352684 -777149 -1820331 -5869847
12140e869847n108731j645305J673639J030290k25028K160431N945222O159758
12132D120429K630737p80415j948887j691767j056881m87253l60565l39893L95885
12123D81390J211924M18594j646231k624727j857068r17952K4257K384448M939352
12114B413987M189891M20735j703040o52801n53109l229935l888905N43997M467721
12105B008541J521120m690159n294359O04948N023434L136681r07431j677359
12097b74584K9217K70098j524669k572787j344695P01787J568551J095354N03406
12088a548322M59052O13199J082901K751618M869179M308818j40588m498597m412034
12079C485226j697108r97631j323245J888611O377766M021023n099978r504501
$$ plain form
12140 -5869847 -10978578 -12623883 -10950244 -9919954 -10144982 -7984551 -2039329 4120429
12132 4120429 6751166 5970751 4021864 2330097 1273216 785963 425398 85505 481390
12123 481390 1693314 2111908 465677 -2159050 -4016118 -4934070 -4909813 -2525365 2413987
12114 2413987 6603878 7024613 5321573 4668772 4115663 885728 -3003177 -2459180 2008541
12105 2008541 3529661 -1160498 -6454857 -5849909 -826475 2310206 1402775 -274584
12097 -274584 -245367 24731 -1499938 -4072725 -5417420 -4715633 -3147082 -2051728 -1548322
12088 -1548322 -1089270 -476071 606830 3358448 8227627 12536445 12395857 7897260 3485226
12079 3485226 1788118 790487 -532758 1355853 7733619 11754642 6654664 -2849837
12071b849837k910786N260448M144046k078631k489893K267997K641294k544643
12063A439995m814784j269545J776003J445683K253840M886961L138613l646785
12055E209981o469148r18383M789220L007371j645006k001915r03544l883949
12047b815373o509412j046606Q407591R920420J766596n004838l088016K309141
12039C939503L865566K130503Q17545l34270k490333l025162J58685L243972J303496
12030I609505l613065m889130j105504K115522Q00238j967113j810874l6991o55898
12021a553310k964771k444813J309915L199932Q17078j328511P66917L715807
12013A518244K404168j223199j552949R97991J228326r97210o03659K424286J761799
$$ plain form
12071 -2849837 -5760623 -500175 3643871 1565240 -924653 1343344 3984638 1439995
12063 1439995 -3374789 -4644334 -2868331 -1422648 831192 5718153 8856766 5209981
12055 5209981 -1259167 -2177550 2611670 5619041 3974035 1972120 1068576 -2815373
12047 -2815373 -9324785 -10371391 -1963800 7956620 9723216 4718378 1630362 3939503
12039 3939503 7805069 9935572 10753117 10418847 7928514 4903352 5062037 8306009 9609505
12030 9609505 5996440 1107310 1806 2117328 2917566 950453 -860421 -897412 -1553310
12021 -1553310 -4518081 -6962894 -5652979 -2453047 -1635969 -2964480 -2197563 1518244
12013 1518244 3922412 2699213 1146264 2144255 3372581 2375371 1771712 4195998 5957797
12004E957797l618268n692805j06570N784470M188473j171287k393767m33319
11996B514724j294629l784157j761300L609179M725110N69598j538005J218178
11988D258698K499559j586374n186256k264048L520072M683704R24618j903368
11980D946605j023957N92201k32527k811554m125889k255257J632288M080894
11972H02804L048404N48017l04771k2038j215987l061106k023912J504860K685939
11963A962210r5054k458869j433022j61852j589254k607490M72159M642659M260012
11954B991499n6598k441785o67382J384075K94984k359264l161284j366798J129101
11945d253452K607875L140927L641705L578956P82082m716385q000316m440024
$$ plain form
12004 5957797 2339529 -3353276 -3459846 2324624 6513097 5341810 2948043 2514724
11996 2514724 1220095 -2564062 -4325362 -716183 4008927 4578525 3040520 4258698
11988 4258698 6758257 5171883 -14373 -2278421 1241651 5925355 6849973 4946605
11980 4946605 3922648 4514849 4282322 1470768 -2655121 -4910378 -3278090 802804
11972 802804 3851208 4399225 4094454 4072416 2856429 -204677 -2228589 -723729 1962210
11963 1962210 1867156 -591713 -2024735 -2186587 -3775841 -6383331 -5911172 -1268513 2991499
11954 2991499 2934901 493116 -174266 1209809 1504793 -854471 -4015755 -5382553 -4253452
11945 -4253452 -1645577 1495350 5137055 8716011 9498093 4781708 -3218608 -7658632
11937g658632K673384N084695J353890q76505K541851M866963k86275p025526
11929F73845n463966K419473N626047J189627k420258J21377L399260J641992
11921G187397k192458k686005m39072R34753Q70420J53466j862751l857322j616645
11912c508217M487869O633200M23123o600510n120657J610011L021821j830606
11904h83966l533843J327225M480609J34637n408373m460830l9674O27587j398483
11895i155111O9831M212680L982645j589381m958007j666921L275052L726876
11887b102336Q20395r70340j088595j460998j439018P23586L384998L168297J36767
11878A172756k449113k745881j412223Q58234L364980L908202J130380k217728
$$ plain form
11937 -7658632 -4985248 99447 1453337 576832 3118683 7985646 7699371 673845
11929 673845 -4790121 -2370648 3255399 4445026 2024768 2146145 5545405 7187397
11921 7187397 4994939 2308934 1869862 2804615 3675035 3828501 1965750 -1891572 -3508217
11912 -3508217 979652 7612852 8035975 1435465 -3685192 -2075181 946640 -883966
11904 -883966 -4417809 -3090584 1390025 1524662 -3883711 -8344541 -8384215 -7756628 -9155111
11895 -9155111 -9085280 -4872600 -889955 -2479336 -7437343 -9104264 -5829212 -2102336
11887 -2102336 -1281941 -2252281 -3340876 -4801874 -6240892 -5517306 -2132308 1035989 1172756
11878 1172756 -1276357 -4022238 -5434461 -4576227 -1211247 2696955 3827335 1609607
11870A609607k359611m15734o60831k838667j825491L364767O007627R41053o937347
11861c114627q450232j985930N357045P301619M413051P55985j093554o58621
11853B524736J414320L260302K828460L53488j687960j875563j430638j655273
11845C731872j712517n58241M23797r34186l693946m018254j67123M499048N199668
11836B770118J525730k383209l142983j337218Q97165K761001L791868K588609
11828G471081q80248l596335l075310j072566n22561n90328J007543K429279K00612
11819A371167l342786k050751L605760N714525J348200k169825O13340L782829
11811H872459K94500n023591k945282L933532M368180l162150p530756k606326
$$ plain form
11870 1609607 -750004 -1165738 -1826569 -4665236 -6490727 -3125960 2881667 3822720 -3114627
11861 -3114627 -11564859 -13550789 -8193744 -892125 3520926 4276911 3183357 2524736
11853 2524736 3939056 7199358 10027818 10381306 8693346 6817783 5387145 3731872
11845 3731872 2019355 1461114 1884911 950725 -2743221 -6761475 -6928598 -2429550 2770118
11836 2770118 4295848 1912639 -1230344 -2567562 -1670397 1090604 4882472 7471081
11828 7471081 6590833 2994498 -80812 -1153378 -1675939 -2266267 -1258724 1170555 1371167
11819 1371167 -1971619 -4022370 -416610 5297915 6646115 4476290 5089630 8872459
11811 8872459 9166959 4143368 1198086 5131618 9499798 6337648 -1193108 -3799434
11803c799434L715726L104140o66548j37713K739527J080416m163959n400815
11795c528660n47204M392066M837444K583260L58979k179227n000961n432140
11787d516443k173556J903203L496890K838302J888072R80741m89069j799391
11779B128749j601244j7778J590794K358830K284832J491052P2328j655879l134039
11770C517645l340444r69473L729801P407999O120103K57240m969364n269718
11762F483789j868741R50231J065402n31105k211086k629954m78083L686275N991857
11753A0458585K914512l418862o691769l930005J237999L797703K856320M40204
11745G664687k135564m162656m179255j761214P80932J276122R28320J799513
$$ plain form
11803 -3799434 -83708 3020432 2353884 2216171 4955698 6036114 1872155 -3528660
11795 -3528660 -4075864 316202 5153646 7736906 8095885 5916658 915697 -4516443
11787 -4516443 -6689999 -4786796 -1289906 1548396 3436468 4417209 3928140 2128749
11779 2128749 527505 509727 2100521 4459351 6744183 8235235 8307563 6651684 3517645
11770 3517645 177201 -792272 2937529 10345528 16465631 16722871 11753507 6483789
11762 6483789 4615048 5565279 6630681 6099576 3888490 1258536 780453 4466728 10458585
11753 10458585 13373097 9954235 3262466 -667539 570460 4368163 7224483 7664687
11745 7664687 5529123 1366467 -2812788 -4574002 -3793070 -2516948 -1588628 210885
11737B10885K557734N76840k483487j867615K684925N088395J105858n141190
11729B732345o430210k119470J609903Q67619r23585Q44874M085153K705385l198903
11720A73111n233913J811082J0481459R141201j399755p935910l465207L120817
11712F692885J543685l990591l055209K681207K169494n619704q769487j587966
11704i935686O092963M792079m48287j96821L787467L298460j760394m124873
11696A504908j556105J022376N18004j223636k504198l040148j222631L352647
11688c148783O130353L116184j667394j594326J689297J311607k472362k876264
11680D88312P52734J717582j212744j213584L061720L090565m543185r807992
$$ plain form
11737 210885 2768619 3345459 861972 -1005643 1679282 6767677 7873535 2732345
11729 2732345 -3697865 -5817335 -4207432 -3339813 -4263398 -3418524 666629 3372014 173111
11720 173111 -5060802 -3249720 7231739 16372940 14973185 7037275 3572068 6692885
11712 6692885 8236570 4245979 1190770 3871977 6041471 421767 -8347720 -9935686
11704 -9935686 -3842723 949356 501069 304248 4091715 7390175 5629781 1504908
11696 1504908 -51197 971179 1489183 265547 -2238651 -5278799 -6501430 -3148783
11688 -3148783 2981570 6097754 4430360 2836034 4525331 5836938 3364576 488312
11680 488312 1241046 2958628 1745884 532300 3594020 6684585 2141400 -7666592
11672g666592m159490N419051P148533J900326r36501M57867K09493k355038j737067
11663a719418K288157L399600J43293j506268O92654J123289k955194n397373
11655c931260j185868M908316N876277K758837P04394l37527l364102o147275
11647g18208l726270K082711L872317P4644k407407O78306M171403K037608k945123
11638C119981l746105J73531K949714J772805J51253J133123K512699J035560
11630I102561k157720l118650m83052K845645K896625j255806o035962o337137
11622d543496j256299L941534L856779J8151j609198L01506Q53835k447297n145867
11613f030352l225716K7695l25958k185133J10550N421211O155575j45523n908645
$$ plain form
11672 -7666592 -11826082 -6407031 741502 2641828 1705327 2163194 2372687 17649 -1719418
11663 -1719418 568739 3968339 4111632 2605364 3298018 4421307 1466113 -3931260
11655 -3931260 -5117128 -208812 5667465 8426302 9130696 8793169 5429067 -718208
11647 -718208 -4444478 -2361767 1510550 1585194 -822213 -143907 4027496 6065104 3119981
11638 3119981 -626124 -452593 2497121 4269926 4421179 5554302 8067001 9102561
11630 9102561 6944841 3826191 3343139 6188784 9085409 7829603 1793641 -4543496
11622 -4543496 -5799795 -1858261 1998518 2016669 407471 708977 1562812 -884485 -6030352
11613 -6030352 -9256068 -9228373 -9554331 -11739464 -11628914 -6207703 -52128 -197651 -6106296
11604f106296l332200N003877R264383M466763l965792p117125k910965K246746
11596b450609J988806k192414l875650r11344K384993K369698O14812l37411q47317
11587c256436j025172J223808N040039M651449k001083p460978m429283K758667
11579d498989M427285L63970j038751K782267N036087J560458l053005l965252
11571A614070k591171j421290L74195K730487K690651Q4173q88088J167906K317281
11562F078214Q54130M26220K151596J206784m035728p054125l287517J875907
11554a784519K029976r640J220314L139604L52655m139562l352303Q25656k265
11545a720084o123215q042291j181511O954422P716371K203555k709892l633699
$$ plain form
11604 -6106296 -9438496 -4434619 4829764 9296527 5330735 -1786390 -4697355 -2450609
11596 -2450609 -461803 -2654217 -6529867 -7441211 -5056218 -2686520 -2071708 -2409119 -3256436
11587 -3256436 -4281608 -3057800 1982239 6633688 4632605 -2828373 -7257656 -4498989
11579 -4498989 -71704 292266 -746485 2035782 7071869 8632327 5579322 1614070
11571 1614070 -977101 -2398391 -2024196 706291 3396942 3481115 2593027 3760933 6078214
11562 6078214 6932344 7358564 9510160 10716944 6681216 -372909 -3660426 -1784519
11554 -1784519 245457 235817 1456131 4595735 4948390 808828 -2543475 -1717819 -1720084
11545 -1720084 -7843299 -15885590 -17067101 -10112679 -2396308 -192753 -2902645 -6536344
11537f536344j781698J093799L706793M412473K584947k12434k066824k573344
11529a372632k026933l96763J873120L367779L065806J606205O63901J173314
11521G953797K042474Q82913k993340o625453o303342k302783J746141M063341
11513a536252N714975O150371K708389l569421o810292m195887k47293M98685
11505a286725J61667K066664L539519O27326l660572l230519J009792K338866
11497A566018j175558m181730k536216J756469M967563N808540M211296N30645
11489A0947027k976528l624006j892635m56897J7375P00241J163338K13572o69351
11480C422136P91708K921244J863123k128423m712929l729003j176879Q01492
$$ plain form
11537 -6536344 -8318042 -7224243 -3517450 895023 3479970 3267536 1200712 -1372632
11529 -1372632 -3399565 -3796328 -1923208 1444571 4510377 6116582 6780483 7953797
11521 7953797 9996271 10879184 7885844 1260391 -5042951 -7345734 -5599593 -1536252
11513 -1536252 4178723 10329094 13037483 9468062 2657770 -1538117 -1785410 -1286725
11505 -1286725 -1125058 941606 4481125 5108451 1447879 -1782640 -772848 1566018
11497 1566018 390460 -3791270 -6327486 -4571017 396546 6205086 10416382 10947027
11489 10947027 7970499 4346493 2453858 1996961 2014336 2714577 3877915 4091487 3422136
11480 3422136 4213844 7135088 8998211 6869788 2156859 -1572144 -2749023 -1947531
11472a947531J678376Q10499j572923k364290O24164L733987J813507l176396
11464d00607m147552M31343M417007L607235R84970L36716N94269n38229k031274
11455C253878j653777N42247K784706L106851N4742m981086p001337l327294J070848
11446f150222K8033l420369j002563O493353Q474845Q35263o469964l656094M731661
11437a36057P043117Q14594n616374n345938l24571L151545K034737j241729k581902
11428b202578j612608j797848l881697k772140M373768J0560786P208409k175134
11420G700958o233423k933073j032234l300597j742317N915015Q902728R14300
11412H191357p531503n147088K288168K851505j639745j274806K921641J773387
$$ plain form
11472 -1947531 -269155 541344 -1031579 -3395869 -2771705 962282 2775789 -400607
11464 -400607 -4548159 -4116816 300191 3907426 4892396 5229112 5823381 5285152 3253878
11455 3253878 1600101 2142348 4927054 8033905 8088647 3107561 -3893776 -7221070 -6150222
11446 -6150222 -6122189 -9542558 -10545121 -4051768 4423077 5258340 -1211624 -4867718 -136057
11437 -136057 6907060 7721654 2105280 -3240658 -3565229 -413684 1621053 379324 -2202578
11428 -2202578 -3815186 -5613034 -9494731 -12266871 -7893103 2667683 9876092 7700958
11420 7700958 1467535 -1465538 -2497772 -5798369 -7540686 -1625671 7277057 8191357
11412 8191357 659854 -4487234 -2199066 652439 -987306 -2262112 659529 2432916
11404B432916l498680k136488O504982R912108K250515o633514p197808l181860
11396a547829k006453k342836O07529M715542M326327r4771k984065k209169r54921
11387b490646k025367m200096m139549j82954N214421O921469K957220j925672
11379A28826j836490J983024L222275L90482j478867K1963N84846k783028n712112
11370e479081k997825L184130O425387M628121J078229j093365j700859j795459
11362B249278k012373k129349j047930J519760L092608R33167k946247l217684
11354c558770Q36922L336069N07532l062937j147032M573829O834223K887476
11346A1207312k700014m822846l060718Q9609K470098K781820O12363k631810
$$ plain form
11404 2432916 -1065764 -3202252 3302730 13214838 15465353 8831839 1634031 -1547829
11396 -1547829 -3554282 -5897118 -5289589 -574047 3752280 3657509 673444 -1535725 -2490646
11387 -2490646 -4516013 -8716109 -12855658 -13038612 -7824191 -902722 2054498 128826
11379 128826 -1707664 275360 3497635 3888117 2409250 2431213 3016059 233031 -5479081
11370 -5479081 -8476906 -5292776 1132611 5760732 6838961 5745596 4044737 2249278
11362 2249278 236905 -1892444 -2940374 -1420614 1671994 2605161 -341086 -3558770
11354 -3558770 -2721848 614221 1121753 -1941184 -3088216 1485613 8319836 11207312
11346 11207312 8507298 3684452 623734 713343 3183441 5965261 6577624 3945814
11338C945814m185126k338116J869368N324857N172273J391283k611183l220728
11330E348442q11419Q76973o5840j469919j036991R8833k75507j674465j864844
11321h74737j98072K095984L824347M311420L110392P30917j474173l077503m506137
11312C942438m610303j307972L908557N783575K294376j732586j592675K04014
11304F889424j337011m739827m112503R11873L893123J157383l102627l454718
11296c894883l94588J928295J916416J419159K040971K878972J708099k032366
11288E570075n184557l291742L109676O819296K397439n342435o565011J63731
11280b323528N847744L843789j661687l235522o57932J090312L16100m83861p3900
$$ plain form
11338 3945814 -239312 -2577428 -708060 4616797 9789070 11180353 8569170 5348442
11330 5348442 4537023 5413996 5348156 3878237 2841246 2940079 2664572 990107 -874737
11321 -874737 -1072809 1023175 4847522 9158942 12269334 13000251 11526078 8448575 3942438
11312 3942438 -667865 -1975837 1932720 7716295 10010671 8278085 6685410 6889424
11304 6889424 5552413 812586 -3299917 -2388044 1505079 2662462 -440165 -3894883
11296 -3894883 -4289471 -2361176 -444760 974399 3015370 5894342 7602441 5570075
11288 5570075 385518 -2906224 203452 7022748 9420187 4077752 -2487259 -2323528
11280 -2323528 3524216 7368005 5706318 2470796 1812864 2903176 3219276 2735415 2661515
11271B661515L38842M76973J205415J769779N52405j569041j946931l11702P82885
11262C960140m4379j169390p04767R23141J809327Q27804j157698j803965K96716
11253B936929L161233K905512j201583n036209m663040j238214J205820J122801
11245h06751K01182K32247J603721L521962L648885m50244o963270r442443m284738
11236a2739449L617160O787607M661816K352552J789306K55843k622061l104017
11228I98757j10664J992115p090l329179l793540j591759K77950L70184q76985
11219f070211k551983k867427L3245M685061O245879K300510l259101m567394
11211f051421o15827M258172N665560L270882J65685p65942K28605P84655L20960
$$ plain form
11271 2661515 3000357 3477330 4682745 6452524 7004929 5435888 3488957 3177255 3960140
11262 3960140 3915761 2746371 2041604 2964745 4774072 5601876 4444178 2640213 2936929
11253 2936929 6098162 9003674 7802091 2765882 -1897158 -3135372 -1929552 -806751
11245 -806751 -605569 -373322 1230399 4752361 8401246 7951002 987732 -8454711 -12739449
11236 -12739449 -9122289 -2334682 2327134 4679686 6468992 6724835 4102774 998757
11228 998757 888093 2880208 2873118 -456061 -4249601 -5841360 -5563410 -5193226 -6070211
11219 -6070211 -8622194 -11489621 -11456376 -6771315 -525436 1775074 -1484027 -6051421
11211 -6051421 -6667248 -2409076 3256484 6527366 6693051 5927109 6155714 6940369 7261329
11202G261329P77205K184337R62624l855412o323794j385224N626201M992812
11194A0240078k782288p177038l424848J354461R22794p28826J477862L674564
11186C556759J64511n485708n323249N73423M863561M110207J574114j20437j956284
11177A956897l916126l516881k72749K609697K235171p95311l398336k632154
11169g729792J604418N276727M063689j66380p03010L903786O290808J002057
11161A3542303o455873p301871k135412J077707r45593l811579l233316L91672
11153h871962M460355O165510L272435k550435n265204j915916K474218K515239
11145B84240P53543J757924K681381j227013n486131j893827O399140P332354
$$ plain form
11202 7261329 8038534 10222871 11185495 7330083 1006289 -378935 5247266 10240078
11194 10240078 7457790 280752 -3144096 -1789635 -866841 -1595667 -117805 3556759
11186 3556759 3721270 -1764438 -7087687 -6514264 -1650703 2459504 4033618 3913181 1956897
11177 1956897 -1959229 -5476110 -5748859 -3139162 -903991 -1699302 -5097638 -7729792
11169 -7729792 -6125374 -848647 3215042 3048662 2345652 6249438 12540246 13542303
11161 13542303 7086430 -215441 -2350853 -1273146 -2218739 -6030318 -9263634 -8871962
11153 -8871962 -4411607 1753903 5026338 2475903 -2789301 -4705217 -2230999 284240
11145 284240 1037783 2795707 5477088 4250075 -1236056 -3129883 3269257 10601611
11137A0601611j559038q718456n731416J694479M553531L051077K327016K954199
11129I173003K159777k33619k327516l279554k681961l34552J474187j16040l036452
11120G97273k209096J729620K301678k154432n141701k595052P77195K44153j186937
11111g437299N16311K580469J146812o29044K226635P098115P244501K335937
11103A5082437j671828k034033j919427l549973m483134k268848J146257J788547
11095B089998j169991m024063k601297K232690M617834J221505l191057j868444
11087b692825L541418M813278l18273m558941k351208K306166L482698K391211
11079F613524L191457M687911K753706j914742m573696l492697j360218o32232
$$ plain form
11137 10601611 9042573 324117 -5407299 -3712820 840711 3891788 6218804 9173003
11129 9173003 11332780 11099161 8771645 5492091 2810130 2475578 3949765 3833725 797273
11120 797273 -1411823 317797 2619475 465043 -4676658 -7271710 -6494515 -6250362 -7437299
11111 -7437299 -6920988 -4340519 -3193707 -3822751 -1596116 5501999 12746500 15082437
11103 15082437 13410609 11376576 9457149 5907176 1424042 -844806 301451 2089998
11095 2089998 920007 -3104056 -5705353 -3472663 1145171 2366676 -824381 -2692825
11087 -2692825 848593 5661871 5343598 784657 -1566551 739615 4222313 6613524
11079 6613524 9804981 14492892 17246598 15331856 10758160 7265463 5905245 5273013
11071E273013j308424k376447k525268o85430J920680K204334l71553k400033
11063b69128j497803N36309J624276K575995L670940K401429j766280m533230
11055B742508k899712k87809q69164k534627j021561K142139K203928k63042j34278
11046i21618L284051M480326L12725m824924m976189m43505L231404K625982J33704
11037B901956r3609J853687J907174j537613m474522l010001M67242R96884r39184
11028a927986n11079L071511N306813L940133J605920j33153k949705o085927
11020B316527n162466L20614M305863K549860j546306k767229p19093K334684
11012A632454M995721N182056P29781n341367o115536o83605L441309J311652
$$ plain form
11071 5273013 3964589 1588142 -937126 -1622556 298124 2502458 2130905 -269128
11063 -269128 -1766931 -1230622 393654 2969649 6640589 9042018 7275738 2742508
11055 2742508 -157204 -445013 -1314177 -3848804 -4870365 -2728226 -524298 -787340 -921618
11046 -921618 2362433 6842759 7155484 2330560 -2645629 -3089134 142270 2768252 2901956
11037 2901956 2808347 4662034 6569208 5031595 557073 -2452928 -1985686 -988802 -1927986
11028 -1927986 -2439065 632446 5939259 9879392 11485312 11352159 8402454 2316527
11020 2316527 -2845939 -2525325 1780538 4330398 2784092 16863 -702230 1632454
11012 1632454 6628175 11810231 12540012 7198645 1083109 399504 3840813 5152465
11004E152465k755401l415415k036044j448970k58687K156110K165359p46136
10996a186719n88067M726237P454905K080683m615652m395072q70919j696761
10988I08635m333260j542357M038150L614469k360878m936826j589982J185009
10980e017040M9946j138515j07384O99726P49203K443746M594780L014136j460799
10971C827799l159882o36741J585659R10389n31373j352731k515768l148149j106493
10962f127290K125305K974828J748969J327482J220365p99651k876693j825938
10954b232623J00214j322167l891810k219753K192708K912793l48040j716786
10946f525464J77694Q21426o59631N6742L466043M582941J913779o2955J068208
$$ plain form
11004 5152465 2397064 -1018351 -3054395 -4503365 -4762052 -2605942 -440583 -1186719
10996 -1186719 -1774786 2951451 10406356 12487039 7871387 3476315 2605396 908635
10988 908635 -3424625 -4966982 -928832 2685637 324759 -4612067 -6202049 -5017040
10980 -5017040 -4967094 -6105609 -6212993 -5513267 -4764064 -2320318 2274462 5288598 3827799
10971 3827799 667917 31176 1616835 2527224 1995851 643120 -1872648 -5020797 -6127290
10962 -6127290 -4001985 -1027157 721812 2049294 3269659 2470008 -406685 -2232623
10954 -2232623 -2132409 -3454576 -7346386 -9566139 -7373431 -4460638 -4808678 -6525464
10946 -6525464 -6347770 -5526344 -6185975 -6129233 -2663190 1919751 3833530 3770575 4838783
10937D838783K640114K871672K499825L14463m924768q372217m044312L918204
10929b58236M881762k376708p729356n397834q15455R79554K665753N876071N675412
10920C500963p6338m682881k497089K360973L310007J030403O8507J157311K245728
10911F417584K625231J762084j595027n817812o557499l163792M8140R08712J872367
10902c500012L551870K760806l78595p15113L097371N141570J503252l729265
10894G731884n676552n221228m275462j284160L812147O340950L597974n59574
10886D465979k093676k329888l177695k695951J54169J928571M16002j187711
10878d520200L8667J973641K136817J789853J734516k46755l961915m802933j250680
$$ plain form
10937 4838783 7478897 10350569 12850394 13164857 8240089 -132128 -4176440 -258236
10929 -258236 4623526 2246818 -5482538 -10880372 -11695827 -10716273 -8050520 -2174449 3500963
10920 3500963 3424625 -1258256 -3755345 -1394372 1915635 2946038 3014545 4171856 6417584
10911 6417584 9042815 10804899 9209872 3392060 -3165439 -6329231 -6281091 -5372379 -3500012
10902 -3500012 51858 2812664 2434069 1718956 4816327 9957897 11461149 7731884
10894 7731884 2055332 -3165896 -7441358 -8725518 -4913371 1427579 5025553 4465979
10886 4465979 2372303 42415 -3135280 -5831231 -5677062 -3748491 -3332489 -4520200
10878 -4520200 -4481533 -2507892 -371075 1418778 3153294 2906539 -1055376 -5858309 -7108989
10869g108989J607410K96804j421123L08152K789922K319178O97216J054467K243716
10860B786753K158024J790212J839614L73563k469363l095954j115557r35808
10852A331484l478146l854922q98011j88170l043564k484548L658334O384262
10844b573281O15897m150539Q92007P908620M992606l488893m392027J935545
10836A739935L360698k555780n474237j320946J499671j631667l567207N34958
10828g414575L758181j35603m919428j776465O120625Q499280L298933k019359
10820E411589k729664j978535k982074l280808Q9098M451519M836987J292013
10812E110125j433092j019645j63554j025835j365116R75620L299119K016649
$$ plain form
10869 -7108989 -5501579 -5204775 -6625898 -6317746 -3527824 -1208646 -511430 543037 2786753
10860 2786753 4944777 6734989 8574603 8948166 6478803 3382849 2267292 1331484
10852 1331484 -2146662 -6001584 -6899595 -7087765 -10131329 -12615877 -8957543 -2573281
10844 -2573281 -1957384 -6107923 -5215916 2692704 7685310 4196417 -195610 1739935
10836 1739935 5100633 2544853 -2929384 -4250330 -2750659 -4382326 -7949533 -7414575
10828 -7414575 -3656394 -3791997 -8711425 -10487890 -4367265 4132015 7430948 5411589
10820 5411589 2681925 703390 -2278684 -5559492 -5470394 -1018875 3818112 5110125
10812 5110125 3677033 2657388 2493834 1467999 102883 1078503 4377622 6394271
10804F394271j050634j266555J390679K729564J373367l0437k43878m85983k79669
10795H530725J723552K890750n94340n734179n206397Q95116M082300N84471l181774
10786C990224j870246P13024j51384j833003n96297Q54247j025925l223014j330995
10777d473369K552456L614991J969897O32509j54425j074466l54671K370256L047873
10768H131051n69864m055885l031884j29746L97578J16709K151606M128878K280602
10759I419045j276763k105858p93205l65783r1638J594157J786369k225798o381525
10750d40999n115011k55172K302535J829939J550688J231023j278475l544645
10742c720117j633002J957168J346750k787383m093438q99219J923378J751446
$$ plain form
10804 6394271 5343637 4077082 5467761 8197325 9570692 9540255 9296377 8810394 8530725
10795 8530725 10254277 13145027 12550687 6816508 1610111 2505227 6587527 7171998 3990224
10786 3990224 2119978 2833002 2681618 848615 252318 1106565 80640 -3142374 -4473369
10777 -4473369 -1920913 1694078 3663975 4296484 4142059 3067593 2712922 5083178 8131051
10768 8131051 7561187 3505302 473418 343672 741250 857959 3009565 7138443 9419045
10759 9419045 8142282 6036424 5243219 4877436 4785798 6379955 8166324 5940526 -440999
10750 -440999 -5556010 -5811182 -3508647 -1678708 -128020 1103003 -175472 -3720117
10742 -3720117 -5353119 -3395951 -2049201 -4836584 -8930022 -9829241 -7905863 -6154417
10734f154417J622231L571987M851439K846170q39760l005465k379376K19636
10726G32445K638291K442763m15763k829795k600139j549445k097885l023491
10718f703019j787865R44607K361253J497010m13647j895848j688979N52001K741195
10709d393292K421187R01861J285155K306335O9442l655435k691703K350773L355950
10700A950273j574330l898764O36128L890674k75671m051787J305670R278254
10692G260447P485376k706082q885106o338731j751022q765J035386K648694K211993
10683I52190n69916k084547n12068K280000M098373L429375n89365n067324m250170
10674b313452J838386N068955J062833l363103j662731J250192j327248m631215
$$ plain form
10734 -6154417 -4532186 -960199 3891240 6737410 5897650 2892185 512809 732445
10726 732445 3370736 5813499 5397736 2567941 -32198 -1581643 -3679528 -6703019
10718 -6703019 -8490884 -7546277 -5185024 -3688014 -4101661 -5997509 -7686488 -7134487 -4393292
10709 -4393292 -1972105 -1070244 214911 2521246 2590688 -1064747 -3756450 -1405677 1950273
10700 1950273 375943 -3522821 -2886693 1003981 728310 -3323477 -2017807 7260447
10692 7260447 14745823 12039741 3154635 -3184096 -4935118 -4943883 -3908497 -1259803 952190
10683 952190 382274 -1702273 -2214341 65659 4164032 7593407 7004042 1936718 -2313452
10674 -2313452 -475066 4593889 5656722 2293619 630888 1881080 553832 -4077383
10666d077383p58223N844782M765320k450662m781443l6361L290054J869658J376972
10657E042714L419595J986787m207593p738729m577497Q4656J766810K885711
10649a337546N121823M691748Q3502l157163o22239L817569L834094p56448n058199
10640F617141n425255j954374K600014M561043K261929j817326l669380k303967
10632H69825J01996J388735P77531j141440j953481M73594L895661L560236j94191
10623G778466j569888J081856J980696k018576n431547l402736L31877Q78030
10615c71822M02617K051642K736561l55429k693230J41547M089579L523533L91119
10606I916117j018368j796468l496157k815053J299494L278768J041653R14727
$$ plain form
10666 -4077383 -4835606 1009176 5774496 3323834 -1457609 -1493970 1796084 3665742 5042714
10657 5042714 8462309 10449096 6241503 -1497226 -6074723 -5990067 -4223257 -1337546
10649 -1337546 3784277 8476025 8559527 5402364 4780125 8597694 12431788 11675340 6617141
10640 6617141 1191886 -762488 1837526 6398569 8660498 6843172 3173792 869825
10632 869825 971821 2360556 3138087 1996647 43166 516760 4412421 7972657 7778466
10623 7778466 6208578 7290434 9271130 7252554 1821007 -1581729 -1249852 -371822
10615 -371822 30795 2082437 4818998 4463569 1770339 1911886 6001465 9524998 9916117
10606 9916117 8897749 7101281 3605124 790071 2089565 5368333 6409986 7324713
10598G324713M662049L442912n446766r268779k48844Q356633K695252p936227
10590C580943o620565L008498N176403k82317j065484K994754J518818m084170
10582D226880k695543M052717L671838l499839m446751K165833L525812l426917
10574C574030o752761j565645K647411R54588K95679L203592K344941l382700
10566A319135m398348K168301O389357K541280k296143j856368N93800J647260
10558F108274L097843M239278J099876l947969l844421L90997R27793k239242
10550E832429j164829M861992P491156L699566p06079k461115l714202m129813
10542I709105j705062L79918j250153k288895J121135L101552r33315l233941
$$ plain form
10598 7324713 11986762 15429674 9982908 714129 465285 8821918 11517170 3580943
10590 3580943 -3039622 -31124 5145279 4862962 3797478 6792232 8311050 4226880
10582 4226880 1531337 5584054 9255892 5756053 1309302 3475135 7000947 3574030
10574 3574030 -3178731 -4744376 -2096965 -1142377 -846698 2356894 4701835 1319135
10566 1319135 -3079213 -910912 5478445 8019725 5723582 3867214 4461014 6108274
10558 6108274 9206117 13445395 14545271 10597302 6752881 7143878 8071671 5832429
10550 5832429 4667600 9529592 17020748 20720314 20014235 17553120 13838918 9709105
10542 9709105 8004043 8383961 7133808 4844913 5966048 9067600 8134285 4900344
10534D900344K198736N957045J24750m654456J588506P091794m11044p881880
10526H913795K34593J0224485K211280j0939655m601090J1682171R959554n605131
10518B2080002p584209L757368M066350o516795n632153M683008K284646p734120
10510I404097q13617J5356139J1079825o540082l730362J3675642Q742619j2934817
10502C4239444r911742J3158138J0168399j4268291o969807K7845621K5843365
10495H0105127j3388928j3744631L2182952L5720068j4911369l766641R5192106
10488A97388684J06308838q7242701k99673590k62197103j2706301J53454821
10482b04667352R8956928j2423726j4285007L8781064L1090900j1927279o926102
$$ plain form
10534 4900344 7099080 13056125 13180875 8526419 10114925 17206719 16795675 8913795
10526 8913795 9148388 19372873 21584153 10644498 6043408 17725579 27685133 22080002
10518 22080002 14495793 18253161 22319511 15802716 10170563 14853571 17138217 9404097
10510 9404097 8590480 23946619 35026444 28486362 24756000 38431642 47174261 34239444
10502 34239444 24327702 37485840 47654239 33385948 26416141 54261762 80105127
10495 80105127 66716199 52971568 85154520 120874588 105963219 102196578 197388684
10488 197388684 303697522 216454821 -83218769 -345415872 -358122173 -204667352
10482 -204667352 -105710424 -118134150 -132419157 -93638093 -62547193 -74474472 -81400574
10475h1400574K6866245K0363237j2634135j2038325J4008007J3821834p948559
10468c8962270o463170J5394720J6658496l606934r647278L080502O411955m017823
10460b1151802o264181J630245J708102m431182J07348J0549651P547344n240862
10452a5545337p080361K623196O396596J557434J65575K651896j8372m522738
10444a3772111j492781L980065J947513j820969K130754N815634j561467j0087172
10436a4860534n142826M986812L256756n412731m019238N318383O640988n23850
10428i756240k604251K437826M265662P32972j257556j032103k372426k422624
10420a2008740J560866K684713l013496n565839J400179N898282j595436q056508
$$ plain form
10475 -81400574 -54534329 -34171092 -46805227 -58843552 -44835545 -31013711 -38962270
10468 -38962270 -45425440 -30030720 -13372224 -16979158 -26626436 -23545934 -17133979 -21151802
10460 -21151802 -27415983 -25785738 -24077636 -28508818 -28401470 -17851819 -10304475 -15545337
10452 -15545337 -22625698 -20002502 -13605906 -12048472 -11882897 -9231001 -9249373 -13772111
10444 -13772111 -15264892 -11284827 -9337314 -11158283 -9027529 -3211895 -4773362 -14860534
10436 -14860534 -20003360 -15016548 -11759792 -17172523 -21191761 -15873378 -9232390 -9756240
10428 -9756240 -12360491 -9922665 -5657003 -4924031 -6181587 -7213690 -9586116 -12008740
10420 -12008740 -10447874 -7763161 -10776657 -16342496 -14942317 -9044035 -10639471 -18695979
10412a8695979J23744J0725764N737839o487422o143669L098881K906567n399631
10404a4133906n107493L673687N530516l86469n27293N227401L674761m474702
10396f523498m560186L987090N787244j991315m542445L220370P977619K094916
10388E449795n043768n574032l744972k778368Q69083N476232L386106l602916
10380e562840m640826J191375K999126j912593l549228J482255L696984j111362
10372g407109m052411L17346M723350L035760l2620N49926J839237P99007j42450
10363c69964K10680n23755j278637J537992M675186J109086o265234o635913J110744
10354f429815N883396K271930k224925j610629k34305k342740m280970k450708
$$ plain form
10412 -18695979 -18572235 -7846471 -2108632 -8596054 -14739723 -11640842 -8734275 -14133906
10404 -14133906 -19241399 -15567712 -10037196 -10423665 -10950958 -5723557 -2048796 -6523498
10396 -6523498 -11083684 -7096594 -1309350 -3300665 -7843110 -4622740 3354879 5449795
10388 5449795 406027 -5168005 -8912977 -11691345 -10822262 -5346030 -1959924 -5562840
10380 -5562840 -10203666 -9012291 -6013165 -7925758 -11474986 -9992731 -6295747 -7407109
10372 -7407109 -11459520 -11142174 -6418824 -3383064 -3415684 -2865758 -1026521 -227514 -369964
10363 -369964 -159284 -683039 -1961676 -423684 4251502 5360588 -904646 -7540559 -6429815
10354 -6429815 -546419 1725511 -499414 -2110043 -2344348 -4687088 -8968058 -11418766
10346a1418766N46565J972165K547612J513150k813922o167427k275914N139426
10338a0957111N718681o07319k628442L352774P015981J346383o002243n591342
10330h352638r5132K198605j90375k862329k890271j19608L807832M750871r391
10321c762436n570364l929322M031816Q771483N682747K07308k245720k688976
10313D96536k629226o64115J970654P58362l965718n836874k238375K094271L513971
10304f500514L787303L732269O67353m838718p261548m286224l7444K035780K815943
10295i885800K660764K75394k170702n07334L470780L414444r92696l232635r81253
10286g949038R35845Q3601l46521M65287n97981k250749P77203O533447O070419
$$ plain form
10346 -11418766 -10872201 -8900036 -6352424 -4839274 -7653196 -13820623 -16096537 -10957111
10338 -10957111 -5238430 -5845749 -8474191 -5121417 1894564 3240947 -2761296 -8352638
10330 -8352638 -8447770 -6249165 -6439540 -9301869 -12192140 -12311748 -8503916 -3753045 -3762436
10321 -3762436 -9332800 -13262122 -9230306 -458823 5223924 5431232 3185512 496536
10313 496536 -2132690 -2796805 -826151 -67789 -4033507 -9870381 -12108756 -10014485 -6500514
10304 -6500514 -2713211 1019058 1686411 -3152307 -10413855 -14700079 -14737523 -12701743 -9885800
10295 -9885800 -7225036 -6949642 -9120344 -9627678 -6156898 -2742454 -3735150 -6967785 -7949038
10286 -7949038 -7013193 -6929592 -7276113 -6810826 -7408807 -9659556 -8882353 -2348906 3721513
10277C721513j630095o253822k266546K920441K627561J326968L914056N278606
10269I638682j6355o353557n540910j85304J321980j584856k421229J098355M807595
10260G64401N201637K425986k027093n703384n671642k639417j343695l242098
10252a2235305l267852J824641O860911N563404J99016k283426n65732Q48290
10244c056053k82982j501520m96968K114903M453129M787797K232365j759379
10236F491292m060109l638902k562246k158872j340056N6724K59017m11609R66804
10227f397957M124532M302890L056l022220j04207M261253K387500n000224r014480
10218h459857m275435M147272O822289R49333o241842n605878K704091Q632360
$$ plain form
10277 3721513 2091418 -4162404 -6428950 -3508509 -880948 446020 4360076 9638682
10269 9638682 9622327 3268770 -2272140 -2457444 -1135464 -2720320 -5141549 -4043194 764401
10260 764401 5966038 8392024 6364931 661547 -5010095 -7649512 -8993207 -12235305
10252 -12235305 -15503157 -13678516 -6817605 -1254201 -1055185 -3338611 -3904343 -3056053
10244 -3056053 -3339035 -4840555 -5337523 -3222620 1230509 6018306 8250671 6491292
10236 6491292 2431183 -1207719 -3769965 -5928837 -7268893 -7212169 -6953152 -7364761 -6397957
10227 -6397957 -2273425 2029465 2032521 -989699 -1093906 3167347 5554847 554623 -8459857
10218 -8459857 -12735292 -8588020 -1765731 -816398 -7058240 -12664118 -9960027 -1327667
10210a327667M771971l797861o733765k522064J520330J737020J961109M185141
10202b05786M564779J621139r2272J423485J412143k397397m396305j044615J659597
10193B544768j590550m918274o74726O284105N088289l420750p443347k463756
10185f594241K927073J820622j146801L21858L333369J887864k316070l093223
10177b859549m57265k37496l911733o043781l071426J428806K945865K604276
10169i602303L643192M999244L456506K20903k86036K058545K438203q74819l453010
10160B600425k227390o89976k513369m693351k565712J894948L268849J862265
10152c063311K421398M539325K334583m893771r315758n487981J436419L206229
$$ plain form
10210 -1327667 3444304 -353557 -7087322 -9609386 -8089056 -6352036 -4390927 -205786
10202 -205786 4358993 5980132 5887860 7311345 8723488 6326091 1929786 885171 2544768
10193 2544768 954218 -3964056 -4638782 1645323 6733612 3312862 -4130485 -6594241
10185 -6594241 -3667168 -1846546 -2993347 -2671489 661880 2549744 233674 -2859549
10177 -2859549 -3316814 -3554310 -7466043 -13509824 -16581250 -15152444 -12206579 -9602303
10169 -9602303 -5959111 -959867 2496639 2717542 2431506 4490051 6928254 6053435 2600425
10160 2600425 373035 -316941 -2830310 -7523661 -10089373 -8194425 -4925576 -3063311
10152 -3063311 -641913 3897412 6231995 1338224 -7977534 -13465515 -12029096 -8822867
10144h822867k13069k228125J91196L592373M568103M015185L770725K913466
10136G786987j30313l781859m391325j081021K510110K340773j286926m463852
10128b497426m505975k285856N0945J481027J725807P87971k2047J280351M222574
10119B37371N297283K223867k831473n911956n552261k904765M72429K949032
10111f020473K673442m42255l414558k880440J084921M764069M166354j088329
10103a157269o193422m728451L684789J0802045Q819222P26316l810332k049347
10095F093551m10459k528911l782455q80085J699956J22941j571594Q53528L584647
10086C181119J604099j848558q19493K682952J986005l096869o242902l968803
$$ plain form
10144 -8822867 -9035936 -11264061 -11072865 -7480492 -2912389 1102796 4873521 7786987
10136 7786987 7656674 3874815 -516510 -1597531 912579 3253352 1966426 -2497426
10128 -2497426 -7003401 -9289257 -9238312 -7757285 -6031478 -5243507 -5265554 -3985203 237371
10119 237371 5534654 7758521 4927048 -984908 -6537169 -9441934 -8969505 -6020473
10111 -6020473 -3347031 -3789286 -7203844 -10084284 -8999363 -4235294 -68940 -1157269
10103 -1157269 -7350691 -12079142 -8394353 2407692 11226914 11953230 8142898 6093551
10095 6093551 5683092 3154181 -628274 -1508359 191597 314538 -1257056 -403528 3181119
10086 3181119 4785218 2936660 2117167 4800119 6786124 3689255 -2553647 -6522450
10078f522450J477788O540163Q059693L635319l934021o447171r68165L893080
10070E734236M1523o728337n247139L019264O178289P31564l965832j397852L166867
10061A532583K924733n81063k519275k590144k824042k606324m98687K092479
10053e069740K627260J122601j6003R59753L013158L118435M4169k971961k133482
10044F94190N60004j70060l409081k185131M447213P788622K685665m105313n058775
10035A247334k879323k648719j723829K861399N160510o8948n642841k383013
10027f077430M844509M930238q68543k519937N99999L84156l462544l017296K243338
10018b943510M106945L81883k631697k814989m027246n059094n92027O187019
$$ plain form
10078 -6522450 -5044662 1495501 9555194 13190513 9256492 2809321 1841156 5734236
10070 5734236 5775759 -952578 -6199717 -3180453 2997836 3729400 -236432 -1634284 1532583
10061 1532583 4457316 3876253 1356978 -1233166 -4057208 -6663532 -7162219 -5069740
10053 -5069740 -2442480 -1319879 -1335882 -376129 2637029 5755464 5799633 2827672 694190
10044 694190 1254194 1084134 -2324947 -4510078 -62865 7725757 10411422 6306109 1247334
10035 1247334 -1631989 -4280708 -6004537 -3143138 2017372 1948424 -3694417 -6077430
10027 -6077430 -1232921 3697317 2828774 308837 908836 1292992 -2169552 -5186848 -2943510
10018 -2943510 1163435 1545318 -1086379 -3901368 -7928614 -12987708 -13579735 -7392716
10010g392716N937612p54757l614199j81006J369984j498086j782336K021546
10002e893958K358514k107153k751340K890943O048249K829575O64380K951024
9994F990234K256113m228904p145911j261205M211811P24879o193855p643091
9986a2289929m423928r14384L399119P974539P306215J063996k211711R06435
9978H10352K262303k539254m800948J502331P090142K558019m788626k944957
9970h50638M686834N646621j147530n422644k624061J729025L288735L624222
9962H930564L787007J770303k686292o442469o690376l457997N88412J644515
9954b556333j171624l196461j94918L910245K172374l363984l962264J385501
$$ plain form
10010 -7392716 -1455104 -2209861 -5824060 -6005066 -4635082 -6133168 -7915504 -5893958
10002 -5893958 -3535444 -5642597 -8393937 -5502994 545255 3374830 4039210 6990234
9994 6990234 9246347 5017443 -2128468 -3389673 822138 1547017 -4646838 -12289929
9986 -12289929 -16713857 -17628241 -14229122 -6254583 1051632 2115628 -96083 810352
9978 810352 3072655 533401 -4267547 -2765216 4324926 6882945 2094319 -850638
9970 -850638 3836196 9482817 8335287 2912643 288582 2017607 5306342 8930564
9962 8930564 12717571 14487874 11801582 5359113 -1331263 -4789260 -4200848 -2556333
9954 -2556333 -3727957 -6924418 -7119336 -3209091 -1036717 -4400701 -8362965 -6977464
9946f977464M622339L022903K917386O174781N700683q06930n028568k091767
9938G533363J104880j554781n300673m101088n84901O36497O55421J196990M69498
9929E5206j057358K59935K793745O20210m206313k635192M898754O909248N287
9920G643522n356789l430360j552662l676304k431676M301058N995981j513552
9912b0782o147248K50504P474199M485046l151350n253049k998513j655952j14536
9903g131681K279406J123715k578265j128204M353796L410869l370162l062974
9895f103500M824089N202524m078251o514642J760442L839732m517719n368980
9887a0956305N026765N996161o189529o766662Q872945J0339425r698974j4219970
$$ plain form
9946 -6977464 -2355125 667778 3585164 9759945 15460628 14653698 9625130 7533363
9938 7533363 8638243 7083462 1782789 -2318299 -2903200 -2266703 -1611282 -414292 55206
9929 55206 -1002152 -742217 2051528 2671738 -1534575 -4169767 728987 7638235 7643522
9920 7643522 2286733 -1143627 -2696289 -6372593 -8804269 -4503211 1492770 -20782
9912 -20782 -6168030 -5917526 1556673 6041719 2890369 -2362680 -5361193 -7017145 -7131681
9903 -7131681 -4852275 -3728560 -6306825 -7435029 -3081233 329636 -3040526 -6103500
9895 -6103500 -1279411 3923113 -155138 -6669780 -4909338 -1069606 -5587325 -10956305
9887 -10956305 -5929540 66621 -6122908 -12889570 -4016625 6322800 -3376174 -17596144
9879a7596144R010845J5595256j3408653k3449976J3972737K2003359o4515354
9872e8387930j55508610j05202135O2340360J62128276J01152892o725523k6308814
9865b6511484J7942611K5496975j0877624k2458299M438231J8054889j79214j3758510
9857g852425l771432O287380J841196k274249J593050J625607m090513l005923
9849i647309M278134M175864j917603k8173P523829N222559n355956p323639O31680
9840b440614L222075k203915k704171L768917N212834p9920j030500L091844J254987
9831H091537o044763n937429K047165L805276l433440o012510P41091M364308
9823b378765j178701m855964M45019N268031J267397m692757l751401J066423
$$ plain form
9879 -17596144 -8585299 7009957 -6398696 -29848672 -15875935 6127424 -58387930
9872 -58387930 -213896540 -319098675 -256758315 -94630039 6522853 -202670 -26511484
9865 -26511484 -8568873 16928102 6050478 -16407821 -11969590 6085299 5906085 -7852425
9857 -7852425 -11623857 -5336477 -3495281 -5769530 -4176480 -2550873 -6641386 -9647309
9849 -9647309 -5369175 -1193311 -3110914 -3139087 4384742 9607301 4251345 -3072294 -2440614
9840 -2440614 781461 -1422454 -4126625 -357708 4855126 4775206 3744706 6836550 8091537
9831 8091537 2046774 -3890655 -1843490 1961786 -1471654 -7484164 -6743073 -2378765
9823 -2378765 -3557466 -8413430 -7968411 -2700380 -1432983 -6125740 -9877141 -8810718
9815h810718L073984K777168K788310J552611j446809k654011j331508j488075
9807e539048l745262l589000j05701K105514J568357J767428L159355K455817
9799a922540O43574K024333M723787K668275k347969k155108K862842K910303
9791I407497m168964p903192k389196L714436J598453l772990k943845K737460
9783c720341M540647K58754l950877l487906l11472J524132Q40509n12917l69684
9774e189155J122529J598561l7850j548383p66177P69520N14271p17326o10021
9765d864031M39500P72827R26512J651800J157171j251658j985887J136610L492986
9756A475830K93667m537769l457119K959846O988200N088037Q82616k200627m045926
$$ plain form
9815 -8810718 -5736734 -2959566 -171256 1381355 -65454 -2719465 -4050973 -5539048
9807 -5539048 -9284310 -12873310 -12979011 -10873497 -9305140 -7537712 -4378357 -1922540
9799 -1922540 -1278966 745367 5469154 8137429 5789460 3634352 6497194 9407497
9791 9407497 5238533 -2664659 -5053855 -1339419 259034 -3513956 -6457801 -3720341
9783 -3720341 820306 1079060 -2871817 -6359723 -6671195 -5147063 -4306554 -4819471 -5189155
9774 -5189155 -4066626 -2468065 -2505915 -4054298 -4820475 -4050955 -3536684 -4254010 -4864031
9765 -4864031 -4424531 -3651704 -2725192 -1073392 83779 -1167879 -3153766 -2017156 1475830
9756 1475830 1769497 -2768272 -6225391 -3265545 3722655 8810692 9693308 7492681 3446755
9747C446755m296513k570096j482117k874249k540651L772463J0617163Q076326
9739A2149081l113178j0715199p087776J829443O142812L712019p55512k741957
9731e80267j085673K011947K508056q29925l547411j192887L356528L529608r79175
9722C190801l926072j875123K187548M579559M421474J521359l284440n795850
9714A019256k583959K613787K923056j416979l675888j577463q782j676492k838142
9705g221606q17051J254398M58429j061094o46472M66608M37922K20356R08996
9696e999514J503451J515974K105400K876002J516617j647122k875631p65034
9688a769857J236103K80687j675049j664914m09835l41870j352990j420355j59562
$$ plain form
9747 3446755 -849758 -3419854 -4901971 -7776220 -10316871 -6544408 4072755 12149081
9739 12149081 9035903 -1679296 -8767072 -6937629 -794817 2917202 2161690 -580267
9731 -580267 -1665940 346007 2854063 2024138 -1523273 -2716160 640368 4169976 3190801
9722 3190801 -735271 -2610394 -422846 4156713 8578187 10099546 6815106 1019256
9714 1019256 -1564703 1049084 3972140 2555161 -1120727 -2698190 -2706972 -4383464 -7221606
9705 -7221606 -8038657 -6784259 -6325830 -7386924 -8033396 -7566788 -7128866 -6908510 -5999514
9696 -5999514 -4496063 -2980089 -874689 2001313 3517930 1870808 -1004823 -1769857
9688 -1769857 -533754 -253067 -1928116 -3593030 -4002865 -4344735 -5697725 -7118080 -7277642
9679g277642P34244M02075M95754K929573O121566N383069p34664o175735m105577
9670b227337K504794L650469k738222o689889j535111N042604K991871m156436
9662c157257n421878L47800M510797L381308J571509J271498o49675l787950k856312
9653d790160K437673N307842K495608j201130j781266j606428k997267l578144
9645e713272j559540O37061J220739J772867K674785J717524m88020Q350L213633
9636C484127L874602J60196k872706j609897P30023N01210p41352p47784q45390
9627A933029j872657j481116O66023O61867k680439m459046j797577N42583j881942
9618a0369275n012089k561302L600827O272957L675762P76827Q67178J636464
$$ plain form
9679 -7277642 -6543398 -6141323 -5645569 -2715996 3405570 8788639 8053975 1878240 -2227337
9670 -2227337 277457 3927926 1189704 -5500185 -7035296 -1992692 999179 -3157257
9662 -3157257 -8579135 -8231335 -3720538 -339230 1232279 2503777 1854102 -1933848 -4790160
9653 -4790160 -2352487 2955355 5450963 4249833 2468567 862139 -2135128 -5713272
9645 -5713272 -7272812 -6635751 -5415012 -3642145 -967360 750164 262144 270494 3484127
9636 3484127 7358729 7518925 4646219 3036322 3766345 4267555 3526203 2778419 1933029
9627 1933029 60372 -1420744 -754721 -92854 -2773293 -7232339 -9029916 -8487333 -10369275
9618 -10369275 -15381364 -17942666 -14341839 -8068882 -4393120 -3616293 -2749115 -1112651
9610a112651O5491k978870m131539j446830L417068O184488M020962r07520l478667
9601c68068j535246K117740L535979J161217l775337p373620m945894K995485
9593h187744Q275715M307331l729904n392796o34677P18782m086288n948031j12780
9584a4790392M786279J439571l069678P30588Q097172P760987M81375l266609
9576B169293j035014l11129l226227k865302K727553N308508K43079m896155k304518
9567d189912L693271M033168j232507m593053k942255o5162P97411n8872k246539
9558f804450n290613n595805P5911P524389Q133301R03488m938823k674287K700084
9549e966805L052120n42408j315772Q86781j49272m984242o065339J38767O645245
$$ plain form
9610 -1112651 -1047160 -4026030 -8157569 -9604399 -6187331 -2843 4018119 3110599 -368068
9601 -368068 -1903314 214426 3750405 4911622 1136285 -6237335 -11183229 -8187744
9593 -8187744 87971 4395302 665398 -4727398 -5362075 -4643293 -8729581 -14677612 -14790392
9584 -14790392 -10004113 -8564542 -11634220 -10903632 -2806460 4954527 5435902 2169293
9576 2169293 1134279 823150 -2403077 -5268379 -2540826 2767682 3010761 -1885394 -4189912
9567 -4189912 -496641 3536527 2304020 -2289033 -5231288 -5296450 -4499039 -4557911 -6804450
9558 -6804450 -12095063 -17690868 -17614957 -10090568 -1957267 -1053779 -5992602 -8666889 -5966805
9549 -5966805 -2914685 -3457093 -4772865 -3886084 -4035356 -9019598 -15084937 -14946170 -8300925
9540h300925O181734J411244p31923K61682R9788j623240j641104j82620q83011
9531e408375l701663m176181n77598L463539M733196M317021M168162L622389
9523F440490J280545k184205m612567m344011j462426J608674J809893l94867
9515a858474n62348L170624N708933J729729n337624p037074j877878K880054
9507c184058K205837l93326J9143K018532J180647k282620l626983k92858M513998
9498A58312N462553J364814l015956k446797J870741L667816N63745k598353j793491
9489C233384j37899j587594l229657n66228L302757J937646l173523m324870N1516
9480d494468L362510J757613j102010j510533m37313P97634K570998L280119M64224
$$ plain form
9540 -8300925 -2119191 -707947 -1439870 -1178188 -1078400 -2701640 -4342744 -4525364 -5408375
9531 -5408375 -9110038 -13286219 -13863817 -10400278 -5667082 -1350061 2818101 6440490
9523 6440490 7721035 5536830 924263 -3419748 -4882174 -3273500 -1463607 -1858474
9515 -1858474 -2420822 749802 6458735 8188464 2850840 -4186234 -6064112 -3184058
9507 -3184058 -978221 -1371547 -1352404 666128 1846775 -435845 -4062828 -4355686 158312
9498 158312 5620865 6985679 3969723 1522926 3393667 7061483 7625228 5026875 3233384
9489 3233384 3095485 1507891 -1721766 -2287994 1014763 2952409 -221114 -4545984 -4494468
9480 -4494468 -1131958 625655 -476355 -1986888 -2424201 -1626567 944431 4224550 4688774
9471D688774l375277l227220m72634j224761n005648m501078J540728N417540
9463f159576L708677K727934N884089O336469p27239q091308p277421j496520
9455e094895R51600l30944l69898J090143R08144j88971L12451J061824L16404
9446a344142P86028M064310N225808O72470l905038k175076J402736r97763o095641
9437b366308m287485L486783O247630N06583m755053k910578J361102J832169
9429h85157J82482O48092K333193K122170K27625j582066l373663n129143m833787
9420a0290254j541462K337210M033213L355094J411687q29970j803065k57676
9412c585223K102194J949370q02693k514504j072665J386592J970192N08176j326581
$$ plain form
9471 4688774 1313497 -1913723 -2386357 -3611118 -8616766 -13117844 -11577116 -6159576
9463 -6159576 -2450899 277035 6161124 12497593 11770354 3679046 -3598375 -5094895
9455 -5094895 -4143295 -4474239 -4844137 -3753994 -2845850 -3034821 -2722370 -1660546 -1344142
9446 -1344142 -558114 3506196 8732004 9404474 5499436 3324360 4727096 3729333 -2366308
9437 -2366308 -6653793 -3167010 3080620 3587203 -1167850 -4078428 -2717326 -885157
9429 -885157 -702675 -54583 2278610 4400780 4628405 3046339 -327324 -5456467 -10290254
9420 -10290254 -11831716 -9494506 -5461293 -2106199 -694512 -1524482 -3327547 -3585223
9412 -3585223 -1483029 466341 -336352 -2850856 -3923521 -2536929 -566737 -58561 -1385142
9403a385142k000494p49210J581623K445234O60086j207382m01556J328302N05649
9394G77110j680012p66866L284394N206469K274791k089678m196296m517607l958491
9385e666186q47023M617039P166904K688235m748208p047951k445871K794570
9377c488491L277624Q62277L65837K130936K298911n48999k848565j452655J411639
9368B008514J503789q56106j526940M61420J192271j499519l982243k227781K060676
9359b865919M088218K393064n66995k340590k110192k83917R98312o75070l572449
9350d935538k328493L765932P283508K677583m296861m282502J508952L504410
9342B896991r14473l950708p14082L482856L053497R63206J775523K657214j241104
$$ plain form
9403 -1385142 -3385636 -4134846 -2553223 -107989 552097 -655285 -1056841 271461 777110
9394 777110 -902902 -1669768 1614626 6821095 9095886 7006208 2809912 -1707695 -5666186
9385 -5666186 -6513209 -1896170 5270734 7958969 3210761 -3837190 -6283061 -3488491
9377 -3488491 -210867 651410 1017247 3148183 5447094 4898095 2049530 596875 2008514
9368 2008514 3512303 2656197 1129257 1590677 2782948 1283429 -2698814 -4926595 -2865919
9359 -2865919 1222299 3615363 3048368 707778 -1402414 -1686331 -688019 -1363089 -4935538
9350 -4935538 -7264031 -3498099 3785409 6462992 2166131 -2116371 -607419 2896991
9342 2896991 1982518 -1968190 -2682272 800584 3854081 4817287 6592810 9250024 8008920
9333H008920o880352o902688j197483K745480J112066j465048j31618L069146
9325a641577L691306K260857K535731M384327L357304k170620p497808p378032
9317b458512k685445J472374K613348K445190K290415J041672j425211k626463
9309F67368j366617j81336j247716k460682q02061K356983L028766O87036j115260
9300d33519j95430J368585N98605k231737l848124j728741K641442M626109J754319
9291B551509k407866k519964O17876J052632k283889k775895K833518P094046
9283D161967K453627n717219n810553K695501Q541988N438615m45826k173818
9275I144282j714552k993091l287151J292501O908017O283655m36237n828804
$$ plain form
9333 8008920 1128568 -5774120 -6971603 -4226123 -3114057 -4579105 -4710723 -1641577
9325 -1641577 2049729 4310586 6846317 11230644 14587948 12417328 4919520 -2458512
9317 -2458512 -5143957 -3671583 -1058235 1386955 3677370 4719042 3293831 667368
9309 667368 -699249 -880585 -2128301 -4588983 -5391044 -3034061 -5295 681741 -433519
9300 -433519 -628949 739636 1338241 -893496 -4741620 -6470361 -3828919 797190 2551509
9291 2551509 143643 -2376321 -1758445 -705813 -2989702 -5765597 -2932079 4161967
9283 4161967 6615594 898375 -4912178 -2216677 6325311 11763926 11318100 9144282
9275 9144282 7429730 4436639 1149488 2441989 9350006 15633661 15197424 9368620
9267I368620n458512k264630l35695O16801K595589M527733L168541j900271o395518
9258C922658n657623m42268L267773J309513l302633m324861o56673K489133J094107
9249b300874k422403l171496m51829J981141J159366j639852k634723J68137M563088
9240d749445O217538L480227o87133k458362j589581n28492m37521n19913m14301
9231a686983n72094p16397l76926k78369p24359R7147K919083M045583j87560
9222B519125o330589o679447R8567O529728O192250J173900k505199k447386j43940
9213a592991K433677L508694J798176j292878k461097j278064q59469k090876
9205a834828j509041K366845N099557K609983k415483m733446l874975k590095
$$ plain form
9267 9368620 3910108 1645478 1309783 1926584 4522173 9049906 12218447 10318176 3922658
9258 3922658 -1734965 -2177233 1090540 2400053 -902580 -5227441 -5884114 -3394981 -2300874
9249 -2300874 -4723277 -7894773 -8346602 -6365461 -5206095 -6845947 -9480670 -9312533 -4749445
9240 -4749445 1468093 4948320 4261187 1802825 213244 -315248 -752769 -1272682 -1686983
9231 -1686983 -2259077 -2975474 -3352400 -3630769 -4355128 -4257981 -1338898 2706685 2519125
9222 2519125 -3811464 -10490911 -10392344 -3862616 2329634 3503534 998335 -1449051 -1592991
9213 -1592991 840686 4349380 6147556 4854678 2393581 1115517 256048 -1834828
9205 -1834828 -3343869 -977024 4122533 6732516 4317033 -416413 -4291388 -6881483
9197f881483r54133K439296N304708L643731j398017l924346j236830K850166
9189a56908L645716J051671j819414k780327j974584q13737m41737n47737J07584
9180c729473J429774J539922l17164k205990k425730j840898j264883O96780M070910
9171d046752M763722Q8882n061348l452464L667070P268456L120861k489371k387450
9162A471606J499152K226466j628220m788299l473872k3636J455485P06457O16985
9153a937876K306606L085671L5857n283670p460823l408927L422788O741774M552153
9144B053553N22245j368326r67200l62509o88653j608303k119550r65263K003819
9135c500187M269156K802275j210499k629433P54716M474727L507426l42395j380975
$$ plain form
9197 -6881483 -7835616 -5396320 -91612 3552119 2154102 -1770244 -3007074 -156908
9189 -156908 3488808 4540479 2721065 -59262 -2033846 -2847583 -3289320 -3837057 -3729473
9180 -3729473 -2299699 -759777 -1076941 -3282931 -5708661 -7549559 -8814442 -8117662 -4046752
9171 -4046752 716970 805852 -4255496 -7707960 -4040890 3227566 6348427 3859056 1471606
9162 1471606 2970758 5197224 3569004 -1219295 -4693167 -4716803 -3261318 -2554861 -1937876
9153 -1937876 368730 3454401 3490258 -1793412 -9254235 -12663162 -9240374 -2498600 2053553
9144 2053553 2575798 1207472 240272 -122237 -810890 -2419193 -4538743 -5504006 -3500187
9135 -3500187 768969 3571244 2360745 -268688 486028 4960755 8468181 8125786 6744811
9126F744811J041178J714136j811313m983570l164925J306470K814807O29289
9118D290883j092278l49650L32828r23767k087680j010409P40727M09867j734835
9109a424314l310933l357707k306542K67705M690349Q469753P875093K851144
9101A3754548k263603l790251k310261m92162K81282j30741j803765m021666m876058
9092e652677l397445j062982K83034R11379K052275L283955K927679O36427j892411
9083a910766k630036q13371K518032M780045L697517L1522k604722j862480O26122
9074A831863J965416J776204J245375Q4502k558533n024848m349869o49871K661130
9065c018631L414993K623836J420154o99309l280491l649113n07305L299137L973073
$$ plain form
9126 6744811 7785989 9500125 7688812 2705242 -459683 846787 3661594 4290883
9118 4290883 3198605 2848955 3181783 2258016 170336 -840073 -99346 310521 -1424314
9109 -1424314 -4735247 -8092954 -10399496 -10131791 -5441442 3028311 10903404 13754548
9101 13754548 11490945 7700694 5390433 4898271 5179553 5048812 3245047 -776619 -5652677
9092 -5652677 -9050122 -10113104 -9830070 -8918691 -6866416 -3582461 -654782 -18355 -1910766
9083 -1910766 -4540802 -5354173 -2836141 1943904 5641421 5672943 3068221 1205741 1831863
9074 1831863 3797279 5573483 6818858 6903360 4344827 -680021 -5029890 -5679761 -3018631
9065 -3018631 396362 3020198 4440352 3741043 460552 -3188561 -3695866 -396729 3576344
9056C576344J380220j605002l220201m020421m450412l392659K16837N142099
9048f373195P838057N375340q17355m991820k945385K473535M591081J819357
9040F969615n88797Q53114K190286j326689o790455p293512k032930L028920L972177
9031a018271K637588J206732r99327l560310l288238M81844L356278K056648o01840
9022B71104o02344Q24077J39084j712973p56807K795214M055671Q28218k893659
9013B947585k511139J118222L328971J701530j537113k793155j396511J04917
9005I63307l07546j426630j140356j98107q74376k330635j264410J998623K698952
8996a881178o90080k719997J017550O164838N362522r14649n269728l781033L77781
$$ plain form
9056 3576344 4956564 3351562 131361 -3889060 -8339472 -11732131 -11515294 -6373195
9048 -6373195 1464862 6840202 6022847 1031027 -1914358 559177 5150258 6969615
9040 6969615 6380818 7233932 9424218 8097529 1307074 -5986438 -8019368 -4990448 -1018271
9031 -1018271 1619317 2826049 1826722 -1733588 -5021826 -4539982 -1183704 872944 271104
9022 271104 -331240 492837 631921 -1081052 -1837859 957355 5013026 5841244 2947585
9013 2947585 436446 1554668 4883639 6585169 5048056 2254901 858390 963307
9005 963307 655761 -770869 -1911225 -2109332 -2983708 -5314343 -6578753 -4580130 -1881178
8996 -1881178 -2571258 -5291255 -4273705 1891133 7253655 6339006 1069278 -2711755 -2333974
8987b333974L199251L995699L027703L39430k119076j754389M66466J089522l34724
8978E575908j061252l40940j26144p51154r31666j667811m397333n845515j784913
8969a1330820M161532L936001j666108k766078L667494Q034607L544358k710595
8961D870391j887248K361204J608889k411727j882371K585322L114366j706777
8953F652049n034199l466448r83615n66530l99323M04031j17271j548849p28697
8944e788852K018627K452771m83591k835848k025213K27174K111190L688364M169631
8935C534253K308316l39567j400761k082760m135887m307099R01250O600846M733394
8926E811985k491589m563094Q57498M419373R36405k683041o47510J527291k192173
$$ plain form
8987 -2333974 865277 4860976 7888679 8228109 6109033 4354644 4821110 5910632 5575908
8978 5575908 4514656 4173716 4047572 3296418 2364752 696941 -3700392 -9545907 -11330820
8969 -11330820 -7169288 -3233287 -4899395 -7665473 -3997979 4036628 7580986 4870391
8961 4870391 2983143 5344347 6953236 4541509 2659138 5244460 8358826 6652049
8953 6652049 1617850 -1848598 -2832213 -3398743 -3798066 -3394035 -3511306 -5060155 -5788852
8944 -5788852 -3770225 -1317454 -1801045 -4636893 -6662106 -6434932 -4323742 -635378 3534253
8935 3534253 5842569 5503002 4102241 2019481 -2116406 -6423505 -5522255 1078591 5811985
8926 5811985 3320396 -1242698 -385200 4034173 4970578 2287537 1640027 3167318 975145
8917I75145o608255l797377L388117O119137L237723O90238M96752o36361l245776
8908F19343l765549j009250K284988M086690M281882K375367j296411l578124
8900C998936k290859j43858m43810j539785n67172L56611k109902n185875l476909
8891a1402623J738144M029390J939143L29098J566283K531973J266145k11345
8883A786208j071512l149717n461907l678028K288344O034775L361367j725594
8875a616064l252020j300850n101q36231j791622j287804K29395J423103J134897
8866g302297l60347o91389J678418L830714J426401m005851n495617k82462N673468
8857e528962N945407K155397J50876J105060J385610o09046k413811j933101p0785
$$ plain form
8917 975145 -5633110 -9430487 -6042370 76767 3314490 4004728 4501480 3865119 619343
8908 619343 -3146206 -4155456 -1870468 2216222 6498104 8873471 7577060 3998936
8900 3998936 1708077 1564219 1120409 -419376 -986548 -629937 -2739839 -7925714 -11402623
8891 -11402623 -9664479 -5635089 -3695946 -3366848 -1800565 731408 1997553 1786208
8883 1786208 714696 -2435021 -7896928 -11574956 -9286612 -3251837 109530 -1616064
8875 -1616064 -4868084 -6168934 -6174035 -7010266 -8801888 -10089692 -9860297 -8437194 -7302297
8866 -7302297 -7662644 -8354033 -6675615 -2844901 -1418500 -5424351 -10919968 -11202430 -5528962
8857 -5528962 416445 2571842 2722718 3827778 5213388 4604342 2190531 257430 186645
8848A86645J324961J502048P24531J1232N10429J689714J342960r82037k349789
8839C960694m68059K529046L158824J714632R30170R42517m28472l063311m388656
8830D887385l865715l554065l735879k179349J093922K486116K97755k111423
8822f681253j200021J732079L178308K479209J212758k49005k188851l121399
8814d838175j396984J627772L110853K727599K265864K006810O66565j536855
8806D633449k933420l179827k875445j093057K818085N472178K521851l804841
8798A558973n723621o23083M481821K688376l286157n963958l717613r10627J79141
8789a1316748J393301L246247L277787Q58213r32681J41805K336620K816692J223135
$$ plain form
8848 186645 1511606 3013654 3738185 3749417 4259846 5949560 7292520 6310483 3960694
8839 3960694 3492635 6021681 9180505 10895137 11825307 12767824 12339352 9276041 4887385
8830 4887385 1021670 -2532395 -6268274 -8447623 -7353701 -4867585 -4569830 -6681253
8822 -6681253 -7881274 -6149195 -2970887 -491678 721080 472075 -1716776 -4838175
8814 -4838175 -6235159 -4607387 -1496534 1231065 3496929 5503739 6170304 4633449
8806 4633449 1700029 -1479798 -4355243 -5448300 -2630215 2841963 5363814 1558973
8798 1558973 -4164648 -4787731 -305910 2382466 -903691 -6867649 -10585262 -11495889 -11316748
8789 -11316748 -9923447 -6677200 -3399413 -2541200 -3473881 -3332076 -995456 1821236 3044371
8780C044371p27548j253759L72240K888898L373867O49869k219017j634588R77190
8771E471523R70178k273194m195559k079447J110698J784824O86188J39336k60931
8762A353616j772202k733300o08264L148243L896360j08860m966686n489435j023786
8753h304314M049165N159962K033495j896712l680828l166936j502059L65882
8745f942345R72963j132448m301386l952236J366115O543639O085181J587021
8737B26504j083220k48708O93367m03656k234568l373979l001697M61922O066289
8728b897746P494123N63031p737472o397412L353132Q700583L862841k540595
8720D400485k504551p2377j327336l064703k78821L178800J415165k219546r54054
$$ plain form
8780 3044371 2316823 1063064 1435304 4324202 7698069 8347938 6128921 4494333 5471523
8771 5471523 6441701 4168507 -27052 -2106499 -995801 789023 1475211 1614547 1353616
8762 1353616 -418586 -3151886 -3760150 -611907 3284453 3175593 -1791093 -7280528 -8304314
8753 -8304314 -4255149 904813 2938308 1041596 -2639232 -5806168 -7308227 -6942345
8745 -6942345 -5969382 -7101830 -11403216 -15355452 -13989337 -7445698 -1360517 226504
8737 226504 -856716 -1105424 -412057 -815713 -3050281 -6424260 -9425957 -8964035 -2897746
8728 -2897746 4596377 5159408 -2578064 -8975476 -5622344 3078239 6941080 4400485
8720 4400485 1895934 1823557 496221 -2568482 -2847303 331497 1746662 -472884 -1426938
8711a426938L101924L012570k72623j87855K760095J819421l048125m135355O79659
8702B302773L686306n07540o879543p829753k854108K953723N209692K653950
8694a264500k518455n191095k031341L761432O201513M322514J608988p96873
8686D092183l994205n622021j973770M045173N019168K06510l091710q27108K940162
8677G94382M255329M113816K748528k154269q100182p616230j62356M441376K65963
8668a413643n397440l876891J627846L015779O83506L14432J454064l26358l107842
8659g026547r60949M705478O062318J415542k144862j45917L113551K311518j409016
8650E921116l655933k729799K06622L241865M103704J495782k607181m543769
$$ plain form
8711 -1426938 1674986 4687556 4414933 4227078 6987173 8806594 5758469 1623114 2302773
8702 2302773 5989079 5481539 -1398004 -9227757 -12081865 -9128142 -3918450 -1264500
8694 -1264500 -3782955 -8974050 -11005391 -7243959 -1042446 3280068 4889056 4092183
8686 4092183 97978 -5524043 -7497813 -3452640 1566528 1773038 -1318672 -2145780 794382
8677 794382 5049711 9163527 11912055 9757786 1657604 -5958626 -6120982 -1679606 -1413643
8668 -1413643 -6811083 -10687974 -9060128 -6044349 -5360843 -5046411 -3592347 -3918705 -7026547
8659 -7026547 -7987496 -3282018 2780300 4195842 2050980 1905063 5018614 7330132 5921116
8650 5921116 2265183 -464616 -257994 2983871 7087575 8583357 5976176 1432407
8642A432407l398395j389412m6549J051303K030125K326727K230026J970083K95893
8633F502208k773346l503248P19293N530125M182884k415035o246555l330878
8625a334552J635444L146861J560112k97910j746243k529115j179531J632434
8617H87500K072426j320126m522592l513155K75565K819768K800086J382348k84666
8608E97154q69415P73802K903018K113535q79426j402800R27336L32494m756380
8599b60682o539145K66681P860799N860186k346001m594385J224508N231152K378293
8590I081406j128451q28177j377759n603859o985764p01645O486787O097348R04230
8581E944116j027978L01744o81853l358803k209965K080609L112212j099j512401
$$ plain form
8642 1432407 -1965988 -3355400 -3401949 -2350646 -320521 2006206 4236232 6206315 6502208
8633 6502208 3728862 225614 944907 6475032 10657916 8242881 1996326 -1334552
8625 -1334552 300892 3447753 5007865 4709955 2963712 434597 -744934 887500
8617 887500 2959926 1639800 -2882792 -6395947 -6120382 -3300614 -500528 881820 597154
8608 597154 -272261 501541 3404559 5518094 4638668 3235868 4163204 4495698 -260682
8599 -260682 -6799827 -6533146 1327653 7187839 4841838 247453 1471961 6703113 9081406
8590 9081406 7952955 7124778 5747019 143160 -6842604 -7544249 -1057462 5039886 5944116
8581 5944116 4916138 5217882 4536029 1177226 -1032739 1047870 4160082 4158983 2646582
8572B646582K85670O07721k080763k958862j15918J670303l9515o54463K626761
8563A987516M813183J429130l634134m550185k311405r08358K08526L170756N434556
8554E639585L558211N1757m19972J025686J94893k036640j574091Q36475J073591
8545H349495j60042J204184L450595L53959p210902r957763l679454L948225M560169
8536H58466L32192j419528N64972J931990Q43543m57846n56059l44840l62883
8527A390007l47305p34552j789494k304554j533362q08229q63082K07459L261740
8518c521372M822473J649534l151185l578211L18405K331495l10256k745571m31222
8509d615910L507996L199835q45638k823503o11456J926308K094492K105749L247518
$$ plain form
8572 2646582 2932252 3539973 1459210 -1499652 -1615570 54733 15218 -639245 1987516
8563 1987516 6800699 8229829 4595695 45510 -2265895 -3174253 -2965727 205029 5639585
8554 5639585 9197796 9249553 8829581 9855267 10050160 8013520 6439429 7275904 8349495
8545 8349495 8189453 9393637 12844232 13198191 5987289 -3970474 -7649928 -3701703 858466
8536 858466 1190658 -228870 336102 2268092 3111635 2653789 2097730 1752890 1390007
8527 1390007 1042702 308150 -1481344 -3785898 -5319260 -6127489 -6990571 -6783112 -3521372
8518 -3521372 1301101 2950635 -200550 -3778761 -3460356 -1128861 -1439117 -4184688 -4615910
8509 -4615910 -1107914 2091921 1246283 -1577220 -2188676 -262368 1832124 3937873 7185391
8500G185391J859283m018552q335301m454287L279968L959262l381191o999890
8492a0905317R8437Q975191Q072311L52215k644461Q65810K138640j945311m251926
8483G55589j184662L50501m728994r688928n869961L940040J0063239R439937
8475C076761O537439L687124j038230o908444r135893n685640P6859M600417P051773
8466B262166O306796Q40962o206045p427215n26684O864396O482361N58800j952194
8457G203343J277024L099365j456807p270835p002723k088529K07508j711227
8449g742881k277067J142562L764667J615534j853367j667332Q28883J161138
8441e027863o92555j456850q24721p77626l12026L076226P316122P181967K085048
$$ plain form
8500 7185391 9044674 5026122 -3309179 -7763466 -4483498 -524236 -3905427 -10905317
8492 -10905317 -10806880 -1831689 6240622 6592837 3948376 4814186 6952826 5007515 755589
8483 755589 -429073 -78572 -4807566 -14496494 -20366455 -16426415 -6363176 3076761
8475 3076761 9614200 13301324 12263094 5354650 -3781243 -9466883 -9390024 -4789607 2262166
8466 2262166 8568962 9409924 3203879 -4223336 -4750020 2114376 8596737 9155537 7203343
8457 7203343 8480367 11579732 10122925 2852090 -4150633 -6239162 -6031654 -7742881
8449 -7742881 -10019948 -8877386 -5112719 -3497185 -5350552 -7017884 -6189001 -5027863
8441 -5027863 -5720418 -7177268 -8001989 -8779615 -9091641 -6015415 1300707 8482674 10567722
8432A0567722k858983l963898k246594M86828L419836M260293P85702m207119
8424F243787n162924k048281m92966k408252k959514Q93610N242005N613887K758749
8415G680101q88665m788868p370091n496590j79055L072005K649751K956564M992557
8406B627709L179624l500973o296476q3001O373171L072211n191794o386163K88522
8397e917170N228410M477446K842418K337359l78926m357231l532772K052982
8389B752516M216414p71108o124420m996421J88449K877145J111604k411742m381463
8380g539026k561241K304360N165771K086441k815634k067411L252479M166853
8372A992592j967142o542085k805197M179877O048619K816095j79247j473504
$$ plain form
8432 10567722 7708739 3744841 1498247 1985075 5404911 9665204 10450906 6243787
8424 6243787 1080863 -967418 -1460384 -3868636 -6828150 -5934540 -692535 4921352 7680101
8415 7680101 6791436 2002568 -5367523 -10864113 -11043168 -7971163 -5321412 -2364848 2627709
8406 2627709 5807333 2306360 -3990116 -4073117 2300054 5372265 180471 -6205692 -5917170
8397 -5917170 -688760 3788686 6631104 8968463 8589537 4232306 699534 2752516
8389 2752516 6968930 6197822 73402 -4923019 -4734570 -1857425 -745821 -3157563 -7539026
8380 -7539026 -10100267 -7795907 -2630136 -543695 -3359329 -5426740 -2174261 1992592
8372 1992592 25450 -6516635 -9321832 -5141955 906664 3722759 3543512 2070008
8364B070008k774006l040235k41483L176492K750248j137523l847847l151059
8356f195405r64279R44472K787374M113220K983267r03106m362144l702797O91451
8347d607947L956786K186319k139017k867491Q85986K731456j119830m969528
8339e943266k382126K730597K221236k205348j699300L817907M725864j282609
8331a7045m153158J372840N943954J111333o216462n343980Q50803K115030j808702
8322f145387k614102J487235M381213L840380L161874J992745l095041q751982
8314e743065o937036J562274O445947L334173m32162R71702K974997L64757l116304
8305e74717j890531J745221K396011P19169N04341P81252j692927m817470l375830
$$ plain form
8364 2070008 -703998 -3744233 -3985716 -809224 1941024 803501 -3044346 -6195405
8356 -6195405 -7159684 -6215212 -3427838 685382 3668649 2765543 -1596601 -5299398 -4607947
8347 -4607947 -651161 1535158 -603859 -3471350 -2585364 146092 -973738 -5943266
8339 -5943266 -8325392 -5594795 -3373559 -5578907 -7278207 -3460300 1265564 -17045
8331 -17045 -4170203 -2797363 3146591 4257924 -1958538 -7302518 -6451715 -4336685 -6145387
8322 -6145387 -8759489 -7272254 -2891041 949339 4111213 6103958 3008917 -5743065
8314 -5743065 -12680101 -11117827 -4671880 -1337707 -1769869 -798167 2176830 2541587 -574717
8305 -574717 -2465248 -720027 1675984 2395153 2899494 3680746 1987819 -2829651 -6205481
8296f205481K234454N910501M316145J30087l140697m621755l986277p34926L165467
8287b932482L939975J057935j479618o19385J703459J927020j39292k078292k819921
8278a440601k984169k277640J79627K751688J872583k600861n345278j800330
8270a1644981N060877P717895L608451k025966l587079j600886L39580J548486
8262e83623L466061N101664L738122j58175k674092j821061j00661n82525k801722
8253C583988l926788k455299L79328J935837M32123l100510n031484k665408K168786
8244h679427M469324J592346l554012n415571j446959N227014Q575948N559541
8236F328204n16527l542925j719052P93458J16047k234216k647353j130844k92244
$$ plain form
8296 -6205481 -3971027 1939474 6255619 6385706 3245009 -1376746 -5363023 -6097949 -2932482
8287 -2932482 1007493 2065428 585810 -33575 1669884 3596904 3457612 1379320 -1440601
8278 -1440601 -4424770 -6702410 -6522783 -3771095 -1898512 -4499373 -9844651 -11644981
8270 -11644981 -6584104 1133791 4742242 2716276 -870803 -2471689 -2132109 -583623
8262 -583623 2882438 7984102 11722224 11564049 8889957 7068896 6968235 6385710 3583988
8253 3583988 -342800 -2798099 -2418771 -482934 -50811 -3151321 -8182805 -10848213 -8679427
8244 -8679427 -4210103 -2617757 -6171769 -11587340 -13034299 -7807285 768663 6328204
8236 6328204 5811677 2268752 549700 1343158 1459205 -775011 -3422364 -4553208 -4845452
8227d845452n09378q5374R03183R90811Q14440J986509L053856J333769j429797
8218B212567p86874K398618J974600l236556n802976p30586N554835L741185m430469
8209H94344q226519k930256M471340N943453K456680M1191L92905L43029j304283
8200B081884j711199M52562J726404j047626m986550m573159J7416K689333N52983
8191d797952j703284L05601L109444J190339l021694k401396K726200M187365
8183d05377p08744m011618K78672N970780L976212l427687o052436j050875L891452
8174a539621K785272j040489j874098M5780Q97381j42063q16319j79699M99757
8165a364099M49851L09860L58810k49944j892987l099120j743028K099660N127764
$$ plain form
8227 -4845452 -5354830 -5440204 -4537021 -3546210 -2731770 -745261 2308595 3642364 2212567
8218 2212567 1425693 3824311 5798911 2562355 -3240621 -3971207 1583628 5324813 894344
8209 894344 -7332175 -10262431 -5791091 152362 2609042 2650233 3043138 3386167 2081884
8200 2081884 370685 823247 2549651 1502025 -3484525 -8057684 -8040268 -5350935 -4797952
8191 -4797952 -6501236 -6195635 -3086191 -1895852 -4917546 -7318942 -4592742 -405377
8183 -405377 -1114121 -5125739 -4847067 1123713 5099925 1672238 -4380198 -5431073 -1539621
8174 -1539621 1245651 205162 -1668936 -1623156 -725775 -867838 -1684157 -1863856 -1364099
8165 -1364099 -914248 -604388 -245578 -495522 -2388509 -5487629 -7230657 -5130997 -3233
8156c233L931154o39530l847526k773043J40739R62015j13968J45244K285506
8147H7358L004089J36777m100534n961325m202207l29621L321402M771376L373345
8138A00660P64586m39001K55330P72922j71349j056167j24490J745246K491240
8129D338977J855968R11358l16213k290815l671218k563989k87963n39688l439703
8120f003286l915395R70650O041497M184147k841449n804695j064529M196062
8112d236998L015944j188154j282753J599009Q63563l067787k504702M390937
8104b410941R224269N614151j669260m623826k878450j033265l03618P74412J085601
8095C779073j045791l203337k341620m91888r58825j538274J399641M475639J548511
$$ plain form
8156 -3233 3927921 3288391 -559135 -3332178 -3191439 -2229424 -2343392 -2198148 87358
8147 87358 3091447 3228224 -872310 -6833635 -11035842 -11365463 -8044061 -3272685 100660
8138 100660 865246 426245 681575 1454497 1283148 226981 102491 1847737 4338977
8129 4338977 6194945 7106303 6790090 4499275 828057 -1735932 -2023895 -2563583 -6003286
8120 -6003286 -9918681 -8948031 -2906534 1277613 -1563836 -7368531 -8433060 -4236998
8112 -4236998 -1221054 -2409208 -3691961 -2092952 -1229389 -4297176 -6801878 -2410941
8104 -2410941 6813328 12427479 10758219 6134393 3255943 2222678 1919060 2693472 3779073
8095 3779073 2733282 -470055 -2811675 -3303563 -4262388 -5800662 -4401021 74618 1623129
8086A623129m601573m538994K702766O764675J883425l800130j132237N655343
8078D556404N957263p20248m806564j661184K461273R39931l898918n596699l026717
8069e795459n30380o84792j393208l91607J056821J002609P56350K485863M065085
8060E71282J171826m645517n593406J330905Q170877O461417l68585k471064J331785
8051E959520K994245q61005m428735l884619l147399m516193l071619L330723
8043g625082O879273R78593p626474p297030J723076Q243915N939070m00852l889735
8034c075246l104520k05551K017344O91074m022753o466960j751893N966278P755780
8025b196447K388414k399373j961977n50471k439011m299665j142610M994406
$$ plain form
8086 1623129 -2978444 -7517438 -4814672 1950003 3833428 33298 -1098939 4556404
8078 4556404 10513667 9793419 4986855 3325671 5786944 6726875 2827957 -2768742 -5795459
8069 -5795459 -6325839 -7010631 -8403839 -8795446 -7738625 -6736016 -5979666 -3493803 571282
8060 571282 1743108 -2902409 -8495815 -7164910 1005967 7467384 7098799 4627735 5959520
8051 5959520 8953765 8092760 3664025 -220594 -3367993 -7884186 -10955805 -7625082
8043 -7625082 -745809 232784 -7393690 -14690720 -12967644 -4723729 1215341 814489 -3075246
8034 -3075246 -6179766 -6385317 -4367973 -3676899 -7699652 -14166612 -15918505 -9952227 -2196447
8025 -2196447 191967 -2207406 -4169383 -4719854 -7158865 -11458530 -12601140 -7606734
8017g606734P561221M335180m15904j691723R24097L395130J768878k976279n441417
8008a47551k744362R70281L02301l136204l316189N75585L431287L107351K954930
7999A997429M180568L079743j323596l986092k042768L84895N0608L94401L729988
7990F465176M466440j968527q915153o750302J826503M891838j168508p051399
7982h203932m743045K430049O782980O057718K672280j020813l042414j877897
7974i45074O32648N19175j916723j688599K363194M359799O76194l325356j648867
7965i73609K212171J033095l641432l710804J742696M491030P67485k394480Q28938
7956C55090M597823N53937p658599q357051R31010R256586P383003m05765m082338
$$ plain form
8017 -7606734 -45513 4289667 3873763 2182040 3106137 6501267 8270145 5293866 -147551
8008 -147551 -2891913 -1921632 -1619331 -4755535 -8071724 -7496139 -4064852 -957501 1997429
7999 1997429 6177997 9257740 7934144 3948052 1905284 2290179 2340787 2735188 6465176
7990 6465176 10931616 8963089 47936 -6702366 -4875863 15975 -1152533 -8203932
7982 -8203932 -12946977 -10516928 -3733948 2323770 4996050 3975237 932823 -945074
7974 -945074 -312426 206749 -1709974 -3398573 -1035379 3324420 4000614 675258 -973609
7965 -973609 1238562 2271657 -1369775 -5080579 -3337883 1153147 1920632 -473848 355090
7956 355090 4952913 5506850 -2151749 -10508800 -9577790 -321204 7061799 6656034 2573696
7947B573696j884316j40916j789664k424947J103122M309285J432988n102984
7939a923736o934767j272498M837771M102979j078950k723107P64995K769495
7931a457818o87274m673896l532548R2527K97495j784147k77402M471734N674493
7922a876836J554464j442969M18325K238625J3929j724875J513171M616459O02487
7913E912780o550462o612262J197268O836369M105570j928408l857467r05348
7905a801960L332890N898366M878320J98603m086558l410538J44297K6237m311147
7896H68510n990318j897519K194271J337166r82972J22066K809452L198018K507900
7887D166574L170653K799877j074151m486237k618765J435447J151760k615984
$$ plain form
7947 2573696 689380 548464 -1241200 -3666147 -2563025 1746260 3179248 -1923736
7939 -1923736 -8858503 -10131001 -5293230 -1190251 -2269201 -4992308 -4227313 -1457818
7931 -1457818 -2145092 -6818988 -10351536 -10259009 -9961514 -11745661 -12023063 -7551329 -1876836
7922 -1876836 -322372 -1765341 -1347016 891609 905538 -819337 693834 5310293 5912780
7913 5912780 -637682 -7249944 -6052676 783693 4889263 2960855 -896612 -1801960
7905 -1801960 1530930 7429296 12307616 12506219 8419661 5009123 5153420 5179657 868510
7896 868510 -5121808 -7019327 -4825056 -3487890 -4470862 -4348796 -1539344 1658674 4166574
7887 4166574 7337227 10137104 9062953 4576716 1957951 3393398 4545158 1929174
$$ [...]
##END NTUPLES=NMR SPECTRUM
##END=
