##TITLE=31Pdec_SR83 Gly'
 CDCl3, 124 sc
 1.09.2021
##JCAMPDX= 6.0         $$ Bruker NMR JCAMP-DX V2.0
##DATA TYPE= NMR SPECTRUM
##DATA CLASS= NTUPLES
##ORIGIN= UXNMR, Bruker Analytische Messtechnik GmbH
##OWNER= root
$$ XWIN-NMR		Version 3.5
$$ Wed Sep  1 16:00:11 2021 Russian Standard Time (UT+4h)  she@DPX200
##.OBSERVE FREQUENCY= 81.013821
##.OBSERVE NUCLEUS= ^31P
##.ACQUISITION MODE= SIMULTANEOUS
##.ACQUISITION SCHEME= undefined
##.AVERAGES= 128
##.DIGITISER RES= 16
##SPECTROMETER/DATA SYSTEM= spect
##.PULSE SEQUENCE= zgpg30
##.SOLVENT NAME= CD2Cl2
##.SHIFT REFERENCE= (INTERNAL, CD2Cl2, 0, 248.564)
##AUDIT TRAIL= $$ (NUMBER, WHEN, WHO, WHERE, WHAT)
$$ ##TITLE= Audit trail, XWIN-NMR		Version 3.5
$$ ##JCAMPDX= 5.01
$$ ##ORIGIN= Bruker BioSpin GmbH
$$ ##OWNER= she
$$ F:/spectra/data/she/nmr/P31/1/pdata/1/auditp.txt
$$ ##AUDIT TRAIL=  $$ (NUMBER, WHEN, WHO, WHERE, WHAT)
(   1,<2021-09-01 15:58:59.84 +0400>,<she>,<DPX200>,
      <continue with go, POWCHK disabled, PULCHK disabled
       configuration hash MD5:
       00 E9 B6 7A A2 85 ED C7 34 08 36 98 17 FE 4E 26
       data hash MD5: 32K
       4B 11 9B C5 EE 9D 2D 35 CE 70 07 93 F2 42 46 01>)
(   2,<2021-09-01 15:59:02.42 +0400>,<she>,<DPX200>,
      <Start of raw data processing
       efp BC_mod = 2 LB = 1 FT_mod = 6 PKNL = 1 PHC0 = -7742.98 PHC1 = 94.07028 SI = 64K 
       data hash MD5: 64K
       0E 7F 90 91 EE 08 F1 5B 41 D2 E4 13 53 BC 03 7F>)
(   3,<2021-09-01 15:59:35.67 +0400>,<she>,<DPX200>,
      <pk PHC0 = 36.86454 PHC1 = -97.59997 
       data hash MD5: 64K
       B8 0B 5C FE 1C 0E 81 49 45 12 C7 C4 FF E6 D6 8D>)
(   4,<2021-09-01 15:59:39.50 +0400>,<she>,<DPX200>,
      <abs ABSG = 5 
       data hash MD5: 64K
       B1 77 80 57 0B 0B F5 C8 3C F9 25 30 7B 1C AD 97>)
$$ ##END=
$$ 
$$ hash MD5
$$ E8 4A D9 76 9C B8 97 9C 75 C9 53 E5 4A 07 D1 95
##$RELAX= 
##$RELAX= 
##$RELAX= 
##$RELAX= 
##$RELAX= 
##$RELAX= 
##$RELAX= 
##$RELAX= 
$$ Bruker specific parameters
$$ --------------------------
##$DU= <F:/spectra>
##$EXPNO= 1
##$NAME= <P31>
##$PROCNO= 1
##$TYPE= <nmr>
##$USER= <she>
##$AMP= (0..31)
100 100 100 100 100 100 100 100 100 100 100 100 100 100 100 100 100 100 
100 100 100 100 100 100 100 100 100 100 100 100 100 100 
##$AQSEQ= 0
##$AQ_mod= 1
##$AUNM= <au_zg>
##$AUTOPOS= <>
##$BF1= 81.014009
##$BF2= 200.13
##$BF3= 200.13
##$BF4= 200.13
##$BF5= 200.13
##$BF6= 200.13
##$BF7= 200.13
##$BF8= 200.13
##$BYTORDA= 1
##$CFDGTYP= 0
##$CFRGTYP= 5
##$CHEMSTR= <none>
##$CNST= (0..31)
1 1 145 1 1 1 1 1 1 1 1 1 1 1 1 1 1 1 1 1 1 1 1 1 1 1 1 1 1 1 1 1 
##$CPDPRG= <waltz16>
##$CPDPRG1= <>
##$CPDPRG2= <waltz16>
##$CPDPRG3= <>
##$CPDPRG4= <mlev>
##$CPDPRG5= <mlev>
##$CPDPRG6= <mlev>
##$CPDPRG7= <mlev>
##$CPDPRG8= <mlev>
##$CPDPRGB= <>
##$CPDPRGT= <>
##$D= (0..31)
0 1 0 0 0 0 0 0 0 0 0 0.03 2e-05 3e-06 0 0 0 0 0 0 0 0 0 0 0 0 0 0 0 0 
0 0 
##$DATE= 1630497368
##$DBL= (0..7)
120 120 120 11 120 120 24 19 
##$DBP= (0..7)
150 150 150 150 150 150 150 150 
##$DBP07= 0
##$DBPNAM0= <>
##$DBPNAM1= <>
$$ [...]
##$SUBNAM3= <"">
##$SUBNAM4= <"">
##$SUBNAM5= <"">
##$SUBNAM6= <"">
##$SUBNAM7= <"">
##$SUBNAM8= <"">
##$SUBNAM9= <"">
##$SW= 501.771253377433
##$SWIBOX= (0..15)
0 1 3 0 0 0 0 0 0 0 0 0 0 0 0 0 
##$SW_h= 40650.406504065
##$TD= 32768
##$TD0= 1
##$TE= 0
##$TE2= 300
##$TE3= 300
##$TEG= 300
##$TL= (0..7)
0 120 53 12 22 120 120 120 
##$TP= (0..7)
150 150 150 150 150 150 150 150 
##$TP07= 0
##$TPNAME0= <>
##$TPNAME1= <>
##$TPNAME2= <>
##$TPNAME3= <>
##$TPNAME4= <>
##$TPNAME5= <>
##$TPNAME6= <>
##$TPNAME7= <>
##$TPOAL= (0..7)
0.5 0.5 0.5 0.5 0.5 0.5 0.5 0.5 
##$TPOFFS= (0..7)
0 0 0 0 0 0 0 0 
##$TUNHIN= 0
##$TUNHOUT= 0
##$TUNXOUT= 0
##$USERA1= <user>
##$USERA2= <user>
##$USERA3= <user>
##$USERA4= <user>
##$USERA5= <user>
##$V9= 5
##$VALIST= <valist>
##$VCLIST= <CCCCCCCCCCCCCCC>
##$VD= 0
##$VDLIST= <DDDDDDDDDDDDDDD>
##$VPLIST= <PPPPPPPPPPPPPPP>
##$VTLIST= <TTTTTTTTTTTTTTT>
##$WBST= 1024
##$WBSW= 4
##$XGAIN= (0..3)
0 0 0 0 
##$XL= 0
##$YL= 0
##$YMAX_a= 2165
##$YMIN_a= -7811
##$ZGOPTNS= <>
##$ZL1= 120
##$ZL2= 120
##$ZL3= 120
##$ZL4= 120
##$ABSF1= 248.5645
##$ABSF2= -253.2056
##$ABSG= 5
##$ABSL= 3
##$ALPHA= 0
##$AQORDER= 0
##$ASSFAC= 0
##$ASSFACI= 0
##$ASSFACX= 0
##$ASSWID= 0
##$AUNMP= <proc_1d>
##$AZFE= 0.1
##$AZFW= 0.5
##$BCFW= 0
##$BC_mod= 2
##$BYTORDP= 0
##$COROFFS= 0
##$CY= -3
##$DATMOD= 1
##$DC= 0
##$DFILT= <>
##$DTYPP= 0
##$F1P= 0
##$F2P= 0
##$FCOR= 1
##$FTSIZE= 65536
##$FT_mod= 6
##$GAMMA= 0
##$GB= 0
##$INTBC= 1
##$INTSCL= 5.30512e-09
##$ISEN= 30
##$LB= 1
##$LEV0= 0
##$LPBIN= 0
##$MAXI= 10000
##$MC2= 0
##$MEAN= 0
##$ME_mod= 0
##$MI= 50
##$NCOEF= 0
##$NC_proc= -7
##$NLEV= 6
##$NOISF1= 182.463
##$NOISF2= 159.3651
##$NSP= 0
##$NTH_PI= 0
##$NZP= 0
##$OFFSET= 248.5645
##$PC= 4
##$PHC0= -7706.115
##$PHC1= -3.529686
##$PH_mod= 1
##$PKNL= yes
##$PPARMOD= 0
##$PSCAL= 0
##$PSIGN= 0
##$REVERSE= no
##$SF= 81.014009
##$SI= 65536
##$SIGF1= 159.3651
##$SIGF2= -187.1042
##$SINO= 113.3802
##$SIOLD= 16384
##$SREGLST= <1H.CDCl3>
##$SSB= 0
##$STSI= 65536
##$STSR= 0
##$SW_p= 40650.406504065
##$SYMM= 0
##$S_DEV= 0
##$TDeff= 32768
##$TDoff= 0
##$TI= <>
##$TILT= no
##$TM1= 0
##$TM2= 0
##$TOPLEV= 0
##$USERP1= <user>
##$USERP2= <user>
##$USERP3= <user>
##$USERP4= <user>
##$USERP5= <user>
##$WDW= 1
##$XDIM= 65536
##$YMAX_p= 389546106
##$YMIN_p= -129296017
$$ End of Bruker specific parameters
$$ ---------------------------------
##NTUPLES= NMR SPECTRUM
##VAR_NAME=  FREQUENCY,     SPECTRUM/REAL,   SPECTRUM/IMAG
##SYMBOL=    X,             R,               I
##VAR_TYPE=  INDEPENDENT,   DEPENDENT,       DEPENDENT
##VAR_FORM=  AFFN,          ASDF,            ASDF
##VAR_DIM=   65536,         65536,           65536
##UNITS=     HZ,            ARBITRARY UNITS, ARBITRARY UNITS
##FACTOR=    0.620285442955139, 1,           1
##FIRST=     20137.2065510759, 0,            0
##LAST=      -20513.1999529892, 0,           0
##MIN=       -20513.1999529892, -129296017,  0
##MAX=       20137.2065510759, 389546106,    0
$$ Real data points
##PAGE= N=1
##DATA TABLE= (X++(R..R)), XYDATA
$$ [...]
13003A901326k310099q428812j311380O987133M070899l127300k299571L361400
12995a156404L060652k102184k974955K32965m75981m788473l790337M188292
12987g806425R725209O458650n46781l496070j575403J038667J447540m48865
12979D796522l070419l927989j654406K073266M386430M381860K703234k44150
12971I444348l230105l571943p32795J533575Q8132k622480k339675K56667J022878
12962a51398p91937j862350m29112J752945L051634L548440K848580J49923k945187
12953E171538l214646l84015K010351J342630j013004k326359k000051j151666
12945a565222m11128M17158J251487J309620j78208k789438m413787k827311J504232
$$ plain form
13003 1901326 -408773 -8837585 -10148965 -3161832 909067 -2218233 -4517804 -1156404
12995 -1156404 1904248 -197936 -3172891 -2939926 -3415907 -8204380 -11994717 -7806425
12987 -7806425 1918784 8377434 7830653 4334583 2759180 3797847 5245387 4796522
12979 4796522 1726103 -2201886 -3856292 -1783026 2603404 6985264 9688498 9444348
12971 9444348 6214243 2642300 1909505 3443080 3531212 908732 -1430943 -1174276 -151398
12962 -151398 -943335 -2805685 -3234797 -1481852 1569782 5118222 7966802 8116725 5171538
12953 5171538 1956892 1572877 3583228 4925858 3912854 1586495 -413556 -1565222
12945 -1565222 -1976350 -1559192 -307705 1001915 823707 -1965731 -6379518 -9206829 -7702597
12936g702597N054043M730792J209999k054043k520980n95533J218941N87503
12928g1875k281697m174283k269787J638196K661730l65040k486958N24385N477736
12919a347593N699867M96184l617672j777233K834416L619507n50457l950523
12911A406496j458382M823288P994876M768785p47169k689636p90711M83397j114111
12902A2676833l277107l895748l972528m305804l277613m66653J239290L68170
12894d911160K823J986718J866153m113359r829620n646315O138850J1598427
12886b907483M115316n736607n315545K425249N197090M82567k592190M68144
12878c863459K871566n65821l893158r0246O487153O289324o76677n176398k702598
$$ plain form
12936 -7702597 -2648554 2082238 3292237 1238194 -1282786 -1878319 -659378 -71875
12928 -71875 -2353572 -6527855 -8797642 -7159446 -4497716 -4862756 -7349714 -6825329 -1347593
12919 -1347593 4352274 4848458 1230786 -546447 2287969 5907476 5357019 1406496
12911 1406496 -51886 4771402 12766278 17535063 16787894 14098258 13307547 13790944 12676833
12902 12676833 9399726 5503978 1531450 -2774354 -6051967 -6518620 -5279330 -4911160
12894 -4911160 -4908337 -2921619 -1055466 -5168825 -14998445 -20644760 -14505910 -2907483
12886 -2907483 1207833 -4528774 -9844319 -7419070 -2221980 -1739413 -4331603 -3863459
12878 -3863459 -991893 -1557714 -5450872 -5541118 946035 7235359 6558682 1382284 -1320314
12869a320314J359289J601449o8576r0144O3201k356087n074778l615538J479125
12860h022373M919808L697802K11187j737871j158056M93539J700805J912810
12852B017651J299263L61257l80559o19485n44412j092547l036114m909432l303614
12843a0207992K479357P302622N430401j227577m487682o29752M788979N121590
12835H569946J144635k101235k952334k912305j817940J232038L621128J533216
12827F317149l495908n330226j441736L708509M738641J421724k644751m462769
12819a189367l063030J058104N802675Q003152N909247R98863l404331n138961
12811H976352m551315l131688j439333Q02788K550235J412339k341375l820772
$$ plain form
12869 -1320314 38975 1640424 1571848 1481704 1544905 -811182 -5885960 -9501498 -8022373
12860 -8022373 -3102565 595237 806424 -931447 -2089503 -1595964 104841 2017651
12852 2017651 3316914 3678171 3297612 2678127 2133715 1041168 -1994946 -6904378 -10207992
12843 -10207992 -7728635 -426013 5004388 3776811 -710871 -1340623 3448356 8569946
12835 8569946 9714581 7613346 4661012 1748707 -69233 1162805 4783933 6317149
12827 6317149 2821241 -2508985 -3950721 -242212 4496429 5918153 3273402 -1189367
12819 -1189367 -4252397 -3194293 2608382 10611534 16520781 17519644 14115313 8976352
12811 8976352 4425037 1293349 -145984 656804 3207039 4619378 2278003 -1542769
12803a542769O33277O760902O713158K39663m542995l153859o23385j847306l245638
12794f08952q8062L970476K639455j934622k588524Q23289J775093j442745l384827
12785h39419j179713J434987J246116l45480j848266l573207l661339P08963O360028
12776a697330N829390j197638n635551k048022L213812K124545l003751m104068
12768f518613L79636M491102L761020l80875m040689m593300j992693Q16999L99440
12759g677973k258324k166833K079438N062356K398133k143528k212982J580868
12751e338845L382981J458247q1625J499159L979862M465044K874752J77968l163706
12742I253837n721146n159351j449580K036170K170393l72811k223706j222018
$$ plain form
12803 -1542769 -909492 5851410 12564568 12804231 8261236 5107377 4483992 2636686 -608952
12794 -608952 -697014 3273462 5912917 3978295 1389771 2213060 3988153 2545408 -839419
12785 -839419 -2019132 -584145 661971 316491 -1531775 -5104982 -8766321 -8057358 -1697330
12776 -1697330 4132060 2934422 -2701129 -4749151 -1535339 589206 -2414545 -6518613
12768 -6518613 -6138977 -1647875 2113145 1732270 -2308419 -6901719 -8894412 -8077413 -7677973
12759 -7677973 -9936297 -12103130 -10023692 -4961336 -2563203 -4706731 -6919713 -5338845
12751 -5338845 -1955864 -497617 -579242 919917 4899779 9364823 12239575 12417543 9253837
12742 9253837 3532691 -1626660 -3076240 -1040070 1130323 757512 -1466194 -2688212
12734b688212J471535K876286J525158r36485j956710j379955j055912j382673
12726c526968p10521J119199J526184o60966k350802k36599L965640N348762K151595
12717F625524k420845m488768l346981r84750L63930j15420j393503j674502m51044
12708g886359J004567J583750J572040J315518M44718m38083M59064K687919K376990
12699C120124k290677o394612l644648M055057P546719K360968m918403n273039
12691e438511J174257O168761M024767k720926p615409o555708k8113P204271
12683c786611Q571104J959120n767469n112245L535520Q967263L979393m466870
12675G879205n572011l42141J393635k872189n065338l06691N569236N846416
$$ plain form
12734 -2688212 -1216677 1659609 3184767 2248282 291572 -1088383 -2144295 -3526968
12726 -3526968 -4237489 -3118290 -1592106 -2253072 -4603874 -4840473 -874833 4473929 6625524
12717 6625524 4204679 -284089 -3631070 -4615820 -4251890 -4367310 -5760813 -7435315 -7886359
12708 -7886359 -6881792 -5298042 -3726002 -2410484 -1965766 -2403849 -1944785 743134 3120124
12699 3120124 829447 -5565165 -9209813 -5154756 2391963 4752931 -165472 -5438511
12691 -5438511 -4264254 1904507 5929274 3208348 -4407061 -10962769 -10990882 -3786611
12683 -3786611 4784493 6743613 976144 -4136101 -600581 8366682 12346075 7879205
12675 7879205 2307194 1965053 3358688 486499 -4578839 -4885530 683706 6530122
12667F530122K276628k76687j765296l739413l865447k34413L104248J618870
12659C648612j892935j592375J784041K385198j091706l747301k251128J235881
12651a521713L128760K163515p60307l119468k168155J216652K184519j413659
12643b89856n096714m329987j165240M48582J521273M102778N077477J396116
12635A664429k522024j061899K535869J687069j445323q0268L792905K513511
12627G084269k192938j027136N389574N508395l417079r239415m437568K016559
12619c15339M58570m127290k715480K017880K067307j302194j063209K453075
12611b526680L012558N7894j075635J024576K235632M29625k052278k851033j484326
$$ plain form
12667 6530122 8806750 8530063 6764767 3025354 -840093 -1074506 2029742 3648612
12659 3648612 1755677 163302 1947343 4332541 3240835 -506466 -2757594 -1521713
12651 -1521713 1607047 3770562 3010255 -109213 -2277368 -1060716 1123803 -289856
12643 -289856 -5386570 -9716557 -10881797 -10433215 -8911942 -4809164 268313 1664429
12635 1664429 -857595 -1919494 616375 2303444 858121 777853 4570758 7084269
12627 7084269 4891331 3864195 9253769 14762164 11345085 2105670 -2331898 -315339
12619 -315339 143231 -3984059 -6699539 -4681659 -2614352 -3916546 -4979755 -2526680
12611 -2526680 485878 543772 -531863 492713 2728345 3157970 1105692 -1745341 -3229667
12602c229667J779513M766300L619874j673905n186380k817335J507723K058870
12594H24993m14804j910616k362742l392694k780399J802736O463584N651722
12586C881780J048785r33389J030320K592100J855451J252012J419886l01355
12578A1845590m152226o036622l217272J533165L119982l05467n499215p020444
12570i732509k679966L545817N910117M160672K937218L679156K418173k494479
12562G744199o238230m610235k87345J888116J440746L61915q35280j457894L83295
12553a610713L535465L432080n98974l195287j620555j5212q86805K8014M817298
12544C885311P166801K239288m330172n114431j994927o45572o68168K33715p95639
$$ plain form
12602 -3229667 -1450154 3316146 6936020 5262115 75735 -2741600 -1233877 824993
12594 824993 410189 -1500427 -3863169 -7255863 -10036262 -8233526 -1769942 3881780
12586 3881780 4930565 3997176 5027496 7619596 9475047 10727059 12146945 11845590
12578 11845590 7693364 1656742 -1560530 -27365 3092617 2787150 -2712065 -9732509
12570 -9732509 -12412475 -8866658 -2956541 1204131 4141349 7820505 10238678 7744199
12562 7744199 1505969 -3104266 -3391611 -1503495 -62749 299166 -536114 -1994008 -1610713
12553 -1610713 1924752 5356832 4757858 1562571 -57984 -73196 -960001 -931987 3885311
12544 3885311 11052112 13291400 8961228 3846797 1851870 1206298 538130 771845 -23794
12535b3794n144017o040372R11424P304496L904039l347744k680078L690259M145174
12526B719387j717569l272855J652416L702524o64731l989842k275574n70267
12518d416511j244780n1889K972465J791439k938577k598688L814674O122712
12510C450845J91142m489225j107876L151870K50182n401355n745315j780512
12502a1480244J376160L775753O368322N220139j144081n429646j461593N331732
12494B556542N703895j23718m781805m876108k533474J03031J457143l90232l713418
12485f598144l012045K155574M367045l3814l831650p01051L519339O04397n654956
12476i185305n749848k66148K263149K39655j36002K431003K477971q21274j344401
$$ plain form
12535 -23794 -5167811 -11208183 -10296759 -2992263 911776 -2435968 -5116046 -1425787 2719387
12526 2719387 1001818 -2271037 -618621 3083903 2419172 -1570670 -3846244 -4416511
12518 -4416511 -5661291 -5713180 -2740715 -949276 -3887853 -6486541 -2671867 3450845
12510 3450845 3641987 -847238 -1955114 1196756 1446938 -3954417 -9699732 -11480244
12502 -11480244 -10104084 -6328331 39991 5260130 4116049 -1313597 -2775190 2556542
12494 2556542 8260437 8136719 3354914 -1521194 -4054668 -3951637 -2494494 -2884726 -6598144
12485 -6598144 -9610189 -7454615 -3087570 -3121384 -6953034 -7654085 -4134746 -3530349 -9185305
12476 -9185305 -14935153 -15201301 -12938152 -12698497 -12834499 -10403496 -7925525 -8746799 -10091200
12467a0091200K797722N407844K547273j592780k573531k092841k693766k609924
12459a0901203k38037J554632J21435j987821r23021K701885N564057O396917
12451B288844N611549K781294j717988m469503k471274J904079L064671n76124
12443F415548m673972m921399k080037M13337J439034K291719L151092K593606
12435D628928P02596k95695M13423N58226j709659m782294n970955m899929k498194
12426a3853553J045857M673315N392226K465579K65338K374431M930854J662021
12418H956068n540994p898255k258509M359138M844622O06711k795637l180895
12410b907751j278434K475863O322836O062047J92883o227480p013057k489236
$$ plain form
12467 -10091200 -7293478 -1885634 661639 -931141 -3504672 -5597513 -8291279 -10901203
12459 -10901203 -11139240 -9584608 -9463173 -11450994 -12374015 -9672130 -4108073 2288844
12451 2288844 7900393 10681687 8963699 4494196 2022922 3927001 6991672 6415548
12443 6415548 1741576 -3179823 -5259860 -4846523 -3407489 -1115770 2035322 4628928
12435 4628928 5331524 5035829 5449252 6007478 4297819 -484475 -6455430 -11355359 -13853553
12426 -13853553 -12807696 -8134381 -2742155 -276576 -11238 2363193 7294047 8956068
12418 8956068 3415074 -4483181 -6741690 -2382552 2462070 3068781 273144 -2907751
12410 -2907751 -4186185 -1710322 4612514 10674561 10867444 4639964 -2373093 -4862329
12402d862329J768467K330353O65580n31887n56253j51830J39322N19858J324862
12393F46143J923150R30264j503575k868031j660081L0357Q1223L71647L019255
12384I70352M694543Q05498n606012o535044j294580J741481j876767n745697
12376a2846226k915903L771032P192819O195668M141046J595273k718125o243764
12368a828180m486041J956090P109918O486175J204590m151739n517467k224688
12360a451342K263269L666413J764446r5986m66030j074142k096876j063100J839980
12351C286632K571619j42625k182171r66424M13997m56056o17481J969734L057687
12342F934912j072721o145169n831080j505831P89906L84852J716758N308435
$$ plain form
12402 -4862329 -3093862 -763509 -97929 -629816 -1186069 -1337899 -1198577 -678719 646143
12393 646143 2569293 3499557 1995982 -872049 -2532130 -2501773 -2420550 -2048903 970352
12384 970352 5664895 6470393 864381 -5670663 -6965243 -5223762 -7100529 -12846226
12376 -12846226 -15762129 -11991097 -4798278 1397390 5538436 7133709 4415584 -1828180
12368 -1828180 -6314221 -4358131 2751787 9237962 10442552 6290813 773346 -1451342
12360 -1451342 811927 4478340 6242786 6146800 5680770 4606628 2509752 1446652 3286632
12351 3286632 5858251 5715626 3533455 2567031 2981028 2524972 1907491 3877225 6934912
12342 6934912 5862191 -282978 -6114058 -7619889 -6829983 -6445131 -4728373 580062
12334E80062O079651J382654m645895o381011l215289M92216O63350j701597j517969
12325h263828L114349O512718K785081l990462m446562J139425K437471l663159
12317d374967o729495j11071O707950L248062l990156j858792P581954J0315075
12309A0788560K637516m518609l830904o02501q88677k452119j881983j117171
12301a865888k001984j917518O32751K311560P44592j387831j395379p46417j263001
12292f889115j776450j161709l80357N61981L192527O212384N428894M75665k984168
12283B679652p04588M219276N711305K083721l277891o158666m664771k45200
12275c57162L162315K662737n43983l087882l473266k145798O03864L674614M182088
$$ plain form
12334 580062 6659713 8042367 3396472 -2984539 -6199828 -5707612 -5044262 -6745859 -8263828
12325 -8263828 -5149479 1363239 4148320 157858 -4288704 -3149279 -711808 -4374967
12317 -4374967 -11104462 -11215533 -4507583 -1259521 -5249677 -7108469 473485 10788560
12309 10788560 13426076 8907467 5076563 4474062 3585385 1133266 -748717 -1865888
12301 -1865888 -3867872 -5785390 -5152639 -2841079 -2096487 -3484318 -4879697 -5626114 -6889115
12292 -6889115 -8665565 -9827274 -10207631 -9645650 -6453123 -240739 5188155 5663820 2679652
12283 2679652 1975064 6194340 11905645 13989366 10711475 4552809 -111962 -357162
12275 -357162 2805153 5467890 4923907 1836025 -1637241 -3783039 -3179175 495439 4677527
12266D677527J324863r74123L30893J863290o48733m153030k601478K511203L933005
12257F263417J96210k830424k084027q84078j528954k113012j833079k012481
12249f826428j174073K964967O302893K451500n150160n828195J545846N920390
12241B06740J859119k333622n4155K554042o37709l655343J18474M459443Q73867
12232C390856n345919l496740L807155M883016j271194m235059m33249K205168
12224d95966m66285k176993J258299M345372K080133j766458k238610j202185
12216f62693j951450k476605r6115K574526K075435J71050J70321J110022P53726
12207A668217O65324K790742M210112J311143l147044l485294k97945M11729k764487
$$ plain form
12266 4677527 6002390 5028267 5359160 7222450 6573717 2420687 -180791 2330412 6263417
12257 6263417 6459627 3629203 1545176 661098 -867856 -2980868 -4813947 -6826428
12249 -6826428 -8000501 -5035534 1267359 3718859 -1431301 -7259496 -5713650 206740
12241 206740 2065859 -267763 -321918 2232124 1594415 -2060928 -1942454 2516989 3390856
12232 3390856 -1955063 -5451803 -1644648 3238368 1967174 -2267885 -2701134 -495966
12224 -495966 -962251 -3139244 -1880945 2464427 4544560 2778102 539492 -662693
12216 -662693 -2614143 -5090748 -5186863 -2612337 -536902 -365852 -195531 914491 1668217
12207 1668217 2333541 5124283 9334395 10645538 7498494 4013200 3715255 4126984 1362497
12198A362497m268740r09498K723396J709942j375453j039946K092827K695520
12190B990545k81803k343985j624623j875423m665100m786776J304150P275447
12182d007568M703679l262964m945405K555229Q364404L872181m773657o759891
12174d253992k338828K65563r02592o33955J919207J615443j809755j707839L361519
12165d485229N300755k74369n392849k056613M245258L238165l107607l863688
12157f396177K623022O131233J625726k876552j96141M378386K652659k878073
12149E064083l873292P3598J733988j572435m580558l049526Q31726L065788K393017
12140H6389n93276l993064m008174R25123N288512K036785o108293q129943n2106
$$ plain form
12198 1362497 -2906243 -3815741 -1092345 617597 -757856 -1797802 295025 2990545
12190 2990545 2708742 364757 -1259866 -3135289 -7800389 -12587165 -11283015 -4007568
12182 -4007568 696111 -2566853 -7512258 -4957029 3407375 7279556 2505899 -4253992
12174 -4253992 -6592820 -6327257 -7229849 -7863804 -5944597 -4329154 -6138909 -7846748 -4485229
12165 -4485229 815526 541157 -4851692 -6908305 -2663047 575118 -2532489 -6396177
12157 -6396177 -3773155 2358078 3983804 1107252 911111 5289497 7942156 5064083
12149 5064083 1190791 1264389 2998377 1425942 -3154616 -6204142 -5372416 -2306628 86389
12140 86389 -506887 -4499951 -8508125 -7583002 -2294490 -257705 -6365998 -14495941 -14548047
12131a4548047Q534494P751902N88228l374281j948849m17968j030888p90272
12123e235681J118612J343031j111111k441525l3252L583019M555445K211785
12115C990323j377847l477604j900300K782828O060291L900455j401794l484885
12107E091467n08884K535187J214542k657673m639029l544047j341077K95796
12099c553718R94741Q50998K14769p49260k559500m705619m062586J515307P993942
12090d060926Q169067J342402m702348l976489P0605R91892q66684n62728K200855
12081a394354K696417k90313j932359P92598L880774K250221k498286m314130
12073h09432j201850K473073K381787m39201k265232k275417k603247l553503
$$ plain form
12131 -14548047 -6013553 1738349 2326577 -1047704 -2996553 -3414521 -4445409 -5235681
12123 -5235681 -4117069 -2774038 -3885149 -6326674 -6359926 -2776907 1778538 3990323
12115 3990323 2612476 -865128 -2765428 17400 6077691 9978146 8576352 5091467
12107 5091467 4582583 7117770 8332312 5674639 1035610 -2508437 -3849514 -3553718
12099 -3553718 -2558977 -1707979 -1493210 -2242470 -4801970 -9507589 -13570175 -12054868 -4060926
12090 -4060926 4108141 5450543 748195 -3228294 -3157689 -2165797 -3032481 -3595209 -1394354
12081 -1394354 1302063 1011750 -920609 -128011 3752763 6002984 3504698 -809432
12073 -809432 -2011282 461791 2843578 2404377 139145 -2136272 -4739519 -8293022
12065h293022k210151K695600P055161N566588r57072n559841l361625K524975
12057b539387N075784J927287k448830k932027K16910K701730K044322j04537
12049C941252j335568j619310j737992p86474K060069M499364L287226n95331
12041G713236k576075j019077O33249l35087j970138j875260j345146j857379
12033b631677j263590J943467L817447J68278n448527n345569J196175O643632
12025i20364N632124R19467k415049l338446l244742k535492j494158j213151
12017h609811j468409n11017J569751K373916J306404P53116J862092K759107
12009C5149K325362J893743J701671q1998k906442l014486L52886K497950K32854
$$ plain form
12065 -8293022 -10503173 -7807573 -752412 4814176 3857104 -1702737 -5064362 -2539387
12057 -2539387 2536397 4463684 2014854 -917173 -700263 2001467 4045789 3941252
12049 3941252 2605684 986374 -751618 -1538092 521977 5021341 8308567 7713236
12041 7713236 5137161 4118084 4751333 4416246 2446108 570848 -774298 -2631677
12033 -2631677 -3895267 -1951800 1865647 2033925 -3414602 -8760171 -7563996 -920364
12025 -920364 4711760 5631227 3216178 -122268 -3367010 -5902502 -7396660 -8609811
12017 -8609811 -10078220 -10589237 -9019486 -6645570 -5339166 -4586050 -2723958 35149
12009 35149 2360511 4254254 5955925 5873927 2967485 -47001 305885 2803835 3036689
12000C036689l024872k807661j54058J469356J869869K185570R76959k524469
11992A027383m544185j903497J728240J010599j869919l39190N254380P220283
11984G584094K278014l536059m130552j354053l15302j610742k303197j413765
11976d801562m88222l66021l14545N09173K319521M340498M576081J840417j611606
11967F003734k176425j90374K89736j886762k663094N56457M018985L066563q03972
11958F214848k706594j765121r05346q55732L85942K617100L161727J796363R11097
11949H854284J82976l251346p702836o394423K114306Q658163M626928n342056
11941A745996q819748k099619N880005O416438J099620l109565l228491j272689
$$ plain form
12000 3036689 11817 -2795844 -2949902 -1480546 389323 2574893 3551852 1027383
11992 1027383 -3516802 -5420299 -3692059 -2681460 -4551379 -4890569 363811 7584094
11984 7584094 9862108 6326049 2195497 841444 526142 -1084600 -3387797 -4801562
11976 -4801562 -5289784 -5655805 -5970350 -5461177 -3141656 1198842 5774923 7615340 6003734
11967 6003734 3827309 3636935 3926671 2039909 -623185 -66728 3952257 7018820 6214848
11958 6214848 3508254 1743133 837787 -17945 367997 2985097 6146824 7943187 8854284
11949 8854284 9037260 5785914 -1916922 -8311345 -6197039 2461124 7088052 1745996
11941 1745996 -7073752 -9173371 -3293366 3123072 4222692 1113127 -2115364 -3388053
11933c388053K48459L32302q27010j701919p76460P11397J9544k076164j355059
11924h812963K831826N071492J713554l057606l459254p75861k87101k245786
11916i021699k284537M12225J863205M76540m34681J389467L623412L482887J483069
11907I89888l43122p24413J004048L925453M376286l6162n265350m923908j34137
11898a131417J012660m136030p713922k845660N649220P958309K725120k556673
11890a038393k446508J155807L813341L327416l53941n449300p934714m640950
11882a3567242K172751O262557M472198N8423j956108o09475J180721J165609
11874h20566K73682M75665J433423P96264j888762l515785j606681J392184J233210
$$ plain form
11933 -3388053 -3139594 -2807292 -3634302 -5336221 -6112681 -5401284 -5381740 -7457904 -8812963
11924 -8812963 -5981137 -909645 803909 -2253697 -5712951 -6488812 -6775913 -9021699
11916 -9021699 -11306236 -10894011 -9030806 -8554266 -8988947 -7599480 -3976068 -493181 989888
11907 989888 646766 -77647 926401 4851854 9228140 9191978 3926628 -997280 -1131417
11898 -1131417 -118757 -4254787 -11968709 -14814369 -9165149 -1206840 1518280 -1038393
11890 -1038393 -3484901 -2329094 1484247 4811663 4457722 -991578 -8926292 -13567242
11882 -13567242 -11394491 -5131934 -659736 -601313 -2557421 -3166896 -1986175 -820566
11874 -820566 -546884 -71219 1362204 2158468 269706 -3246079 -4852760 -3460576 -2227366
11865b227366j464213j865837J395986L902262K394494o50032j865264j750445
11857b130415j318991J131333N350319N902100l07080o950048n929119L78400
11849c873501K577576j226886l359708J64560L647251K231971k36665P08212J618437
11840B251247k029916n997635l074863M236648O147366M68887l827521k54139
11832b079926N711513N295009j054692n536174m163310k50434K026242K199544
11824B147772J286558n09170k274664j768973J512559M453868L468744j162316
11816G154378n306497n074338n67384M060030M505692R34210k119812j562661
11808B023618J92271n58063k391231j070984K448991K440945j786234l242658
$$ plain form
11865 -2227366 -3691579 -5557416 -4161430 -259168 2135326 1485294 -379970 -2130415
11857 -2130415 -3449406 -2318073 3032246 8934346 8627266 1677218 -4251901 -3873501
11849 -3873501 -1295925 -2522811 -5882519 -5717959 -2070708 161263 -75402 632810 2251247
11840 2251247 221331 -5776304 -8851167 -4614519 1532847 2001734 -1825787 -2079926
11832 -2079926 3631587 8926596 7871904 2335730 -1827580 -2078014 -51772 2147772
11824 2147772 3434330 2925160 650496 -1118477 394082 4847950 8316694 7154378
11816 7154378 1847881 -3226457 -3793841 266189 4771881 5706091 3586279 2023618
11808 2023618 2215889 1657826 -733405 -1804389 644602 3085547 1299313 -1943345
11800a943345J705968O064238K326338n158040o296106q38378J812356j838291
11792d165260m127407N35467O341428N606955O46285j025022J165872J275067
11784F253385k515801n097593k784216J401023K645803N15398j954426k645441
11776d181868j676168J27860K087079L346512K980350Q07338k106892l971667
11768b587456l495819p02726L252607O501911O794949L014673k566940n196405
11760E014794k760725J343390K740365J772298J350301R16138k284592o347205
11752A744764n453168P95403M888504J740910l715950l917220O13876L515464
11744B12583K518156Q30239P1336j636502m135579l742226O91574M749837M217501
$$ plain form
11800 -1943345 -237377 5826861 8153199 2995159 -3300947 -4139325 -2326969 -4165260
11792 -4165260 -8292667 -7757200 -1415772 4191183 4837468 3812446 4978318 6253385
11784 6253385 3737584 -1360009 -4144225 -2743202 -97399 417999 -1536427 -4181868
11776 -4181868 -5858036 -5730176 -3643097 -296585 2683765 3491103 1384211 -2587456
11768 -2587456 -6083275 -6786001 -3533394 2968517 9763466 12778139 10211199 5014794
11760 5014794 2254069 3597459 6337824 8110122 9460423 10376561 8091969 1744764
11752 1744764 -3708404 -2913001 1975503 3716413 463 -3916757 -3302881 212583
11744 212583 2730739 3560978 3632314 1995812 -2139767 -5881993 -5190419 -440582 3776919
11735C776919P23961j236207o86799l35036j318135j240757J545668M199047K543848
11726G972509k462434m379866Q63470Q680648J0270635K950967o704542j0380486
11718F810901o237283Q32496M598743K287836l618272p298459n266321n92640
11710h482999R61465r86249j106281L010513O693857N330701J203183q11944q06418
11701E005828k218203n023159n764239l321307P5017L028299N638210O242623
11693C663069K410932l892235o633949l177608K008297L324245R26834r41738
11685b312153l60133P77184Q98611J096568K458722L470326K067494q26485k166017
11676E104117j130011j52323q41726j506946m73107Q09397P01150Q10696K601140
$$ plain form
11735 3776919 4500880 3264673 2577874 2242838 924703 -316054 1229614 5428661 7972509
11726 7972509 5510075 1130209 1993679 10674327 20944962 23895929 17191387 6810901
11718 6810901 573618 1406114 6004857 8292693 4674421 -2624038 -7890359 -8482999
11710 -8482999 -7521534 -8507783 -9614064 -6603551 90306 5421007 6624190 5812246 5005828
11701 5005828 2787625 -2235534 -7999773 -11321080 -11246063 -8217764 -2579554 3663069
11693 3663069 6074001 2181766 -4452183 -7629791 -5621494 -2297249 -1370415 -2312153
11685 -2312153 -2672286 -1895102 -996491 100077 2558799 6029125 8096619 7270134 5104117
11676 5104117 3974106 3821783 2980057 1473111 1000004 1809401 2510551 3321247 5922387
11667E922387K910466j699305p392534o551979O57602N245299K143397k831407
11659a596074k529459J311967K676834J031316K51353J215619J646753J141672
11651E149981Q07989k02470k470796k657998J965579O803364M434584m188179
11643I642054r610378o338526M32121L074665J527585J152246L704416N086617
11635H670800J910591l192633m790714j944873N22971r12794l104744j322850
11627d164246K495780K268651j868046k832584J834378N204552J985926k824842
11619B099569k457499P54250P06564j456836o52333J649085J95328l094126j597805
11610c853803L282383L051709k979192n103412Q78724N951092K108215m888676
$$ plain form
11667 5922387 8832853 7133548 -258986 -6810965 -6153363 -908064 1235333 -1596074
11659 -1596074 -4125533 -2813566 -136732 894584 1145937 2361556 4008309 5149981
11651 5149981 5957970 5755500 3284704 626706 2592285 9395649 13830233 9642054
11643 9642054 31676 -6306850 -5874729 -2800064 -1272479 -120233 3584183 8670800
11635 8670800 10581391 7388758 2598044 653171 1176142 263348 -2841396 -4164246
11627 -4164246 -1668466 600185 -1267861 -4100445 -2266067 2938485 4924411 2099569
11619 2099569 -357930 396320 1102884 -353952 -1006285 642800 838128 -2255998 -3853803
11610 -3853803 -571420 2480289 -498903 -5602315 -4723591 1227501 3335716 -1552960
11602a552960m932793J046293M086245J486516r37106M29995K045189M4823l738150
11593b021948m702887j209014M065887O683191M060197j808134n450444l499626
11585c882778J144628K624522n98009l930806k650293K199295N302268L490218
11577C699045j045352l901838l055323M24959M282362N815657K606487m128831
11569D697166p989597l779173M330218O311771m34598p060723n717505j41810
11561i784251J395581j339338k034482J193686L803766K780308R2582j570349
11553e462497j252120J427128N020040N225803K94033m432094l190628J270932
11545a099403K273819K01556M40010K226026k12158n542996n517651Q26020M303444
$$ plain form
11602 -1552960 -6485753 -5439460 -1353215 133301 -803805 -373810 1671379 1716202 -2021948
11593 -2021948 -6724835 -7933849 -3867962 2815229 6875426 5067292 -383152 -3882778
11585 -3882778 -2738150 -113628 -711637 -4642443 -7292736 -5093441 208827 3699045
11577 3699045 2653693 -1248145 -4303468 -3878509 403853 6219510 8825997 4697166
11569 4697166 -3292431 -7071604 -2741386 3570385 3135787 -3924936 -9642441 -9784251
11561 -9784251 -8388670 -9728008 -11762490 -10568804 -6765038 -3984730 -3892148 -5462497
11553 -5462497 -6714617 -5287489 -267449 4958354 5252387 820293 -2370335 -1099403
11545 -1099403 1174416 1375972 1815982 4042008 3829850 -1713146 -7230797 -6404777 -2101333
11536b101333N63943k966438l75899K976275J047075k016498k70532K648343L87401
11527a07663l771878j806052N414982R227024O068242O46497k701782m059375
11519H909995l909028k079656o04777j692787l241461j734921J443900K199558
11511g09177Q86093J069159K220797N87632k813228k332854K933197O536057L693556
11502A2071232k483473o098446n248416j716167J843174K579459n80728m006783
11494c640148k627752K407628M239038M82625k735211m53782L054194J397990
11486B124582l216388l566950O09310K165471j723237n055900k778767J591817
11478i850062K517179J314418K508386M820066L026179k289286m324822n55301
$$ plain form
11536 -2101333 -1537390 -4503828 -4879727 -1903452 -856377 -2872875 -3143407 -495064 -107663
11527 -107663 -3879541 -5685593 -270611 8956413 15024655 15671152 12969370 8909995
11519 8909995 5000967 2921311 2316534 623747 -2617714 -4352635 -2908735 -709177
11511 -709177 176916 1246075 3466872 4054504 1241276 -1091578 1841619 8377676 12071232
11502 12071232 9587759 3489313 -1759103 -3475270 -1632096 947363 366635 -3640148
11494 -3640148 -6267900 -3860272 378766 861391 -1873820 -2327602 726592 2124582
11486 2124582 -1091806 -4658756 -4049446 -1883975 -3607212 -8663112 -11441879 -9850062
11478 -9850062 -7332883 -6018465 -3510079 1309987 4336166 2046880 -2277942 -2833243
11470b833243L296086K495277K8819q0435q2687l050144n158046j308377M655430
11461b037320M273894j988388m746983k38846M238754K414518j826146k137828
11453b048345N32349J724366J382254J658121J156729k015684m584211k139999
11445d334420L031216M403895O11451l189713l075563n40146J259764J270245
11437e63271P6982j164050j121348J70980Q83416L80015O97094K603147K969330
11428D932295l32211l679340k390922K114046M748237M195470K503441n35524
11420A1555492n874582r399718n426269L473280P721357L573353k378595l883482
11412f39164k874785k870751j739142K936061O676308L676368l164773m943441
$$ plain form
11470 -2833243 462843 2958120 2986939 2906504 2823817 -226327 -5384373 -6692750 -2037320
11461 -2037320 2236574 248186 -4498797 -4737643 -498889 1915629 89483 -2048345
11453 -2048345 -1515996 208370 1590624 3248745 4405474 2389790 -2194421 -4334420
11445 -4334420 -1303204 3100691 3712142 522429 -2553134 -3093280 -1833516 -563271
11437 -563271 -486289 -1650339 -2771687 -2600707 -1717291 -1337276 -640182 1962965 4932295
11428 4932295 4600084 920744 -1470178 643868 5392105 9587575 12091016 11555492
11420 11555492 5680910 -3718808 -9145077 -5671797 2049560 5622913 3244318 -639164
11412 -639164 -3513949 -6384700 -8123842 -5187781 1488527 5164895 2000122 -2943319
11404b943319R02183O878095N252665k596155q563269p248123j130408L197423
11396f250908K762751P98960R72962J586656p77207l612805r83708N616697O799965
11387F913363m36964n958025j168135O503351M244391n468729p961834L97586
11379b934996O348751J230762n327283j849220O012613N141455l600914p488766
11371b467598k506900K083586L53513k096554j44289J964373l84687l296950j492019
11362g987525K472017L180929J331591Q80004J533461P36669n03052j68976j41889
11353A333229k175434k616074J801260O345413M398707j692841m397476l122067
11345a25283l037212l706459J065N852236N282765j382061l108387L938400Q662870
$$ plain form
11404 -2943319 -2041136 4836959 10089624 7493469 -1069800 -8317923 -9448331 -6250908
11396 -6250908 -3488157 -2689197 -1716235 -129579 -906786 -4519591 -5503299 113398 6913363
11387 6913363 6476399 518374 -649761 5853590 10097981 4629252 -3332582 -2934996
11379 -2934996 3413755 4644517 -682766 -2531986 3480627 8622082 5021168 -2467598
11371 -2467598 -4974498 -2890912 -2537399 -4633953 -4778242 -2813869 -3198556 -6495506 -7987525
11362 -7987525 -5515508 -2334579 -1002988 -122984 1410477 2147146 1644094 1475118 1333229
11353 1333229 -842205 -3458279 -1657019 4688394 9087101 7394260 2996784 -125283
11345 -125283 -3162495 -6868954 -6867889 -1015653 4267112 2885051 -223336 3715064 12377934
11336A2377934K230628p727088r220419l494406j00964r66498o08590J837842
11328e671561J891569p91859j986455j080640r81250p07593L027845P097425M265225
11319E062706m318513p997900j345540P583193Q222955R44755n343491n001690
11311b193525k44235L807528M420930K053977j406449m362246n723048m096218
11303g743286J073326O506484O491268L59330m591120k192102L384568L455579
11295F744047k203943n497907k520278J913690L141162K240231P59150k306925
11287B269227n161127k662015M392016O969347P39463n629502k732833M721851
11279B906427M728013l638725q847378l786037N162054Q101887L529739k869741
$$ plain form
11336 12377934 14608562 6881474 -2338945 -5833351 -5934315 -6900813 -7509403 -5671561
11328 -5671561 -3779992 -4571851 -6558306 -7638946 -8620196 -9327789 -6299944 797481 5062706
11319 5062706 744193 -7253707 -8599247 -1016054 7206901 8151656 2808165 -2193525
11311 -2193525 -2437760 1369768 5790698 7844675 6438226 2075980 -3647068 -7743286
11303 -7743286 -6669960 -163476 6327792 6687122 2096002 -96100 3288468 6744047
11295 6744047 4540104 -957803 -3478081 -1564391 1576771 3817002 4576152 2269227
11287 2269227 -2891900 -5553915 -1161899 5807448 6546911 917409 -1815424 2906427
11279 2906427 7634440 3995715 -4851663 -8637700 -3475646 4626241 8155980 5286239
11271E286239o028450m787071j033790J650848R31979j134513l91098L208822
11263b297034M993493K312606j750955l190885k120988p18730O65093K454555
11255C47155L384659K102489m32706k524400l927800m400270k553473J112752
11247f891594K731525L21763j913097P73137N563414N443804J58736k822054K90877
11238C656511L851922J953055k390481k659383N54343J066622k316042l669013
11230D7534M78478N199088L897549k565779p143037n526810n69314K325193J823820
11221b033278J231473L203889N806056N095595P24655l275019l667594j660153
11213E425624k20557j00992m85289j411766k836381k992407p94676J470150J219125
$$ plain form
11271 5286239 -742211 -5529282 -6563072 -4912224 -3980245 -5114758 -5505856 -2297034
11263 -2297034 2696459 5009065 3258110 67225 -2053763 -2772493 -2107400 347155
11255 347155 3731814 5834303 5401597 2877197 -1050603 -5450873 -8004346 -6891594
11247 -6891594 -4160069 -3838306 -5751403 -4978266 585148 6028952 6187688 3365634 3656511
11238 3656511 7508433 9461488 7071007 4411624 4965967 6032589 3716547 47534
11230 47534 526012 5725100 9622649 7056870 -86167 -5612977 -6182291 -3857098 -2033278
11221 -2033278 -801805 2402084 8208140 13303735 14028390 10753371 7085777 5425624
11213 5425624 5205067 5104075 4618786 3207020 370639 -2621768 -3416444 -1946294 -727169
11204g27169K7749R61558K504303L24833m742526o248792j505586L918575M125037
11195a362018P15793j110173l18485P23318J684292L665312N001284L022661p79320
11186A1242664k391911j735998k302607m177583l229414J218517L802888J367917
11178C794473j556127j78197K231367j31316m768458l669978L315567O494236
11170E531567O05939o593142n550012J209866L892809M48446k026847l0585J343533
11161a168426j647137m469321j872576L549187N753866M107515K383385J777890
11153H414383L80284k026239l583293l948154m165130l732549j488420J396965
11145h752153K725667K619391K430860J772624K4908r61389M46790K018008Q76609
$$ plain form
11204 -727169 -699420 262138 2766441 3091274 -1651252 -7900044 -9405630 -5487055 -1362018
11195 -1362018 -646225 -1756398 -2074883 -1351565 332727 3998039 8999323 12021984 11242664
11186 11242664 8850753 7114755 4812148 634565 -2594849 -1376332 2426556 3794473
11178 3794473 2238346 2060149 4291516 4160200 -608258 -4278236 -962669 5531567
11170 5531567 6137506 -455636 -6005648 -4795782 -902973 -454527 -2481374 -2511959 -1168426
11161 -1168426 -2815563 -7284884 -9157460 -5608273 145593 4253108 6636493 8414383
11153 8414383 8794667 6768428 3185135 -763019 -4928149 -8660698 -10149118 -8752153
11145 -8752153 -6026486 -3407095 -976235 796389 821297 -140092 306698 2324706 3201315
11136C201315j450181j737966p75651j111752j163026K068671N840714M479668
11128I351792r87565l525711j053792Q21162j455285m300371l974237j741347
11120f865354N45402L298113M937085J888444l824116m401365J917572O228492
11112C724273J802765n325093n569162K23905L951947L029693J418488N42321
11104C799137k122898n938659o336319k194902K022198K897937K070151K196423
11096c606932K889098K462156R70982k44344n78225n17109n21917k04593R74281
11087A623397K100194J333524o77209k42509L462529M733760r67639p841620o186412
11078b661985K287616N195420k047265q640141m741257L936547N969028J361980
$$ plain form
11136 3201315 1751134 13168 -762483 -1874235 -3037261 -968590 4872124 9351792
11128 9351792 8364227 4838516 3784724 4605886 3150601 -1149770 -5124007 -6865354
11120 -6865354 -6319952 -3021839 1915246 3803690 -20426 -4421791 -2504219 3724273
11112 3724273 5527038 201945 -5367217 -5143312 -1191365 1838328 3256816 3799137
11104 3799137 1676239 -4262420 -10598739 -12793641 -10771443 -7873506 -5803355 -3606932
11096 -3606932 -717834 1744322 2715304 2470960 1892735 1375626 853709 649116 1623397
11087 1623397 3723591 5057115 4379906 4137397 7599926 12333686 11366047 3524427 -2661985
11078 -2661985 -374369 4821051 2773786 -5866355 -10607612 -6671065 -702037 659943
11070F59943q73411K271690N110067L627468p1188l180143n079841m929131k020953
11061d485499J596402L147918K852266K171010O00460k133576l687925k814868
11053b753812j872807j732509Q97694O154612P075967m1555p099263m709905L467092
11044f14486O517282K545052j272879j979158k878767l800491r67396L391574
11036I40731K638316k141649k749521J816419L165647j529907m070771M89165
11028a441570M975670K106773l766964m478094m50480K288919J994784R24962
11020B154000n47419k909745l811373j207776K283913K953158J523022J021878
11012A459658J658969J646014P34830m87678k441221m654849m605347j346685
$$ plain form
11070 659943 -213468 2058222 7168289 10795757 10724569 7544426 2464585 -2464546 -4485499
11061 -4485499 -2889097 258821 3111087 5282097 5882557 3748981 61056 -2753812
11053 -2753812 -4626619 -6359128 -5461434 693178 7769145 7727590 628327 -4081578 -614486
11044 -614486 5902796 8447848 7174969 5195811 2317044 -1483447 -2450843 940731
11036 940731 3579047 1437398 -1312123 504296 3669943 2140036 -1930735 -1441570
11028 -1441570 3534100 5640873 1873909 -2604185 -3054665 -765746 1229038 2154000
11020 2154000 1606581 -1303164 -5114537 -6322313 -4038400 -1085242 437780 1459658
11012 1459658 3118627 4764641 5499471 5011793 2570572 -2084277 -6689624 -8036309
11004h036309K261073L464709K878961J631038r68899m031025l596299J342961
10996e053790N030055K155401l828432n095835o21560K785221O95096l057224
10988f991068k596656J760160M514790K442357j949406m307179l294420m79703
10980a0901125K574528M725594M079778L7419l639602k227168K538008L639692
10972H27124m56239k524237J632177M961374Q3557p384524o490221J527154M953298
10963b870537R7392m023220j444948K108024R21667r46822J735238N531479M708137
10954E816410J000854n81348o13336k434163m548345l306864k34750L89287r56455
10945e468710p08276M22445j234063m469141l738574J841242O354654N612101
$$ plain form
11004 -8036309 -5775236 -2310527 568434 2199472 1230573 -2800452 -6396751 -5053790
10996 -5053790 -23735 2131666 -1696766 -6792601 -7414161 -4628940 -3933844 -6991068
10988 -6991068 -9587724 -7827564 -3312774 -870417 -2819823 -7127002 -10421422 -10901125
10980 -10901125 -8326597 -3601003 478775 516194 -3123408 -5350576 -2812568 827124
10972 827124 370885 -2153352 -521175 4440199 4523756 -2860768 -9350989 -7823835 -2870537
10963 -2870537 -2773145 -6796365 -8241313 -6133289 -5211622 -6158444 -4423206 1108273 5816410
10954 5816410 6817264 6235916 5622580 3188417 -1359928 -4666792 -4901542 -4512255 -5468710
10945 -5468710 -6176986 -5754541 -6988604 -11457745 -15196319 -13355077 -7000423 -1388322
10937a388322K477518J323947J664857N61291j748149k382715o22442J162726
10929A048711J240079M55169q0517p62919j621359j025896J258975J773967j906258
10920C79952n354262j932590O067371P910653m61807q741884o055832L215147
10912d973252O120182J38922m695490j996708K999910L713664J250887o85834
10904A872281k321123m513717m847602j756901J932753L431395L690557L533403
10896A021046J137006k830068k932340L009757Q179846N201635k805450o075703
10888C905729j527111M034735M036422q8973k736134j650993P54260J392018n09176
10879G610777l668673o125635n997490k367668L069575O023207L727971p71801
$$ plain form
10937 -1388322 1089196 2413143 4078000 4639291 2891142 508427 -114015 1048711
10929 1048711 2288790 2743959 2663442 1900523 279164 -746732 512243 2286210 379952
10920 379952 -4974310 -6906900 -839529 7071124 6609317 -2132567 -8188399 -4973252
10912 -4973252 1146930 1285852 -3409638 -5406346 -2406436 1307228 2558115 1872281
10904 1872281 -448842 -4962559 -9810161 -11567062 -9634309 -6202914 -2512357 1021046
10896 1021046 2158052 -672016 -3604356 -594599 7585247 12786882 9981432 3905729
10888 3905729 2378618 6413353 10449775 10360802 7624668 5973675 6727935 8119953 7610777
10879 7610777 3942104 -2183531 -8181021 -10548689 -7479114 -1455907 2272064 1500263
10871A500263j540666K039188L811080j30539n197318m958633k29254L390722
10863a315157L771932K491540j74684m109175n683916k232374J763036L83771
10855e105027l535355k226684M011872O769954K777571j964727k661566j480885
10847c414847q05021Q05043L347105L836931K306312J901890J708600j969194
10839G716819o097909l111326N035786O624006j676165q238111m356073K790752
10831a312221L160146q58069j995367j540236l869118n056736O99810Q326350
10823b445441P776561j52943n159591l075767J99390L668j420091j491724j421941
10814g187879j912010q75803K532087N716369N773225K475963j663471k914497
$$ plain form
10871 1500263 -40403 1998785 5809865 5679326 482008 -4476625 -4705879 -1315157
10863 -1315157 2456775 4948315 4773631 664456 -5019460 -7251834 -5488798 -5105027
10855 -5105027 -8640382 -10867066 -6855194 -85240 2692331 727604 -1933962 -3414847
10847 -3414847 -4219868 -3414825 -67720 3769211 6075523 7977413 9686013 7716819
10839 7716819 1618910 -1492416 3543370 10167376 8491211 253100 -4102973 -1312221
10831 -1312221 1847925 989856 -1005511 -2545747 -6414865 -11471601 -10771791 -2445441
10823 -2445441 5331120 5178177 18586 -3057181 -2857791 -2854123 -4274214 -5765938 -7187879
10814 -7187879 -9099889 -9975692 -7443605 -1727236 4045989 6521952 4858481 1943984
10806A943984J49532L476863J529145m061726n193908O67943N656591L116145
10798G284569k616170l997836j567172k19606K72460K763556M993346K826188
10790I739335j748605l636974k809618k038001K8611N080361P698847J580751
10782A3894707q344604j0228486k069270N370369M101654j313851k562607J053421
10774i8667M124072L185568m25668l043386j884903K271426N038679L062132j668493
10765A0560760m438985l757121j979758j147353j138293j091140k21495J696477
10757a516908L025646J586537j296537j522333J142919J739262j758831m361639
10749b961884k184434J001732O99415m28262J636649L584563O4901n868283o285902
$$ plain form
10806 1943984 2093516 5570379 7099524 3037798 -2156110 -1488167 4168424 7284569
10798 7284569 4668399 670563 -896609 -1116215 -843755 1919801 6913147 9739335
10790 9739335 7990730 4353756 1544138 -493863 -465252 4615109 12313956 13894707
10782 13894707 5550103 -4678383 -6747653 -1377284 2724370 1410519 -1152088 -98667
10774 -98667 4025405 7210973 6785305 3741919 1857016 4128442 9167121 12229253 10560760
10765 10560760 6121775 2364654 384896 -762457 -1900750 -2991890 -3213385 -1516908
10757 -1516908 1508738 3095275 1798738 276405 1419324 3158586 1399755 -2961884
10749 -2961884 -5146318 -4144586 -3445171 -3873433 -2236784 1347779 1412680 -4455603 -10741505
10740a0741505n59403M127255L687923J256184O02967J808386L461753L904934
10732G548494J015390m438726o957704l022326K617971L166869k43425j437449
10724a750906L61467O95362r46685l36286L077810M656656K457021q0952n30124
10715G603363n58735j358279j418497k62762J72602r59381k218828k521741j767527
10706c289785M14507L145134L182954o37937l970981k623867P52138J066718p09027
10697b670146n9838K100394O99752l820761m993048n01607M164109M190749J608686
10688G18290N30245J060914P79223r41244k540476k619410j507467j013188k059438
10679g592551k386548R57860O178369P704956M165122M72771l73287j490762m554366
$$ plain form
10740 -10741505 -11300908 -7173653 -3485730 -2229546 -1626579 181807 3643560 7548494
10732 7548494 8563884 4125158 -2832546 -5854872 -3236901 -70032 -313457 -1750906
10724 -1750906 -1389439 -694077 -1640762 -1977048 1100762 5757418 8214439 8133487 7603363
10715 7603363 7044628 5686349 4267852 4005090 4177692 3218311 999483 -1522258 -3289785
10706 -3289785 -2875278 269856 3452810 2814873 -1156108 -3779975 -3027837 -1961119 -2670146
10697 -2670146 -2729984 -629590 70162 -3750599 -8743647 -9245254 -5081145 -890396 718290
10688 718290 1248535 2309449 3088672 2147428 -393048 -3012458 -4519925 -5533113 -7592551
10679 -7592551 -9979099 -9021239 -2842870 4862086 9027208 9499979 9126692 7635930 3081564
10670C081564n176339j369269O87134l211646o284128j101072P050676P835059
10662A511979K243837m25744J259809M05108l778972m117826Q68780L684853R59576
10653B611400j306959N80033J346151l062136p380398n317741P00190M244697
10645g584763M309424M059844L818881J333264k522346l574023m41030K686169
10637B085420J280721l008212l983749J53806L035409q91814o629783m740126
10629a2698328L902237Q382393M182809n70114Q05091L436063J294628j932534
10621F802245q85941Q66814k009862n780674m147546K52193J130615N7874K136008
10612a578274M864335K289942l342334m718676j361364J303472J697186J726678
$$ plain form
10670 3081564 -2094775 -3464044 -2776910 -5988556 -12272684 -13373756 -6323080 1511979
10662 1511979 3755816 3330072 4589881 4994989 1216017 -2901809 -2033029 1651824 2611400
10653 2611400 1304441 1884474 3230625 168489 -7211909 -12529650 -11829460 -7584763
10645 -7584763 -3275339 784505 4603386 5936650 3414304 -159719 -600749 2085420
10637 2085420 3366141 357929 -3625820 -3472014 -436605 -1328419 -7958202 -12698328
10629 -12698328 -8796091 -413698 3769111 3198997 4004088 7440151 8734779 6802245
10621 6802245 5916304 6783118 4773256 -1007418 -5154964 -4902771 -3772156 -3714282 -1578274
10612 -1578274 3286061 5576003 2233669 -2485007 -3846371 -2542899 -845713 880965
10604H80965M15736k851809l051376K891079Q012855M973690j417429k246412
10596G607299N53492n31665l799533k320468J691410O45589l608553k875762K086288
10587e51903L294039L18847l43962J508261P32719j407012r833J825249j849339
10578C517066o421972l394069L173915L007752j259374R05831O834429M224117
10570A0587695n384649p397423M70139M307288j370790n270026o84402L667949
10562a074219Q81483k766542q64615K984836M338901M721675M712142J952454
10554A4886115j339042n65633J110273k414159o641705k688001M943060L880149
10546A1171057m406092o933700k011849Q2042j792102P53419N329800J122180
$$ plain form
10604 880965 1296701 -1555108 -4606484 -1715405 6297450 11271140 9853711 7607299
10596 7607299 8160791 7629126 3829593 1509125 3200535 3846124 237571 -2638191 -551903
10587 -551903 2742136 3060983 2717021 4225282 4958001 3550989 3541156 5366405 3517066
10578 3517066 -2904906 -6298975 -3125060 -117308 -1376682 -470851 6363578 10587695
10570 10587695 5203046 -2194377 -1724238 2583050 1212260 -4057766 -4742168 -1074219
10562 -1074219 -192736 -2959278 -3823893 -839057 3499844 8221519 12933661 14886115
10554 14886115 13547073 12981440 14091713 11677554 5035849 2347848 7290908 11171057
10546 11171057 6764965 -168735 -2180584 -2098542 -3890644 -3137225 2192575 3314755
10538C314755p741642n549938O211998Q863654j212052o622109l35863L983047
10530I11850j22089r71729N414152N494854n065461j0587275k901845M702166
10522c125377K472717p21311J627928J464597m032683m074724L810200O903509
10514D324856J407526q54610K796319Q60712o320801m628249M127843K690795
10506D404391o665077m010921P059429K365733j3383360r092849J2622957J4085412
10498G385715o557765p559842J5238863J3826532j7687864j9449197K0960384
10491F156826K8485109j9521244j7907876R6379899J91646533J04306859j00554281
10484B88991825j95401770j03829478J6426621K5748592k2769037k2501287J3414001
$$ plain form
10538 3314755 -4426887 -9976825 -3764827 5098827 3886775 -2735334 -3071197 911850
10530 911850 789761 -181968 5232184 10727038 5661577 -4925698 -7827543 -3125377
10522 -3125377 -652660 -1373971 253957 1718554 -2314129 -6388853 -2578653 4324856
10514 4324856 5732382 4877772 7674091 8534803 2214002 -2414247 1713596 4404391
10506 4404391 -2260686 -6271607 787822 3153555 -10229805 -19322654 -6699697 7385715
10498 7385715 827950 -6731892 8506971 22333503 4645639 -14803558 6156826
10491 6156826 34641935 15120691 -2787185 93592714 285239247 389546106 288991825
10484 288991825 93590055 -10239423 6187198 31935790 9166753 -13334534 79467
10477G9467J4408725j1768797j1238972J0225616R035673q972517o059852J1464653
10469G173996Q211975j0689901j0968050N664994P764790n953003p995345M225584
10461b564960O416900m970006q487528M64374L892221k799339m841320J378192
10453a1511466L446414j071355j703734K478544K607414O3863L307360Q168036
10445E785076L980360m873946n518436L64979J479789j121341J240338M732696
10437F069515J08281o390715k392469O107783L492168o972401p920872J799615
10429f099095O226958Q11283k091019K486425M755706K53646k654803O17539L776759
10420H083399K635269N97320p65623l307420m345253j56990L947119N29226n497731
$$ plain form
10477 79467 14488192 2719395 -8519577 1706039 10741712 1769195 -4290657 7173996
10469 7173996 15385971 4696070 -6271980 -606986 7157804 1204801 -6790544 -2564960
10461 -2564960 3851940 -1118066 -9605594 -9141220 -5248999 -8048338 -12889658 -11511466
10453 -11511466 -8065052 -9136407 -10840141 -8361597 -5754183 -5690320 -2382960 5785076
10445 5785076 9765436 4891490 -626946 -261967 1217822 96481 1336819 6069515
10437 6069515 6177796 -212919 -2605388 3502395 6994563 22162 -7898710 -6099095
10429 -6099095 127863 939146 -1151873 1334552 6090258 6343904 3689101 4306640 8083399
10420 8083399 10718668 11315988 10550365 7242945 2897692 2740702 6687821 7217047 1719316
10411A719316l785523K979057L312165k769600m429660K95700K450490l65355
10403e93410j176572J062587k80069m570489l219453L869018O524946J794361
10395C410919j453224J344146L671188J064803j977417k155687k482403l652295
10387b229970j710816K391746K127222k594602l911947K61788K353431j106467
10379d419615l092434J317077O077408M189783j483060l677842j116942J838429
10371c67196J820472p78811k714643m62486N043129P406243K859174l138786l388076
10362F279020m019k31570l964761m797293j900781o31020j542595O93768O174658
10353G5407P708155K535185k813004k683546K82770J252821R9194j195676k567629
$$ plain form
10411 1719316 -2066207 912850 4225015 1455415 -2974245 -2678545 -228055 -593410
10403 -593410 -1769982 -707395 -987464 -5557953 -8777406 -4908388 1616558 3410919
10395 3410919 1957695 3301841 6973029 8037832 6060415 3904728 1422325 -2229970
10387 -2229970 -3940786 -1549040 578182 -2016420 -5928367 -5666579 -3313148 -4419615
10379 -4419615 -7512049 -6194972 -117564 4072219 2589159 -1088683 -2205625 -367196
10371 -367196 1453276 674465 -2040178 -2502664 2540465 9946708 12805882 9667096 6279020
10362 6279020 6275001 6043431 2078670 -2718623 -4619404 -5250424 -6793019 -6099251 75407
10353 75407 7783562 10318747 7505743 4822197 5104967 6357788 6456982 5261306 2693677
10344B693677m086370m170929j958818J249147L631932L770975J116029j969483
10336B76160j380432K305716K764542k321415n865289k042894L478028K468342
10328c17242j972922r34590M656244N651334L93885k952893k38842L250108K808230
10319A0343312L71179j383947k838155l563220j840680P35459O69935j151402
10311A342481j042513K58636r40905l418882k350653J927798M091092K437450
10303B304504L7606j925621m445745n361929j609317M044835O022533M293206
10295C360072K394544p5652m442936n979087l38068O124360M153719k773164l491061
10286a067273J954378K820238l023016n533000m14225M188249K665708k08600
$$ plain form
10344 2693677 -1392693 -5563622 -7522440 -6273293 -2641361 1129614 2245643 276160
10336 276160 -1104272 1201444 3965986 1644571 -4220718 -6263612 -2785584 -317242
10328 -317242 -2290164 -3224754 1431490 7082824 7476709 4523816 4284974 7535082 10343312
10319 10343312 10714491 9330544 6492389 2929169 1088489 1823948 2493883 1342481
10311 1342481 299968 558604 -382301 -3801183 -6151836 -4224038 -132946 2304504
10303 2304504 2342110 416489 -4029256 -9391185 -11000502 -6955667 -933134 3360072
10295 3360072 5754616 5678964 1236028 -4743059 -5081127 1043233 5196952 2423788 -1067273
10286 -1067273 887105 3707343 684327 -4848673 -5262898 -1074649 1591059 1382459
10278A382459p97350k621440n968284m617370J525056L475100j110601k455615
10270a1188045M045478Q490386L273132l574090k438459J963407P10080l087599
10262a805710j253434L774659L625567p49778j303193K701820M125250K56397
10254I371578m241726n745758m648205j123597M320168P258593L768076k374697
10246F584432l791665k18420J484310j903015n354353l177713L144560O665286
10238C433422K857005m980339q424200l276847M899901P835069N468326L989530
10230A1801867M240671R52440n369192o370352J77444M841306J440361k623663
10222I090882M25798M703930J052419o150556n750706J366895L972606j054674
$$ plain form
10278 1382459 585109 -2036331 -8004615 -12621985 -11096929 -7621829 -8732430 -11188045
10270 -11188045 -7142567 1347819 4620951 1046861 -1391598 571809 1281889 -1805710
10262 -1805710 -3059144 715515 4341082 3591304 2288111 4989931 9115181 9371578
10254 9371578 5129852 -615906 -5264111 -6387708 -2067540 5191053 8959129 6584432
10246 6584432 2792767 2574347 4058657 2155642 -3198711 -6376424 -3231864 3433422
10238 3433422 6290427 1310088 -7114112 -10390959 -5491058 2344011 7812337 11801867
10230 11801867 16042538 16994978 11625786 5255434 5432878 10274184 11714545 9090882
10222 9090882 9516680 14220610 15273029 9122473 3371767 4738662 8711268 7656594
10214G656594n351473m185495k159155j935838O12111O126552P484970J415443
10206I663709m520447l121053J362063N64295m732199o462670j742474L847071
10198e141705N093733L293872K255648K478378J775126m69005k254042j973493
10190E058512o95975n74602j832939k651289j903374n57937k5833m66416j170516
10181d820369j259968K74782L452784N828445M378517l14771m069133m262611
10173g92324k504383j105445O9891J482193J778606L19449p21002M95086K287904
10164A309975J953337m12939k717239l475690j866264K127608N707306M750258
10156G376352j98899l154369r96059J599110l80955m169164m029289n95784J013242
$$ plain form
10214 7656594 2305121 -1880374 -4039529 -5975367 -5363256 763296 8248266 9663709
10206 9663709 5143262 2022209 3384272 3948567 -783632 -7246302 -8988776 -5141705
10198 -5141705 -47972 3245900 5501548 7979926 9755052 9286047 7032005 5058512
10190 5058512 4362537 3787935 1954996 -696293 -2599667 -3157604 -3183437 -3649853 -4820369
10181 -4820369 -6080337 -5805555 -2352771 3475674 7854191 7539420 3470287 -792324
10173 -792324 -3296707 -4402152 -4332261 -2850068 -1071462 -752013 -1473015 -977929 1309975
10164 1309975 3263312 2850373 133134 -3342556 -5208820 -3081212 2626094 7376352
10156 7376352 7177453 4023084 3027025 4626135 4245180 76016 -3953273 -4549057 -3535815
10147c535815j18619o85502j30574p06235j615188j67846J780677j8935l661099
10138h859136k712352K731953N200293K212878M79060L783202N684737O00315
10130I120950n683728m825531O03175J781886j947394l161719O00558L523769
10122A1966J972488l97187j97246N95229L54750J950828O697836R402721M846271
10113B5237656l968577r166920p922974m586058l586476m112631k465814K580098
10105g991696P679510P852012K029804m519893n242531m4193M646403M220828
10097H630244P95216j734789l252927m805513m392757k31929M304329M296248
10089C608122N12412j978481j515297r26028j294576l90288J832285J762446j665741
$$ plain form
10147 -3535815 -3654434 -4339936 -4470510 -5176745 -6791933 -6959779 -5179102 -5198037 -8859136
10138 -8859136 -11571488 -8839535 -3639242 -1426364 -947304 2835898 8520635 9120950
10130 9120950 3437222 -1388309 -785134 996752 -950642 -4112361 -3511803 11966
10122 11966 1984454 1587267 1390021 1985250 2340000 4290828 10988664 20391385 25237656
10113 25237656 21269079 12102159 4179185 -406873 -3993349 -8105980 -10571794 -7991696
10105 -7991696 -312186 7539826 9569630 5049737 -192794 -236987 4409416 8630244
10097 8630244 9425460 7690671 4437744 -367769 -4760526 -4992455 -688126 3608122
10089 3608122 4120534 2142053 626756 -299272 -1593848 -1984136 -151851 1610595 -55146
10080e5146l940550j102833M305510O260981K273993m453099q286646n761724
10072a0759514J138354O034371M767125N65345n03683J675920J818408j580598
10064C155728l706191j665533Q64441K97917j065334M4139J784222O38739k579925
10055b231797m532619m256228k475130Q46566M439633M646100P11518k235582
10047e087539k91082K561711O43390l523026k497560M217421Q882740O641239
10039A1547294J419140j121503j005754j374713k565400k480562q93201K4526
10031C549827p03293j171740L91492K262445J145492k346103l291109K63108L092232
10022C192351L48332l789659k011544L375548K972783l719012n735645J803058
$$ plain form
10080 -55146 -3995696 -5098529 -793019 5467962 7741955 3288856 -4997790 -10759514
10072 -10759514 -9621160 -3586789 1180336 1745681 1241998 2917918 4736326 3155728
10064 3155728 -550463 -2215996 -1351555 -1053638 -2118972 -2074833 -290611 348128 -2231797
10055 -2231797 -6764416 -11020644 -13495774 -12649208 -8209575 -3563475 -2851957 -5087539
10047 -5087539 -5378621 -2816910 -2173520 -5696546 -8194106 -3976685 4906055 11547294
10039 11547294 12966434 11844931 10839177 9464464 6899064 4418502 3525301 3549827
10031 3549827 2846534 1674794 2066286 4328731 5474223 3128120 -162989 100119 3192351
10022 3192351 3540683 -248976 -2260520 1115028 4087811 368799 -5366846 -3563788
10014c563788Q486730M451404m018781m734672J735087N096424K318992l69422
10006I401974j63546p11962k726001k132582J306174K628092L10838j666710j370460
9997D875817r36832n58099J636275L228125l92946o559944o962366o38891L786292
9988b522569J544814j929273j845775j652335m156836m085754K616175R032232
9980b999321O034606l310361p167131j212936O482134P233730J927424k504331
9972D483814k406388l53433l95332k678168l690489j518282J084499P49639j019374
9963e743514J1031L670188M863574J306196k526463j759018J777593K244589j847577
9954A996599n321185k918290L699353P324795L864761k222483l517000M57375
$$ plain form
10014 -3563788 4922942 9374346 5355565 620893 2355980 7452404 9771396 9401974
10006 9401974 9238428 8526466 5800465 3667883 4974057 7602149 7912987 6246277 4875817
9997 4875817 3938985 3380886 5017161 8245286 7852340 1292396 -5669970 -6308861 -2522569
9988 -2522569 -977755 -2907028 -4752803 -6405138 -10561974 -14647728 -12031553 -2999321
9980 -2999321 3035285 -275076 -7442207 -8655143 -2173009 5060721 6988145 4483814
9972 4483814 2077426 1723993 1328661 -1349507 -5039996 -6558278 -5473779 -4724140 -5743514
9963 -5743514 -5732483 -2062295 2801279 4107475 1581012 -178006 1599587 3844176 1996599
9954 1996599 -3324586 -6242876 -2543523 4781272 8646033 6423550 2906550 3363925
9946C363925L126234R65189j895370j570769q37480k924419m374744p31408M651282
9937b27560M940085M69331k331539j068418O72998M64271n77208j588744j935483
9928a182267R32645O920259Q960883J447697q868418r898852j579117L888381
9920F21211R2857n568100m790289J51975K430075Q76093q56646n10374J334444
9911f218754K983273K928572J741516K010146L600968K107075l422567n996189
9903b65960r88729M369549J415980m994993l857678L594004O509184K866476M95499
9894I143332J013554j458197n618163l532797L084315L927594j209471k434586
9886B915581M35258k016415p295992k788475P661646N991106n038908j238756
$$ plain form
9946 3363925 6490159 7455348 5559978 3989209 3151729 227310 -4147434 -4878842 -227560
9937 -227560 4712525 5181856 2850317 1781899 2454897 2919168 2341960 753216 -1182267
9928 -1182267 -249622 6670637 15631520 17079217 8210799 -1688053 -3267170 621211
9920 621211 714068 -4854032 -9644321 -9492346 -7062271 -6186178 -7042824 -7553198 -6218754
9911 -6218754 -3235481 -306909 1434607 3444753 7045721 9152796 5730229 -265960
9903 -265960 -1254689 3114860 4530840 -464153 -4321831 -727827 5781357 8647833 9143332
9894 9143332 10156886 8698689 3080526 -452271 2632044 6559638 5350167 2915581
9886 2915581 3350839 1334424 -5961568 -8750043 -1088397 4902709 -136199 -1374955
9878a374955J5859196Q211572l7243295p1118556m3629979K0455548N2804260
9871e6036209L3260952M595922N53184P129701L435714k506505K109821P779386
9863C21966K264028n665676k947753M565105M369751j085216k266173o85995l114696
9854d244659o596554l929500K599660N454776M126582K819644J738418k25967
9846A742400m64215J324594o77418p706381j0139392j741424Q038706P416476
9838b206654M46334j070382K410951J071633n059854n718590Q41621M042545q84922
9829f127318m691918J20397O791460N489525j496948m688188k006975O18844L73405
9820e617716N04106K426641K663045l38352k431419k22203L081377K442607j248941
$$ plain form
9878 -1374955 14484241 22695813 -14547482 -85666038 -129296017 -108840469 -56036209
9871 -56036209 -22775257 -18179335 -17626151 -10496450 -7060736 -9567241 -7457420 321966
9863 321966 2585994 -3079682 -6027435 -1462330 2907421 1822205 -443968 -1129963 -4244659
9854 -4244659 -10841213 -14770713 -12171053 -6716277 -2589695 229949 1968367 1742400
9846 1742400 1278185 2602779 1925361 -5781020 -15920412 -17661836 -9623130 -2206654
9838 -2206654 -1760320 -2830702 -419751 651882 -4407972 -10126562 -9284941 -5242396 -6127318
9829 -6127318 -10819236 -10698839 -3907379 1582146 85198 -4602990 -6609965 -5991121 -5617716
9820 -5617716 -5113610 -2686969 -23924 -362276 -2793695 -3015898 65479 2508086 1259145
9811A259145k889579j180967J24347q91366j215664J531174M653571M342276J108272
9802F841209j619867k050707o12029J750536L253509J612316k455696m434210
9794B285061j825281J661964J271148j852555l009809j199738O31913J205569
9786h31728J859999K439821R90148k055658l315086r61529K800027M219397J581334
9777F726725k935041m275368M7806M749748J838727o910589r360083k6905R587775
9768e57205O293206n057620q486600l04500P267783N858899J260983P54418J957356
9759H986720K05164k323810j844632m49471j592129l275925j945958Q84722J486064
9750A30745J29839m48980r0545m65991j596604k493585k992039k512199M950K792803
$$ plain form
9811 1259145 -1630434 -2811401 -2687054 -3578420 -4794084 -3262910 1390661 5732937 6841209
9802 6841209 5221342 3170635 2558606 4309142 7562651 9174967 6719271 2285061
9794 2285061 459780 2121744 3392892 1540337 -1469472 -2669210 -2037297 -831728
9786 -831728 1028271 3468092 4458240 2402582 -912504 -1874033 925994 5145391 6726725
9777 6726725 3791684 -483684 -435878 4313870 6152597 -757992 -10118075 -10144980 -557205
9768 -557205 5736001 678381 -7808219 -8112719 -844936 5013963 6274946 7029364 8986720
9759 8986720 9191884 6868074 5023442 4573971 2981842 -294083 -2240041 -1355319 130745
9750 130745 260584 -188396 -278941 -744932 -2341536 -4835121 -7827160 -10339359 -10334409 -7541606
9740g541606J847422k509689m107729M13242N706469N036223m9255k531362n5990
9731c792275K943916K270492j269573l980608l099694J258764N771033O125799
9723F227854J409621m407301o589214m233533j11831K404238J705151p47208j210206
9714e552429J822884M336672J793841k996149k576515L654998P237982K826259
9706A0547543l980792n607480l353771l058327m616874l304212J089603L917206
9698h367104L497231K578956K192401L40751k564912k816070N36992L559424L077697
9689B035366M61587j688174k808665k805091r50043J740564K332644J82607j619040
9680c118245q64006P88457J470171K295865L980986L629880r15235n861594n504918
$$ plain form
9740 -7541606 -5694184 -8203873 -12311602 -11898360 -6191891 -1155668 -1204923 -3736285 -3792275
9731 -3792275 -848359 1422133 152560 -3828048 -6927742 -5668978 102055 6227854
9723 6227854 7637475 3230174 -3359040 -7592573 -7704404 -5300166 -3595015 -4342223 -5552429
9714 -5552429 -3729545 607127 2400968 -595181 -3171696 483302 7721284 10547543
9706 10547543 6566751 959271 -2394500 -5452827 -10069701 -13373913 -12284310 -8367104
9698 -8367104 -4869873 -2290917 -98516 242235 -2322677 -5138747 -4601755 -1042331 2035366
9689 2035366 2496953 808779 -1999886 -4804977 -5755020 -4014456 -1681812 -1499205 -3118245
9680 -3118245 -3982251 -3193794 -1723623 572242 4553228 8183108 7267873 1406279 -4098639
9671d098639m73253K980542J852731l95515l17931Q74915J172708J494134K400141
9662E489833J298059k878164n611379k468436L512304N493904K387141r55984
9654F267278k151331l425001n023573l397730J799512N049054K778351j068487
9646H28073j121034J743448K842455P44783k000916l089135k286959o40244K15504
9637b764025k39401J64650L043812M931842J365437m265404l556249L215404N377244
9628G273310j578101p468227l091318M677152M061441k526835l451353K401104
9620B97173M793286Q1036l571677q82505K575797R83323k828308l644922j525004
9611c721801Q93148K621865K748688K27380k497778j265878K760364L777893L62159
$$ plain form
9671 -4098639 -4571892 -1591350 261381 -134134 -452065 422850 1595558 3089692 5489833
9662 5489833 6787892 3909728 -1701651 -4170087 -657783 4836121 7223262 6267278
9654 6267278 4115947 690946 -4332627 -7730357 -5930845 -881791 1896560 828073
9646 828073 -292961 1450487 4292942 5037725 3036809 -52326 -2339285 -2979529 -2764025
9637 -2764025 -3003426 -2838776 205036 5136878 6502315 2236911 -1319338 1896066 7273310
9628 7273310 5695209 -1773018 -4864336 -187184 3874257 1347422 -2103931 297173
9620 297173 5090459 5171495 1599818 717313 3293110 4276433 1448125 -2196797 -3721801
9611 -3721801 -2828653 -206788 2541900 2769280 271502 -994376 1765988 5543881 5906040
9602E906040k731237l040181l281860l912607r88550N155214P013301O68725o946351
9593b157506o928545J89519O571496O737199J349870n027128o966664k497209
9585h728968L515792M136222l89649l139821j142980J021955J28683m45026K182191
9576b861601M687638L279350k16526j943905j086386J489767M744073N633984
9568A3726394J642251l262190k284495K955025L551498j930194m291401M35483
9560A0542371L471461j461809o753469m189816P04275q54431m804589j847549
9552e193556N306004O321361P35309k836911k473713l996550p088913m326468
9544a3553437M438885R477306N960507K59715j782284k376579l676157k264364
$$ plain form
9602 5906040 3174803 134622 -3147238 -7059845 -8048395 -2893181 4120120 4788845 -2157506
9593 -2157506 -9086051 -8896532 -2325036 4412163 5762033 734905 -6231759 -8728968
9585 -8728968 -5213176 -1076954 -1466603 -4606424 -5749404 -4727449 -4598766 -5043792 -2861601
9576 -2861601 1826037 5105387 4888861 2944956 1858570 3348337 8092410 13726394
9568 13726394 15368645 12106455 9821960 12776985 16328483 14398289 10106888 10542371
9560 10542371 14013832 12552023 5798554 1608738 2313013 1458582 -3346007 -5193556
9552 -5193556 112448 6433809 7169118 4332207 1858494 -2138056 -9226969 -13553437
9544 -13553437 -9114552 362754 6323261 6582976 4800692 2424113 -1252044 -3516408
9536c516408K937674N978251L073490p65869l02774J288076j037269m540170l149133
9527c4132J864342L196226j626059p010918p283262l098229J205942L153594L311934
9518f320562K907024K220803J207144M79266O80120J060730J43771j667260j995769
9509a284733k62799O74597j068645k590307l01248L669480L617887j279023n109851
9500c934642l122900K177396M939964L393934Q17939L00702J002847J44157k468801
9491C250596l417213r0219M838730N763012J404335k970133k179491K314503M643964
9482A3558084J661757m205309p820865n487191J875822Q078702O621817j588360
9474A2694457q076862o767684j134835J697284O74254P5563J466127J868274n55187
$$ plain form
9536 -3516408 -578734 5399517 8473007 7707138 7404364 8692440 7655171 3115001 -34132
9527 -34132 1830210 5026436 3400377 -3610541 -10893803 -13992032 -12786090 -9632496 -6320562
9518 -6320562 -3413538 -1192735 14409 493675 1173795 2234525 2378296 711036 -1284733
9509 -1284733 -1547532 -872935 -1941580 -4531887 -4833135 -1163655 2454232 1175209 -3934642
9500 -3934642 -7057542 -4880146 59818 3453752 4271691 4572393 5575240 5719397 3250596
9491 3250596 -166617 -256836 4581894 10344906 11749241 8779108 6599617 8914120 13558084
9482 13558084 15219841 11014532 3193667 -2293524 -417702 7661000 14282817 12694457
9474 12694457 4617595 -2150089 -3284924 -1587640 -913386 -837823 628304 2496578 1941391
9465A941391l645040m414703j883628K889521O749505N604349q77710o817034
9457d53349o120390p3315M751752N097805L335247J996353P57907q79315k066930
9448F345765k391713j998601j20742L223505M871503J905619l214564n300543
9440C320229l689503k090655j775182o19495J077603M41765j200185J372215P455091
9431D291883Q308204k23170r366252q430150M00783N933252L807222l394r02593
9422C815785j842180n169622o239728p77549O444069P030794Q37134m082869k965323
9413b949489M98956J610056J114013J228097O56941j766747k715576N53374L816248
9404B045873J342628m091840m365820J100786M113560J023549j615627J202314
$$ plain form
9465 1941391 -1703649 -6118352 -8001980 -5112459 1637046 7241395 6363685 -453349
9457 -453349 -6573739 -6647054 -1895302 3202503 6537750 8534103 9292010 8412695 6345765
9448 6345765 3954052 1955451 1834709 5058214 9929717 11835336 8620772 3320229
9440 3320229 -369274 -2459929 -4235111 -4854606 -3777003 -3335238 -4535423 -3163208 4291883
9431 4291883 12600087 12376917 3010665 -5419485 -5018702 914550 4721772 4718378 3815785
9422 3815785 1973605 -3196017 -9435745 -10213294 -3769225 3261569 4098703 15834 -2949489
9413 -2949489 -2450533 -840477 273536 1501633 2158574 391827 -2323749 -1770375 2045873
9404 2045873 3388501 -703339 -5069159 -3968373 145187 1168736 -446891 755423
9396G55423M042356O19806m614386l256133L081466N259359J281246j285442J642597
9387G526292M271889J038243m007225l259010L009905O726417K482430n959269
9379A1829672j0192229o323298J312817N296680L175935p89222j832238k56840
9371B221277O82811J07284k29920K48658K18743n43593l62989J431323K935230
9362F708824K067089n85724k229232r90938J763394K739419P15139j796953k145058
9353F245960j298112j469246j554079Q74797L790910K402539k736643n210569
9345A045557k185071J614303K050011J358954J940624R31377l448842o046862
9337b739949k271035L193565K851918j819900l095844P10276L828879K991552
$$ plain form
9396 755423 4797779 5417585 803199 -2452934 628532 5887891 7169137 5883695 7526292
9387 7526292 11798181 12836424 8829199 5570189 8580094 15306511 17788941 11829672
9379 11829672 1637443 -4685855 -3373038 1923642 5099577 4310355 2478117 2221277
9371 2221277 2904088 3011372 2781452 3030110 3248853 2705260 2342271 3773594 6708824
9362 6708824 8775913 8190189 5960957 4970019 6733413 9472832 10187971 8391018 6245960
9353 6245960 4947848 3478602 1924523 2799320 6590230 8992769 6256126 1045557
9345 1045557 -1139514 474789 2524800 3883754 5824378 6755755 3306913 -2739949
9337 -2739949 -5010984 -1817419 1034499 -785401 -3881245 -3170969 657910 3649462
9329C649462J036698M19477J40277p0052J285527L239522K507976j035356l702148
9320G471383l558397k378542j669966r31222j43976j22375l80428j31534o25473
9311b470530k801820m033984j493474K793578M823559M651914M518236L327989
9303I315468q10191m675013l742204m46029q49977l910648k645003L629533P138953
9294C004889L644973j668341l102855j748342o19358N91502K155455J804678n79559
9285C483042j185736J207064K134251j364500n345943m850074j034782J674359
9277e282319K156974K333547K795560K228307n2439k983224m249682j834253K988638
9268a898891N171377J664857l536349m326533j044730J135679Q24826P92163P79417
$$ plain form
9329 3649462 4686160 5105637 5245914 5175862 6461389 9700911 12208887 11173531 7471383
9320 7471383 3912986 1534444 -135522 -1066744 -1210720 -1333095 -1713523 -1845057 -2470530
9311 -2470530 -5272350 -9306334 -10799808 -8006230 -3182671 1469243 5987479 9315468
9303 9315468 8505277 3830264 88060 -357969 -1207946 -5118594 -7763597 -4134064 3004889
9294 3004889 6649862 4981521 1878666 130324 -489034 102468 2257923 4062601 3483042
9285 3483042 2297306 3504370 5638621 4274121 -1071822 -5921896 -6956678 -5282319
9277 -5282319 -3125345 -791798 2003762 4232069 4179630 1196406 -3053276 -4887529 -1898891
9268 -1898891 3272486 4937343 1400994 -2925539 -3970269 -2834590 -2009764 -1217601 -438184
9259d38184k087837n562699l643788K826325N738472K413983k44300J989234L303379
9250D294585j686900q020046p787758j625110L761448N059202L557612P78410
9242a668557j903837k473045j107377n47366j008123O82909M389872M951556L64388
9233A680420m491869n751668n416963m644946k41002O985166Q885882K025695
9225i69285m793156l140002K261018K452772r89995p48194K312887J727051j779165
9216c666069j883621J157171J433310p91850L24242M029481L024006l068251n528975
9207d970556o43683M311893L111590n19736q20935R72064Q35423r28606j896449
9198e48995k095920k128897r10397J239846J451675o22675j014110K068122M541909
$$ plain form
9259 -438184 -2526021 -8088720 -11732508 -8906183 -3167711 -753728 -998028 991206 4294585
9250 4294585 2607685 -5412361 -13200119 -14825229 -11063781 -6004579 -2446967 -1668557
9242 -1668557 -3572394 -6045439 -7152816 -7700182 -8708305 -8025396 -3635524 1316032 1680420
9233 1680420 -2811449 -8563117 -13980080 -18625026 -18866028 -11880862 -2994980 -969285
9225 -969285 -5762441 -8902443 -6641425 -4188653 -5178648 -5926842 -3613955 -1886904 -3666069
9216 -3666069 -5549690 -4392519 -2959209 -3751059 -3426817 602664 3626670 558419 -4970556
9207 -4970556 -5614239 -1302346 1809244 1289508 468573 1440637 2276060 1347454 -548995
9198 -548995 -2644915 -4773812 -5684209 -4444363 -2992688 -3615363 -4629473 -2561351 1980558
9189A980558K972456L42685Q49826K685523J094328l754188o788342m737921R29035
9180d426040O650016R143363O457504k7478n520795o615569n166702m694213m579564
9171h779478j742665K862794M329554J205876j761523n85090K053494J290731
9163a126307k261941l786472j946532l74995j027025r32626K232961N432731M520519
9154G30313L32655l143303m416408m387114k697122J055188L833912K264172j269997
9145g697704j235539K206379L128321k58351k290531P80255M432792L212057p86112
9136A491567j994126j05414P62877q19224k417374k243572o87117J494147L200881
9127a317355K707866K48651j121275m5524M74497j719143l269647l08782M578878
$$ plain form
9189 1980558 4953014 5295699 6145525 8831048 9925376 6171188 -617154 -5355075 -4426040
9180 -4426040 2223976 11367339 17824843 17797365 12276570 5661001 494299 -4199914 -8779478
9171 -8779478 -10522143 -7659349 -3329795 -2123919 -3885442 -4470532 -2417038 -1126307
9163 -1126307 -3388248 -7174720 -9121252 -9496247 -10523272 -11455898 -9222937 -3790206 730313
9154 730313 1062968 -2080335 -6496743 -10883857 -13580979 -12525791 -8691879 -6427707 -7697704
9145 -7697704 -8933243 -6726864 -3598543 -3856894 -6147425 -5367170 -934378 2277679 1491567
9136 1491567 -502559 -607973 154904 -664320 -3081694 -5325266 -6012383 -4518236 -1317355
9127 -1317355 1390511 1639162 517887 472363 946860 -772283 -4041930 -4350712 228166
9118B28166N630329K352017o78358j383345k087672l944042m537798j988848K271688
9109d137863N548051N977636K834166k413432n943768n379655k835142j382588
9101g732595l59451K011157L539213R96544l081304k724505K117438M704955J353063
9092H24515l628026n047287l483353j702740O77259M625269P319430N219429k04907
9083D599589l990960l943039j790742R05097L894902N441889K925995k276599
9075E766132m533981j350940K198339L24911m502365m679436J058376N347393
9067c71571K968225j966740l067409p58762N81977M02551R83300J751595Q79582
9058A402748J09439J460038J668168k545588o205980k437941M489856L663497
$$ plain form
9118 228166 5858495 8210512 7532154 6148809 4061137 117095 -4420703 -6409551 -4137863
9109 -4137863 1410188 7387824 10221990 7808558 1864790 -3514865 -6350007 -7732595
9101 -7732595 -8092046 -6080889 -2541676 -1545132 -4626436 -7350941 -5233503 -528548 824515
9092 824515 -2803511 -7850798 -11334151 -13036891 -12359632 -7734363 -414933 4804496 4599589
9083 4599589 608629 -3334410 -5125152 -4220055 -325153 5116736 8042731 5766132
9075 5766132 1232151 -118789 2079550 2404461 -2097904 -6777340 -5718964 -371571
9067 -371571 2596654 629914 -2437495 -3196257 -2614280 -2211729 -1228429 523166 1402748
9058 1402748 1512187 2972225 4640393 2094805 -4111175 -6549116 -2059260 1604237
9050A604237m615675p899168j235959N240034L709747P59800L862655P507696
9042H933367L608528l646445n239542k348450j864267k881142j62307L590804
9034i454J868785k431825q84145N204261O205529L06381m141707k865453m57827
9025B794545R5289J092405J720756k392434q688254q187346q5097N162647J787450
9016f700039k935935j763715J426042P05353r28668J705078N292866L380285k157625
9007a976358l882067n55677J788521k00242k822188j758955J823215L459057J492364
8998b632330q29978L16388L750595M418908J015767j332476Q51944L040439L856
8989H603113m654991m156223n96972j431834n345835l236956N500224R764877
$$ plain form
9050 1604237 -3011438 -10910606 -12146565 -6906531 -3196784 -2436984 1425671 8933367
9042 8933367 12541895 8895450 3655908 1307458 -556809 -3437951 -3600258 -9454
9034 -9454 1859331 -572494 -1456639 3747622 9953151 10259532 6117825 3252372 2794545
9025 2794545 2889834 3982239 5702995 3310561 -5377693 -13565039 -13650136 -8487489 -6700039
9016 -6700039 -9635974 -11399689 -9973647 -9268294 -10196962 -8491884 -3199018 181267 -1976358
9007 -1976358 -5858425 -6414102 -4625581 -4825823 -7648011 -9406966 -7583751 -4124694 -2632330
8998 -2632330 -3462308 -3145920 604675 5023583 6039350 4706874 5558818 8599257 8603113
8989 8603113 3948122 -208101 -805073 -2236907 -7582742 -10819698 -5319474 4445403
8981D445403L843151l522704l269881O90414Q6427l855333m051807L54266M001068
8972a278996M108922K405160P12353r4926P61799J896970J89306l458144l509689
8963A732755J313040M210633L55979m918281m195306O75871K326940o56359l107659
8954b262387j927168Q88402K543868J993379l55439k056122k34474L478364L635099
8945E703522m73486k505707O48194K919745p03674m824476k468740K720981K735706
8936C752065r38922n52932L482626K959796l450021o946755k352009M154488M697909
8927D806245K1919l746366l495446q19844J269061R70995q32069j299933J91289
8918b934149K45649k896970m654782l84958N943672O183710R0659m318616k606937
$$ plain form
8981 4445403 8288554 4765850 1495969 2186383 2272810 -1582523 -5634330 -5280064 -1278996
8972 -1278996 2829926 5235086 5947439 5852513 6614312 8511282 8700588 5242444 1732755
8963 1732755 3045795 7256428 7612407 2694126 -1501180 -825309 1501631 845272 -2262387
8954 -2262387 -4189555 -3301153 -757285 1236094 880655 -1175467 -1409941 2068423 5703522
8945 5703522 5230036 2724329 3372523 6292268 5588594 764118 -1704622 1016359 3752065
8936 3752065 2813143 2260211 5742837 8702633 5252612 -1694143 -4046152 108336 4806245
8927 4806245 4828164 1081798 -2413648 -3233492 -1964431 -993436 -1825505 -3125438 -2934149
8918 -2934149 -2688500 -5585470 -10240252 -10625210 -4681538 1502172 1592831 -2725785 -5332722
8909e332722J214196K743766K839289K913868J270842k420622m297707j733370
8901b802460K193766K876061J5896l020905l301639l87701L336677L887171j9821
8892B777045m040941l029884J653437L908954J611593j414467k117939j372063
8884b024265N1306K658831M357087J759252k936407l025228K300669N561541K441632
8875A1144418j503541m99973J853507p29423o280048p893161m489217q09442J008049
8866h198831K560470L326690R70272k731903l004656L07897K314014J097341J78006
8857c180700J529728K127121j4812j751528k00083K179095J747493n49184j546837
8848C40293j126962j001981o08659J349831K991711J605420j115442j132570R75568
$$ plain form
8909 -5332722 -4118526 -1374760 1464529 4378397 5649239 3228617 -1069090 -2802460
8901 -2802460 -608694 2267367 2283263 -737642 -4039281 -4426982 -1090305 2796866 2777045
8892 2777045 -1263896 -4293780 -2640343 1268611 2880204 1465737 -652202 -2024265
8884 -2024265 -1972959 685872 5042959 6802211 3865804 840576 3141245 8702786 11144418
8875 11144418 9640877 9140904 10994411 10264988 3984940 -3908221 -8397438 -9206880 -8198831
8866 -8198831 -5638361 -2311671 -1341399 -4073302 -7077958 -6770061 -4456047 -3358706 -3180700
8857 -3180700 -1650972 476149 461337 -1290191 -1490274 688821 2436314 1887130 340293
8848 340293 -786669 -1788650 -2397309 -1047478 1944233 3549653 2434211 1301641 2277209
8839B277209M89212l221106m558274k59336M873709M660404K77340k236963q54024
8830A448171Q66124J16028j670583j945811l89532J440260J744763j16705k393649
8821i00934k299238j78203O2601k856888m337794r64852K768373R51231l378717
8812a1134421k381604L330248M895431l79536m414195j299888M168831N586898
8804a628236M326203M012993L050790n57496l308174k252092j182156l460072
8796i98240m503822K68902N538937L706404k183058l609996r97384j426753m351502
8787h556512k283472M408591O191504l7361n822186m913963j297305M21035K061068
8778i828601M562073L873863k28148j070969K990557L766216k139695m617548
$$ plain form
8839 2277209 2766421 -454685 -5012959 -5272295 -398586 4261818 4539158 2302195 1448171
8830 1448171 2314295 2430323 759740 -1186071 -1575603 -135343 1609420 1492715 -900934
8821 -900934 -3200172 -3378375 -3315774 -6172662 -10510456 -11475308 -8706935 -7755704 -11134421
8812 -11134421 -13516025 -10185777 -5290346 -5669882 -10084077 -11383965 -7215134 -1628236
8804 -1628236 2697967 6710960 9761750 9204254 5896080 3643988 2461832 -998240
8796 -998240 -5502062 -5233160 305777 4012181 1829123 -1780873 -2778257 -4205010 -8556512
8787 -8556512 -10839984 -6431393 -239889 -277250 -6099436 -11013399 -12310704 -11889669 -9828601
8778 -9828601 -5266528 -1392665 -1620813 -2691782 298775 4064991 1925296 -2692252
8770b692252L685124J2204009P098594n993434r544590j144568L780871k764592
8762D629162r635227n667922L253714N298473Q88425r22050J749109K497810q73390
8753A218104k839674j38418K691245O96838m019187n761946k789524J870452M929582
8744d142528N136299K574234j236793l168391j323377J944123K512986K21161
8736B517714r45471O84883J442548j589667m580471j595377N893853R283404L868736
8727A4980152m541235o751972j387890M196477L270424k864335p276670n465657
8719e840706J09902L287154J232099k589900k863352J038013M458638L487782
8711B319630r2718j167962K092273N719613M844755o4862l865546l634833k029704
$$ plain form
8770 -2692252 992872 13196881 20295475 14302041 4757451 3612883 7393754 4629162
8762 4629162 -5006065 -10673987 -7420273 -2121800 -1233375 -2155425 -406316 2091494 1218104
8753 1218104 -1621570 -1759988 931257 1628095 -2391092 -8153038 -10942562 -9072110 -4142528
8744 -4142528 993771 3568005 2331212 -837179 -2160556 -216433 2296553 2517714
8736 2517714 1572243 2257126 3699674 2110007 -2470464 -4065841 1828012 11111416 14980152
8727 14980152 10438917 3686945 2299055 6495532 9765956 6901621 -375049 -5840706
8719 -5840706 -5730804 -2443650 -1211551 -3801451 -6664803 -5626790 -1168152 2319630
8711 2319630 2226912 1058950 3151223 8870836 13715591 13650729 9785183 6150350 4120646
8702D120646k010678j513698K313098N884105K914578m456557o123258J290893
8694B419129P778658L757393n817818q901688l365034K429193L461615K778010
8686D539458K687920P13316l737832o520545n245420k328566L74241L626664N785026
8677a05738K860936l599064n748795m05648N569641N215002R92528n52890J335801
8668E561773K510407J075690j309536k927612l194452k408663k227542l524329
8660f444264l243092J764647P422625O027756j391950m984015j315837J267543
8652h96587k376148m822664R0859M725288M35628n939420k489797O949006Q088289
8643C764454n15600n570952q85896M440445K961408k19516P37588J925718j407184
$$ plain form
8702 4120646 2109968 596270 2909368 8793473 11708051 7251494 1128236 2419129
8694 2419129 10197787 13955180 8137362 -764326 -4129360 -1700167 1761448 4539458
8686 4539458 7227378 7940694 4202862 -2317683 -7563103 -9891669 -9517428 -5890764 -105738
8677 -105738 2755198 -843866 -6592661 -6998309 -1428668 3786334 4778862 4225972 5561773
8668 5561773 8072180 9147870 7838334 4910722 1716270 -692393 -2919935 -6444264
8660 -6444264 -9687356 -7922709 -500084 5527672 4135722 -848293 -2164130 -896587
8652 -896587 -3272735 -8095399 -8004540 -3279252 -2843624 -8783044 -11272841 -4323835 3764454
8643 3764454 3248854 -2322098 -3207994 1232451 4193859 3974343 4711931 6637649 5230465
8634E230465n104006l519447M18916O07904j980932j993930R60473K506758R45322
8625a928477j137191j586466q01024J40057O04028L88766J59235O82589J058506
8616b419977j59248j916225j699906K54750J347757J253670J980741L152990K162700
8607C957252l80999p60594J201803J319666j518784l053704j098774O52780p77046
8598d58400k833613k488707r44015o1031Q68346J793827O51135j720455j296283
8589f489196J620025J549291j982408j700805M668554P870922J282125o644062
8581A74446m446951M244616O699017J113602k249758J266468M587454J972838
8573A3361732k905571n092409n299498n044852k689697J733648M245242L072178
$$ plain form
8634 5230465 126459 -3392988 -2974072 -2366168 -4347100 -6341030 -5380557 -2873799 -1928477
8625 -1928477 -3065668 -4652134 -5453158 -5313101 -4709073 -4320307 -4161072 -3478483 -2419977
8616 -2419977 -2579225 -4495450 -6195356 -5940606 -4592849 -3339179 -1358438 1794552 3957252
8607 3957252 3576253 2815659 4017462 5337128 3818344 764640 -334134 318646 -458400
8598 -458400 -3292013 -5780720 -6724735 -6785766 -5917420 -4123593 -3472458 -5192913 -6489196
8589 -6489196 -4869171 -3319880 -5302288 -7003093 -2334539 5536383 6818508 174446
8581 174446 -4272505 -27889 6671128 7784730 5534972 6801440 11388894 13361732
8573 13361732 10456161 5363752 64254 -4980598 -7670295 -5936647 -1691405 1380773
8565A380773J427549J290898L09169k193789k413324R45392K877348o9000l489169
8556F5847k086214J520956J193387k478810k982241J893975O569419N459217R4538
8547I250074l430439j967551J506034J829009k121565o032227n538961j701703
8539h207329J000087J176011J594972L593203M501510K376951l43212p02909n941
8530D983343j430027m560274n715977l188561P25703L068120L310993K485892
8522c20788R99117j229406k949992j702694K866183O662936M809905j582074n350000
8513B203187k277130K775963K530784k249823m282143r28036K280199N56177l279673
8504b670495l693404m8918L858443M983418L041554k88698k069630l99203K396635
$$ plain form
8565 1380773 2808322 4099220 4408389 2214600 -198724 746668 3624016 3555016 65847
8556 65847 -2020367 -499411 693976 -1784834 -4767075 -2873100 3696319 9155536 9250074
8547 9250074 5819635 3852084 5358118 7187127 5065562 -966665 -6505626 -8207329
8539 -8207329 -7207242 -6031231 -4436259 -843056 3658454 6035405 5692193 4989284 4983343
8530 4983343 3553316 -1006958 -6722935 -9911496 -9185793 -6117673 -2806680 -320788
8522 -320788 678329 -551077 -3501069 -5203763 -2337580 4325356 9135261 7553187 2203187
8513 2203187 -73943 2702020 5232804 2982981 -1299162 -2227198 53001 609178 -2670495
8504 -2670495 -6363899 -6412817 -2554374 2429044 5470598 5181900 3112270 2713067 5109702
8495E109702J786735k238823m261760j491003J632190M57147k378640j456472
8487b840924K452706L774339J013059j678453j780260j672636l229373l814802
8479g776344l75228N244085P815286M604281j812042o152529n220587n87927L173576
8470a087429L129319N74090j148655m30019J620097K849094J827135j013597l218974
8461C101061k576631k48238J85558k187048l872363k143645N70789L70375j939004
8452h739146j990823J516115M895331M563115J262755j660994k264590j322038
8444c740275p32637j354044k223727j992989q92666j89849J84471J496946L371005
8435f073765L699829K369351K001873L248921K753604j326852m963507l408367
$$ plain form
8495 5109702 6896437 4657614 395854 -1095149 537041 994188 -1384452 -2840924
8487 -2840924 -388218 3386121 4399180 2720727 940467 -732169 -3961542 -7776344
8479 -7776344 -8151572 -2907487 4907799 9512080 7700038 1547509 -3673078 -4261005 -1087429
8470 -1087429 2041890 2615980 1467325 1037306 2657403 5506497 7333632 6320035 3101061
8461 3101061 524430 276192 461750 -1725298 -5597661 -7741306 -7170517 -6800142 -8739146
8452 -8739146 -10729969 -9213854 -4318523 244592 1507347 -153647 -2418237 -3740275
8444 -3740275 -4472912 -5826956 -8050683 -10043672 -10936338 -11126187 -10941716 -9444770 -6073765
8435 -6073765 -2373936 -4585 1997288 5246209 7999813 6672961 1709454 -1698913
8427a698913J554596L918725J684833j566607k624167j897854p56284M83345J322944
8418D20618Q80699m95574j506865j593419o34903J648688L778394K347684k781928
8409B063394n702564j731916M639415N100551l92148l882553j856636L50204j296825
8400b709078k596622J171261O447460O095483l89081o595760p450589l690027
8392i716953Q55983L229378L049153K198552K339732K359416J54991k981345l152599
8383a663692K4883K036017J08212k653056k367182J8998J337614J180013Q88448
8374a089745L45338q43517j406555p81808q77028k404932k435320R02754M398724
8365d192089M450475K637694K086528J568591j240314l647916j816654J412486
$$ plain form
8427 -1698913 -144317 3774408 5459241 3892634 1268467 -629387 -1385671 -902326 420618
8418 420618 1301317 805743 -701122 -2294541 -2929444 -1280756 2497638 4845322 2063394
8409 2063394 -3639170 -5371086 -731671 4368880 3976732 94179 -1762457 -1412253 -2709078
8400 -2709078 -5305700 -4134439 2313021 8408504 8019423 1423663 -6026926 -9716953
8392 -9716953 -8860970 -5631592 -2582439 -383887 1955845 4315261 4470252 1488907 -1663692
8383 -1663692 -1638809 397208 505420 -2147636 -4514818 -4495820 -3158206 -1978193 -1089745
8374 -1089745 -744407 -1587924 -2994479 -3776287 -4653315 -7058247 -9493567 -8590813 -4192089
8365 -4192089 258386 2896080 4982608 6551199 5310885 1662969 -153685 1258801
8357A258801J99456l822085l193505K707441N588723J436626k865111q15405L430902
8348C925843K635835j566998k153760J455566L227858Q12357j622550j165888
8340E548263j37290r10890k316823l000488l605052l780642j619678J829802K192682
8331e800116j312219l250277N3016M404292M370358J854409J839855K883408k13593
8322D829133n665812n701431N31808M169475L86453l626418n78059M452026K308426
8313A105601m311578m014224N093205J1053546M944776o401682j0043298l734886
8305f308540L297326L709228k14913k400501j388632j68142k84259l1251J256134
8296b533550Q49728k652293m910521j005598N855853O997996Q60225l945848j491486
$$ plain form
8357 1258801 1458257 -2363828 -5557333 -2849892 2738831 4175457 1310346 494941 3925843
8348 3925843 6561678 4994680 2840920 4296486 7524344 8336701 6714151 5548263
8340 5548263 5410973 4500083 2183260 -817228 -4422280 -8202922 -9822600 -7992798 -5800116
8331 -5800116 -7112335 -10362612 -10309596 -5905304 -1534946 319463 2159318 5042726 4829133
8322 4829133 -836679 -6538110 -6006302 -1836827 -1450374 -5076792 -5654851 -1202825 1105601
8313 1105601 -3205977 -7220201 -2126996 8926550 13871326 7469644 -2573654 -6308540
8305 -6308540 -3011214 698014 483101 -1917400 -3306032 -3474174 -3758433 -3789684 -2533550
8296 -2533550 -1683822 -4336115 -9246636 -10252234 -4396381 2601615 3461840 -484008 -1975494
8287a975494K735238J642016j801816r62410J985662L55102l827190k508974L791536
8278e66330O094747K143828o77007N12125l58763m958049n658503J72663L492891
8269A97602j033834m846671l00586N444220L028821k410388q32052M281802K428038
8260E956952m262812m217346K944163N237254j434397o964299m055589J732005
8252e064069L259512J628842j0131k253438m177555j646708M134194N180868r24456
8243A27059n622748k046869M624239N703826J110900l349801m816049l319629
8235g589072J493973P311698P874056J153062n509412m543016J564610N011692
8227F767591L693655J183265p35622k763230l721809j876090Q27317J137689l02940
$$ plain form
8287 -1975494 759744 2401760 599944 -362466 1623196 1978298 -1848892 -4357866 -566330
8278 -566330 5528417 7672245 6995238 7507363 7148600 2190551 -3467952 -3295289 197602
8269 197602 -836232 -5682903 -5983489 -539269 2489552 79164 -752888 3528914 5956952
8260 5956952 1694140 -2523206 420957 5658211 4223814 -2740485 -6796074 -5064069
8252 -5064069 -1804557 -175715 -185846 -2439284 -6616839 -8263547 -4129353 1051515 127059
8243 127059 -5495689 -7542558 -2918319 2785507 3896407 546606 -4269443 -7589072
8235 -7589072 -6095099 1216599 9090655 10243717 4734305 191289 1755899 6767591
8227 6767591 10461246 11644511 10908889 8145659 4423850 2547760 3375077 4512766 4209826
8218D209826o50306J27977K26072j92165l20708j239907k895233j811193L198044
8209F52407O454074K538556m826434p490227m261496q76526l22554l30132L10860
8200h151472N3392p15023K45975K029882J733960M94403J894903M416642K793524
8191D796186k308664l784459O43672M291351J952943k564238l578830j936595
8183b488634j313997j442665m02247O13490J34426L35213K916666M543364J911015
8174D806631j792837j550104J011788N87056k104420j220893L557475N075639
8166H370335l31252o548511o182056n23233L311817J970312j703797l895344l491848
8157i023577j270670J382504K894996K648011J631482Q97633K99480j71577M78255
$$ plain form
8218 4209826 3559520 3687497 3913569 3721404 3400696 2160789 -734444 -2545637 652407
8209 652407 7106481 9645037 4818603 -2671624 -6933120 -7809646 -8132200 -8462332 -8151472
8200 -8151472 -8098080 -8813103 -8567128 -6537246 -4803286 -4308883 -2413980 2002662 4796186
8191 4796186 2487522 -1296937 -653265 3638086 5591029 3026791 -552039 -2488634
8183 -2488634 -3802631 -5245296 -5647543 -5034053 -4899627 -4564414 -1647748 2895616 4806631
8174 4806631 3013794 1463690 2475478 3062534 958114 -262779 3294696 8370335
8166 8370335 8039083 1490572 -4691484 -5214717 -1902900 67412 -1636385 -5531729 -9023577
8157 -9023577 -10294247 -8911743 -6016747 -3368736 -1737254 -839621 -540141 -711718 -233463
8148b33463K002675J763159j513219m465356l028141J327231L199808R42596j464943
8139a469653r72649M14478o7665j372762j110622M00173J466888J995107K314589
8130A597884J384037q65394j773032J45635J914945N00925j911330j528906M88751
8121d6485N47615k89135J516039L749674N47897o406419p616289q5314O449432
8112a632985L288883m239028n100261J133462N030094K005778k470631k688706
8104d673394k09918O30015o86834j640483q19757J007607K263857J960729Q57723
8095a310455R40785K433166K688897J88785k224697j263828J361994J394735j252602
8086B956780k655252j239159N22867P54169J35523r06377k564254l096512o99525
$$ plain form
8148 -233463 1769212 3532371 2019152 -2446204 -5474345 -4147114 -947306 -4710 -1469653
8139 -1469653 -2442302 -2027824 -2095489 -3468251 -4578873 -4178700 -2711812 -716705 1597884
8130 1597884 2981921 2116527 343495 489130 2404075 2905000 993670 -535236 -46485
8121 -46485 501130 211995 1728034 5477708 6025605 -380814 -7997103 -8082417 -1632985
8112 -1632985 1655898 -2583130 -7683391 -6549929 -1519835 485943 -1984688 -4673394
8104 -4673394 -4883312 -4253297 -4940131 -6580614 -7400371 -6392764 -4128907 -2168178 -1310455
8095 -1310455 -369670 2063496 4752393 4941178 2716481 1452653 2814647 4209382 2956780
8086 2956780 301528 -937631 -414764 339405 474928 -431449 -2995703 -6092215 -6791740
8077f791740J874056J38668l922624l006713L963830Q367624M117781k953118
8069A787764l844052N65888K558213L66066m77859K141232L236133j98651l402313
8060B732421j248690L325915L393980j747475n495081l101262K179471L869765
8052C909044O58363k717393k225471P14239K122629P14763j770428l832361n000123
8043g426738m265810j115230J904071J361532j509260j438974K947253O085927
8035c457229L554297p43044k88251L853516M561387l58760m919463l956490K8614
8026a725423J766209P57344K32774J248583J793685P26728p65603j452510j175170
8017A406617K89879K950187M751975K587170l351836q001868o402079L10189N918925
$$ plain form
8077 -6791740 -4917684 -4779016 -8701640 -11708353 -7744523 623101 4740882 1787764
8069 1787764 -2056288 -1490400 1067813 1433879 956020 3097252 6333385 6134734 2732421
8060 2732421 1483731 4809646 8203626 6456151 961070 -2140192 39279 3909044
8052 3909044 4567407 1850014 -375457 338782 2461411 3176174 1405746 -2426615 -7426738
8043 -7426738 -11692548 -12807778 -10903707 -9542175 -11051435 -12490409 -9543156 -3457229
8035 -3457229 97068 -645976 -934227 2919289 7480676 7121916 2202453 -1754037 -1725423
8026 -1725423 40786 798130 1030904 2279487 4073172 4799900 4034297 2581787 1406617
8017 1406617 1696496 4646683 9398658 11985828 8633992 632124 -5769955 -5459766 459159
8008D59159O266987L283512R98847j04742k155609m623239l962706M84714L850276
7999D497199J788836l104274m445009o00145L680542M226920K208346O51184k85224
7990H618375j951299l555655l191262j484990r92291j975668j772242Q02470L074010
7981b428552K268979k90334j185990p4101J03246j718731k491542K16417L731967
7972a868641L626893L15462j524209k13995N37757j734845l513478r24310L143854
7963b155512K880475j042710k149152J355889L395175K3861l517277q08084N197319
7954C179984O212839Q86306m041111m364288k956181k354640j60605M431839N985928
7945F820071P51994n237350l473415L791793N862910m40528n619069j830442N009891
$$ plain form
8008 459159 6726146 10009658 11008505 10903763 8748154 4124915 162209 646923 4497199
7999 4497199 6286035 3181761 -1263248 -1863393 1817149 6044069 8252415 8903599 8618375
7990 8618375 6667076 3111421 -79841 -1564831 -2557122 -4532790 -6305032 -5502562 -2428552
7981 -2428552 -159573 -449907 -1635897 -1709998 -1606752 -3325483 -5817025 -5600608 -1868641
7972 -1868641 1758252 2073714 549505 335510 873267 -861578 -4375056 -5299366 -2155512
7963 -2155512 724963 -317747 -2466899 -1111010 2284165 2308026 -1209251 -2017335 3179984
7954 3179984 9392823 10279129 6238018 1873730 -1082451 -3437091 -3597696 834143 6820071
7945 6820071 7572065 2334715 -1138700 2653093 8516003 8075475 2456406 625964 5635855
7936E635855M103077l885866p790583k339353M695743M189191k102631n639078
7928c133645l148301J070370K982662L230712L428886K917066J053284o21417
7920G779617p65694n60413j542358k807273k475462p13549P58399J301760J540794
7911B515821J558646Q72934j42827o45951q73152j464239j475933P13489M198050
7902E256838N512899K883955j233338l241542k743930k179153k846796l169211
7894a760278j272004J972596L566383J971313q21790j632151k14995L41863j962198
7885A88739m598673l252835K383566P412961O835785Q04122n575836o981041k475365
7876e258577L712213O045188L082888j287828k720532j410427o67028j751088
$$ plain form
7936 5635855 9738932 5853066 -1937517 -4276870 418873 4608064 2505433 -3133645
7928 -3133645 -6281946 -5211576 -2228914 1001798 4430684 7347750 8401034 7779617
7920 7779617 7013923 6453510 4911152 2103879 -371583 -1085132 -326733 975027 2515821
7911 2515821 4074467 4947401 4804574 4158623 3285471 1821232 345299 1058788 5256838
7902 5256838 10769737 13653692 12420354 9178812 6434882 4255729 1408933 -1760278
7894 -1760278 -3032282 -1059686 2506697 4478010 3656220 2024069 1809074 2150937 188739
7885 188739 -4409934 -7662769 -5279203 2133758 8969543 9773665 4197829 -2783212 -5258577
7876 -5258577 -1546364 4498824 7581712 6293884 3573352 2162925 1495897 -255191
$$ [...]
##END NTUPLES=NMR SPECTRUM
##END=
