##TITLE=31Pdec_SR82 Leu
 CDCl3, 124 sc
 1.09.2021
##JCAMPDX= 6.0         $$ Bruker NMR JCAMP-DX V2.0
##DATA TYPE= NMR SPECTRUM
##DATA CLASS= NTUPLES
##ORIGIN= UXNMR, Bruker Analytische Messtechnik GmbH
##OWNER= root
$$ XWIN-NMR		Version 3.5
$$ Wed Sep  1 14:16:36 2021 Russian Standard Time (UT+4h)  she@DPX200
##.OBSERVE FREQUENCY= 81.013821
##.OBSERVE NUCLEUS= ^31P
##.ACQUISITION MODE= SIMULTANEOUS
##.ACQUISITION SCHEME= undefined
##.AVERAGES= 124
##.DIGITISER RES= 16
##SPECTROMETER/DATA SYSTEM= spect
##.PULSE SEQUENCE= zgpg30
##.SOLVENT NAME= CD2Cl2
##.SHIFT REFERENCE= (INTERNAL, CD2Cl2, 0, 248.564)
##AUDIT TRAIL= $$ (NUMBER, WHEN, WHO, WHERE, WHAT)
$$ ##TITLE= Audit trail, XWIN-NMR		Version 3.5
$$ ##JCAMPDX= 5.01
$$ ##ORIGIN= Bruker BioSpin GmbH
$$ ##OWNER= she
$$ F:/spectra/data/she/nmr/P31/1/pdata/1/auditp.txt
$$ ##AUDIT TRAIL=  $$ (NUMBER, WHEN, WHO, WHERE, WHAT)
(   1,<2021-09-01 14:14:53.89 +0400>,<she>,<DPX200>,
      <continue with go, POWCHK disabled, PULCHK disabled
       configuration hash MD5:
       00 E9 B6 7A A2 85 ED C7 34 08 36 98 17 FE 4E 26
       data hash MD5: 32K
       C0 AE D9 72 3C 71 BA F3 3C 28 55 93 74 1E 24 CD>)
(   2,<2021-09-01 14:15:16.37 +0400>,<she>,<DPX200>,
      <Start of raw data processing
       efp BC_mod = 2 LB = 1 FT_mod = 6 PKNL = 1 PHC0 = -7723.255 PHC1 = 44.07028 SI = 64K 
       data hash MD5: 64K
       76 BC 8C 9E FC 7E 1E 17 88 A6 39 8C 63 F7 46 CE>)
(   3,<2021-09-01 14:15:38.62 +0400>,<she>,<DPX200>,
      <pk PHC0 = -15.63208 PHC1 = 40.2 
       data hash MD5: 64K
       3E 84 C1 85 40 33 66 B8 C5 BF 79 8B 08 C8 4C 7E>)
(   4,<2021-09-01 14:16:02.65 +0400>,<she>,<DPX200>,
      <pk PHC0 = -4.092954 PHC1 = 9.8 
       data hash MD5: 64K
       4C 24 6E B9 29 18 8B 00 1B 1E 76 FF A5 33 62 AF>)
(   5,<2021-09-01 14:16:06.60 +0400>,<she>,<DPX200>,
      <abs ABSG = 5 
       data hash MD5: 64K
       FE A7 1B 2D C2 25 51 0E 42 C1 41 35 A4 F1 48 AD>)
$$ ##END=
$$ 
$$ hash MD5
$$ 05 EC D7 CE AB 93 B7 75 2A 89 EC 5D 24 95 10 98
##$RELAX= 
##$RELAX= 
##$RELAX= 
##$RELAX= 
##$RELAX= 
##$RELAX= 
##$RELAX= 
##$RELAX= 
$$ Bruker specific parameters
$$ --------------------------
##$DU= <F:/spectra>
##$EXPNO= 1
##$NAME= <P31>
##$PROCNO= 1
##$TYPE= <nmr>
##$USER= <she>
##$AMP= (0..31)
100 100 100 100 100 100 100 100 100 100 100 100 100 100 100 100 100 100 
100 100 100 100 100 100 100 100 100 100 100 100 100 100 
##$AQSEQ= 0
##$AQ_mod= 1
##$AUNM= <au_zg>
##$AUTOPOS= <>
##$BF1= 81.014009
##$BF2= 200.13
##$BF3= 200.13
##$BF4= 200.13
##$BF5= 200.13
##$BF6= 200.13
##$BF7= 200.13
##$BF8= 200.13
##$BYTORDA= 1
##$CFDGTYP= 0
##$CFRGTYP= 5
##$CHEMSTR= <none>
##$CNST= (0..31)
1 1 145 1 1 1 1 1 1 1 1 1 1 1 1 1 1 1 1 1 1 1 1 1 1 1 1 1 1 1 1 1 
##$CPDPRG= <waltz16>
##$CPDPRG1= <>
##$CPDPRG2= <waltz16>
##$CPDPRG3= <>
##$CPDPRG4= <mlev>
##$CPDPRG5= <mlev>
##$CPDPRG6= <mlev>
##$CPDPRG7= <mlev>
##$CPDPRG8= <mlev>
##$CPDPRGB= <>
##$CPDPRGT= <>
##$D= (0..31)
$$ [...]
##$SUBNAM3= <"">
##$SUBNAM4= <"">
##$SUBNAM5= <"">
##$SUBNAM6= <"">
##$SUBNAM7= <"">
##$SUBNAM8= <"">
##$SUBNAM9= <"">
##$SW= 501.771253377433
##$SWIBOX= (0..15)
0 1 3 0 0 0 0 0 0 0 0 0 0 0 0 0 
##$SW_h= 40650.406504065
##$TD= 32768
##$TD0= 1
##$TE= 0
##$TE2= 300
##$TE3= 300
##$TEG= 300
##$TL= (0..7)
0 120 53 12 22 120 120 120 
##$TP= (0..7)
150 150 150 150 150 150 150 150 
##$TP07= 0
##$TPNAME0= <>
##$TPNAME1= <>
##$TPNAME2= <>
##$TPNAME3= <>
##$TPNAME4= <>
##$TPNAME5= <>
##$TPNAME6= <>
##$TPNAME7= <>
##$TPOAL= (0..7)
0.5 0.5 0.5 0.5 0.5 0.5 0.5 0.5 
##$TPOFFS= (0..7)
0 0 0 0 0 0 0 0 
##$TUNHIN= 0
##$TUNHOUT= 0
##$TUNXOUT= 0
##$USERA1= <user>
##$USERA2= <user>
##$USERA3= <user>
##$USERA4= <user>
##$USERA5= <user>
##$V9= 5
##$VALIST= <valist>
##$VCLIST= <CCCCCCCCCCCCCCC>
##$VD= 0
##$VDLIST= <DDDDDDDDDDDDDDD>
##$VPLIST= <PPPPPPPPPPPPPPP>
##$VTLIST= <TTTTTTTTTTTTTTT>
##$WBST= 1024
##$WBSW= 4
##$XGAIN= (0..3)
0 0 0 0 
##$XL= 0
##$YL= 0
##$YMAX_a= 9443
##$YMIN_a= -11901
##$ZGOPTNS= <>
##$ZL1= 120
##$ZL2= 120
##$ZL3= 120
##$ZL4= 120
##$ABSF1= 248.5645
##$ABSF2= -253.2056
##$ABSG= 5
##$ABSL= 3
##$ALPHA= 0
##$AQORDER= 0
##$ASSFAC= 0
##$ASSFACI= 0
##$ASSFACX= 0
##$ASSWID= 0
##$AUNMP= <proc_1d>
##$AZFE= 0.1
##$AZFW= 0.5
##$BCFW= 0
##$BC_mod= 2
##$BYTORDP= 0
##$COROFFS= 0
##$CY= -3
##$DATMOD= 1
##$DC= 0
##$DFILT= <>
##$DTYPP= 0
##$F1P= 0
##$F2P= 0
##$FCOR= 1
##$FTSIZE= 65536
##$FT_mod= 6
##$GAMMA= 0
##$GB= 0
##$INTBC= 1
##$INTSCL= 5.30512e-09
##$ISEN= 30
##$LB= 1
##$LEV0= 0
##$LPBIN= 0
##$MAXI= 10000
##$MC2= 0
##$MEAN= 0
##$ME_mod= 0
##$MI= 50
##$NCOEF= 0
##$NC_proc= -6
##$NLEV= 6
##$NOISF1= 182.463
##$NOISF2= 159.3651
##$NSP= 0
##$NTH_PI= 0
##$NZP= 0
##$OFFSET= 248.5645
##$PC= 4
##$PHC0= -7742.98
##$PHC1= 94.07028
##$PH_mod= 1
##$PKNL= yes
##$PPARMOD= 0
##$PSCAL= 0
##$PSIGN= 0
##$REVERSE= no
##$SF= 81.014009
##$SI= 65536
##$SIGF1= 159.3651
##$SIGF2= -187.1042
##$SINO= 113.3802
##$SIOLD= 16384
##$SREGLST= <1H.CDCl3>
##$SSB= 0
##$STSI= 65536
##$STSR= 0
##$SW_p= 40650.406504065
##$SYMM= 0
##$S_DEV= 0
##$TDeff= 32768
##$TDoff= 0
##$TI= <>
##$TILT= no
##$TM1= 0
##$TM2= 0
##$TOPLEV= 0
##$USERP1= <user>
##$USERP2= <user>
##$USERP3= <user>
##$USERP4= <user>
##$USERP5= <user>
##$WDW= 1
##$XDIM= 65536
##$YMAX_p= 398585484
##$YMIN_p= -11221059
$$ End of Bruker specific parameters
$$ ---------------------------------
##NTUPLES= NMR SPECTRUM
##VAR_NAME=  FREQUENCY,     SPECTRUM/REAL,   SPECTRUM/IMAG
##SYMBOL=    X,             R,               I
##VAR_TYPE=  INDEPENDENT,   DEPENDENT,       DEPENDENT
##VAR_FORM=  AFFN,          ASDF,            ASDF
##VAR_DIM=   65536,         65536,           65536
##UNITS=     HZ,            ARBITRARY UNITS, ARBITRARY UNITS
##FACTOR=    0.620285442955139, 1,           1
##FIRST=     20137.2065510759, 0,            0
##LAST=      -20513.1999529892, 0,           0
##MIN=       -20513.1999529892, -11221059,   0
##MAX=       20137.2065510759, 398585484,    0
$$ Real data points
##PAGE= N=1
##DATA TABLE= (X++(R..R)), XYDATA
$$ [...]
40813g75138q00418K129496K165849M07869R59885L101957K238397j498309k573667
$$ -775138 -1575556 553940 2719789 3127658 4087543 7189500 9427897 7929588 5355921
40804E355921O52068K782331L18898k534237j038160K400690K668762R2291j133835
$$ 5355921 6007989 8790320 9109218 6574981 5536821 7937511 10606273 10698564 9564729
40795I564729L3139J188776J571661K698173M670753N847307N827556N599322
$$ 9564729 9597868 10786644 12358305 15056478 19727231 25574538 31402094 37001416
40787C7001416N290548M569574M326203N082665M899394K016990j644741l200064
$$ 37001416 42291964 46861538 51187741 56270406 61169800 63186790 61542049 58341985
40779E8341985l809787o636318j0425376j0302461n710472k300065l691611o028243
$$ 58341985 54532198 47895880 37470504 27168043 21457571 19157506 15465895 9437652
40771I437652m177719L69238K230968L73149j354388j028238r03950k156375k109493
$$ 9437652 5259933 5629171 7860139 8233288 6878900 5850662 4946712 2790337 680844
40762F80844R57618L882241K855602o64120j989926p9222J456863K61412j539141
$$ 680844 1638462 5520703 8376305 7712185 5722259 5643037 7099900 7361312 5822171
40753E822171j201726N57296J240861K11613j279992k178244k019998n85696J304966
$$ 5822171 4620445 5177741 6418602 6630215 5350223 3171979 1151981 566285 1871251
40744A871251J961970J127769N11279P54322J63937j692789k002607P00341K802406
$$ 1871251 3833221 4960990 5472269 6226591 6390528 4697739 2695132 3395473 6197879
40735F197879P16188k558116j385810L171322M262602q0252l669862j761307K003708
$$ 6197879 6914067 4355951 2970141 6141463 10404065 10323813 6653951 4892644 6896352
40726F896352J952520j093379k354477r17265M115r77080j760004p30186J048950
$$ 6896352 8848872 7755493 5401016 4483751 4487866 3510786 1750782 1020596 2069546
40717B069546J796458R32145q47855j938111j010014R80151J402562j75885r30805
$$ 2069546 3866004 4798149 3950294 2012183 1002169 1982320 3384882 3208997 2278192
40708B278192N73479J446713p91484l113694r18535M358197O357194K519138k676650
$$ 2278192 2851671 4298384 3506900 393206 -525329 3832868 10190062 12709200 10032550
40699A0032550m084638j762493R31052J961097J494191M22283j61028N57766J893862
$$ 10032550 5947912 4185419 5116471 7077568 8571759 8994042 8833014 9390780 11284642
40690A1284642K131364R77634J58521Q49987J988754J970573P14102p43304j515430
$$ 11284642 13416006 14393640 14552161 15402148 17390902 19361475 20075577 19332273 17816843
40681A7816843j144934J02917P15829p91439l411041m101942j732151J010394
$$ 17816843 16671909 16774826 17490655 16699216 13288175 9186233 7454082 8464476
40673H464476J016122j238027k708213j915554k90438K64831m60397j372347j401066
$$ 8464476 9480598 8242571 5534358 3618804 3328366 3593197 3132800 1760453 359387
40664C59387j79652J680355K707574J762348m69647j800935r33324Q88855J371236
$$ 359387 179735 1860090 4567664 6330012 5860365 4059430 3126106 4014961 5386197
40655E386197J74122o27537M12284J703561O94212k105227l223234r80697J835257
$$ 5386197 5560319 4932782 5345066 7048627 7742839 5637612 2414378 1433681 3268938
40646C268938J628229j128581k869520k046356o85114o74120j077034l32952Q47244
$$ 3268938 4897167 3768586 899066 -1147290 -1832404 -2506524 -3583558 -3916510 -3069266
40637c069266O39365q56728j641351o92287P51067J110786N00043J27952L93984
$$ -3069266 -2429901 -3286629 -4927980 -5620267 -4869200 -3758414 -3258371 -3130419 -2736435
40628b736435N50030J50335j55229K41486P52042N09037l0744K91913J201400
$$ -2736435 -2186405 -2036070 -2191299 -1949813 -1197771 -688734 -719478 -427565 773835
40619G73835J110684j74458p23029M29480J308218K6240j733807r20672J972851
$$ 773835 1884519 1710061 987032 1416512 2724730 2750970 1017163 96491 2069342
40610B069342L229053J264652j278391j627471l76325M61474N26345M40550k7026
$$ 2069342 5298395 6563047 5284656 3657185 3280860 3742334 4268679 4709229 4682203
40601D682203j066688j511963m91928O81708L13780r03494j028542l7811M14147
$$ 4682203 3615515 2103552 1611624 2293332 2607112 1703618 675076 637265 1051412
40592A051412m2421j36485N11314Q22244M59339L98563Q85545R24089L07404L0888
$$ 1051412 1008991 872506 1383820 2206064 2665403 3063966 3949511 4873600 5181004 5211892
40582E211892J14641o14634j752687j065938J518734K529572o7143l012385k063272
$$ 5211892 5326533 4711899 2959212 1893274 3412008 5941580 5874437 2862052 798780
40573G98780J656427L286007J200205j528774k387957k174792j949371j081104
$$ 798780 2455207 5741214 6941419 5412645 3024688 849896 -1099475 -2180579
40565b180579L40035N55304o45286q02359J116007K411359Q87156j292432r07517
$$ -2180579 -1840544 -1285240 -1930526 -2732885 -1616878 794481 1681637 389205 -518312
40556e18312J378199K594708K135066J399371L51198j685026k886880r14659K320671
$$ -518312 859887 3454595 5589661 6989032 7340230 5655204 2768324 1853665 4174336
40547D174336K350696r96954k954092j150131R40753j3058k004036j626413K08794
$$ 4174336 6525032 5528078 2573986 1423855 2364608 2351550 347514 -1278899 -1070105
40538a070105L99642p83768m34864J725167K716562R68890j487253k045662n24440
$$ -1070105 -670463 -1454231 -1889095 -163928 2552634 3521524 2034271 -11391 -535831
40529e35831J368097J946542O63357j396285k146001p40765J154558J471742M33730
$$ -535831 832266 2778808 3442165 2045880 -100121 -840886 313672 1785414 2219144
40520B219144k79363k47570l35672n82274j75358O46353P18127L3943j93902L06106
$$ 2219144 1939781 1692211 1356539 774265 598907 1245260 1963387 1997330 1803428 2109534
40510B109534M71436j46885q07018j107794j323216j121122Q6570J375155J100161
$$ 2109534 2580970 2434085 1627067 519273 -803943 -1925065 -1838495 -463340 636821
40501F36821k27354l29543R69066J051476j098937k683980j261109J391454K117580
$$ 636821 409467 79924 1048990 2100466 1001529 -1682451 -2943560 -1552106 565474
40492E65474J013100K63468J333j207173k625727j850488Q57612K272225J023682
$$ 565474 1578574 1842042 1843375 636202 -1989525 -3840013 -2982401 -710176 313506
40483C13506m72461j44563P30375M96974K58573J375787K084942P7183k778322
$$ 313506 -158955 -303518 426857 923831 1182404 2558191 4643133 4720316 1941994
40474A941994k215028J834730M241862J653409k733557l703058r86505J320248
$$ 1941994 -273034 1561696 5803558 7456967 4723410 1020352 33847 1354095
40466A354095J008003l9308O0914K20461j056919k560824k054715J01106J249407
$$ 1354095 2362098 2322790 2383704 2604165 1547246 -1013578 -3068293 -2967187 -1717780
40457a717780J76972j259516o72086J886075M093006L901392J496186j002249
$$ -1717780 -1540808 -2800324 -3472410 -1586335 2506671 6408063 7904249 6902000
40449F902000j659005o87320l3840p66779j601178q80645O82396Q19957q19505
$$ 6902000 5242995 4555675 4521835 3755056 2153878 1273233 1955629 2775586 1956081
40440A956081j829012l63308K239316L295971K069808j21242k117248l521508
$$ 1956081 127069 -236239 2003077 5299048 7368856 7247614 5130366 1608858
40432A608858l627993j786495Q78576J901248M66625j303486j036421Q75458K046173
$$ 1608858 -2019135 -3805630 -2927054 -1025806 -559181 -1862667 -2899088 -2023630 22543
40423B2543J253373l54047r96566k03546J063717J530624P31290n64302j071169
$$ 22543 1275916 921869 -74697 -278243 785474 2316098 3047388 2483086 1411917
40414A411917m26928L76270L79945k5801J17729P14681Q05613J91555k67421o3055
$$ 1411917 984989 1361259 1741204 1715403 1833132 2547813 3353426 3544981 3277560 3214505
40404C214505L29055M50106M36010K72934m28733j418574j650794q24942m4305
$$ 3214505 3543560 3993666 4429676 4702610 4273877 2855303 1204509 379567 335262
40395C35262j02529j72358O44636J404118N48957j388953k083254o40620R93213
$$ 335262 232733 60375 705011 2109129 2658086 1269133 -814121 -1454741 -461528
40386d61528O19370j235620j977973k57705K334679L168370J606289n08314j285905
$$ -461528 157842 -1077778 -3055751 -3313456 -978777 2189593 3795882 3287568 2001663
40377B001663q12486k80393p1508J47297J13141n94211j072624q97J848688K152056
$$ 2001663 1189177 908784 837276 984573 1097714 503503 -569121 -570018 1278670 3430726
40367C430726N75915n94869k37820j02869j257486j735181q1857J518975P77790
$$ 3430726 4006641 3411772 3173952 3071083 1813597 78416 -3441 1515534 2293324
40358B293324n30649K55779J510846K5727k610591j898397J677432K674836m41822
$$ 2293324 1762675 2018454 3529300 3555027 944436 -953961 723471 3398307 2956485
40349B956485k579259m53331K081460P95548j915320j594129O90417Q89473n78785
$$ 2956485 377226 -76105 2005355 2800903 885583 -708546 -18129 871344 292559
40340B92559P4963K683566K843128p31029l780046k796559L78155J987108J133619
$$ 292559 367522 3051088 5894216 5163187 1383141 -1413418 -1035263 951845 2085464
40331B085464p01658k280097k802118j463575J281280L284738L014781J365386
$$ 2085464 1383806 -896291 -3698409 -5161984 -3880704 -595966 2418815 3784201
40323C784201J72547N18L55619R45681J484060J062326q85611l207957l756007
$$ 3784201 3956748 3957266 4312885 5258566 6742626 7804952 6919341 3711384 -44623
40314d4623j760359J062689K131527O29672j711910k554153j385013L80394J408019
$$ -44623 -1804982 -742293 1389234 2018906 306996 -2247157 -3632170 -3251776 -1843757
40305a843757J651072J538657J126279N48517K99487L96725J27269p42106j344698
$$ -1843757 -192685 1345972 2472251 3020768 3320255 3716980 3844249 3102143 1757445
40296A757445q78944M41616J952350K961317K439768o0318k790483l171355j470238
$$ 1757445 878501 1320117 3272467 6233784 8673552 8613234 5822751 2651396 1181158
40287A181158o82575j707361j652466J143832L609278K446472o29327j827379
$$ 1181158 498583 -1208778 -2861244 -1717412 1891866 4338338 3709011 1881632
40279A881632j124119r36279q81638J113663L508031K463524j358281k758044
$$ 1881632 757513 -178766 -1060404 53259 3561290 6024814 4666533 1908489
40271A908489L7499K463698P98514k227436j958720J420165L824203K813997l86305
$$ 1908489 1945988 4409686 5208200 2980764 1022044 2442209 6266412 9080409 8694104
40262H694104k886956k418971P89670L338241J902542k072248l701916j580411
$$ 8694104 5807148 3388177 4177847 7516088 9418630 7346382 3644466 2064055
40254B064055K52274j047613k608706r60200K045347K494515Q47505N37492J833072
$$ 2064055 2316329 1268716 -1339990 -2300190 -254843 2239672 3087177 3624669 5457741
40245E457741J752096n34279k442389k190602p51917O07478J655067J895429Q45682
$$ 5457741 7209837 6675558 4233169 2042567 1290650 1898128 3553195 5448624 6294306
40236F294306k33000L42715J552089P73147j833784l180787j965515k66963M39901
$$ 6294306 6061306 6404021 7956110 8729257 6895473 3714686 1749171 1482208 1922109
40227A922109J437661L356596L907108J477294j583419k157523r85801j034709
$$ 1922109 3359770 6716366 10623474 12100768 10517349 8359826 7374025 6339316
40219F339316k456013k481608o4912K480008K976911J921234O53511o70349j973068
$$ 6339316 3883303 1401695 1336783 3816791 6793702 8714936 9368447 8698098 6725030
40210F725030k119935o85183N85577Q0117r44060j53957J983453K693261J195926
$$ 6725030 4605095 3919912 4505489 4585606 3641546 3487589 5471042 8164303 9360229
40201I360229k76692l79447o36750k084669k771527r92477J303906J361393J42846
$$ 9360229 9083537 8704090 8067340 5982671 3211144 2218667 3522573 4883966 5026812
40192E026812N43371K202515J992151o10637k594776k279489j328834j069923
$$ 5026812 5570183 7772698 9764849 9154212 6559436 4279947 2951113 1881190
40184A881190n39171N43326N81828m32507r009K158700K454752q23587l629938
$$ 1881190 1342019 1885345 2467173 2034666 2025657 4184357 6639109 5815522 2185584
40175B185584j968202J657087K096580n42453j799104j40265J752774K269714
$$ 2185584 217382 1874469 3971049 3428596 1629492 1489227 3242001 5511715
40167E511715K406669K062950k17793l143674l083769R8353K020672L78133j568831
$$ 5511715 7918384 9981334 9763541 6619867 3536098 3634451 5655123 6033256 4464425
40158D464425m59321J960028K144508L28971o51221j82270r0297j000339j505030
$$ 4464425 4005104 5965132 8109640 8438611 7787390 7605120 7514823 6514484 5009454
40149E009454q15698K9737j42148j127852j711843r03164R79408K266747J702049
$$ 5009454 4193756 4223493 4081345 2953493 1241650 338486 1317894 3584641 5286690
40140E286690K09481l60590j06638o73189j825642j220335J379968K715995Q94539
$$ 5286690 5496171 5135581 5028943 4355754 2530112 1309777 2689745 5405740 6300279
40131F300279j187695k25579J975834J153058k482615m154468j480608K314480
$$ 6300279 5112584 4887005 6862839 8015897 5533282 1378814 -101794 2212686
40123B212686L304264J819860O27304M83382j0336j224336j686734o39986M40230
$$ 2212686 5516950 7336810 7964114 8447496 8437160 7212824 5526090 4886104 5326334
40114E326334r2499j431573j229070Q46789K073400L01918k622979l062402o66685
$$ 5326334 5233835 3802262 2573192 3419981 5493381 5795299 3172320 109918 -556767
40105e56767J233326N58216r39220j076394m70265m87951m22033P53294J743153
$$ -556767 676559 1234775 295555 -780839 -1251104 -1739055 -2161088 -1407794 335359
40096C35359R31130m53525k11326R57800P28722n77492n47345R34083J545389
$$ 335359 1266489 812964 601638 1559438 2288160 1710668 1163323 2097406 3642795
40087C642795P58393M29395Q84785L89628q21692k32994K044667K524120L40547
$$ 3642795 4401188 4830583 5715368 6104996 5283304 5050310 7094977 9619097 9959644
40078I959644p07279J172408J945909j335449m355630j868528L137938L292972
$$ 9959644 9252365 10424773 12370682 11035233 6679603 4811075 7949013 11241985
40070A1241985j781584m943130k448857J298784J497330n07518j135897k27420
$$ 11241985 9460401 4517271 2068414 3367198 4864528 4357010 3221113 2993693
40062B993693M87650R01914J270235L65992k038327l387644j971814N9543K42504
$$ 2993693 3481343 4383257 5653492 6019484 3981157 593513 -1378301 -1318758 -1076254
40053a076254j52573R52138J869713j66993l300344k926082R89019L273139J124281
$$ -1076254 -1228827 -276689 1593024 1426031 -1874313 -4800395 -3811376 -538237 586044
40044E86044k018121k021478J69984R97636q8943o62790L03622J168610O72854
$$ 586044 -1432077 -3453555 -3283571 -2285935 -2374878 -3037668 -2734046 -1565436 -892582
40035h92582j65573M5279Q30624O48141p09174j623286p10361J390119K843642
$$ -892582 -1058155 -1012876 -182252 465889 -243285 -1866571 -2576932 -1186813 1656829
40026A656829K777614J781363N40070p65571j557192r29808O12389J026703m24596
$$ 1656829 4434443 6215806 6755876 5990305 4433113 3503305 4115694 5142397 4717801
40017D717801j639802o74592J031405P15153j244691j694087M16879K260380J158325
$$ 4717801 3077999 2403407 3434812 4149965 2905274 1211187 1628066 3888446 5046771
40008E046771j771525l335942k184950L13905K180967K573135J823976O53507
$$ 5046771 3275246 -60696 -2245646 -1931741 249226 2822361 4646337 5299844
40000E299844m81373j317142j283753K4052J452639Q19676j819070k981183j68191
$$ 5299844 4818471 3501329 2217576 2241628 3694267 4513943 2694873 -286310 -454501
39991d54501L706114L485422r65745m254990k836349O47843J832020K24344j693919
$$ -454501 3251613 6737035 5771290 1516300 -1320049 -672206 1159814 1384158 -309761
39982c09761k262356j218053J265564L722713L565171N37233j894492j150852
$$ -309761 -2572117 -3790170 -2524606 1198107 4763278 5300511 3406019 2255167
39974B255167M73656m65513k718539k212070J152568K943325Q08038k286533k651818
$$ 2255167 2728823 2263310 -455229 -2667299 -1514731 1428594 2236632 -49901 -2701719
39965b701719n23214J493549K077899J519668L35058o64806l33039J215156K072442
$$ -2701719 -3224933 -1731384 346515 1866183 2201241 1536435 1203396 2418552 4490994
39956D490994R50099r08876j517566q77345n03182r28332j190719n62239M94428
$$ 4490994 5441093 4532217 3014651 2137306 1634124 705792 -484927 -1047166 -552738
39947e52738J177840J269810J063630R14331Q96491O04021m70122j980857k569703
$$ -552738 625102 1894912 2958542 3872873 4769364 5373385 4903263 2922406 352703
39938C52703j344747O79738J457460L81297q81858n40266Q84248J174899n14602
$$ 352703 -992044 -312306 1145154 1526451 644593 104327 988575 2163474 1648872
39929A648872k235612j626904Q96778K511641J538863n82477j415751n85528K97583
$$ 1648872 -586740 -2213644 -1316866 1194775 2733638 2151161 735410 149882 447465
39920D47465J91273j54859L61867J506325K022466J276179K1436o08316n40080
$$ 447465 638738 483879 845746 2352071 4374537 5650716 5672152 5063836 4523756
39911D523756o69939j271772j299110K2235J603079J765337P94165N86082J568683
$$ 4523756 3853817 2582045 1282935 1305170 2908249 4673586 5467751 6053833 7622516
39902G622516J810403M6138k090478k263194o61029N64036L25401n25250r55541
$$ 7622516 9432919 9479057 7388579 5125385 4464356 5028392 5353793 4828543 3873002
39893C873002r12081p97354r13396j401150j960626j908512j175411o24065n64134
$$ 3873002 2960921 2163567 1250171 -150979 -2111605 -4020117 -5195528 -5819593 -6383727
39884f383727J08978K005567L419607K305829l86842j537287j72486J203171M02988
$$ -6383727 -6274749 -4269182 -849575 1456254 1069412 -467875 -640361 562810 965798
39875I65798j263550j135166P37721J677030L52254j205792m74202J837722K563183
$$ 965798 -297752 -1432918 -695197 981833 1334087 128295 -345907 1491815 4054998
39866D054998N11938j664451j131121R94864J182690j340006l327012j921282
$$ 4054998 4566936 2902485 1771364 2766228 3948918 2608912 -718100 -2639382
39858b639382J710470M111944L340380J61402l023986l597679p45446K949155
$$ -2639382 -928912 3183032 6523412 6684814 3660828 63149 -682297 2266858
39850B266858L636755Q81304j782719j945257j279077j728590j854365J34410
$$ 2266858 5903613 6784917 5002198 3056941 1777864 49274 -1805091 -1670681
39842a670681K379957K095901L32771M7281Q83434J81529j744899j929762r5448
$$ -1670681 709276 2805177 3137948 3185229 4068663 4250192 2505293 575531 480083
39833D80083R14585L13804M12859J753823J844199J15139m10829J519598K586455
$$ 480083 1394668 1708472 2121331 3875154 5719353 5834492 5423663 6943261 9529716
39824I529716J82549l106079l427736j189267N15311O70398L98714P7113o06498
$$ 9529716 9712265 6606186 3178450 1989183 2504494 3174892 3573606 3650719 3044221
39815C044221j007090m87674P1093k14794n12478P1179O89861N12940M70514J161071
$$ 3044221 2037131 1549457 1620550 1405756 893278 964457 1654318 2167258 2637772 3798843
39805C798843J036087q07774k014638k06273K740342K998197L38842j965894k136817
$$ 3798843 4834930 4027156 2012518 1806245 4546587 7544784 7883626 5917732 3780915
39796C780915j420541q42565K29005J796989K330820J023346j015373k384593
$$ 3780915 2360374 1517809 1746814 3543803 5874623 6897969 5882596 3498003
39788C498003k642213j801241j99992J071148J116285N23065L84813N17435J20841
$$ 3498003 855790 -945451 -1145443 -74295 1041990 1565055 1949868 2467303 2588144
39779B588144n21430p13162q32507j240409q39917R15624J846178o1151k595176
$$ 2588144 2066714 1353552 521045 -719364 -1559281 -643657 1202521 1141370 -1453806
39770a453806j857592J595177L257419J519667l95395l09689k83380j873021k589669
$$ -1453806 -3311398 -1716221 1541198 3060865 2665470 2355781 2072401 199380 -2390289
39761b390289l29656K196245J425184j156372j344068J031115K060037Q3546k070972
$$ -2390289 -2719945 -523700 901484 -254888 -1598956 -567841 1492196 1575742 -495230
39752d95230j829379l17443L47581M52373J373581K608233K340385M13139j099250
$$ -495230 -2324609 -2642052 -2294471 -1842098 -468517 2139716 4480101 4893240 3793990
39743C793990n63335J132633J837823Q91266l29412o23178n84649j196719j791140
$$ 3793990 3230655 4363288 6201111 7092377 6762965 6139787 5555138 4358419 2567279
39734B567279j002156O57637J174131K04556k73431P38508J556033Q21497r423
$$ 2567279 1565123 2222760 3396891 3601447 3328016 4066524 5622557 6444054 6434631
39725F434631O21093J115925p78150l415308k894863P63235K882269P53455k409978
$$ 6434631 7055724 8171649 7393499 3978191 1083328 1846563 4728832 5482287 3072309
39716C072309k364254L2045P27358j023727j753715N59980L253354K834905j46343
$$ 3072309 708055 740100 1467458 443731 -1309984 -750004 2503350 5338255 5191912
39707E191912k146147j436174K63360P95903K53721k5164L10650O22756P34338
$$ 5191912 3045765 1609591 1872951 2668854 2922575 2897411 3208061 3830817 4565155
39698D565155J017597J282424R12075J80116P9008M92026L3966j487973k041143
$$ 4565155 5582752 6865176 7777251 7957367 8036375 8528401 8562367 7074394 5033251
39689E033251k90759J773978J329811q81908j337394R20454K577467R34806k001297
$$ 5033251 4742492 6516470 7846281 6964373 5626979 6547433 9124900 10059706 8058409
39680H058409k479132l60777J121776K22834j410690j824287j304470r65411o70769
$$ 8058409 5579277 5218500 6340276 6563110 5152420 3328133 2023663 1058252 387483
39671C87483K84292J526894K001819J546248J012383R34326Q01701k16285k081805
$$ 387483 671775 2198669 4200488 5746736 6759119 7693445 8495146 8278861 6197056
39662F197056l503287k961079m92915J812803J872768R8847j102110m43832P45756
$$ 6197056 2693769 -267310 -760225 1052578 2925346 3024193 1922083 1478251 2224007
39653B224007O43587n49162j134098k60342J278935K281588K293014J586611O13605
$$ 2224007 2867594 2318432 1184334 923992 2202927 4484515 6777529 8364140 8977745
39644H977745m09947j508922k430899k348962q22501R65340J076288o38200k037619
$$ 8977745 8567798 7058876 4627977 2279015 1456514 2421854 3498142 2859942 822323
39635H22323j479389Q1241Q18690O62562O87995Q37490J92354q82916r01856K98261
$$ 822323 -657066 -575825 242865 905427 1593422 2430912 2623266 1740350 838494 1136755
39625A136755J126249P25655K07063N92757R69892j33509k377424l748855k813474
$$ 1136755 2263004 2988659 3195722 3788479 4758371 4624862 2247438 -1501417 -4314891
39616d314891k24548J836440J615089l47319j436633J9652K135922J471851k014710
$$ -4314891 -4539439 -2702999 -1087910 -1435229 -2871862 -2852210 -716288 755563 -1259147
39607a259147m129248j918388J979369K839350M03358j243937j01812J092237
$$ -1259147 -5388395 -7306783 -5327414 -2488064 -2084706 -3328643 -3430455 -2338218
39599b338218j40297j797585q73528J399015J421007q31642j729332J16471J856250
$$ -2338218 -2478515 -4276100 -5149628 -3750613 -2329606 -3161248 -4890580 -4774109 -2917859
39590b917859J393306O11046J531816K551123J428873n34768o97882M31601M54322
$$ -2917859 -1524553 -913507 618309 3169432 4598305 4063537 3365655 3797256 4251578
39581D251578n84178p87581k19994k86715l14502R94107J600972j273808m947170
$$ 4251578 3667400 2879819 2659825 2373110 2058608 3052715 4653687 3379879 -1567291
39572a567291l669912J959188M468319O15211l494556k022016J987852K582351
$$ -1567291 -5237203 -3278015 1190304 1805515 -1689041 -3711057 -1723205 859146
39564H59146K53395o63562J05404j31009r49491j57290R75878p4763j601653n09637
$$ 859146 1112541 448979 554383 423374 -526117 -683407 292471 217708 -1383945 -1893582
39554a893582J267624k05239l068884k179776J556826K184771j035032k467575
$$ -1893582 -625958 -831197 -3900081 -6079857 -4523031 -2338260 -3373292 -5840867
39546e840867j10571J487812K09242J732K536372L265000j7539k126789Q25474
$$ -5840867 -5951438 -4463626 -4254384 -4252652 -1716280 1548720 1531181 -595608 229866
39537B29866M283669K654270j737488l319764k195023j941509k302590n91986
$$ 229866 4513535 7167805 5430317 2110553 -84470 -2025979 -4328569 -4920555
39529d920555K349068L578199L198793K824965J445029j872406l855018j407662
$$ -4920555 -2571487 1006712 4205505 7030470 8475499 6603093 2748075 1340413
39521A340413K272938K037837q44755j105827J385793J867706o36479j937361
$$ 1340413 3613351 5651188 4806433 3700606 5086399 6954105 6317626 4380265
39513D380265l23409J050104M53716J21351R72888M97673k088632l661500k393898
$$ 4380265 4056856 5106960 5560676 5682027 6654915 7152588 5063956 1402456 -991442
39504i91442o50879m83794m49829P51195J440514L63976n80503K34092J044809
$$ -991442 -1642321 -2126115 -2575944 -1824749 -384235 -20259 -600762 -366670 678139
39495F78139j56711j858282j307311J187936K835527K157078K32988j108204j034855
$$ 678139 521428 -1336854 -2644165 -1456229 1379298 3536376 3769364 2661160 1626305
39486A626305k17296r1375q95532q62386J082922K665628J042332k178319k312146
$$ 1626305 1409009 1317634 422102 -440284 642638 3308266 4350598 2172279 -139867
39477a39867J401884L968320J504164l294167m936887k083253J749945K945487
$$ -139867 1262017 5230337 6734501 3440334 -1496553 -3579806 -1829861 1115626
39469A115626J145148j295916j757691J88182K204822J923126J00514o30877Q7091
$$ 1115626 2260774 964858 -792833 -604651 1600171 3523297 3623811 2992934 3080025
39460C080025M3801j365153j745722K78575K512766K500709J047609L61792N96744
$$ 3080025 3123826 1758673 12951 291526 2804292 5305001 6352610 6714402 7311146
39451G311146M81638j6001Q1894O72378O28583m14104j670322k265433j775597
$$ 7311146 7792784 7776783 7858677 8531055 9159638 8745534 7075212 4809779 3034182
39442C034182k40428J546691K272009J337213m47557j709006j694861p00000J34483
$$ 3034182 2793754 4340445 6612454 7949667 7502110 5793104 4098243 3398243 3532726
39433C532726k15032j203836r44736J113274K804433K110162K39331k81390M99473
$$ 3532726 3317694 2113858 1169122 2282396 5086829 7196991 7436322 7154932 7654405
39424G654405O44922K0094Q1200M22420q48442l073529l062973o990K954733L143660
$$ 7654405 8299327 8319421 8400621 8823041 7974599 4901070 1838097 1831107 4785840 7929500
39414G929500J298470p98583k453923k781891p33029K129399K262119o87547k659069
$$ 7929500 9227970 8429387 5975464 3193573 2460544 4589943 6852062 6164515 3505446
39405C505446j126646J126802P18643j077826r92073Q67728J766623P80647o92421
$$ 3505446 2378800 3505602 4224245 3146419 2154346 3022074 4788697 5569344 4876923
39396D876923j646700j924000j032433R36219K161024J251532k96578q0592J497073
$$ 4876923 3230223 1306223 273790 1210009 3371033 4622565 4325987 4245395 5742468
39387E742468J749178l91144k901164l140992o25628K556713L537576J439250
$$ 5742468 7491646 7100502 4199338 1058346 432718 2989431 6527007 7966257
39379G966257j417151k069631o05492L56750k63267r25953p72838j021769k039283
$$ 7966257 6549106 4479475 3873983 4230733 3967466 3041513 2268675 1246906 -792377
39370g92377k037101k64359J274954J067197M24095P39391J056270L73480k17564
$$ -792377 -2829478 -3093837 -1818883 -751686 -327591 411800 1468070 1841550 1623986
39361A623986J89440M39030k00008l30284O72813R69070k23261o14241R78749
$$ 1623986 1813426 2252456 2052448 1722164 2394977 3364047 3140786 2526545 3505294
39352C505294J928625N07694m04060J605902L334114R91582k695407k412513Q54497
$$ 3505294 5433919 5941613 5537553 7143455 10477569 11469151 8773744 6361231 7215728
39343G215728J458096j346145k352673O09732L204205J863648j127772k330824
$$ 7215728 8673824 7327679 4975006 5584738 8788943 10652591 9524819 7193995
39335G193995k127689k034527j079119J605345L475249J614529k450833m242936
$$ 7193995 5066306 3031779 1952660 3558005 7033254 8647783 6196950 1954014
39327A954014k114347R72560J546656k76286j468848j04750K218625K517774N62227
$$ 1954014 -160333 812227 2358883 2082597 613749 508999 2727624 5245398 5807625
39318E807625o88295N67813K075336P91347k391661l746811j925839N64325J174437
$$ 5807625 5119330 5687143 7762479 8553826 6162165 2415354 489515 1053840 2228277
39309B228277K24759n67954n56753k39235k2170K67850J000639K041678K415727
$$ 2228277 2453036 1885082 1328329 1089094 1066924 1334774 2335413 4377091 6792818
39300F792818J261933p41828j952453j939013j575975p93447J424278M081210
$$ 6792818 8054751 7312923 5360470 3421457 1845482 1052035 2476313 6557523
39292F557523M145188J091911j461436q78611O35193K8508j639351j693239p41960
$$ 6557523 10702711 11794622 10333186 9454575 10089768 10118276 8478925 6785686 6043726
39283F043726j043219j907382r91906J157221J992541J329054Q50305L56545j357335
$$ 6043726 5000507 3093125 2101219 3258440 5250981 6580035 7430340 7786885 6429550
39274F429550k897528j943469K32954M32058q86292m52542J658648J817339p91620
$$ 6429550 3532022 1588553 1821507 2253565 1367273 914731 2573379 4390718 3599098
39265C599098k526774j068619J521022K674888K364183J301424k16672r46949
$$ 3599098 1072324 3705 1524727 4199615 6563798 7865222 7648550 6701601
39257F701601K09543J415962O3321k272406j589182J668023K728423K45384j670755
$$ 6701601 6911144 8327106 8390427 6118021 4528839 6196862 8925285 9170669 7499914
39248G499914o59737L19412j119127k754324k453515j864153k244945j382626
$$ 7499914 6840177 7159589 6040462 3286138 832623 -1031530 -3276475 -4659101
39240d659101J751739L659575J588232j591437j722630O52559K316088K292479
$$ -4659101 -2907362 752213 2340445 749008 -973622 -321063 1995025 4287504
39232D287504J219883j090986l858035m069859o83661K703596K825959J393752
$$ 4287504 5507387 4416401 558366 -3511493 -4195154 -1491558 1334401 2728153
39224B728153J261902J347680m23669k258087j319057J117609J995608J610330
$$ 2728153 3990055 5337735 4914066 2655979 1336922 2454531 4450139 6060469
39216F060469J747923J182972j743365m217821k398953J675104K504875l87556
$$ 6060469 7808392 8991364 7247999 3030178 631225 2306329 4811204 4423648
39208D423648k277682j168111J02524m6425K64735J435227R56703j360465j999931
$$ 4423648 2145966 977855 1080379 1033954 1298689 2733916 3690619 2330154 330223
39199C30223K49091J749501O9566j900928r63186J221829J520655O14233R91896
$$ 330223 579314 2328815 2398381 497453 -465733 756096 2276751 2890984 3882880
39190C882880K055384J272146j153398k486515j729325n00494R3392O08584J193255
$$ 3882880 5938264 7210410 6057012 3570497 1841172 1340678 1434070 2042654 3235909
39181C235909R56353n4727l83300N30960J288331P13619l14496l86808J88146
$$ 3235909 4192262 4137535 3754235 4285195 5573526 6287145 5972649 5585841 5773987
39172E773987J40859l80371M8372J521355K116441O53649j301066j525559k00130
$$ 5773987 5914846 5534475 5582847 7104202 9220643 9874292 8573226 7047667 6847537
39163F847537P16996M13272l24240j049593j890200k047537n27950J411618J209364
$$ 6847537 7564533 7977805 7653565 6603972 4713772 2666235 2138285 3549903 4759267
39154D759267r50846j848602j32105J447738N36880r82513k98307J569346J554475
$$ 4759267 3808421 1959819 1827714 3275452 3812332 2829819 2531512 4100858 5655333
39145E655333m50135j711434r99877K31335O81651N50276J61633m60934p01951
$$ 5655333 5205198 3493764 2493887 2725222 3406873 3957149 4118782 3657848 2955897
39136B955897N8629J174668J620016J486175J081528j74174j982913k003412P40080
$$ 2955897 3014526 4189194 5809210 7295385 8376913 8202739 6219826 4216414 4956494
39127D956494K909127R50801k991528l558197j81722K107458M95078j813354j356213
$$ 4956494 7865621 8816422 5824894 2266697 2084975 4192433 4687511 2874157 1517944
39118A517944M35884O40895j39630M30470K003178K321719J005832l87924j133856
$$ 1517944 1953828 2594723 2455093 2885563 4888741 7210460 8216292 7828368 6694512
39109F694512j570582j296983L80918K485797K976542J355814q53610k092604
$$ 6694512 5123930 3826947 4207865 6693662 9670204 11026018 10172408 8079804
39101H079804j944461p22055P35888J170179J62829r27898n27103R48466J711981
$$ 8079804 6135343 5413288 6149176 7319355 7482184 6554286 6027183 6975649 8687630
39092H687630J144265L00531M400r5706m40280q96926j441836k218900k601397
$$ 8687630 9831895 10132426 10136826 10041120 9600840 8703914 7262078 5043178 2441781
39083B441781j535819O49998K103128J852765J064236R01969N23631j189195k956910
$$ 2441781 905962 1555960 3659088 5511853 6576089 7478058 8001689 6812494 3855584
39074C855584k366527M27677K507307K099230O05119j10369m28557j510694k768401
$$ 3855584 1489057 1916734 4424041 6523271 7128390 7018021 6589464 5078770 2310369
39065B310369k712195j319623K59583J547809K490955K243687L62874j439770
$$ 2310369 -401826 -1721449 -1461866 85943 2576898 4820585 5183459 3743689
39057C743689j186029J15666j51110j678655j337985J520199L340133J656859
$$ 3743689 2557660 2673326 2522216 843561 -494424 1025775 4365908 6022767
39049F022767r68459q58443J289516J865803j25773k107771j971669l76138J022345
$$ 6022767 5054308 4195865 5485381 7351184 7225411 5117640 3145971 2769833 3792178
39040C792178J439683P67079p62144k210810k361782r16693J185990K494318J880467
$$ 3792178 5231861 5998940 5236796 3025986 664204 -252489 933501 3427819 5308286
39031E308286m58913k367280j450455J594607K911167K86418l421746l766921
$$ 5308286 4849373 2482093 1031638 2626245 5537412 5823830 2402084 -1364837
39023a364837n64180K243216K080898L91577n00481n55365q29858j045517j98663
$$ -1364837 -1929017 314199 2395097 2786674 2286193 1730828 900970 -144547 -343210
39014c43210J174020J180576o60830k183769j234141J045854J346268j050558
$$ -343210 830810 2011386 1350556 -833213 -2067354 -1021500 324768 -725790
39006g25790k745379r94310K006396K328449L10291l78744R91218J377111j54375
$$ -725790 -3471169 -4465479 -2459083 -130634 179657 -199087 792131 2169242 2014867
38997B014867o19210J112123J598739j254092l977923k927307j3212J153629J300150
$$ 2014867 1395657 2507780 4106519 2852427 -1125496 -4052803 -4066015 -2912386 -1612236
38988a612236K756945L742463J125968l079837l946748j326437M31021j14161
$$ -1612236 1144709 4887172 6013140 2933303 -1013445 -2339882 -1908861 -2023022
38980b023022j90436J088572J282210Q3652M69131K844011L368286K53708k986275
$$ -2023022 -2213458 -1124886 157324 240976 710107 3554118 6922404 7176112 4189837
38971D189837k967416r64601L72422R87380J606730J417937P4172r10731q15495
$$ 4189837 1222421 257820 630242 1617622 3224352 4642289 4716461 3805730 2990235
38962B990235q49408j082494K76980K848980L291510P16147j251582m53771J25973
$$ 2990235 2140827 1058333 1335313 4184293 7475803 8191950 6940368 6486597 6612570
38953F612570j984585l819258k025180J055624J407754K17372J115283L006780
$$ 6612570 4627985 808727 -1216453 -160829 1246925 1464297 2579580 5586360
38945E586360J791123k076247l892466k281949o31131n72682K72209K787592L898085
$$ 5586360 7377483 5301236 1408770 -873179 -1504310 -2076992 -1804783 982809 4880894
38936D880894J766119r43183j446108p72860p75561n83255R97122K274151J094588
$$ 4880894 6647013 5703830 4257722 3484862 2709301 2126046 3123168 5397319 6491907
38927F491907j395924k427339j700927j053658j081820p82260J04381Q60145J439440
$$ 6491907 5095983 2668644 967717 -85941 -1167761 -1950021 -1845640 -985495 453945
38918D53945K089141J831345k11000k301614j698960J021565K176028L24616j507094
$$ 453945 2543086 4374431 4163431 1861817 162857 1184422 3360450 3685066 2177972
38909B177972n10708J723625K048032N59719m16933n95011j478682k575476j676228
$$ 2177972 1667264 3390889 5438921 5998640 5581707 4986696 3508014 932538 -743690
38900g43690P93333J490081n56430j884765J24113K982233K888543M05304r57714
$$ -743690 49643 1539724 983294 -901471 -777358 2204875 5093418 5498722 4541008
38891D541008k75680K46102l71184n07710P18578J722445J036625n65239j637864
$$ 4541008 4265328 4511430 4140246 3632536 4351114 6073559 7110184 6544945 4907081
38882D907081k126566k647877k725848j067814K325644M981250L832352r48403
$$ 4907081 2780515 132638 -2593210 -3661024 -1335380 3645870 7478222 6529819
38874F529819m827020l589039J072063L408908J464981o16281L43370J566261
$$ 6529819 1702799 -1886240 -814177 2594731 4059712 3443431 3786801 5353062
38866E353062k78089k782331j863853R46836J135038q94091r26427J131291J276800
$$ 5353062 5074973 2292642 428789 1375625 2510663 1616572 690145 1821436 3098236
38857C098236p11480n80777K197014K793997k77108k018073K62926J976492n06987
$$ 3098236 2386756 1805979 4002993 6796990 6519882 4501809 4764735 6741227 6234240
38848F234240l136719j355492J655795O55902k186741j103085K890425L419018
$$ 6234240 3097521 1742029 3397824 4053726 1866985 763900 3654325 7073343
38840G073343n34310l074810j110511J306266K44418k167143j831128J291217
$$ 7073343 6539033 3464223 2353712 3659978 3904396 1737253 -93875 1197342
38832A197342L970396L923829J270225k212767l962338k579520K38943J457410
$$ 1197342 5167738 9091567 10361792 8149025 4186687 1607167 1846110 3303520
38824C303520P07598L67189J371621J705446M9890j736197j486157m1642L44500
$$ 3303520 4011118 4378307 5749928 7455374 7505264 5769067 4282910 4241268 4585768
38815D585768l74514k18591J372910K264837N19493k543330l510082j164903J684893
$$ 4585768 4211254 3992663 5365573 7630410 8149903 5606573 2096491 931588 2616481
38806B616481J726367m89943j576863l17465Q80418O1794j424831j570010q06247
$$ 2616481 4342848 3852905 2276042 1958577 2838995 2900789 1475958 -94052 -900299
38797i00299m92660k90522O46350J441874R08966k879M00937J635206J834045
$$ -900299 -1392959 -1683481 -1037131 404743 1313709 1310830 1711767 3346973 5181018
38788E181018P33720l57463r01990j303700j359031o27264K16340L43672L89954
$$ 5181018 5914738 5557275 4655285 3351585 1992554 1365290 1581630 1925302 2315256
38779B315256J147076J523892N2986k320986l312873k531537j291508J05435K210428
$$ 2315256 3462332 4986224 5039210 2718224 -594649 -3126186 -4417694 -4312259 -2101831
38770b101831L971243L359963O46687j533219j753731j141600q22546l90474M09600
$$ -2101831 1869412 5229375 5876062 4342843 2589112 1447512 624966 234492 644092
38761F44092O20119k76988j203341r75478P7336P28675M14754k96717m80620J8675
$$ 644092 1264211 987223 -216118 -1191596 -1114260 -385585 29169 -267548 -748168 -729493
38751g29493L13490j58808l10529J116674K845685K174424o19787j883563n8235
$$ -729493 -416003 -574811 -885340 231334 3077019 5251443 4631656 2748093 2689858
38742B689858J574973L5709k458922k072067N96987J918423R97436K2829j8960
$$ 2689858 4264831 4300540 1841618 -230449 366538 2284961 3282397 3305226 3286266
38733C286266m1053k1454P52861J193906j72393j873290j282738Q19000J376234
$$ 3286266 3245213 3223759 3976620 5170526 4998133 3124843 1842105 2661105 4037339
38724D037339K62839J48605J339654J208728q58539k306642j918844j322765j162044
$$ 4037339 4300178 4448783 5788437 6997165 6138626 3831984 1913140 590375 -571669
38715e71669J6380J945485J995985q2187r19000R83958K465196R09205j324720
$$ -571669 -555289 1390196 3386181 3303994 2384994 3368952 5834148 6743353 5418633
38706E418633p95953J411984J427858j518746m008706k954016P41920L278531
$$ 5418633 4622680 6034664 7462522 5943776 1935070 -1018946 -277026 3001505
38698C001505K051380j461546l309822j842348N03345J148431Q76168J270507
$$ 3001505 5052885 3591339 281517 -1560831 -1057486 90945 967113 2237620
38690B237620J243271m70756j698019n6036K168836J395141p60158k31165J705463
$$ 2237620 3480891 3010135 1312116 1256080 3424916 4820057 4059899 3828734 5534197
38681E534197L90700l087411k752458J541527K839424j158160l714037l59047
$$ 5534197 5924897 2837486 85028 1626555 4465979 3307819 -406218 -765265
38673g65265L600721K275330j316445j381376R89653J252769k39478l41159J69989
$$ -765265 2835456 5110786 3794341 2412965 3402618 4655387 4415909 4074750 4244739
38664D244739j199581k746763j383157J188659J284720j87509j2544R16790k53886
$$ 4244739 3045158 298395 -1084762 103897 1388617 1201108 1188564 2105354 1851468
38655A851468k052449j150137Q26123q7392k270331o61722L845571M854654P97934
$$ 1851468 -200981 -1351118 -524995 -612387 -2882718 -3544440 301131 5155785 5953719
38646E953719k554928j359011J281083J602167M13250m61928j588894k981594
$$ 5953719 3398791 2039780 3320863 4923030 5336280 4874352 3285458 303864
38638C03864k371778P34148L086228K289119J6175j382263k044672k406967j327118
$$ 303864 -2067914 -1333766 1752462 4041581 4057756 2675493 630821 -1776146 -3103264
38629c103264J338663L298706L073330J976957J171151k69196k498367l197882
$$ -3103264 -1764601 1534105 4607435 6584392 7755543 7486347 4987980 1790098
38621A790098j066528J530879J710741j91631j946456k486422j929648n51410
$$ 1790098 723570 2254449 3965190 3773559 1827103 -659319 -2588967 -3140377
38613c140377O73323M46041o18455l03885J472160J893550k21777k019232r34444
$$ -3140377 -2467054 -2021013 -2639468 -2943353 -1471193 422357 200580 -1818652 -2753096
38604b753096J272290J539479L22200K67347J623963K191220J083148l52470j125550
$$ -2753096 -1480806 58673 380873 648220 2272183 4463403 5546551 5194081 4068531
38595D068531j621323j940221j346495J47671J180753O91336o39946j119048N279
$$ 4068531 2447208 506987 -839508 -691837 488916 1180252 540306 -578742 -573463
38586e73463J534742J563266l8688j088469K6850J759566J414981q17217k219806
$$ -573463 961279 2524545 2485857 1397388 1424238 3183804 4598785 3781568 1561762
38577A561762j834487j472453j810155p72207K394491M432654K340697j662697
$$ 1561762 -272725 -1745178 -3555333 -4327540 -1933049 2499605 4840302 3177605
38569C177605k718624N4309K678254J951189q65954k591798k073936n18410N79207
$$ 3177605 458981 513290 3191544 5142733 4276779 1684981 -388955 -907365 -328158
38560c28158O29395n1677m37138M87222K351286L138262J256613k136401l881930
$$ -328158 301237 249560 -187578 299644 2650930 5789192 7045805 4909404 1027474
38551A027474k378427M31760J515737N11376l83394K1982M48790k13133q87331
$$ 1027474 -1350953 -919193 596544 1107920 724526 746508 1195298 982165 94834
38542I4834l07377O63069N33185k61444l14894K17605J77742k51184j2443N08028
$$ 94834 -212543 450526 983711 722267 407373 624978 802720 551536 539093 1047121
38532A047121l0596j326668j612303m63852O45363O65812n2783r68998j588350
$$ 1047121 1016525 -310143 -1922446 -2386298 -1740935 -1075123 -1127906 -2096904 -3685254
38523c685254q61377J425628L096073K021954k51583l46830J617159K034674m20336
$$ -3685254 -4546631 -3121003 -24930 1997024 1745441 1398611 3015770 5050444 4630108
38514D630108k753723k500132j024185k87263L55233J894555K986321K030543
$$ 4630108 1876385 -623747 -1647932 -1935195 -1579962 314593 3300914 5331457
38506E331457q4314j481064j821468j585541o64567O28958R66191J8605p05896
$$ 5331457 5247143 3766079 1944611 359070 -305497 323461 1289652 1308257 602361
38497F02361l46245N2390r3741J52288O66220k40697k017470j221278K740672
$$ 602361 256116 308506 214765 367053 1033273 792576 -1224894 -2446172 294500
38488B94500N009865K041113k448587k733092N38632K260558J073223J03674O27964
$$ 294500 5304365 7345478 4896891 2163799 2702431 4962989 6036212 6139886 6767850
38479F767850O55083k76484j77270J049579J160063O3802J07619J264299R41136
$$ 6767850 7422933 7146449 6969179 8018758 9178821 9242623 9350242 10614541 11555677
38470A1555677n66172K63369L700476N628102M866992N414693Q427009R117068
$$ 11555677 10989505 11252874 14953350 20581452 25448444 30863137 39290146 48407214
38462D8407214O748747J0208112K4937071L9807102L8596331K2931636J1421733
$$ 48407214 55155961 65364073 90301144 130108246 168704577 191636213 203057946
38455B03057946J3871510J8790905J2898570J922567N94751Q175622P630334j0583063
$$ 203057946 216929456 235720361 248618931 250541498 251136249 259311871 266942205 256359142
38447B56359142l5321523m8999088m6586718l5574633k3801854j4051607p145741
$$ 256359142 221037619 172038531 125451813 89877180 66075326 52023719 44877978
38440D4877978l658559k799580l342077n041929o801396n686796j144110K114824
$$ 44877978 41219419 38419839 35077762 30035833 23234437 17547641 16403531 18518355
38432A8518355k41595n276772o321876k413062R93640O07300q47504l85088Q00854
$$ 18518355 18276760 12999988 6678112 4265050 5258690 5865990 5018486 4633398 5434252
38423E434252P08609K75l49570j242124k807441k836406m35645J673145J087481
$$ 5434252 6142861 6143136 5793566 4551442 1744001 -1092405 -1528050 145095 1232576
38414A232576p14410j213538n41241K17150J539879L319552K995301o38203m085592
$$ 1232576 518166 -695372 -1236613 -1019463 520416 3839968 6835269 6197066 2111474
38405B111474l386061J69218K312594K048587J546533J228708m21955k654310
$$ 2111474 -1274587 -1105369 1207225 3255812 4802345 6031053 5609098 2954788
38397B954788k567715J85490K620577K869354K051247J295352K54321q23199p89795
$$ 2954788 387073 572563 3193140 6062494 8113741 9409093 9663414 8840215 8050420
38388H050420j20108o45466k014684j620920R16821K466909J090109j002874j110029
$$ 8050420 7930312 7284846 5270162 3649242 4566063 7032972 8123081 7120207 6010178
38379F010178L4720K56485l52134k70780M19339M05695k38545o1842J300249K337090
$$ 6010178 6044898 6301383 5949249 5678469 6097808 6503503 6264958 6203116 7503365 9840455
38369I840455J549022p70484k768669k783555j063608L76460J77654n50733J7666
$$ 9840455 11389477 10618993 7850324 5066769 4003161 4379621 4557275 4006542 4024208
38360D024208J453406J766039Q16930M89301J031538J66892k742190m471289k318709
$$ 4024208 5477614 7243653 8060583 8549884 9581422 9748314 7006124 2534835 216126
38351B16126J385361K199446j63360j728752j76368K319669K881377J793858J024557
$$ 216126 1601487 3800933 3637573 1908821 1732453 4052122 6933499 8727357 9751914
38342I751914Q70167J77427j065273j479126n71768M37902M45094k32304r17806
$$ 9751914 10622081 10799508 9734235 8255109 7683341 8121243 8566337 8334033 7416227
38333G416227j681546k484624k343046o65072J349052K160633K189836K888961
$$ 7416227 5734681 3250057 907011 241939 1590991 3751624 5941460 8830421
38325H830421L892649L351115J303529K02822J161198K122774J282465J1590K54934
$$ 8830421 12723070 16074185 17377714 17580536 18741734 20864508 22146973 22158563 22413497
38316B2413497J015580J69247j613769j877698o84784p08895k810042m421066
$$ 22413497 23429077 23598324 21984555 20106857 19422073 18713178 15903136 11482070
38308A1482070l293829o09813R25390N59699k73448l74270j91912p55362j775545
$$ 11482070 8188241 7578428 8503818 9063517 8790069 8415799 8223887 7468525 5692980
38299E692980j569011N05654K273494J222257j381232j593488J172689K598997
$$ 5692980 4123969 4629623 6903117 8125374 6744142 5150654 6323343 8922340
38291H922340N8861k794402j653043J335564J097774j792976k136194Q51984K051267
$$ 8922340 8981201 6186799 4533756 5869320 6967094 5174118 3037924 3889908 5941175
38282E941175p90104l037766p48285L011423L317108Q50680k05517R61678J518709
$$ 5941175 5151071 2113305 1365020 4376443 7693551 8544231 8338714 9300392 10819101
38273A0819101J71497j380991j729257j301638o80389J33519O35093r3025j897854
$$ 10819101 10990598 9609607 7880350 6578712 5898323 6031842 6666935 6573910 4676056
38264D676056l303545k871988m35018K515795L575588J744978q24819j002535
$$ 4676056 1372511 -1499477 -1934495 581300 4156888 5901866 5077047 4074512
38256D074512J196870K726676K089270J104306J204918J042524m96801j817085
$$ 4074512 5271382 7998058 10087328 11191634 12396552 13439076 12942275 11125190
38248A1125190j444204p38802j230869j667322n59565O03428q7249j203621l63591
$$ 11125190 9680986 8942184 7711315 6043993 5484428 6087856 6000607 4796986 4433395
38239D433395J289024R20159q47331q34633J171597K111165J018841M20474J449728
$$ 4433395 5722419 6642578 5795247 4960614 6132211 8243376 9262217 9682691 11132419
38230A1132419J629199o86661l032976k375081M59759K284464J870034N84301
$$ 11132419 12761618 12074957 9041981 6666900 7126659 9411123 11281157 11865458
38222A1865458j77055j99914L03863R98091J218938O99473L04780J022270K338415
$$ 11865458 11688403 11488489 11792352 12790443 14009381 14708854 15013634 16035904 18374319
38213A8374319K565905R13592j469338k765963k336473j017958j8826k0577j061984
$$ 18374319 20940224 21853816 20384478 17618515 15282042 14264084 14245258 14224681 13162697
38204A3162697k446528k740851j026028J354825J644269o92665k612621j440823
$$ 13162697 10716169 7975318 6949290 8304115 9948384 9255719 6643098 5202275
38196E202275J235335K004907P59720J80993P54275K22303j623875j678571J595516
$$ 5202275 6437610 8442517 9202237 9383230 10137505 10359808 8735933 7057362 8652878
38187H652878N542175P155169O440550M758014L243352L764541P196421J0107481
$$ 8652878 14195053 21350222 27790772 32548786 35792138 39556679 46753100 56860581
38179E6860581R196209J0263691K3854172M7222816O0494498N0205923K8895060
$$ 56860581 66056790 76320481 100174653 147397469 207891967 258097890 286992950
38172B86992950J8900178K2299899K2537316J3720434Q960910J4031859J1141938
$$ 286992950 305893128 328193027 350730343 364450777 373411687 387443546 398585484
38165C98585484j7139516n8736919q2738244p5188320n0735018l0064209j9016395
$$ 398585484 381445968 322709049 239970805 164782485 114047467 83983258 64966863
38158F4966863j2530917p561155m997036m703788n141046n796384o340152n268679
$$ 64966863 52435946 44874791 39877755 35173967 30032921 24236537 17896385 12627706
38150A2627706k175307L83224j15446k485099l338104j449643J216626K282793
$$ 12627706 10452399 10835623 10720177 8235078 4896974 3447331 4663957 6946750
38142F946750J163417j175619l205095l522120j740551Q59575K218497J464945
$$ 6946750 8110167 6934548 3729453 207333 -1533218 -673643 1544854 3009799
38134C009799l25523j567459j839186j591038q10730P25797J961147J150538j224098
$$ 3009799 2684276 1116817 -722369 -2313407 -3124137 -2398340 -437193 713345 -510753
38125e10753k035149K85757K819345J983295r69786j654000O64094J925502k67157
$$ -510753 -2545902 -2260145 559200 2542495 1572709 -81291 582803 2508305 2241148
38116B241148k935747k424653M09690K273776K193281J397379M01535q62666j396816
$$ 2241148 -694599 -3119252 -2709562 -435786 1757495 3154874 3556409 2693743 1296927
38107A296927m57303M82691k63944j568880j178488L60581M41670j252090k148718
$$ 1296927 839624 1322315 1058371 -510509 -1688997 -1328416 -886746 -2138836 -4287554
38098d287554q11344J138300J765052J204533N10614M8982j06488K47617O97629
$$ -4287554 -5098898 -3960598 -2195546 -991013 -480399 -431417 -537905 -290288 407341
38089D07341L57630o73788j246113r30574n00488k75349M48086J686626K095273
$$ 407341 764971 91183 -1154930 -2085504 -2585992 -2861341 -2413255 -726629 1368644
38080A368644J020098j09754K79696J521018J644363K09313j152183j031347o653
$$ 1368644 2388742 2278988 2558684 4079702 5724065 5933378 4781195 3749848 3743195
38071C743195K96026o84953j855395j969426j270263j100345j826820j912342
$$ 3743195 4039221 3354268 1498873 -470553 -1740816 -2841161 -4667981 -6580323
38063f580323J33391L178558M067868J370483k345630l156605n39397J892584
$$ -6580323 -6446932 -3268374 799494 2169977 -175653 -3332258 -3871655 -1979071
38055a979071J066136j484583j951471Q0965J063764p55882k124525K25332L858550
$$ -1979071 -912935 -2397518 -4348989 -4268024 -3204260 -3960142 -6084667 -5859335 -2000785
38046b000785L788888J61760j860836j57944J396153j03242j540002O50644L772520
$$ -2000785 1788103 1949863 89027 -68917 1327236 1223994 -316008 334636 4107156
38037D107156K852889r56144j857356J133348K273403j702210n850131m108001
$$ 4107156 6960045 6003901 4146545 5279893 7553296 5851086 955 -4107046
38029d107046J609616M162538J361588j664836o66131J897496J678543m66180
$$ -4107046 -2497430 1665108 3026696 1361860 695729 2593225 4271768 3805588
38021C805588m02006J844384J657308k354622n033212k150390K661162L021802
$$ 3805588 3403582 5247966 6905274 4550652 -482560 -2632950 28212 3050014
38013C050014o09127k078601N38367K347763O9502k865562k399826k4330Q02237
$$ 3050014 2440887 362286 900653 3248416 3317918 452356 -1947470 -1971800 -1169563
38004a169563L29287M58852L70477j280365k426779n42420K455593K856052J032874
$$ -1169563 -840276 -381424 -10947 -1291312 -3718091 -4260511 -1804918 1051134 2084008
37995B084008R3721K93327k51452p34287Q85335K546264L62324l853585l893862
$$ 2084008 2177729 2471056 2219604 1485317 2370652 4916916 5279240 1425655 -2468207
37986b468207R72832M023566J272859k531158j611551K352027L784432J428514
$$ -2468207 -1495375 2528191 3801050 1269892 -341659 2010368 5794800 7223314
37978G223314j417705k317882j525652j92326L55553p23935j838253j28230L561172
$$ 7223314 5805609 3487727 1962075 1769749 2125302 1401367 -436886 -565116 2996056
37969B996056M268122P2590m041194l052516Q10529K020994R4479j050943r4777
$$ 2996056 7264178 7336768 3295574 243058 1053587 3074581 3169060 2118117 2023340
37960B023340O05613r12n05447n29815r77073j035672Q65881L320189L366838
$$ 2023340 2628953 2628041 2122594 1592779 615706 -419966 445915 3766104 7132942
37951G132942J504284R24475J871477J644125M85233J840751N348591N473899
$$ 7132942 8637226 9561701 11433178 13077303 13562536 15403287 20751878 26225777
37943B6225777Q8746m949453m042786k99717m75699m536676o304030l265736L00664
$$ 26225777 26314523 21365070 17322284 17022567 16546868 12010192 5706162 2440426 2741090
37934B741090N82060o86456l85112Q22320M04241j465294k283355j042164P96288
$$ 2741090 3323150 2636694 2251582 3073902 3478143 2012849 -270506 -1312670 -516382
37925e16382J714607J595481R04465L7293m07135n303O47358N57622r3553j82453
$$ -516382 1198225 2793706 3698171 3735464 3328329 3323026 3970384 4528006 4434453 4252000
37915D252000L68131K52371r91039j889308j215556Q4366N78480P47431J742967
$$ 4252000 4620131 4872502 3881463 1992155 776599 860965 1439445 2186876 3929843
37906C929843K622302J327690j698840l492167k695113j243274r50818q70884
$$ 3929843 6552145 7879835 6180995 2688828 -6285 -1249559 -2200377 -3071261
37898c071261L38421J616897J305801J76032J63631J044098R18991l87234r22224
$$ -3071261 -2732840 -1115943 189858 365890 529521 1573619 2492610 2105376 1183152
37889A183152K08954J432307J116512k63053j154906r57426k89880l124m37346
$$ 1183152 1392106 2824413 3940925 3677872 2522966 1565540 1275660 1272536 835190
37880H35190j182173j375095o37913L82079Q59583Q33216P57419M82391l79232
$$ 835190 -346983 -1722078 -2359991 -1977912 -1118329 -285113 472306 954697 575465
37871E75465j370245j504470n99525N45923J221883J325987J000666M97318K40053
$$ 575465 -794780 -2299250 -2898775 -2352852 -1130969 195018 1195684 1693002 1933055
37862A933055L85810N32789L32400m8584m58934r63360j050213J32549J897299
$$ 1933055 2318865 2851654 3184054 3135470 2676536 1713176 662963 795512 2692811
37853B692811J888514o61533k950918j972991J105390K345373L88042k081555
$$ 2692811 4581325 3919792 968874 -1004117 101273 2446646 2834688 753133
37845G53133k338958p61343O34877Q82279M15784N1052L54447J204660J661903
$$ 753133 -1585825 -2347168 -1712291 -830012 -414228 -363176 -8729 1195931 2857834
37836B857834R46240n27041j721000k075879j325210O94947K844666K705079k85760
$$ 2857834 3804074 3277033 1556033 -519846 -1845056 -1150109 1694557 4399636 4113876
37827D113876l055646k662254n83644k97154j680499j562017O05488J871894J046038
$$ 4113876 1058230 -1604024 -2187668 -2484822 -4165321 -5727338 -5121850 -3249956 -2203918
37818b203918N30873J631588K123789M71479j228757r50134j06966n15747r44823
$$ -2203918 -1673045 -41457 2082332 2553811 1325054 374920 267954 -247793 -1192616
37809a192616K69646J727169J361171K03229L57377J032752K21351j094883l61686
$$ -1192616 -922970 804199 2165370 2368599 2725976 3758728 3980079 2885196 2523510
37800B523510J676658J608110j010144k508149o40298J960845J627977j252628
$$ 2523510 4200168 5808278 4798134 2289985 1649687 3610532 5238509 3985881
37792C985881l033536j664926R89081J723989p9776j812556j073172J059036J505216
$$ 3985881 952345 -712581 276500 2000489 1920713 108157 -965015 94021 1599237
37783A599237l40507j723126p23773R67258R09947n34377j403035j094672j18187
$$ 1599237 1258730 -464396 -1188169 -220911 689036 154659 -1248376 -2343048 -2461235
37774b461235J338781K400256J059540k511965m226161j139316L396376L755981
$$ -2461235 -1122454 1277802 2337342 -174623 -4400784 -5540100 -2143724 1612257
37766A612257R1956k317917j320937j72498q47046o82144J916616L435186P18522
$$ 1612257 1704213 -613704 -1934641 -2107139 -2954185 -3636329 -1719713 1715473 2433995
37757B433995l188730l123957M96953K573660R34609j213830o70726J523340K394021
$$ 2433995 -754735 -3878692 -3381739 -808079 126530 -1087300 -1758026 -234686 2159335
37748B159335J088414q38475j741034j193691K85530J818635K607457K265553
$$ 2159335 3247749 2409274 668240 -525451 -239921 1578714 4186171 6451724
37740F451724Q82498j026344k524907k667791j375120L19283J232201J029807
$$ 6451724 7334222 6307878 3782971 1115180 -259940 59343 1291544 2321351
37732B321351J11485r98244j767251j655085n95808O59509J103891M19285p21964
$$ 2321351 2432836 1434592 -332659 -1987744 -2583552 -1924043 -820152 -400867 -1122831
37723a122831j250347p04589K12389L71648k56118m03616N90621J433347N38444
$$ -1122831 -2373178 -3077767 -2865378 -2493730 -2749848 -3153464 -2562843 -1129496 -591052
37714e91052j480494k407352j361006L35025J287828J519718J506724J236329
$$ -591052 -2071546 -4478898 -5839904 -5504879 -4217051 -2697333 -1190609 45720
37706D5720Q19319P59862R56171N45293o32465j458896j037977J69336J191673
$$ 45720 865039 1624901 2581072 3126365 2493900 1035004 -2973 166363 1358036
37697A358036J563733J133866k7851j125676j192674n07491k47622n46922m39501
$$ 1358036 2921769 4055635 4027784 2902108 1709434 1201943 954321 407399 -32102
37688c2102R4723N1206k23962R02893K939546K764508o26118l616200k851828
$$ -32102 62621 113827 -110135 792758 3732304 6496812 5870694 2254494 -597334
37679e97334k31427L26449q17917j47548K469949L050138l6255l090762k406034
$$ -597334 -828761 -502312 -1320229 -1467777 1002172 4052310 4016055 925293 -1480741
37670a480741P04525K476175J840652M97026m27952j123005j376340n75879P27379
$$ -1480741 -776216 1699959 3540611 4037637 3609685 2486680 1110340 534461 1261840
37661A261840J150625M64461k04972k10669n7176p1276K34291R45809J052523
$$ 1261840 2412465 2876926 2671954 2461285 2404109 2332833 2567124 3512933 4565456
37652D565456j40634j598610j620639j83865P76089j64577j869807j929970J45037
$$ 4565456 4424822 2826212 1205573 1021708 1797797 1633220 -236587 -2166557 -2021520
37643b021520K059174J601341m49308j408062l49178P82015J45889j311879j349741
$$ -2021520 37654 1638995 1189687 -218375 -567553 214462 360351 -951528 -2301269
37634b301269K79586J633308J448311N06534k04238r68738k011546k238813r12349
$$ -2301269 -2021683 -388375 1059936 1566470 1362232 393494 -1618052 -3856865 -4769214
37625d769214N60173N38914Q4459J439228L821657L873154J032741r45017K50702
$$ -4769214 -4209041 -3670127 -3585668 -2146440 1675217 5548371 6581112 5636095 5886797
37616E886797J513087p10423m197615m115920q23393P11706q79828j345392J552289
$$ 5886797 7399884 6689461 2491846 -1624074 -2447467 -1735761 -2615589 -3960981 -2408692
37607b408692L829078J845932j478063j367419J224475J777379j30298p93262
$$ -2408692 1420386 3266318 1788255 420836 1645311 3422690 3292392 2499130
37599B499130O81410R32148j394232k956786j263630J228563J268869j51102j41556
$$ 2499130 3180540 4112688 2718456 -238330 -1501960 -273397 995472 844370 702814
37590G02814R70016N03687j616940k343096j96327K374044K394911J99857j509779
$$ 702814 1672830 2176517 559577 -1783519 -1979846 394198 2789109 2988966 1479187
37581A479187j299361k30529J83811q6787j13618L33529M57809l40953j572084
$$ 1479187 179826 -50703 133108 46321 -67297 266232 724041 383088 -1188996
37572a188996k206006j711733l58621J069404J636148R03365l61852o90055L27941
$$ -1188996 -3395002 -5106735 -5465356 -4395952 -2759804 -1856439 -2218291 -2908346 -2580405
37563b580405J328693R14343m29897j058102m38595L39424K83080k50927k92153
$$ -2580405 -1251712 -337369 -767266 -1825368 -2263963 -1924539 -1641459 -1892386 -2184539
37554b184539L45143P49388j8212j468817j643825N82408L259531L009055m83381
$$ -2184539 -1839396 -1090008 -1108220 -2577037 -4220862 -3638454 -378923 2630132 2146751
37545B146751l438892k733149J32158J682048J303770P54723K89254j189313k691850
$$ 2146751 -1292141 -4025290 -3893132 -2211084 -907314 -152591 136663 -1052650 -3744500
37536c744500j816059P33696J257036j076430k357811o6126K562899J471569j760244
$$ -3744500 -5560559 -4826863 -3569827 -4646257 -7004068 -7070194 -4507295 -3035726 -4795970
37527d795970k348299M58194K734187J991918L9469p15632m24702j21524L95170
$$ -4795970 -7144269 -6686075 -3951888 -1959970 -1920501 -2636133 -3060835 -3182359 -2787189
37518b787189J447598K174621J885063J323737J210221P35209r62877k725485
$$ -2787189 -1339591 835030 2720093 4043830 5254051 5989260 5026383 2300898
37510B300898k530695m61524J121109O99575m37169j63638J448422K326818J425982
$$ 2300898 -229797 -691321 429788 1129363 692194 528556 1976978 4303796 5729778
37501E729778J08435j47616j61198j668887m105971m741898k415304O86327J983803
$$ 5729778 5838213 5690597 5529399 3860512 -245459 -4987357 -7402661 -6716334 -4732531
37492d732531J684679J523338J603766O08610j314110k103387o49625J564739
$$ -4732531 -3047852 -1524514 79252 687862 -626248 -2729635 -3379260 -1814521
37484a814521K396150J433761j58592j142901q70073O11549K258178K485401P62902
$$ -1814521 581629 2015390 1856798 713897 -156176 455373 2713551 5198952 5961854
37475E961854j571757k649005j885870j40652J322409J520604J70359j709446
$$ 5961854 4390097 1741092 -144778 -285430 1036979 2557583 2727942 1018496
37467A018496k178797m33940J811430K111889L29839j298402j168055l158Q22289
$$ 1018496 -1160301 -1594241 217189 2329078 2658917 1360515 192460 189302 1011591
37458A011591J152438J321578R18720k86876j141756n24074O25453N38385m51070
$$ 1011591 2164029 3485607 4404327 4117451 2975695 2451621 3077074 3615459 3164389
37449C164389l61593R68173J334689j25882j208692k06530J039095o374k292810
$$ 3164389 2802796 3770969 5105658 4979776 3771084 3564554 4603649 4597275 2304465
37440B304465k586846l45247J672616J525852J62852q98881j467838j612133r28851
$$ 2304465 -282381 -627628 1044988 2570840 2733692 1834811 366973 -1245160 -2174011
37431b174011K35989P01280L63386L96082R18804N97623n67071n06755J403776
$$ -2174011 -1938022 -1236742 -873356 -477274 441530 1039153 472082 -34673 1369103
37422A369103K540827Q61306j568970j530968M56769J224016m9285j140481q19413
$$ 1369103 3909930 4771236 3202266 1671298 2128067 3352083 3302798 2162317 1342904
37413A342904l62231n93973l89416Q16013J552161Q24872N1904P33454J747776
$$ 1342904 980673 386700 -2716 813297 2365458 3190330 3242234 3975688 5723464
37404E723464R83274j222567k291562q92669J371587K015004L71285j996050k901461
$$ 5723464 6706738 5484171 3192609 2299940 3671527 5686531 6057816 4061766 1160305
37395A160305j451090J094805K356183J202894j011087k039544j254717J44673
$$ 1160305 -290785 804020 3160203 4363097 3352010 1312466 57749 202422
37387B02422J061805J466775J462115Q32083L4057J89259J096818O54528k167328
$$ 202422 1264227 2731002 4193117 5025200 5059257 5248516 6345334 6999862 4832534
37378D832534m892769m210304n23638K524281K924656K039791J190545k85885
$$ 4832534 -60235 -4270539 -4794177 -2269896 654760 2694551 3885096 3599211
37370C599211k261288k341460L80818K723284J637524j011350j380867K32649
$$ 3599211 1337923 -1003537 -622719 2100565 3738089 2726739 1345872 1578521
37362A578521K97297j743203k610511p96334J212442J342097P70598R02410R09448
$$ 1578521 1875818 132615 -2477896 -3274230 -2061788 -719691 50907 953317 1862765
37353A862765M2130n90213l59948n32445j577841j708437Q0351K007138K257667
$$ 1862765 1904895 1314682 954734 422289 -1155552 -2863989 -2783638 -776500 1481167
37344A481167J241941l16131k485193l766081j439019L348263M937718R43959
$$ 1481167 2723108 2406977 -78216 -3844297 -5283316 -1935053 3002665 3946624
37336C946624l345022k557465P04757P95974j404682p06346K507440K286060k688950
$$ 3946624 601602 -1955863 -1251106 -455132 -1859814 -2566160 -58720 2227340 -461610
37327d61610o115896l386217J964815M060655K456262Q77505J325989K494993
$$ -461610 -6577506 -9963723 -7998908 -3938253 -1481991 -604486 721503 3216496
37319C216496K327643J97219k327622k413355O41586L296181J755596k381947
$$ 3216496 5544139 5741358 3413736 1000381 1641967 4938148 6693744 4311797
37311D311797m032538j967503J04533J29958L11615J737647J711604r19425k609020
$$ 4311797 279259 -1688244 -1583711 -1453753 -1142138 595509 2307113 1387688 -1221332
37302a221332p77184J510710N16918k003383j976183L89069J702300J131458O03775
$$ -1221332 -1998516 -487806 29112 -1974271 -3950454 -3561385 -1859085 -727627 -123852
37293a23852O15067O8220n39724K81011J674689J304117o65830j702253q51227
$$ -123852 491215 559435 19711 300722 1975411 3279528 2613698 911445 60218
37284F0218M83354J463839K408484K555904N05684k702033l971772k380884m15806
$$ 60218 543572 2007411 4415895 6971799 7477483 4775450 803678 -1577206 -1993012
37275a993012j63190p01589l48242O35684R39710L18618l88795m22865L96893
$$ -1993012 -2156202 -2857791 -3206033 -2570349 -1630639 -1312021 -1700816 -2123681 -1726788
37266a726788J487709J573745L1757j713520j547315K77055J066093n49158k337675
$$ -1726788 -239079 1334666 1366423 -347097 -1894412 -1617357 -551264 -1100422 -3438097
37257c438097j403968J541530K729309K99976k927817k858247N49564L177590
$$ -3438097 -4842065 -3300535 -571226 -271250 -3199067 -6057314 -5507750 -2330160
37249b330160K207984l44804r61701L04267O33937o25402j125992J41853J009916
$$ -2330160 -122176 -466980 -1428681 -1124414 -490477 -1115879 -2241871 -2100018 -1090102
37240a090102j17518j578584j334147j14036L66803K68041N19982O60240L0150
$$ -1090102 -1207620 -2786204 -4120351 -4234387 -3867584 -3599543 -3079561 -2419321 -2389171
37231b389171m26339K16158R07823M89347N030P97720J764272J057109p87292
$$ -2389171 -2815510 -2599352 -1691529 -1202182 -1197152 -399432 1364840 2421949 1634657
37222A634657j971448k315543k340414j082357J903146L800167J761007j893143
$$ 1634657 -336791 -2652334 -4992748 -6075105 -4171959 -371792 1389215 -503928
37214e03928j993450J894835M478827K210389k138360l904395k284672K09906
$$ -503928 -2497378 -602543 3876284 6086673 3948313 43918 -2240754 -2030848
37206b030848J511036J291858L03218q6878R23751K021489J062721j516392k718193
$$ -2030848 -519812 772046 1075264 988386 1912137 3933626 4996347 3479955 761762
37197G61762j306172K24116n38108k242620j956957M04310K103365J533535J32775
$$ 761762 -544410 -320294 -858402 -3101022 -5057979 -4653669 -2550304 -1016769 -883994
37188h83994j6935Q66875P84307q68568j945839m41492K110494K296937j9084
$$ -883994 -900929 -34054 750253 -118315 -2064154 -2505646 -395152 1901785 1882701
37179A882701j062517J067964L096177J604387j489032k184802r02023j092576
$$ 1882701 820184 1888148 4984325 6588712 5099680 2914878 2012855 920279
37171I20279k630905j850680J753081M023755K515206j77975j114105r34105j107362
$$ 920279 -1710626 -3561306 -1808225 2215530 4730736 4552761 3438656 2504551 1397189
37162A397189r74966R2057P01429m0248o74488j27879K96224l95367q75451j41544
$$ 1397189 422223 514280 1215709 1175461 500973 373094 669318 273951 -601500 -743044
37152g43044N51135L96966P57096J968105J647102j008038k428278K16550L797392
$$ -743044 -191909 205057 962153 2930258 4577360 3569322 1141044 1357594 5154986
37143E154986L258081j018684m137539l755431j947642o28576N73603J589568
$$ 5154986 8413067 7394383 3256844 -498587 -2446229 -3074805 -2501202 -911634
37135i11634R99951j027322j951400m14609J664620J925865P84631L58339J200680
$$ -911634 88317 -939005 -2890405 -3305014 -1640394 285471 1070102 1428441 2629121
37126B629121J599385J37009k010585k254276j91814J286288j16538k289135j435902
$$ 2629121 4228506 4365515 2354930 100654 -91160 1195128 1078590 -1210545 -2646447
37117b646447J881565L079776N82505j625206m19483J622172J019673o70650p7441
$$ -2646447 -764882 2314894 2897399 1272193 852710 2474882 3494555 2823905 2746464
37108B746464J640833Q41666j828639k174147M36040K004157N87811q78953J671
$$ 2746464 4387297 5228963 3400324 1226177 1662217 3666374 4254185 3375232 3376903
37099C376903J151742j48755k708347l344714j332649J284368K507556J895188
$$ 3376903 4528645 4379890 1671543 -1673171 -3005820 -1721452 786104 2681292
37091B681292L18080o58715p4343J111688J054567l78451j486170j409631j114056
$$ 2681292 2999372 2340657 2266314 3378002 4432569 4054118 2567948 1158317 44261
37082D4261j221747q11168P25861K283322K497395J330942m46294j968644k003857
$$ 44261 -1177486 -1988654 -1262793 1020529 3517924 4848866 4402572 2433928 430071
37073D30071J87671K888310K808206o53966l757401k851411Q35297K954290J804991
$$ 430071 617742 3506052 6314258 5660292 1902891 -948520 -113223 2841067 4646058
37064D646058o1542p3892Q94686M55620j516853k867971k379569j140646m36441
$$ 4646058 4584516 4510624 5405310 5860930 4344077 1476106 -903463 -2044109 -2480550
37055b480550N979P60026J236853R53094R27131J817477J857696o15650l369526
$$ -2480550 -2474571 -1714545 -477692 475402 1402533 3220010 5077706 4462056 1092530
37046A092530k564892J117202K693239K36987k248093j323382Q20908Q78505l3369
$$ 1092530 -1472362 -355160 2338079 2575066 326973 -996409 -175501 703004 669635
37037F69635N23219J103078p21969k802711j266973K590485L800940J300532j329964
$$ 669635 1192854 2295932 1573963 -1228748 -2495721 94764 3895704 5196236 3866272
37028C866272k165019k462911k118196M83481L551836K882988r71838k447025
$$ 3866272 1701253 -761658 -2879854 -2396373 1155463 4038451 3066613 619588
37020F19588L56697K677630J149118j170589j039206m28791j536504j838243Q34576
$$ 619588 976285 3653915 4803033 3632444 2593238 2164447 627943 -1210300 -375724
37011c75724K979482Q58489k597184k334869M85449J043515o64907o68920J081991
$$ -375724 2603758 3462247 865063 -1469806 -984357 59158 -605749 -1274669 -192678
37002a92678O80365k062449k740128j64744J246342j067928l453662j983935J604409
$$ -192678 487687 -1574762 -4314890 -4479634 -3233292 -4301220 -7754882 -9738817 -8134408
36993h134408L078359J620534l61950r75815P2209K182409L648904K553865m63334
$$ -8134408 -5056049 -3435515 -3797465 -4773280 -4701071 -2518662 1130242 3684107 3220773
36984C220773k224733j270860J00089k95629j113616k81686J057759M63870j445317
$$ 3220773 996040 -274820 -174731 -470360 -1583976 -1865662 -807903 -344033 -1789350
36975a789350j867761l59596P61339N23697O08848J806127K120420M6262k519104
$$ -1789350 -3657111 -4016707 -3255368 -2731671 -2122823 -316696 1803724 1849986 -669118
36966f69118k772490r37114O25045J255294K204758L239269K261034o42855j903203
$$ -669118 -3441608 -4378722 -3753677 -2498383 -293625 2945644 5206678 4563823 2660620
36957B660620M48230K940241J316927k664643l463620l03621J585431n68821k607739
$$ 2660620 3108850 6049091 7366018 4701375 1237755 934134 2519565 1950744 -656995
36948f56995m63738K914451K318437j237357k387898j36792J226996k15027j291586
$$ -656995 -1120733 1793718 4112155 2874798 486900 350108 1577104 1362077 70491
36939G0491O1649J236601J5327j310820j11657J809806J256639j063868j944808
$$ 70491 132140 1368741 1384068 73248 -38409 1771397 3028036 1964168 19360
36930A9360o79913P70512J369673J496977Q18904j045123k328485q92837J981538
$$ 19360 -660553 109959 1479632 2976609 3795513 2750390 421905 -470932 1510606
36921A510606K804758J010762l84046K01898O44790q06131k335153j612959L51583
$$ 1510606 4315364 5326126 4942080 5143978 5788768 4982637 2647484 1034525 1386108
36912A386108R68359Q9370l29137L20724O89608L3040p89730r92055p88139m48593
$$ 1386108 2354467 2443837 2114700 2435424 3125032 3158072 2368342 1376287 588148 139555
36902A39555O3272L04282l57035j355806j236407J78920J219270O17099p74983
$$ 139555 202827 507109 150074 -1205732 -2442139 -2263219 -1043949 -426850 -1201833
36893a201833j264418m01740R62676J911875K005124J267572L34567m101N8712
$$ -1201833 -2466251 -2867991 -1905315 6560 2011684 3279256 3613823 3609722 3668434
36884C668434n10817j690265j763942K74728K624537K556149j5309k407549k606230
$$ 3668434 3157617 1467352 -296590 -21862 2602675 5158824 5143515 2735966 129736
36875A29736j379867o53070r88467j337378o39027R00015J989538J638475L44685
$$ 129736 -1250131 -1903201 -2891668 -4229046 -4868073 -3968058 -1978520 -340045 4640
36866D640n10734m95963m17945m89639K66439J794431J971167k89716k432841
$$ 4640 -506094 -1002057 -1420002 -1909641 -1643202 151229 2122396 1832680 -600161
36857f00161j426443J465427K227218R441j977743j725268q42868o90626J04124
$$ -600161 -2026604 -561177 1666041 1675482 -302261 -2027529 -2870397 -3561023 -3456899
36848c456899K265645L378901J497724j365651k196147j240003m58312J81447
$$ -3456899 -1191254 2187647 3685371 2319720 123573 -1116430 -1574742 -1393295
36840a393295J601229K522467J113993j304433j731374l1887J269790J128333
$$ -1393295 207934 2730401 3844394 2539961 808587 776700 2046490 3174823
36832C174823N24700n01073k516247l632534j086082L546598N061036J922884
$$ 3174823 3699523 3198450 682203 -2950331 -4036413 -489815 4571221 6494105
36824F494105j265378o11271J634826J314948j242937k601033j796790q95080
$$ 6494105 5228727 4617456 6252282 7567230 6324293 3723260 1926470 1031390
36816A031390j037127j141981k33592J316727K678432L023867J690844o20970
$$ 1031390 -5737 -1147718 -1381310 -64583 2613849 5637716 7328560 6707590
36808F707590j727383o11264Q81291O80137m80071p17571l32550q81014j919564
$$ 6707590 4980207 4368943 5250234 5930371 5450300 4732729 4400179 3519165 1599601
36799A599601j620144j81791L49151l61128m71716O24158J267749N49942l19373
$$ 1599601 -20543 -202334 146817 -214311 -686027 -61869 1205880 1755822 1436449
36790A436449m81056o63557r86841k42720J323655J319408q55956k107411j89575
$$ 1436449 955393 291836 -695005 -937725 385930 1705338 849382 -1258029 -1447604
36781a447604K287223J613193j128018j804918O9299P17219j488485l225078j532040
$$ -1447604 839619 2452812 1324794 -480124 -410825 306394 -1182091 -4407169 -5939209
36772e939209J549566K286056P86068J09407J130823J555698K4643j617120j095645
$$ -5939209 -4389643 -2103587 -1317519 -1208112 -77289 1478409 1503052 -114068 -1209713
36763a209713J113629K596730J932636k29029k331584l164286k318908l60175
$$ -1209713 -96084 2500646 4433282 4204253 1872669 -1291617 -3610525 -3970700
36755c970700J372234J769467J023501L75988O07963J086181O82150n38127j198641
$$ -3970700 -2598466 -828999 194502 570490 1178453 2264634 2946784 2408657 1210016
36746A210016m66299O26414M66582q97843j834139j376363j67212J069805K449440
$$ 1210016 743717 1370131 1836713 938870 -895269 -2271632 -2438844 -1369039 1080401
36737A080401L512328K591738o85488l460252k518565J258799L630839K321882
$$ 1080401 4592729 7184467 6498979 3038727 520162 1778961 5409800 7731682
36729G731682o29469k319047k416358k078226j605167q52472l70684l87628P0578
$$ 7731682 7102213 4783166 2366808 288582 -1316585 -2169057 -2539741 -2927369 -2856791
36720b856791J380219J963700O21847j063430r24108K85102K52140p65142l43793
$$ -2856791 -1476572 487128 1108975 45545 -878563 -593461 -341321 -1106463 -1450256
36711a450256J605163K131090m8088k204173j573755Q18957K198023J812959O07751
$$ -1450256 154907 2285997 2237909 33736 -1540019 -721062 1476961 3289920 3897671
36702C897671j073092l003112l578569j450856J898808L550226K822233J459619
$$ 3897671 2824579 -178533 -3757102 -5207958 -3309150 241076 3063309 4522928
36694D522928M92652o72088j927625j799450M7210J745734J817236J079132P32191
$$ 4522928 5015580 4343492 2415867 616417 663627 2409361 4226597 5305729 6037920
36685F037920K26363j277338k646962k128957l58595J82893j173185k174979r01379
$$ 6037920 6264283 4986945 2339983 211026 -147569 35324 -1137861 -3312840 -4214219
36676d214219J510756K542175J570642R4045o73296q70102p42380Q0222J453743
$$ -4214219 -2703463 -161288 1409354 1503399 830103 -39999 -782379 -702157 751586
36667G51586K087287J096961m69748p82876L53302J271111O18036j167664k675280
$$ 751586 2838873 3935834 3466086 2683210 3036512 4307623 4925659 3757995 1082715
36658A082715k945027j904143k92158N73546p9858j203087q42120J094591K253621
$$ 1082715 -1862312 -3766455 -4058613 -3485067 -3564925 -4768012 -5610132 -4515541 -2261920
36649b261920J044482q36218p04290J204764K208001J232946J13800M40316J266423
$$ -2261920 -1217438 -2053656 -2757946 -1553182 654819 1887765 2001565 2441881 3708304
36640C708304R72652l08657j401168j863111j715461n79709J366600K491751J470867
$$ 3708304 4680956 4372299 2971131 1108020 -607441 -1187150 179450 2671201 4142068
36631D142068n97551j450226o37859L45642N34838K80104k82892j513173k719580
$$ 4142068 3544517 2094291 1456432 1802074 2336912 2617016 2334124 820951 -1898629
36622a898629k359732n05546P09675O9906r58327n82394P72546J687183K078934
$$ -1898629 -4258361 -4763907 -4054232 -3984326 -4942653 -5525047 -4752501 -3065318 -986384
36613i86384K563289K588106J169608j115187k662466k927160k371153r91843
$$ -986384 1576905 4165011 5334619 4219432 1556966 -1370194 -3741347 -4733190
36605d733190J139447K437436J336110p99139r03547J200988K178776K04695k102729
$$ -4733190 -3593743 -1156307 179803 -619336 -1522883 -321895 1856881 2061576 -41153
36596d1153j663021M54260J013922l23383r69860J21859J044277M20458m12578
$$ -41153 -1704174 -1249914 -235992 -559375 -1529235 -1407376 -363099 57359 -355219
36587c55219M8944Q17561J20899j455817j597773K41188J863738J371242k96072
$$ -355219 -306275 511286 632185 -823632 -2421405 -2180217 -316479 1054763 758691
36578G58691r49193k93396J04555l28630l07531P08342J000423o75066k291374
$$ 758691 -190502 -483898 -379343 -707973 -1015504 -307162 693261 18195 -2273179
36569b273179r59956K402431L641712J078556k059893k237570k82229N72867m18461
$$ -2273179 -3233135 -830704 2811008 3889564 1829671 -407899 -690128 -117261 -535722
36560e35722j140283l60262O66111M81161n68249j132487n37170P13558J484477
$$ -535722 -1676005 -2036267 -1370156 -888995 -1457244 -2589731 -3126901 -2413343 -928866
36551i28866J058464o596n48681n71993j165223k097692j395109J231102K658271
$$ -928866 129598 123002 -425679 -997672 -2162895 -4260587 -5655696 -4424594 -1766323
36542a766323O28069k020000r48960K825128L987085R87701j619864m83426J415168
$$ -1766323 -1138254 -3158254 -4107214 -1282086 2704999 3692700 2072836 1589410 3004578
36533C004578J8077l021569l067209Q1546K123637J015472o06402m00993J80215
$$ 3004578 3022655 1086 -3066123 -2984577 -860940 154532 -451870 -852863 -672648
36524f72648q39241k121398j021467K063362L880284K548350k99171j869845j398566
$$ -672648 -1511889 -3633287 -4654754 -2591392 1288892 3837242 3538071 1668226 269660
36515B69660l72044k67386q07926n38816J132588K818107K449861k38656l038657
$$ 269660 -102384 -369770 -1177696 -1716512 -583924 2234183 4684044 4445388 1406731
36506A406731l562607j905711k57396Q7913K22745J528518L180865L171729J357735
$$ 1406731 -2155876 -4061587 -4318983 -4231070 -4008325 -2479807 701058 3872787 5230522
36497E230522k61864m84190l14038p62484j076670m35944K40307q0096m98237
$$ 5230522 4968658 4484468 4170430 3407946 2331276 1895332 2135639 2055543 1557306
36488A557306J40513P10303m98045k315660j875077Q98851K964567K608112J205135
$$ 1557306 1697819 2408122 1910077 -405583 -2280660 -1381809 1582758 4190870 5396005
36479E396005j0206j631167l335849k846991K94620K821008K098516n6326n84557
$$ 5396005 5385799 3754632 418783 -2428208 -2133588 687420 2785936 2729610 2145053
36470B145053J22301j24051r51804m24288Q30206L38987j786015k750901j497827
$$ 2145053 2267354 2143303 1191499 767211 1597417 1936404 150389 -2600512 -4098339
36461d098339O9975O30898J109835K143651K701275K127519J182375K67923j160205
$$ -4098339 -4028364 -3397466 -2287631 -143980 2557295 4684814 5867189 6135112 4974907
36452D974907k746329k989343j505557M50695K008571L020458K487034l62941
$$ 4974907 2228578 -760765 -2266322 -1815627 192944 3213402 5700436 5337495
36444E337495l238184k645080O25133J802824o88082k676034j127549R47404L9313
$$ 5337495 2099311 -545769 79364 1882188 1194106 -1481928 -2609477 -1662073 -1622760
36435a622760j578369N908L029909K637968r10239k531916m52722J586913R04631
$$ -1622760 -3201129 -3195221 -165312 2472656 1562417 -969499 -1422221 164692 1069323
36426A069323m96811l40077L44484J3851o42685p23830p98411q63389L49646K377848
$$ 1069323 572512 232435 576919 590770 -51915 -775745 -1574156 -2437545 -2087899 289949
36416B89949K515834K12290j235858L27866K371181J812755k51302j095818r60765
$$ 289949 2805783 3018073 1782215 2110081 4481262 6294017 6042715 4946897 3986132
36407C986132j525920k035359q45940Q37676P31544l59468j36421O69227k20041
$$ 3986132 2460212 424853 -421087 416589 1148133 788665 652244 1321471 1101430
36398A101430j542522N6561L590219M129798N87430k247085j343413J22241j066682
$$ 1101430 -441092 -384531 3205688 7335486 7922916 5675831 4332418 4454659 3387977
36389C387977k443727o23751K054785J008607k694240l543235r1429L007427K198375
$$ 3387977 944250 320499 2375284 3383891 689651 -2853584 -2945013 62414 2260789
36380B260789k75349o45652R21227J589124L50396j235956j710887j074554P3457
$$ 2260789 1985440 1339788 2261015 3850139 4200535 2964579 1253692 179138 252595
36371B52595J174668J544052P19838p74012j679701j313691l16469J40089k59102
$$ 252595 1427263 2971315 3691153 2917141 1237440 -76251 -392720 -252631 -511733
36362e11733o99133l99504M12055J072038J478964J680211R67001j154726l142928
$$ -511733 -1210866 -1610370 -1198315 -126277 1352687 3032898 3999899 2845173 -297755
36353b97755k465568Q19504L339821K523576j17696j416050q69114m77702j195431
$$ -297755 -2763323 -1943819 1396002 3919578 3801882 2385832 1516718 1039016 -156415
36344a56415j890304j612192p38546L22012J704540K958580K916401J280552p38287
$$ -156415 -2046719 -3658911 -4397457 -4075445 -2370905 587675 3504076 4784628 4046341
36335D046341j752300j381136j70406P60339K94758j301638j974857k70343K261519
$$ 4046341 2294041 912905 742499 1502838 1797596 495958 -1478899 -1749242 512277
36326E12277K772007R95465n80016m96022n4107o59327j565559j419327m12667
$$ 512277 3284284 4279749 3699733 3203711 3149604 2490277 924718 -494609 -907276
36317i07276M00799P65543R99075R50891K41323r26196j811076j664120k07474
$$ -907276 -506477 259066 1258141 2209032 2450355 1524159 -286917 -1951037 -2158511
36308b158511J739601K439031J186635l14064j04360R57366M69862j390919j917057
$$ -2158511 -418910 2020121 3206756 2892692 2788332 3745698 4215560 2824641 907584
36299I07584n08428J3570j820844l229730j449890J705463K556401R57320k43909
$$ 907584 399156 412726 -1408118 -4637848 -6087738 -4382275 -1825874 -868554 -1112463
36290a112463M4396K72349l62852p96111n15486l95850o52609k48180J072150
$$ -1112463 -1068067 -795718 -1158570 -1954681 -2470167 -2866017 -3518626 -3766806 -2694656
36281b694656K055977J796845P11675n85118j689252j590261M42511K714864K183574
$$ -2694656 -638679 1158166 1869841 1284723 -404529 -1994790 -1552279 1162585 3346159
36272C346159j248588l662586j965469J923638L706218K258135K32177k64637
$$ 3346159 2097571 -1565015 -3530484 -1606846 2099372 4357507 4589684 4325047
36264D325047j7329l86467r95122r75247q53577j456659j897187o63976J526436
$$ 4325047 4307718 3921251 2926129 1950882 1097305 -359354 -2256541 -2920517 -1394081
36255a394081K089813K86037j428256q98794O58675Q26379k53714o26231q4069
$$ -1394081 695732 981769 -446487 -1345281 -686606 139773 -113941 -740172 -824241
36246h24241j82496r48175n91905J041338J755062P65852J99080J224469J677285
$$ -824241 -1006737 -1954912 -2546817 -1505479 249583 1015435 1214515 2438984 4116269
36237D116269r8306j770449o08205J537529P47327k551174l855110j330224J662638
$$ 4116269 4017963 2247514 1639309 3176838 3924165 1372991 -2482119 -3812343 -2149705
36228b149705J801781J61573m14419L48244P08488K22909K38186J512800K882597
$$ -2149705 -347924 -186351 -600770 -252526 455962 678871 917057 2429857 5312454
36219E312454K472775j80164l124699l435749m92230K599759K307376p89524k652784
$$ 5312454 7785229 7605065 4480366 1044617 552387 3152146 5459522 4669998 2017214
36210B017214j201064J169239J389576k04759j322092j424887j608886j753250
$$ 2017214 816150 1985389 3374965 3170206 1848114 423227 -1185659 -2938909
36202b938909m93039J827859K581478L40768k631194k936556m14415J696278J126657
$$ -2938909 -3431948 -1604089 977389 1318157 -1313037 -4249593 -4664008 -2967730 -1841073
36193a841073m72749j01074K099622K919213P68248j857082j868422J42390J144818
$$ -1841073 -2313822 -2414896 -315274 2603939 3372187 1515105 -353317 -210927 933891
36184I33891J57124r65870r29980n26552l07935O08255K175370K262223j21116
$$ 933891 1091015 125145 -804835 -1331387 -1639322 -1031067 1144303 3406526 3285410
36175C285410k253009r70113K406131L244489j81437m200896m410916r26088K392347
$$ 3285410 1032401 62288 2468419 5712908 5531471 1330575 -3080341 -4006429 -1614082
36166a614082K687585N62282j537947j870785m43169J233666J283213o37209k406252
$$ -1614082 1073503 1635785 97838 -1772947 -2216116 -982450 300763 -336446 -2742698
36157b742698j462658J873310M213584K963238n96824l059410k871496j269969
$$ -2742698 -4205356 -2332046 1881538 4844776 4247952 1188542 -1682954 -2952923
36149b952923J35555J010715J503371J415883P63454J35004r213K65932P50765
$$ -2952923 -2817368 -1806653 -303282 1112601 1876055 2011059 2001846 2267778 3018543
36140C018543J064556M50490j227550k490228j769119J47936R93627L85877J54303
$$ 3018543 4083099 4533589 3306039 815811 -953308 -805372 188255 574132 728435
36131G28435R93255J338500M24325k15355L67306Q02383K15970J4206P84093L73308
$$ 728435 1721690 3060190 3484515 3269160 3636466 4438849 4654819 4669025 5453118 5826426
36121E826426k159815l639681j446794J554274J204146r98142m59630K293992
$$ 5826426 3666611 26930 -1419864 134410 1338556 340414 -119216 2174776
36113B174776K138380j729877l743651p05058L119927K778313j17957q27857J163426
$$ 2174776 4313156 2583279 -1160372 -1865430 1254497 4032810 3914853 3086996 4250422
36104D250422K411869J198770q04815j642970j003077L77891J251119N54793j024186
$$ 4250422 6662291 7861061 7056246 5413276 4410199 4788090 6039209 6594002 5569816
36095E569816j418273k94409O5272j497882k658935j164042J368307J889991M73635
$$ 5569816 4151543 3857134 3922406 2424524 -234411 -1398453 -30146 1859845 2333480
36086B333480m87595l31506l54155q54500r21843o63542q61410p95706Q03938
$$ 2333480 1845885 1514379 1160224 305724 -616119 -1279661 -2141071 -2936777 -2132839
36077b132839K824896K621573K0133k103679j694562K79303J878701K265251J278486
$$ -2132839 692057 3313630 3333763 1230084 -464478 -185175 1693526 3958777 5237263
36068E237263q81214k855810k904791j169752M38661R59691J152270J276427M07967
$$ 5237263 4356049 1500239 -1404552 -2574304 -2135643 -1175952 -23682 1252745 1660712
36059A660712j258162j762527l46349R67744L13959j261527j698628r88288l77880
$$ 1660712 402550 -1359977 -1706326 -738582 -424623 -1686150 -3384778 -4373066 -4750946
36050d750946J31841J205758K016081J183798m70651o40868Q48697J619613N79003
$$ -4750946 -4619105 -3413347 -1397266 -213468 -684119 -1324987 -476290 1143323 1722326
36041A722326k85689O95007J883657Q98331j339881j812786j06495R32869l27230
$$ 1722326 1436637 2131644 4015301 4913632 3573751 1760965 1654470 2587339 2260109
36032B260109j816045j068824J070969K018302J341299P88055J009373O46771
$$ 2260109 444064 -624760 446209 2464511 3805810 4593865 5603238 6250009
36024F250009j022937k557259k359898q78602J98780J09395m88558o49490m7201
$$ 6250009 5227072 2669813 309915 -568687 -369907 -260512 -749070 -1398560 -1445761
36015a445761R54570J619361J358150J92134j337052k584845k922667j860798
$$ -1445761 -491191 1128170 2486320 2678454 1341402 -1243443 -4166110 -6026908
36007f026908L13053K262223K669503J496637k29761j441342j395668M0827J600047
$$ -6026908 -5713855 -3451632 -782129 714508 484747 -956595 -2352263 -2311436 -711389
35998g11389J282350p98540j590679P90001L440334K173890k080626m094887j760497
$$ -711389 570961 -227579 -1818258 -1028257 2412077 4585967 2505341 -1589546 -3350043
35989c350043J268300J478071P1891m30939m71549j317443j641829J88962K510837
$$ -3350043 -2081743 -603672 -531781 -962720 -1434269 -2751712 -4393541 -4204579 -1693742
35980a693742K641832J197386N91671O29386n11821j882152p44653K085376K363154
$$ -1693742 948090 2145476 2737147 3366533 2854712 972560 227907 2313283 4676437
35971D676437j077518l950383k516636J321061L247813K283103O50584k65402
$$ 4676437 3598919 -351464 -2868100 -1547039 1700774 3983877 4634461 4369059
35963D369059r30390j454713j091106m4771K92881m82001q48040M96341K411153
$$ 4369059 3438669 1983956 892850 848079 1140960 658959 -189081 307260 2718413
35954B718413K376710k86929l226034l628796j428769R03929J467788O80750j00028
$$ 2718413 5095123 4808194 1582160 -2046636 -3475405 -2571476 -1103688 -422938 -522966
35945e22966k97156O0739Q28438J233786K68568j375961j326957J030882K758754
$$ -522966 -820122 -759383 69055 1302841 1571409 195448 -1131509 -100627 2658127
35936B658127J157770j967812k586433k48724J488739N18161j077660o87339J088174
$$ 2658127 3815897 1848085 -738348 -987072 501667 1019828 -57832 -745171 343003
35927C43003J878241Q31429j061699k567878k821811j452005P71406K319660K689266
$$ 343003 2221244 3052673 1990974 -576904 -3398715 -4850720 -4079314 -1759654 929612
35918I29612K703098K494567R24801j864480l206162j240215J762486J854880
$$ 929612 3632710 6127277 7052078 5187598 1981436 741221 2503707 4358587
35910D358587j218874l512487k060552J497474L342379J943064j043422l168919
$$ 4358587 3139713 -372774 -2433326 -935852 2406527 4349591 3306169 137250
35902A37250l108573r12579K031567L366725J639808j705566l415628k177077
$$ 137250 -2971323 -3883902 -1852335 1514390 3154198 1448632 -1966996 -4144073
35894d144073j57447J10509q52302p53666O65745J342611L49399o60595j57134
$$ -4144073 -4301520 -4191011 -5043313 -5796979 -5131234 -3788623 -3439224 -4099819 -4256953
35885d256953J099228J637433J330859O97044k56864j135232o69838J223311K345406
$$ -4256953 -3157725 -1520292 -189433 507611 250747 -884485 -1554323 -331012 2014394
35876B014394J091885q42525q32731O63403J015401k86757j061954j87799Q09395
$$ 2014394 3106279 2263754 1431023 2094426 3109827 2823070 1761116 1573317 2382712
35867B382712N70127l6369K48772R34610P12492n55460j748477j796411o62764
$$ 2382712 2952839 2916470 3165242 4099852 4812344 4256884 2508407 711996 49232
35858D9232N02773L42961r21002j314087J98867J804316J374131q5413o0362J037410
$$ 49232 552005 894966 -26036 -1340123 -1141256 663060 2037191 1951778 1891416 2928826
35848B928826L89979k047817k626567L04225L243203K526955k91155j155258L21692
$$ 2928826 3318805 1270988 -1355579 -1051354 2191849 4718804 4427649 3272391 3594083
35839C594083R33890p07379k324571j756315K91803K020887K751781K404901P49856
$$ 3594083 4527973 3820594 1496023 -260292 31511 2052398 4804179 7209080 7958936
35830G958936j534789k563995j468353J32105K89253n52049o57200j04430n33578
$$ 7958936 6424147 3860152 2391799 2523904 2813157 2261108 1603908 1499478 965900
35821I65900j761098j254928J782228M095142K416638j622050l417463j611430
$$ 965900 -795198 -2050126 -267898 3827244 6243882 4621832 1204369 -407061
35813d07061O76610R74609N16378J002880J386095O0857j982419k668319j951057
$$ -407061 269549 1244158 1760536 2763416 4149511 4210368 2227949 -440370 -2391427
35804b391427j105383k73157Q93273J358995J00682j464738j047996J069719K589097
$$ -2391427 -3496810 -3769967 -2876694 -1517699 -1417017 -2881755 -3929751 -2860032 -270935
35795b70935K614843K062828J272873o4430j059405o09600M6399j134949k994880
$$ -270935 2343908 4406736 5679609 5615179 4555774 3946174 3992573 2857624 -137256
35786a37256k168844J418995L625799J885405j286622k305050j271897o03353
$$ -137256 -2306100 -887105 2738694 4624099 3337477 1032427 -239470 -842823
35778h42823r74319r40151M20051K201243K684010J087668j194085j509394O94356
$$ -842823 -1817142 -2757293 -2337242 -135999 2548011 3635679 2441594 932200 1626556
35769A626556K331775O02310k556943l000053o35762P53233j41486n64066P36275
$$ 1626556 3958331 4560641 2003698 -996355 -1632117 -878884 -1020370 -1584436 -848161
35760h48161J250914j22712m91744J650007K897107L57830l225978l738144j734767
$$ -848161 402753 280041 -211703 1438304 4335411 4693241 1467263 -2270881 -4005648
35751d005648q7936J225011L244727L755992M22828l604962l040887J300130L270878
$$ -4005648 -4093584 -2868573 376154 4132146 4554974 950012 -2090875 -790745 2480133
35742B480133N11392k627867k199886L13714J741148J652434R79127j89051j232646
$$ 2480133 2991525 363658 -1836228 -1522514 218634 1871068 2850195 2661144 1428498
35733A428498m71631J810131K493609K3241k702002k260668M19505J710029M33525
$$ 1428498 956867 2766998 5260607 5283848 2581846 321178 740683 2450712 2884237
35724B884237j236415j351495l37976L67570R0151q63210j609330j232215K51131
$$ 2884237 1647822 296327 -41649 325921 416072 -447138 -2056468 -3288683 -3037552
35715c037552J548170J463353M76118J52000R97943J761071J194061j91437q83844
$$ -3037552 -1489382 -26029 450089 602089 1600032 3361103 4555164 4363727 3479883
35706C479883o02540p17056k025033l115299k065309P66848L052489L425586K555662
$$ 3479883 2877343 2160287 135254 -2980045 -5045354 -4278506 -1226017 2199569 4755231
35697D755231J269841m57067k072569k074830l13900J030740K45867j527409k142266
$$ 4755231 6025072 5568005 3495436 1420606 1106706 2137446 2383313 855904 -1286362
35688a286362j336856k86364L62952M11636n22057j800681j444184R95202K809861
$$ -1286362 -2623218 -2909582 -2546630 -2134994 -2657051 -4457732 -5901916 -4906714 -2096853
35679b096853J738796l81936l84261J246304J513508L8660p30794o3700K13858
$$ -2096853 -358057 -739993 -1124254 122050 1635558 1674218 943424 879724 1093582
35670A093582l96859k61348O62140K57581j412201j213920J712862L539584J348037
$$ 1093582 696723 435375 1097515 1355096 -57105 -1271025 441837 3981421 5329458
35661E329458k165131k832656j140106m35834j019010l16613J853073K524251
$$ 5329458 3164327 331671 -808435 -1244269 -2263279 -2579892 -726819 1797432
35653A797432N55923j335787q11463P33682Q25879k34561l63177O74024Q98073
$$ 1797432 2353355 1017568 206105 939787 1765666 1531105 1167928 1841952 2740025
35644B740025p27325k573515k414499k36882J822319K008109P00976m46138n28352
$$ 2740025 2012700 -560815 -2975314 -3212196 -1389877 618232 1319208 873070 344718
35635C44718m5639J98891J16790O708j95025p52557j449752j651281j036909J70074
$$ 344718 299079 497970 614760 621468 426443 -326114 -1775866 -3427147 -4464056 -4293982
35625d293982J624598K866811K903804Q62237k259564l530049j226096K422596
$$ -4293982 -2669384 197427 3101231 3963468 1703904 -1826145 -3052241 -629645
35617f29645L420816J023276j444203j359400m6548J96111j29514N00588J019611
$$ -629645 2791171 3814447 2370244 1010844 964296 1160407 1030893 1531481 2551092
35608B551092n29751k680592j967908J289069K777952P24729j452271q41673N42645
$$ 2551092 2021341 -659251 -2627159 -1338090 1439862 2164591 712320 -129353 413292
35599D13292j19511j319294l6682K582767K660297k22020k290670j207326R69987
$$ 413292 293781 -1025513 -1062195 1520572 4180869 3958849 1668179 460853 1430840
35590A430840J354217J35483n65653j88131k70651j591745k199940J94702L919800
$$ 1430840 2785057 2920540 2354887 2166756 1896105 304360 -1895580 -1700878 2218922
35581B218922L932443j307744o002441l999333J996864L771149j55438k622993
$$ 2218922 6151365 4843621 -1158820 -5158153 -3161289 609860 454422 -2168571
35573b168571J61924K585658j28443l222992p53092L609403K682152j785745k362204
$$ -2168571 -2006647 579011 450568 -2772424 -3525516 83887 2766039 980294 -1381910
35564a381910J088068J847437j183098j850615J589991L297573O21753j531050
$$ -1381910 -293842 1553595 370497 -1480118 109873 3407446 4029199 2498149
35556B498149m82497o60504m116226n067837j371M746455K823838j487642p36372
$$ 2498149 2015652 1355148 -2761078 -7828915 -7830286 -3083831 -259993 -1747635 -2484007
35547b484007L089771K684108j565381k521543J225685L315587N56944k563231
$$ -2484007 605764 3289872 1724491 -797052 428633 3744220 4301164 1737933
35539A737933k234007q78492j360596j665023P26534L525976K979754r1596j539818
$$ 1737933 -496074 -1374566 -2735162 -4400185 -3673651 -147675 2832079 2740483 1200665
35530A200665J4707J659368P43983j534939k112963l69023J113417K93530j342413
$$ 1200665 1215372 2874740 3618723 2083784 -29179 -398202 715215 1008745 -333668
35521c33668j068372P74865J269219l69310j574544p30209M35855K71614p2980
$$ -333668 -1402040 -627175 642044 272734 -1301810 -2032019 -1596164 -1324550 -1397530
35512a397530N60571P90362m61034j349749l16377P15036l08241j511551k16473
$$ -1397530 -836959 -46597 -507631 -1857380 -2173757 -1458721 -1766962 -3278513 -3494986
35503c494986K104626K276303R73603J119749K106173Q12613k144138k603565
$$ -3494986 -1390360 885943 1859546 2979295 5085468 5898081 3753943 1150378
35495A150378J77435J859983k73702l370594l682270j563561L02430P98266M55883
$$ 1150378 1327813 3187796 2914094 -456500 -4138770 -5702331 -5399901 -4601635 -4145752
$$ [...]
##END NTUPLES=NMR SPECTRUM
##END=
