##TITLE=31Pdec_SR82 Leu'_1
 CDCl3, 124 sc
 2.09.2021
##JCAMPDX= 6.0         $$ Bruker NMR JCAMP-DX V2.0
##DATA TYPE= NMR SPECTRUM
##DATA CLASS= NTUPLES
##ORIGIN= UXNMR, Bruker Analytische Messtechnik GmbH
##OWNER= root
$$ XWIN-NMR		Version 3.5
$$ Thu Sep  2 12:05:53 2021 Russian Standard Time (UT+4h)  she@DPX200
##.OBSERVE FREQUENCY= 81.013821
##.OBSERVE NUCLEUS= ^31P
##.ACQUISITION MODE= SIMULTANEOUS
##.ACQUISITION SCHEME= undefined
##.AVERAGES= 124
##.DIGITISER RES= 16
##SPECTROMETER/DATA SYSTEM= spect
##.PULSE SEQUENCE= zgpg30
##.SOLVENT NAME= CD2Cl2
##.SHIFT REFERENCE= (INTERNAL, CD2Cl2, 0, 248.564)
##AUDIT TRAIL= $$ (NUMBER, WHEN, WHO, WHERE, WHAT)
$$ ##TITLE= Audit trail, XWIN-NMR		Version 3.5
$$ ##JCAMPDX= 5.01
$$ ##ORIGIN= Bruker BioSpin GmbH
$$ ##OWNER= she
$$ F:/spectra/data/she/nmr/P31/1/pdata/1/auditp.txt
$$ ##AUDIT TRAIL=  $$ (NUMBER, WHEN, WHO, WHERE, WHAT)
(   1,<2021-09-02 12:04:34.87 +0400>,<she>,<DPX200>,
      <continue with go, POWCHK disabled, PULCHK disabled
       configuration hash MD5:
       00 E9 B6 7A A2 85 ED C7 34 08 36 98 17 FE 4E 26
       data hash MD5: 32K
       F6 79 C3 86 36 4F B1 2A E1 CF BF 08 DF 0C CF 50>)
(   2,<2021-09-02 12:04:47.96 +0400>,<she>,<DPX200>,
      <Start of raw data processing
       efp BC_mod = 2 LB = 1 FT_mod = 6 PKNL = 1 PHC0 = -7749.611 PHC1 = 121.6703 SI = 64K 
       data hash MD5: 64K
       8C 5A D6 36 C8 73 9C 53 69 3A F6 51 25 BE 1C F5>)
(   3,<2021-09-02 12:05:12.21 +0400>,<she>,<DPX200>,
      <pk PHC0 = -10.5027 PHC1 = 18.40001 
       data hash MD5: 64K
       2A 0A 61 62 92 B1 B3 CF E9 96 95 13 E4 A5 46 76>)
$$ ##END=
$$ 
$$ hash MD5
$$ 1E 09 A1 14 08 8C BA CE CC 93 BB 27 12 17 58 C1
##$RELAX= 
##$RELAX= 
##$RELAX= 
##$RELAX= 
##$RELAX= 
##$RELAX= 
##$RELAX= 
##$RELAX= 
$$ Bruker specific parameters
$$ --------------------------
##$DU= <F:/spectra>
##$EXPNO= 1
##$NAME= <P31>
##$PROCNO= 1
##$TYPE= <nmr>
##$USER= <she>
##$AMP= (0..31)
100 100 100 100 100 100 100 100 100 100 100 100 100 100 100 100 100 100 
100 100 100 100 100 100 100 100 100 100 100 100 100 100 
##$AQSEQ= 0
##$AQ_mod= 1
##$AUNM= <au_zg>
##$AUTOPOS= <>
##$BF1= 81.014009
##$BF2= 200.13
##$BF3= 200.13
##$BF4= 200.13
##$BF5= 200.13
##$BF6= 200.13
##$BF7= 200.13
##$BF8= 200.13
##$BYTORDA= 1
##$CFDGTYP= 0
##$CFRGTYP= 5
##$CHEMSTR= <none>
##$CNST= (0..31)
1 1 145 1 1 1 1 1 1 1 1 1 1 1 1 1 1 1 1 1 1 1 1 1 1 1 1 1 1 1 1 1 
##$CPDPRG= <waltz16>
##$CPDPRG1= <>
##$CPDPRG2= <waltz16>
##$CPDPRG3= <>
##$CPDPRG4= <mlev>
##$CPDPRG5= <mlev>
##$CPDPRG6= <mlev>
##$CPDPRG7= <mlev>
##$CPDPRG8= <mlev>
##$CPDPRGB= <>
##$CPDPRGT= <>
##$D= (0..31)
0 1 0 0 0 0 0 0 0 0 0 0.03 2e-05 3e-06 0 0 0 0 0 0 0 0 0 0 0 0 0 0 0 0 
0 0 
##$DATE= 1630569688
##$DBL= (0..7)
120 120 120 11 120 120 24 19 
##$DBP= (0..7)
150 150 150 150 150 150 150 150 
##$DBP07= 0
##$DBPNAM0= <>
##$DBPNAM1= <>
##$DBPNAM2= <>
##$DBPNAM3= <>
##$DBPNAM4= <>
##$DBPNAM5= <>
##$DBPNAM6= <>
##$DBPNAM7= <>
##$DBPOAL= (0..7)
0.5 0.5 0.5 0.5 0.5 0.5 0.5 0.5 
##$DBPOFFS= (0..7)
$$ [...]
##$SUBNAM2= <"">
##$SUBNAM3= <"">
##$SUBNAM4= <"">
##$SUBNAM5= <"">
##$SUBNAM6= <"">
##$SUBNAM7= <"">
##$SUBNAM8= <"">
##$SUBNAM9= <"">
##$SW= 501.771253377433
##$SWIBOX= (0..15)
0 1 3 0 0 0 0 0 0 0 0 0 0 0 0 0 
##$SW_h= 40650.406504065
##$TD= 32768
##$TD0= 1
##$TE= 0
##$TE2= 300
##$TE3= 300
##$TEG= 300
##$TL= (0..7)
0 120 53 12 22 120 120 120 
##$TP= (0..7)
150 150 150 150 150 150 150 150 
##$TP07= 0
##$TPNAME0= <>
##$TPNAME1= <>
##$TPNAME2= <>
##$TPNAME3= <>
##$TPNAME4= <>
##$TPNAME5= <>
##$TPNAME6= <>
##$TPNAME7= <>
##$TPOAL= (0..7)
0.5 0.5 0.5 0.5 0.5 0.5 0.5 0.5 
##$TPOFFS= (0..7)
0 0 0 0 0 0 0 0 
##$TUNHIN= 0
##$TUNHOUT= 0
##$TUNXOUT= 0
##$USERA1= <user>
##$USERA2= <user>
##$USERA3= <user>
##$USERA4= <user>
##$USERA5= <user>
##$V9= 5
##$VALIST= <valist>
##$VCLIST= <CCCCCCCCCCCCCCC>
##$VD= 0
##$VDLIST= <DDDDDDDDDDDDDDD>
##$VPLIST= <PPPPPPPPPPPPPPP>
##$VTLIST= <TTTTTTTTTTTTTTT>
##$WBST= 1024
##$WBSW= 4
##$XGAIN= (0..3)
0 0 0 0 
##$XL= 0
##$YL= 0
##$YMAX_a= 10512
##$YMIN_a= -16186
##$ZGOPTNS= <>
##$ZL1= 120
##$ZL2= 120
##$ZL3= 120
##$ZL4= 120
##$ABSF1= 0
##$ABSF2= 0
##$ABSG= 0
##$ABSL= 0
##$ALPHA= 0
##$AQORDER= 0
##$ASSFAC= 0
##$ASSFACI= 0
##$ASSFACX= 0
##$ASSWID= 0
##$AUNMP= <proc_1d>
##$AZFE= 0.1
##$AZFW= 0.5
##$BCFW= 0
##$BC_mod= 2
##$BYTORDP= 0
##$COROFFS= 0
##$CY= -3
##$DATMOD= 1
##$DC= 0
##$DFILT= <>
##$DTYPP= 0
##$F1P= 0
##$F2P= 0
##$FCOR= 1
##$FTSIZE= 65536
##$FT_mod= 6
##$GAMMA= 0
##$GB= 0
##$INTBC= 1
##$INTSCL= 5.30512e-09
##$ISEN= 30
##$LB= 1
##$LEV0= 0
##$LPBIN= 0
##$MAXI= 10000
##$MC2= 0
##$MEAN= 0
##$ME_mod= 0
##$MI= 50
##$NCOEF= 0
##$NC_proc= -7
##$NLEV= 6
##$NOISF1= 182.463
##$NOISF2= 159.3651
##$NSP= 0
##$NTH_PI= 0
##$NZP= 0
##$OFFSET= 248.5645
##$PC= 4
##$PHC0= -7760.114
##$PHC1= 140.0703
##$PH_mod= 1
##$PKNL= yes
##$PPARMOD= 0
##$PSCAL= 0
##$PSIGN= 0
##$REVERSE= no
##$SF= 81.014009
##$SI= 65536
##$SIGF1= 159.3651
##$SIGF2= -187.1042
##$SINO= 113.3802
##$SIOLD= 16384
##$SREGLST= <1H.CDCl3>
##$SSB= 0
##$STSI= 65536
##$STSR= 0
##$SW_p= 40650.406504065
##$SYMM= 0
##$S_DEV= 0
##$TDeff= 32768
##$TDoff= 0
##$TI= <>
##$TILT= no
##$TM1= 0
##$TM2= 0
##$TOPLEV= 0
##$USERP1= <user>
##$USERP2= <user>
##$USERP3= <user>
##$USERP4= <user>
##$USERP5= <user>
##$WDW= 1
##$XDIM= 65536
##$YMAX_p= 444222688
##$YMIN_p= -111344690
$$ End of Bruker specific parameters
$$ ---------------------------------
##NTUPLES= NMR SPECTRUM
##VAR_NAME=  FREQUENCY,     SPECTRUM/REAL,   SPECTRUM/IMAG
##SYMBOL=    X,             R,               I
##VAR_TYPE=  INDEPENDENT,   DEPENDENT,       DEPENDENT
##VAR_FORM=  AFFN,          ASDF,            ASDF
##VAR_DIM=   65536,         65536,           65536
##UNITS=     HZ,            ARBITRARY UNITS, ARBITRARY UNITS
##FACTOR=    0.620285442955139, 1,           1
##FIRST=     20137.2065510759, 0,            0
##LAST=      -20513.1999529892, 0,           0
##MIN=       -20513.1999529892, -111344690,  0
##MAX=       20137.2065510759, 444222688,    0
$$ Real data points
##PAGE= N=1
##DATA TABLE= (X++(R..R)), XYDATA
$$ [...]
43313f09368o82199j219488m142920m924038o35874M166055M733757K554288O59612
$$ -609368 -1291567 -2511055 -6653975 -11578013 -12213887 -8047832 -3314075 -759787 -100175
43304a00175p88785j188357J010518K950942k95552n651669m142361L659991N892617
$$ -100175 -888960 -2077317 -1066799 1884143 1588591 -4063078 -8205439 -4545448 1347169
43295A347169j493883o477552k56402P438660L972992n570702p322577n38680
$$ 1347169 -146714 -6624266 -6880668 557992 4530984 -1039718 -8362295 -8900975
43287h900975M358941M421894N262056O298059R87072p860038q325630J768646
$$ -8900975 -4542034 -120140 5141916 11439975 12427047 4567009 -3758621 -1989975
43279a989975R587591N913448k181816l579452R80363K555217k179940p531277
$$ -1989975 7597616 13511064 11329248 7749796 8730159 11285376 9105436 1574159
43271A574159o853869j34923N602476L298419m893273q067196p22761P624990
$$ 1574159 -5279710 -5414633 187843 3486262 -1407011 -9474207 -10196968 -2571978
43263b571978M830817n439649q615650j146333N457934L991759J095273K665452
$$ -2571978 2258839 -3180810 -11796460 -12942793 -7484859 -3493100 -2397827 267625
43255B67625L288623j646569n071909l6327O785435N085180k233283m272485K69418
$$ 267625 3556248 1909679 -3162230 -3198557 3586878 8672058 6438775 2166290 2435708
43246B435708K857721J54830k422606j913695j827064l503083k801648J880638
$$ 2435708 5293429 5448259 3025653 1111958 -715106 -4218189 -7019837 -5139199
43238e139199N738144M716924Q59598j922031k619021j874080l67768J76199j500493
$$ -5139199 598945 5315869 6175467 4253436 1634415 -239665 -607433 -431234 -1931727
43229a931727k940640o91021L286397L216024j393357l974305n12422M338112
$$ -1931727 -4872367 -5563388 -2276991 939033 -454324 -4428629 -4941051 -602939
43221f02939M043038j018840n034256m059058J056706O474218P706221K774756
$$ -602939 3440099 2421259 -2612997 -6672055 -5615349 858869 8565090 11339846
43213A1339846m679791p941791m874092l52723P24153n72829p13806M36627R17461
$$ 11339846 6660055 -1281736 -6155828 -6508551 -5784398 -6357227 -7071033 -6634406 -5716945
43204e716945R29528J678637J997190J91704k223232k509242j117766l07287K37347
$$ -5716945 -4787417 -3108780 -1111590 -919886 -3143118 -5652360 -6770126 -7077413 -6840066
43195f840066K091903L596211J730757j885622k336624O55167J761170j320591
$$ -6840066 -4748163 -1151952 578805 -1306817 -3643441 -2988274 -1227104 -2547695
43187b547695l881252j799072J969086K545568N65740l10153J3986p37532j819411
$$ -2547695 -6428947 -8228019 -6258933 -3713365 -3147625 -3457778 -3443792 -4181324 -6000735
43178f000735q21616J104246R04677n99864l33389O55999q45385k310055K138927
$$ -6000735 -6822351 -5718105 -4813428 -5413292 -5746681 -5090682 -5936067 -8246122 -6107195
43169f107195R866797R625719j946837j2365778r406120J538513N705938J87908
$$ -6107195 3759602 13385321 11438484 -927294 -10333414 -8794901 -3088963 -2901055
43161b901055m083863l96878M904904M083717q45317l305756j870198L13770J411644
$$ -2901055 -6984918 -7381796 -2476892 1606825 761508 -2544248 -4414446 -4100676 -2689032
43152b689032J754475J734946J990489L058485L065119n35251n275972m740101
$$ -2689032 -934557 800389 2790878 5849363 8914482 8379231 3103259 -1636842
43144a636842J941565P045931M697775q79808k591457r01235o16813j547860k38815
$$ -1636842 304723 7350654 12048429 11168621 8577164 7675929 7059116 5511256 5272441
43135E272441J695625m27632m982542n311194q86886J335444j443269l381402
$$ 5272441 6968066 6540434 1557892 -3753302 -4640188 -3304744 -4748013 -8129415
43127h129415o12081J837646p77775l873624j009248M673084N033315K26361j658727
$$ -8129415 -8741496 -6903850 -7681625 -11555249 -12564497 -7891413 -2858098 -2631737 -4290464
43118d290464J936762L885618o82259n957321m056245L185535P243168M968454
$$ -4290464 -2353702 1531916 849657 -5107664 -9163909 -5978374 1264794 6233248
43110F233248J198687o8768p34092l053297m401614j505674L212952M141541L43479
$$ 6233248 7431935 7363167 6629075 3575778 -825836 -2331510 881442 5022983 5366462
43101E366462l259388k871275k90807R30578O97755J373437L368413M296897K157186
$$ 5366462 2107074 -764201 -1055008 -124430 573325 1946762 5315175 9612072 11769258
43092A1769258k228781n840528n854539k156223J891239K308443r87390l780939
$$ 11769258 9540477 3699949 -2154590 -4310813 -2419574 -111131 -1098521 -4879460
43084d879460k702862P38831K750249K257722J090372L03089q52964k339574k305344
$$ -4879460 -7582322 -6843491 -4093242 -1835520 -745148 -442059 -1295023 -3634597 -5939941
43075e939941L84311L992944N184147K128391l493321p253274n729361m23353
$$ -5939941 -5555630 -1562686 3621461 5749852 2256531 -4996743 -10726104 -11149457
43067a1149457L254403K197067p23819j122598N86339O59102j225543j156040
$$ -11149457 -7895054 -5697987 -6421806 -7544404 -6958065 -6298963 -7524506 -8680546
43059h680546K248274M649783K260789j880211j777380K771220N499519K307275
$$ -8680546 -6432272 -1782489 478300 -1401911 -3179291 -408071 5091448 7398723
43051G398723l090148m416927j341400Q02226p97332k678451j218882J276086
$$ 7398723 4308575 -108352 -1449752 -647526 -1444858 -4123309 -5342191 -4066105
43043d066105M93732k139933j004380M474396P769640M490305j227917k935958
$$ -4066105 -3572373 -5712306 -6716686 -2242290 5527350 10017655 8789738 5853780
43035E853780n40172J373072Q64672l19061j032794j491277j058083N15794R27078
$$ 5853780 5313608 6686680 7551352 7232291 6199497 4708220 3650137 4165931 5093009
43026E093009j374686l203900q33286L102737K628354k090230m529060j745617
$$ 5093009 3718323 514423 -318863 2783874 5412228 3321998 -1207062 -2952679
43018b952679J802422K169008J503576K681126L701816J499155k511042m645969
$$ -2952679 -1150257 1018751 2522327 5203453 8905269 10404424 7893382 3247413
43010C247413m017970k191560j94574J441451J974201J975568L070478M464640
$$ 3247413 -770557 -2962117 -3156691 -1715240 258961 2234529 5305007 9769647
43002I769647K992508j473074m520333l573804j635007j601497j284025J848617
$$ 9769647 12762155 11289081 6768748 3194944 1559937 -41560 -1325585 523032
42994E23032N153174M986830K784906J555917l19823n411312r982548p853414
$$ 523032 5676206 10663036 13447942 15003859 14684036 9272724 -709824 -8563238
42986h563238o04603L485609J202184j874025q86899J725291K019916J073859
$$ -8563238 -9167841 -5682232 -4480048 -6354073 -7240972 -5515681 -3495765 -2421906
42978b421906J617077K425605P71250k008042j916490J529931M230429K996000
$$ -2421906 -804829 1620776 2392026 383984 -1532506 -2575 4227854 7223854
42970G223854l90085j753192j269J512927m14566m068963m732643j425671J285953
$$ 7223854 6833769 5080577 5079308 6592235 6177669 2108706 -2623937 -4049608 -2763655
42961b763655n6058k424444r71382L201742M494247J162449k567339l125858j838242
$$ -2763655 -2819713 -5244157 -6215539 -3013797 1480450 2642899 75560 -3050298 -4888540
42952d888540j195775q47647M88533J952641J769656J0865j522759j329051M54263
$$ -4888540 -6084315 -6931962 -6443429 -4490788 -2721132 -2710267 -4233026 -5562077 -5107814
42943e107814J943390J251534m75482N27960M734079O233843J73039q388187r418824
$$ -5107814 -3164424 -1912890 -2388372 -1860412 2873667 9107510 9280549 892362 -8526462
42934h526462j817432M711473L554956m00995j87400K436836J878027q91118o31981
$$ -8526462 -10343894 -5632421 -2077465 -2478460 -2665860 -229024 1649003 757885 125904
42925A25904K319571K500850j149433l623809k424622j079852k122805k510907
$$ 125904 2445475 4946325 3796892 173083 -2251539 -3331391 -5454196 -7965103
42917g965103O91984M673264M967704K214526O52544J409214J297778j713506
$$ -7965103 -7273119 -2599855 2367849 4582375 5234919 6644133 7941911 6228405
42909F228405n046073m748749n45594L704247M200879J016295k442364l275896
$$ 6228405 1182332 -3566417 -4112011 -407764 3793115 4809410 2367046 -908850
42901i08850j736381l856P15510R96277J552739J922735J114444q64637k410415
$$ -908850 -2645231 -2649087 -1933577 -937300 615439 2538174 3652618 2787981 377566
42892C77566j579688J453905L518713J588283k771374m204818l59157M207901
$$ 377566 -1202122 251783 3770496 5358779 2587405 -1617413 -1976570 2231331
42884B231331L692351q14728k756282M14398L739926K545897o10890o46158J456809
$$ 2231331 5923682 5108954 2352672 2767070 6506996 9052893 8442003 7795845 9252654
42875I252654L11304m381718o205014j804646L281675K780138o01205J83128M313912
$$ 9252654 9563958 5182240 -1022774 -2827420 454255 3234393 2633188 2816316 7130228
42866G130228L335871n187742j1786117p408638L638090R172896M717602k648979
$$ 7130228 10466099 5278357 -6507760 -13916398 -10278308 -1105412 3612190 963211
42858I63211m898736j461292L335017N790939M320943k73992m271504m050406
$$ 963211 -3935525 -5396817 -2061800 3729139 8050082 7776090 3504586 -545820
42850e45820p41791J286058Q08607M12831N72010j265127m210130l096383K616628
$$ -545820 -1287611 -1553 807054 1219885 1791895 526768 -3683362 -6779745 -4163117
42841d163117N597222J326791l889298k244519L153755L439315j590208l521549
$$ -4163117 1434105 2760896 -1128402 -3372921 -219166 3220149 1629941 -1891608
42833a891608Q95455N188267L912504q4495k019112k018238k014802j356948N76768
$$ -1891608 -996153 4192114 8104618 8020123 6001011 3982773 1967971 611023 1187791
42824A187791J767419J137417Q57770J871293J214412k570316n429153l615362
$$ 1187791 2955210 4092627 4950397 6821690 8036102 5465786 36633 -3578729
42816c578729L398M82674j133530K9034M007071N527650K428922q43539O8708
$$ -3578729 -3575331 -3092657 -4226187 -4197153 -190082 5337568 7766490 6922951 6991659
42807F991659L191642L309547p05359m226930k604780K661917M837135k9221p295545
$$ 6991659 10183301 13492848 12787489 8560559 5955779 8617696 13454831 13425610 6130065
42798F130065q874156l890831K54757j096516l230500m48488L928597K572702
$$ 6130065 -2744091 -6634922 -6380165 -7476681 -10707181 -11155669 -7227072 -4654370
42790d654370l683455o405238j900444M281358O302758M825539K794595O71115
$$ -4654370 -8337825 -14743063 -16643507 -12362149 -6059391 -1233852 1560743 2231858
42782B231858j087344k91244K595056L121584k79382k739286o09714J962535l64368
$$ 2231858 1144514 853270 3448326 6569910 6290528 3551242 2941528 4904063 4539695
42773D539695m870806m722003L71725M344082M196392K286161o7706l784362o377804
$$ 4539695 -331111 -5053114 -4681389 -337307 3859085 6145246 6077540 2293178 -4084626
42764d084626l014085M581681P733246K884991k776248k359942O31342n24226
$$ -4084626 -7098711 -2517030 5216216 8101207 5324959 2965017 3596359 3072133
42756C072133m165112l889097j26804R74222j167752o71731L625861N081864L73183
$$ 3072133 -1092979 -4982076 -5108880 -4134658 -5302410 -5974141 -2348280 2733584 3106767
42747C106767m186282k230245L098021M921867K976306J579336Q90956k227819
$$ 3106767 -1079515 -3309760 -211739 4710128 7686434 9265770 10156726 7928907
42739G928907o169789n233673Q27990M859549K492015j400582k88732M207789
$$ 7928907 1759118 -3474555 -2646565 2212984 4704999 3304417 3015685 7223474
42731G223474N052455K55005m465710l756378M77212K040864j569262o204107
$$ 7223474 12275929 12530934 8065224 4308846 4786058 6826922 5257660 -946447
42723i46447o069317n58936M894140M945586K89991l662014l425524q24426N70259
$$ -946447 -7015764 -7574700 -2680560 2265026 2555017 -1106997 -4532521 -5356947 -4786688
42714d786688K53701M72490K241098L642791K387341r63304l109189j594160K018202
$$ -4786688 -4532987 -4060497 -1819399 1823392 4210733 3247429 138240 -1455920 562282
42705E62282L558488J334247j617893j791874j35081j3119j388826j008717J475488
$$ 562282 4120770 5455017 3837124 2045250 1910169 1897050 508224 -500493 974995
42696I74995K169892o38798l185733k165011J88797P64341J374635M652304P227636
$$ 974995 3144887 2506089 -679644 -2844655 -2655858 -1891517 -516882 4135422 11363058
42687A1363058L671250l996176p717867m687398n02231L54862L64675K430765
$$ 11363058 15034308 11038132 3320265 -1367133 -1869364 -1514502 -1149827 1280938
42679A280938L965490K060449o54837p32885l98864l259937o478259m025880L373335
$$ 1280938 5246428 7306877 6652040 5919155 5520291 2260354 -4217905 -8243785 -4870450
42670d870450Q144836O150740J364182j015228j050615j506783k874624l758776
$$ -4870450 3274386 9425126 10789308 9774080 8723465 7216682 4342058 583282
42662E83282l636506k749519q84139J841992M034079M102660J679202k188439
$$ 583282 -3053224 -5802743 -6686882 -4844890 -810811 3291849 4971051 2782612
42654B782612n230390m885823r03980L368049M355152K395131L02361j047375
$$ 2782612 -2447778 -7333601 -8237581 -4869532 -514380 1880751 2183112 1135737
42646A135737k415013k581693M33943M648534N523157K750637O00101N70841m88692
$$ 1135737 -1279276 -3860969 -3427026 1221508 6744665 9495302 10095403 10666244 10177552
42637A0177552l184182l129205R65276L415289O19072k368718n49262J782021
$$ 10177552 6993370 3864165 4829441 8244730 8863802 6495084 5945822 7727843
42629G727843j388794n984731l648288L512412N152501o20698m152421j60236
$$ 7727843 6339049 354318 -3293970 218442 5370943 4750245 597824 437588
42621D37588M056515J248528m155184l975462R31879L573246K249510J479404
$$ 437588 4494103 5742631 1587447 -2388015 -1456136 2117110 4366620 5846024
42613E846024L380807M604221J859423l632093p349291n246610K217184Q513138
$$ 5846024 9226831 13831052 15690475 12058382 4709091 -537519 1679665 10192803
42605A0192803O625534j826317p046881l506143K654659K823098k054805m383202
$$ 10192803 16818337 14992020 7945139 4438996 7093655 9916753 7861948 3478746
42597C478746j397741K695539L929046J799283k998899q018246p920654m67259
$$ 3478746 2081005 4776544 8705590 10504873 7505974 -512272 -8432926 -8900185
42589h900185P557360P387025N01384l675228j964477n72665k794836l242812
$$ -8900185 -1342825 6044200 6545584 2870356 905879 333214 -2461622 -5704434
42581e704434J558326N601313K911024k076852j376343L708163M766448o58311
$$ -5704434 -4146108 1455205 4366229 2289377 913034 4621197 9387645 8729334
42573H729334n886510n236349j052060J130440k8098j586282j197503L15852Q81400
$$ 8729334 2842824 -2393525 -3445585 -2315145 -2343243 -3929525 -5127028 -4811176 -3929776
42564c929776L92587R43306L265529M325854R51733m748485p100094m330623l79990
$$ -3929776 -3537189 -2593883 671646 4997500 5949233 1200748 -5899346 -10229969 -10609959
42555a0609959J609643K822707L858747J858025l456245n852263n33733P267829
$$ -10609959 -9000316 -6177609 -2318862 -460837 -3917082 -9769345 -10303078 -3035249
42547c035249Q115864J255829m597061l228673J988322M058357R21802l706371
$$ -3035249 5080615 6336444 1739383 -1489290 499032 4557389 5479191 1772820
42539A772820n220703k403252J845706L815134L422131L587185M509131K449441
$$ 1772820 -3447883 -5851135 -4005429 -190295 3231836 6819021 11328152 13777593
42531A3777593l286044o943860m514183o84868j275619l095719J97135N441744
$$ 13777593 10491549 3547689 -966494 -1651362 -2926981 -6022700 -5825565 -383821
42523c83821L897647l080050m274298L279451Q332492K835113n362629n000558
$$ -383821 3513826 433776 -3840522 -561071 7771421 10606534 5243905 243347
42515B43347J847702M785270J065874k964541l086575j181173L91250J170359
$$ 243347 2091049 6876319 7942193 4977652 1891077 709904 1101154 2271513
42507B271513M17904j646801k017872N84599K099689l66911k093725J965073P000650
$$ 2271513 2689417 1042616 -975256 -390657 1709032 1342121 -751604 1213469 8214119
42498H214119M647749k728251m611503R09061M114153l79897n554825m464906
$$ 8214119 12861868 10133617 5522114 6431175 10545328 10165431 4610606 145700
42490A45700r10575j123878k960555j196769K506896L064098R62851o471m03170
$$ 145700 -764875 -1888753 -4849308 -6046077 -3539181 -475083 487768 481297 78127
42481G8127k544129l252275J929683Q708406P655339j331833p150087k927702
$$ 78127 -2466002 -5718277 -3788594 4919812 12575151 11243318 4093231 1165529
42473A165529M532198N278061j96387l833673k229171O76515J337986P73588N89993
$$ 1165529 5697727 10975788 10779401 6945728 4716557 5393072 6731058 7504646 8094639
42464H094639j73689k394539m268173l514382m86433K488848L647812K495933
$$ 8094639 7920950 5526411 1258238 -2256144 -2742577 -253729 3394083 5890016
42456E890016n64223l630687l572373O30400N162011M800319k82689m054712k612285
$$ 5890016 5325793 1695106 -1877267 -1246867 3915144 8715463 8432774 4378062 1765777
42447A765777L72907o19415m264025m411531q1678K566924m1386l000632p18378
$$ 1765777 2138684 1519269 -2744756 -7156287 -7237965 -4671041 -4712427 -7713059 -8431437
42438h431437L992866M305511J18863k135255K67620K910349K185590M79268N89336
$$ -8431437 -4438571 -133060 -14197 -2149452 -1881832 1028517 3214107 3693375 4282711
42429D282711L60678k720754n542257l400900K103560M810776K994409J070551
$$ 4282711 4643389 1922635 -3619622 -7020522 -4916962 -106186 2888223 3958774
42421C958774J645163J464366k119570n463475l808235Q82499K443943l63867
$$ 3958774 5603937 7068303 4948733 -514742 -4322977 -3440478 -996535 -1360402
42413a360402k646878j632706o29309k454579l830339o07982M654215N684161
$$ -1360402 -4007280 -5639986 -6269295 -8723874 -12554213 -13162195 -8507980 -2823819
42405b823819J821164j094829L98577K724062J480457j860654k658655J06312
$$ -2823819 -1002655 -2097484 -1698907 1025155 2505612 644958 -2013697 -1907385
42397a907385L069018L246610Q85051j818877k847727j684604J42240M68257p78827
$$ -1907385 1161633 4408243 5293294 3474417 626690 -1057914 -915674 -447417 -1226244
42388a226244j513456p66544M0598Q1414O83999K196058K290286k8837j668229
$$ -1226244 -2739700 -3506244 -3465646 -3384232 -2700233 -504175 1786111 1757274 89045
42379H9045p963K501777K203650J15035o39607q24661k867322m501298j478760
$$ 89045 81082 2582859 4786509 4901544 4261937 3437276 569954 -3931344 -5410104
42370e410104L850520M091449j860799o164352l185891L150571O330881N530468
$$ -5410104 -1559584 2531865 671066 -5493286 -8679177 -5528606 802275 6332743
42362F332743L143214k51785l847747m514296j701711m6150k102612l008762J823143
$$ 6332743 9475957 9224172 5376425 862129 -839582 -885732 -2988344 -5997106 -4173963
42353d173963P956152P715635J518492l733819n080499m825216l408454P19632
$$ -4173963 3782189 11497824 13016316 9282497 4201998 -623218 -4031672 -3312040
42345c312040M713454L290363k178089m499571j899897l88337k761938l664139
$$ -3312040 1401414 4691777 2513688 -1985883 -3885780 -4274117 -7036055 -10700194
42337a0700194M98378M538235K939967j003329r09062K545471L813953J613895
$$ -10700194 -10201816 -5663581 -2723614 -3726943 -4636005 -2090534 1723419 3337314
42329C337314n00598p53596o04018o67010q6357O47329K89960m05462P5878J035616
$$ 3337314 2836716 2083120 1479102 812092 725735 1373064 1663024 1257562 1333440 2369056
42319B369056R46888L87791M15637j87131k490177m177301k786936l74347m17099
$$ 2369056 3315944 3703735 4119372 3932241 1442064 -2735237 -5522173 -5896520 -6313619
42310f313619j681091l03898L094702M040138J690114j09989K13083j44214k051012
$$ -6313619 -7994710 -8298608 -5203906 -1163768 526346 416357 629440 485226 -1565786
42301a565786j910807J827968M798810L048071q42520k115154j191421j989215
$$ -1565786 -3476593 -1648625 3150185 6198256 5355736 3240582 2049161 59946
42293E9946m602633m520378M93936O333283P005553J660208m290442n046322o80420
$$ 59946 -4542687 -9063065 -8569129 -2235846 4769707 6429915 2139473 -2906849 -3587269
42284c587269L306201K614347j295227m122544l977780j604309K222688N913137
$$ -3587269 -281068 2333279 1038052 -3084492 -7062272 -8666581 -6443893 -530756
42276e30756N653862j77909o005309m337953L359585P274051K597754l996455
$$ -530756 5123106 4945197 -1060112 -5398065 -2038480 5235571 7833325 3836870
42268C836870m547840m93823J721241P64296N8108O11196N31912n7028O13493
$$ 3836870 -710970 -1204793 516448 1280744 1338852 1950048 2481960 2424932 3038425
42259C038425J649186O72669j462967j936662j082892j314348j769174L99535
$$ 3038425 4687611 5360280 3897313 1960651 877759 -436589 -2205763 -1806228
42251a806228L609673K826690k061223m808220j885155K372770K663717J21063
$$ -1806228 1803445 4630135 2568912 -2239308 -4124463 -1751693 912024 1033087
42243A033087r12343J12285M30814p40239j447905o43792N91581J161178J014347
$$ 1033087 120744 233029 663843 -76396 -1524301 -2168093 -1576512 -415334 599013
42234E99013L10879p99632j741055j978776j650561j114871m33836L76783J387899
$$ 599013 909892 110260 -1630795 -3609571 -5260132 -6375003 -6808839 -6432056 -5044157
42225e044157K996448M841112M790199J198849l617749m858818j309396K506856
$$ -5044157 -2047709 2793403 7583602 8782451 5164702 305884 -1003512 1503344
42217A503344J978895j718775l533528j193830K209163K328402j066522l644478
$$ 1503344 3482239 1763464 -1770064 -2963894 -754731 1573671 507149 -3137329
42209c137329j761352K424872L114588j082091m346584j759675K894087K508571
$$ -3137329 -4898681 -2473809 640779 -441312 -4787896 -6547571 -3653484 -1144913
42201a144913k125411l311575J255661M727361K054223k381808k380591P45847
$$ -1144913 -3270324 -6581899 -5326238 -598877 1455346 -926462 -3307053 -2561206
42193b561206J840527L13381r34440j560492k895750l571853j724539M28389k62101
$$ -2561206 -720679 -407298 -1341738 -2902230 -5797980 -9369833 -11094372 -10665983 -10928084
42184a0928084j802349L29498N678760R274806Q723799N833082K211025j582529
$$ -10928084 -12730433 -12400935 -6722175 2552631 11276430 17109512 19320537 17738008
42176A7738008l581415k560027j577700l670896n426815j747961M063343L516481
$$ 17738008 14156593 11596566 10018866 6347970 921155 -826806 3236537 6753018
42168F753018l207925o013637l58709N301523K790475l199897l168902K444976
$$ 6753018 3545093 -2468544 -2827253 2474270 5264745 2064848 -1104054 1340922
42160A340922N081143J497125k843648l072352o20264J078253J092001k14390
$$ 1340922 6422065 7919190 5075542 2003190 1382926 2461179 3553180 3338790
42152C338790k739524n237128n232859k109978J442515K439859J081947J71111
$$ 3338790 599266 -4637862 -9870721 -11980699 -10538184 -8098325 -7016378 -6845267
42144f845267J424465L291202L034860O33841q80254L10554K031904J366732j040781
$$ -6845267 -5420802 -2129600 905260 1539101 658847 969401 3001305 4368037 3327256
42135C327256k375993j731464P543K381464M043647J911370l548294n282534J127861
$$ 3327256 951263 -780201 -772658 1608806 5652453 7563823 4015529 -1267005 -139144
42126a39144P876904M030206o797517r503949k6554Q017724M404428k853241k546886
$$ -139144 7737760 11767966 4970449 -4533500 -4560054 3457670 7862098 5008857 2461971
42117B461971J442026q08305o606022n468125K270582O142309K934115j72567
$$ 2461971 3903997 3095692 -3510330 -8978455 -6707873 -565564 2368551 2195984
42109B195984K95593j75281k794711k231594K186091L293837j424051m206965
$$ 2195984 2491577 2316296 -478415 -2710009 -523918 2769919 1345868 -2861097
42101b861097N33123O672446N741775p44257m864867l542360k90282J243142P03176
$$ -2861097 -2327974 4344472 10086247 9341990 4477123 934763 644481 1887623 2590799
42092B590799k72050M2817J460495J299043j578906l113659Q69725O881203P363275
$$ 2590799 2318749 2361566 3822061 5121104 3542198 428539 1298264 8179467 15542742
42083A5542742J769618l135527m100150m174915m070898o20147L907895J794663
$$ 15542742 17312360 14176833 10076683 5901768 1830870 1210723 5118618 6913281
42075F913281o467527r328170j241903P728226P145585J297153k75298J599374
$$ 6913281 445754 -8882416 -10124319 -2396093 4749492 6046645 5771347 7370721
42067G370721O17664j861431p88581R96835k185858o240998k747706N433003P215965
$$ 7370721 7988385 6126954 5338373 6335208 4149350 -2091648 -4839354 593649 7809614
42058G809614J079025l364182k091556j610750m709513m534083J878248N867824
$$ 7809614 8888639 5524457 3432901 1822151 -2887362 -7421445 -5543197 324627
42050C24627M89991p298741o224104L329694J0767856R286620J931290m396333
$$ 324627 814618 -6484123 -12708227 -9378533 1389323 10675943 12607233 8210900
42042H210900n856133l285690j23111J279297J767784K693749K531754l29757
$$ 8210900 2354767 -930923 -1054034 225263 1993047 4686796 7218550 6888793
42034F888793k946500j327594K165663J402477l411386n478426k370870O02619
$$ 6888793 3942293 2614699 4780362 6182839 2771453 -2706973 -5077843 -4475224
42026d475224K04390J31285K439092K508247k080716n362368k316444K367663
$$ -4475224 -4270834 -4139549 -1700457 807790 -1272926 -6635294 -8951738 -6584075
42018f584075K353603M74615K829859O892391N386708p22756l327309o01485N40093
$$ -6584075 -4230472 -3755857 -925998 5966393 11353101 10630345 7303036 6701551 7241644
42009G241644l280554o279448l455252J324222J867287r77298j601317J737696
$$ 7241644 3961090 -2318358 -5773610 -4449388 -2582101 -3559399 -5160716 -3423020
42001c423020N129693M653527N69933l785527n378593l880696j543971l75261
$$ -3423020 1706673 6360200 6930133 3144606 -2233987 -6114683 -7658654 -8033915
41993h033915M12062K877252O423058P433644L722584k152753n262410l400284
$$ -8033915 -7621853 -4744601 1678457 9112101 12834685 10681932 5419522 2019238
41985B019238R14953L193987J359291k414480m102977k060082J426222K768155
$$ 2019238 2934191 6128178 7487469 5072989 970012 -1090070 336152 3104307
41977C104307O62098l005876n052345l720612l53583J766024J153532m3575M24842
$$ 3104307 3766405 760529 -4291816 -8012428 -8366011 -6599987 -5446455 -5490030 -5065188
41968e065188Q51764j678216n155159m044922K077999O392671M128895o54811
$$ -5065188 -4213424 -5891640 -11046799 -15091721 -13013722 -6621051 -2492156 -3146967
41960c146967j691965J41260l92422l451747l950341k74682K964334K075013p01355
$$ -3146967 -4838932 -4697672 -5090094 -8541841 -12492182 -12766864 -9802530 -7727517 -8428872
41951h428872j212584J238983M466490O393507N642420J678408l561625o020284
$$ -8428872 -9641456 -8402473 -3935983 2457524 8099944 9778352 6216727 196443
41943A96443l579584J148942L509252J644949k165140m221262k683718J185433
$$ 196443 -3383141 -2234199 1275053 2920002 754862 -3466400 -6150118 -4964685
41935d964685M292790M432191K019458q83563k770340l347331k616383m86554
$$ -4964685 -671895 3760296 5779754 4896191 2125851 -1221480 -3837863 -4324417
41927d324417K583049N238180N791825L349216r20916l757400k581529J047688
$$ -4324417 -1741368 3496812 9288637 12637853 11716937 7959537 5378008 6425696
41919F425696K372703q93141n209317n263764n85594L750108L015543j892179
$$ 6425696 8798399 7905258 2695941 -2567823 -3153417 596691 3612234 1720055
41911A720055n521959l790305J625336N363844M746242K364758J386033R87061
$$ 1720055 -3801904 -7592209 -5966873 -603029 4143213 6507971 7894004 8881065
41903H881065o17110j293883J778218N437981L522916l252490p271941n306852
$$ 8881065 8263955 6970072 8748290 14186271 17709187 14456697 7184756 1877904
41895A877904k500168k468533j521381K661338M761745J102190k016714K107842
$$ 1877904 -622264 -3090797 -4612178 -1950840 2810905 3913095 1896381 4004223
41887D004223Q372438O967054j377297p334299p288612n334542l071719J450610
$$ 4004223 12376661 19343715 17966418 10632119 3343507 -1991035 -5062754 -3612144
41879c612144N312414K825572l084663l023270L423598N958882M57952m327031
$$ -3612144 1700270 4525842 1441179 -1582091 1841507 7800389 8258341 3931310
41871C931310j981195J378853o62450l191325N7663M078833R63864n529849n331570
$$ 3931310 1950115 3328968 2666518 -524807 -467144 3611689 4575553 -954296 -6285866
41862f285866J891734P101873O239331L746749K372664n05408n092310o456068
$$ -6285866 -4394132 2707741 8947072 12693821 15066485 14561077 9468767 3012699
41854C012699k399732K469699L373711J134872r16421j536690j035475K18712
$$ 3012699 612967 3082666 6456377 7591249 6674828 5138138 4102663 4321375
41846D321375R34788m16878k651486k489034N55968K694062R08251k772258l937092
$$ 4321375 5256163 4839285 2187799 -301235 254733 2948795 3857046 1084788 -2852304
41837b852304j390829J692578J901374l69903j680181j01666K337761K880635
$$ -2852304 -4243133 -2550555 -649181 -1019084 -2699265 -2800931 -463170 2417465
41829B417465K152889K440994L026905J254354j898565k163298J040525K986573
$$ 2417465 4570354 7011348 10038253 11292607 9394042 7230744 8271269 11257842
41821A1257842Q91526k247682l351033l359252k888271J261L914103K927802l394054
$$ 11257842 12149368 9901686 6550653 3191401 303130 304391 4218494 7146296 3752242
41812C752242o071216J0958O117857K496122n195811m358883L951832O921610
$$ 3752242 -2318974 -2308016 3809841 6305963 1110152 -3248731 703101 7624711
41804G624711J185475k698473R13483L891862l30841n409779l920883n7234j200677
$$ 7624711 8810186 6111713 7025196 10917058 10586217 5176438 1255555 1198321 -2356
41795b356m820588l756327R96886K669570M43623m12790J651578K768247J151794
$$ -2356 -4822944 -8579271 -7582385 -4912815 -4469192 -4881982 -3230404 -462157 689637
41786F89637p53385j604583k548305l091492j120968K397459L649415J710448
$$ 689637 -63748 -1668331 -4216636 -7308128 -8429096 -6031637 -2382222 -671774
41778f71774k05619l3480N85963P0999m51284K13436R91976O03845j68997K9234
$$ -671774 -877393 -910873 -324910 -253911 -705195 -491759 500217 1104062 935065 964299
41768I64299P33944K86700j650252l222852k284842Q76734L200545K196656o02511
$$ 964299 1698243 1984943 334691 -2888161 -5173003 -4296269 -1095724 1100932 498421
41759D98421j302366R16872K374229J98800l220734l340179M64934M371208M963580
$$ 498421 -803945 112927 2487156 2685956 -534778 -3874957 -3410023 961185 5924765
41750E924765K481119n66372k257043k469023k219124k187646k008283j274669
$$ 5924765 8405884 7839512 5582469 3113446 894322 -1293324 -3301607 -4576276
41742d576276n03451K8272J381789L854445M851417J976006k368844l396012r62989
$$ -4576276 -5079727 -5051455 -3669666 184779 5036196 7012202 4643358 1247346 284357
41733B84357L48403j159974j839207M16488K333934J303285k5548Q80974J451329
$$ 284357 632760 -527214 -2366421 -1949933 384001 1687286 1661738 2542712 3994041
41724C994041p55354k375707L26999L981919K605208k797213n680133l669331
$$ 3994041 3238687 862980 1189979 5171898 7777106 4979893 -700240 -4369571
41716d369571o35828K40019k70973q64112j217789k65388K508102M624796L685346
$$ -4369571 -5005399 -4765380 -5036353 -5900465 -7118254 -7383642 -4875540 -250744 3434602
41707C434602J497888P02128l25085l581323n339762j330246M249202L704478
$$ 3434602 4932490 5634618 5309533 1728210 -3611552 -4941798 -692596 3011882
41699C011882j403443k424706J435544J523298m708992q148623k848608M228469
$$ 3011882 1608439 -816267 619277 2142575 -2566417 -10715040 -13563648 -9335179
41691i335179M923485K049701K109031L829610K521405n99042j950928k820858
$$ -9335179 -4411694 -2361993 -252962 3576648 6098053 5499011 3548083 727225
41683G27225m781828l596571L332141Q903781N722494j238087k258640J075364
$$ 727225 -4054603 -7651174 -4319033 4584748 10307242 9069155 6810515 7885879
41675G885879k07383n489874n517817K06838J686311l646762n730871M43701N558987
$$ 7885879 7678496 2188622 -3329195 -3122357 -1436046 -5082808 -10813679 -10369978 -4810991
41666d810991J929054l241695l96068O127863N799743o35346l271070O47197L619408
$$ -4810991 -2881937 -6123632 -6519700 -391837 5407906 4772560 1501490 2148687 5768095
41657E768095O36400m122828m631645n37033M121286N389107K006097l391283
$$ 5768095 6404495 2281667 -2349978 -2887011 1234275 6623382 8629479 5238196
41649E238196o108267m620761k079527p09079J359841M568620M532532n55178
$$ 5238196 -870071 -5490832 -7570359 -8279438 -6919597 -2350977 2181555 1626377
41641A626377m343232j319101L173750Q58894m876670l113816O625292J1925487
$$ 1626377 -2716855 -4035956 -862206 -3312 -4879982 -7993798 -1368506 10556981
41633A0556981N334564n441619r404815n880009j103829J814942L512560L846687
$$ 10556981 15891545 10449926 1045111 -4834898 -5938727 -4123785 -611225 3235462
41625C235462K505042J187720J074274P31406o61563j226411R6260J596148K373374
$$ 3235462 5740504 6928224 8002498 8733904 8072341 6845930 6942190 8538338 10911712
41616A0911712L518075L866657J58105n948765p470151k628542R62003k092845
$$ 10911712 14429787 18296444 18454549 12505784 5035633 2407091 3369094 1276249
41608A276249n995986l337637K657237M092411J482228R10515J804110j247871
$$ 1276249 -4719737 -8057374 -5400137 -1307726 174502 1085017 2889127 1641256
41600A641256o108387m514727L153736O283887O26878m389724o64066N677225
$$ 1641256 -4467131 -8981858 -5828122 455765 1082643 -3307081 -3971147 1706078
41592A706078M327590l077459o157332j594446L343785K697166m47933k05389
$$ 1706078 6033668 2956209 -3201123 -4795569 -1451784 1245382 797449 592060
41584E92060L345080N101206K505967j059020j065302J642319J526474l729597
$$ 592060 3937140 9038346 11544313 10485293 9419991 11062310 12588784 8859187
41576H859187q804305p310130q34129L234763K240809Q98500K385138L094474
$$ 8859187 54882 -7255248 -8089377 -4854614 -2613805 -1715305 669833 3764307
41568C764307l59128m345516l567630M79561K178733Q24224R44468L969986N411404
$$ 3764307 3405179 -940337 -4507967 -4028406 -1849673 -1025449 -80981 3889005 9300409
41559I300409J997852k796346l261414Q70847M197162K526645k219694m685996
$$ 9300409 11298261 8501915 5240501 6111348 10308510 12835155 10615461 5929465
41551E929465k527777J258783K580826J112548n43258j097291j272016r09071
$$ 5929465 3401688 4660471 7241297 8353845 7810587 6713296 5441280 4532209
41543D532209J053938L214723K234015j565197l032089M21003L785896J150412
$$ 4532209 5586147 8800870 11034885 9469688 6437599 6858602 10644498 11794910
41535A1794910n013810o649254j496547L974577M105787J155574m9086l1483k299107
$$ 11794910 6781100 131846 -1364701 2609876 6715663 7871237 7822151 7790668 5491561
41526E491561n516996m192983K307338P085653M872326n49171k382921r43983
$$ 5491561 -25435 -4218418 -1911080 5174573 10046899 9497728 7114807 6170824
41518F170824j755508n114106m996116L74257M291778J723190k639605j968531
$$ 6170824 4415316 -698790 -5694906 -5320649 -1028871 694319 -1945286 -3913817
41510c913817K164000L510736J557517O23286J036712o29418l508646k845093
$$ -3913817 -1749817 1760919 3318436 3941722 4978434 4349016 840370 -2004723
41502b004723J285709L479275K099617J200348K168396J536294r77068q26687
$$ -2004723 -719014 2760261 4859878 6060226 8228622 9764916 8787848 7961161
41494G961161J984983Q15589n867574r432028l946996L760185M335142m35480
$$ 7961161 9946144 10761733 4894159 -4537869 -8484865 -4724680 -389538 -825018
41486h25018k368362L1209J878640J473785J079102P14271j060209k172536k588
$$ -825018 -3193380 -3162171 -1283531 190254 1269356 1983627 923418 -1249118 -1251706
41477a251706K581348J043442k747670l080715N23502L430673L604713K673135
$$ -1251706 1329642 2373084 -374586 -3455301 -2931799 498874 4103587 6776722
41469F776722Q34937k521014m380058j196445M292446N817585K501152r68477
$$ 6776722 7611659 5090645 710587 -485858 3806588 9624173 12125325 11156848
41461A1156848j966319j637366m13567J766800K275205o56442l103128j021395
$$ 11156848 9190529 7553163 7139596 8906396 11181601 10525159 7422031 6400636
41453F400636J922320R4886l310565r17446N246716N725146r98995o127585m579135
$$ 6400636 8322956 8417842 5107277 4189831 9436547 15161693 14162698 8035113 3455978
41444C455978p49523J323706K937207L774449O56696m095733l618422J340503
$$ 3455978 2706455 4030161 6967368 10741817 11398513 7302780 3684358 5024861
41436E024861K147057k718571m251486J207127N084816J468854l241473k707917
$$ 5024861 7171918 4453347 201861 1408988 6493804 7962658 4721185 2013268
41428B013268r74562k336212k337731J929048L577863j806647o197163k487176
$$ 2013268 1038706 -1297506 -3635237 -1706189 1871674 65027 -6132136 -8619312
41420h619312K527395P84968j763336L129475Q512074L346954o136018m918256
$$ -8619312 -6091917 -5306949 -7070285 -3940810 4571264 7918218 1782200 -3136056
41412c136056N148396P662168j183072p076019j779408N061221L731910j392544
$$ -3136056 2012340 9674508 8491436 1415417 -363991 4697230 8429140 7036596
41404G036596k601645r90266k78825J009619L832283L845086q75160m847587l857026
$$ 7036596 4434951 3444685 3165860 4175479 8007762 11852848 10977688 6130101 2273075
41395B273075j549988j982416k649747n36759J552127N31644j023162r5806J071725
$$ 2273075 723087 -1259329 -3909076 -4445835 -2893708 -2362064 -3385226 -3481032 -2409307
41386b409307o6932q98517J367385L971251L281685R70547L68010O74114j72682
$$ -2409307 -2476239 -3374756 -2007371 1963880 5245565 6216112 6584122 7258236 7085554
41377G085554p75179M41109Q94353j910525n022231m253041r90771M94827J82117
$$ 7085554 6310375 6751484 7645837 5735312 713081 -3539960 -4530731 -4035904 -3853787
41368c853787J230559L358040K835919j070442m189186k731758K235445O031156
$$ -3853787 -2623228 734812 3570731 2500289 -1688897 -4420655 -2185210 3845946
41360C845946M726768j048477n826474m565160R57965L714241O49406l216717
$$ 3845946 8572714 7524237 1697763 -2867397 -1909432 1804809 2454215 -762502
41352g62502k268062J852115L563277J642404l36076l98030m43893j976949l163379
$$ -762502 -3030564 -1178449 2384828 4027232 3691156 3293126 2849233 872284 -2291095
41343b291095j491919K429201N061531L741800j72009k600416j482565J025965
$$ -2291095 -3783014 -1353813 3707718 7449518 7277509 4677093 3194528 4220493
41335D220493K095163K000283K181116J744813n80833k833065k500570j326671
$$ 4220493 6315656 8315939 10497055 12241868 11661035 8827970 6327400 5000729
41327E000729k383341l698231r75776L956085M549616n6782l471640k427644j115256
$$ 5000729 2617388 -1080843 -2056619 1899466 6449082 6392300 2920660 493016 -622240
41318f22240k619778l635749j340080J477773K152353K370319K769647M22721
$$ -622240 -3242018 -6877767 -8217847 -6740074 -4587721 -2217402 552245 974966
41310I74966l882118l538962L117326P676320M038056j591558j115866K180359
$$ 974966 -2907152 -6446114 -3328788 4347532 8385588 6794030 5678164 7858523
41302G858523M36820m572927m960706n99245J591559J01212p6992K052531J952255
$$ 7858523 8295343 3722416 -1238290 -1837535 -245976 -144764 -221756 1830775 3783030
41293C783030j236170k959932j431268L96581J341267K853160L446897K08975
$$ 3783030 2546860 -413072 -1844340 -1447759 -106492 2746668 6193565 6402540
41285F402540m056394l309519J756872M344566K415598L80263l80293l062484
$$ 6402540 2346146 -963373 793499 5138065 7553663 7933926 7553633 4491149
41277D491149o254630l634263M157138P571845K531742k884754j632603J648181
$$ 4491149 -1763481 -5397744 -1240606 6331239 8862981 5978227 4345624 5993805
41269E993805J57175l121519j565247L126423M165740R54903j319857r23427p16456
$$ 5993805 6150980 3029461 1464214 4590637 8756377 9711280 8391423 7467996 6751540
41260F751540j426452o52330J747274K858950J314371j543234m495213o628338
$$ 6751540 5325088 4672758 6420032 9278982 10593353 9050119 4554906 -2073432
41252b073432n796445j066982M035419M777490J402270j487451j356580O8482
$$ -2073432 -7869877 -8936859 -4901440 -123950 1278320 -209131 -1565711 -1497229
41244a497229J030380K391587M823684O185487L929272q25011l673846k165375
$$ -1497229 -466849 1924738 6748422 12933909 16863181 16038170 12364324 10198949
41236A0198949N45765n92390n204243p253749l871597k17030j374333l481512
$$ 10198949 10744714 10152324 4948081 -2305668 -6177265 -6394295 -7768628 -11250140
41228a1250140K26905P170960Q087714J708140k786129l8350M097600L244876
$$ -11250140 -11023235 -3852275 4235439 5943579 3157450 3119100 7216700 10461576
41220A0461576k29888j768219k365632l782016l447290o02815k49581l965277
$$ 10461576 10231688 8463469 6097837 2315821 -1131469 -1734284 -1983865 -5949142
41212e949142m422956K620231Q669776N102978j786531p86611N030530L678672
$$ -5949142 -10372098 -7751867 917909 6020887 4234356 3447745 8478275 12156947
41204A2156947m568855p369886j435860K709976j94449j995282K464691N368174
$$ 12156947 7588092 218206 -1217654 1492322 1297873 -697409 1767282 7135456
41196G135456N41261m558234j677608L511028R91839o586534q305682j987942
$$ 7135456 7676717 3118483 1440875 4951903 5943742 -642792 -8948474 -10936416
41188a0936416M140476M504159J396732j634151l383222k579289J084056L991096
$$ -10936416 -6795940 -2291781 -895049 -2529200 -5912422 -8491711 -7407655 -3416559
41180c416559K630835m64181m27129K005226K343707L08913p40682p59566k121457
$$ -3416559 -785724 -1249905 -1677034 328192 2671899 2980812 2240130 1480564 -640893
41171f40893k951504N88503N593775M643498k126636n808827j958617L339533
$$ -640893 -3592397 -3003894 2589881 7233379 5106743 -702084 -2660701 678832
41163F78832M099833K870220L601358L741071K2459m046782l887393k221975l884308
$$ 678832 4778665 7648885 11250243 14991314 15013773 10966991 7079598 4857623 973315
41154I73315o062880k524293M488956N935916j58110n264364l001922K347481
$$ 973315 -5089565 -7613858 -3124902 2811014 2652904 -2611460 -5613382 -3265901
41146c265901L607615Q71122p61296N64798K178989J581833j141535m021785m103272
$$ -3265901 341714 1212836 451540 1016338 3195327 4777160 3635625 -386160 -4489432
41137d489432J51042N506265O108384J327998k300305l48021K450818l82281o054599
$$ -4489432 -4338390 1167875 7276259 8604257 6303952 5955931 8406749 8024468 1969869
41128A969869o034579P24656N871387L946086p61096k373781j770734k344289
$$ 1969869 -4064710 -3340054 2531333 6477419 5716323 3342542 1571808 -772481
41120g72481k885100n51507K547232J927953j791045l648769j854929O22677J713622
$$ -772481 -3657581 -4209088 -1661856 266097 -1524948 -5173717 -7028646 -6405969 -4692347
41111d692347K371941K758050J451529n63402l10422J225731q06318o237994p058491
$$ -4692347 -2320406 437644 1889173 1325771 1015349 2241080 1434762 -4803232 -11861723
41102a1861723J309714J0717601R583547q48708p662818l964796K654357K362506
$$ -11861723 -10552009 165592 9749139 8900431 1237613 -2727183 -72826 2289680
41094B289680l240265n295370j013360L915104M578479K279936M44179J96079
$$ 2289680 -950585 -6245955 -7259315 -3344211 1234268 3514204 3958383 4154462
41086D154462J190558K761380K940797L8785l531947l040600J209788K909223
$$ 4154462 5345020 8106400 11047197 11085982 7554035 4513435 5723223 8632446
41078H632446q96202m263911j044589M898819M852029j532454n751176l107400
$$ 8632446 7736244 3472333 2427744 7326563 12178592 10646138 4894962 1787562
41070A787562J685875L145496K045559Q50395j042954l220054j740083L687849
$$ 1787562 3473437 6618933 8664492 9514887 8471933 5251879 3511796 7199645
41062G199645N657257q60444r027223q872252k013228J779871O39210K081085
$$ 7199645 12856902 11996458 2969235 -5903017 -7916245 -6136374 -5497164 -3416079
41054c416079P754894Q695560M25299p723228n808354K257294O081386M320478
$$ -3416079 4338815 13034375 13459674 5736446 -71908 2185386 8266772 12587250
41046A2587250K925178K326222k100685q087796o929110J906394P351708K786547
$$ 12587250 15512428 17838650 15737965 7650169 721059 2627453 9979161 12765708
41038A2765708l584520j439362N644096O008490k112611q399324n970475M0147
$$ 12765708 9181188 7741826 13385922 19394412 17281801 8882477 2912002 2952149
41030B952149K075330P69293J046350K869258K309417m19716m16181M057725Q288816
$$ 2952149 5027479 5796772 6843122 9712380 12021797 11602081 11185900 15243625 23532441
41021B3532441P399600K212184l141772o226292o397173k867395L597040Q672038
$$ 23532441 30932041 33144225 30002453 23776161 17378988 14511593 18108633 26780671
41013B6780671Q205950L717618P85223J928590M434130N513237N841094O750798
$$ 26780671 34986621 38704239 39489462 41418052 45852182 51365419 57206513 63957311
41005F3957311P478994P237455P180899Q274155R873234J2410334J8301685K7271766
$$ 63957311 71436305 78673760 85854659 94128814 104002048 116412382 134714067 161985833
40997A61985833L3743061L2663662K5767795J8224027J1258202K728509o756667
$$ 161985833 195728894 228392556 254160351 272384378 283642580 286371089 279614422
40990B79614422j4023594j9217938k5555934l2306200l3834433k7885886j9760801
$$ 279614422 265590828 246372890 220816956 188510756 154676323 126790437 107029636
40983A07029636j5219289j3565659j1314407q776676q346239q840602o741973
$$ 107029636 91810347 78244688 66930281 58153605 49807366 40966764 34224791
40976C4224791k349751j63057k514699o094074o015647j530606L238944L516990
$$ 34224791 31875040 31711983 29197284 23103210 17087563 15556957 18795901 22312891
40968B2312891j254454o353713o254919o27103N246383O473902L245327j134840
$$ 22312891 21058437 14704724 8449805 7822702 13069085 19542987 22788314 21653474
40960B1653474m354764n540892m111747q79592J302708N89351j329488j816888
$$ 21653474 17298710 11757818 7646071 6766479 8069187 8658538 7329050 5512162
40952E512162p71526O45618K465356M063966K393332l546373q244851n129898
$$ 5512162 4740636 5386254 7851610 11915576 14308908 10762535 2517684 -2612214
40944b612214L802535R244583O340503J34788k361228o81475J209396J467465
$$ -2612214 1190321 10434904 16775407 16910195 14548967 13867492 15076888 16544353
40936A6544353J270988J725203K977093M713963N385029K992596j302947k899844
$$ 16544353 17815341 19540544 22517637 27231600 32616629 35609225 34306278 31406434
40928C1406434L22865M264926L968598N86351p65864J442536M039652M936677
$$ 31406434 31729299 35994225 39962823 40549174 39783310 41225846 45265498 50202175
40920E0202175N471464O429260O088777L951440K667234L612375L578090n73927
$$ 50202175 55673639 62102899 68191676 72143116 74810350 78422725 82000815 81426888
40912H1426888n956371o811994l229242j777081n741591r419573o279689M20375
$$ 81426888 75470517 68658523 65429281 63652200 57910609 48491036 42211347 42631722
40904D2631722J334517n236462j0200169o641030L57431J783541k179168l953686
$$ 42631722 43966239 38729777 28529608 21888578 22246009 24029550 21850382 17896696
40896A7896696j008223J302466n00998k834590j929485K69159N45633j38508L27767
$$ 17896696 16888473 18190939 17689941 14855351 12925866 13195025 13740658 13602150 13929917
40887A3929917N27465j746121m665268m540710j301528J778120K747879K366560
$$ 13929917 14457382 12711261 8045993 3505283 2203755 3981875 6729754 9096314
40879I096314J747502J240889R73917N72756p38580k395634k386687j87316K124392
$$ 9096314 10843816 12084705 13058622 13631378 12892798 10497164 8110477 7923161 10047553
40870A0047553K828948K189386K32494l457801o330199m030974K314364N198947
$$ 10047553 12876501 15065887 15298381 11840580 5510381 1479407 3793771 8992718
40862H992718J171801l126395q65336M137871L759088j264359l227119m05075
$$ 8992718 10164519 7038124 6172788 10310659 14069747 12805388 9578269 9173194
40854I173194J077723j766990m548646l580758q55040P71518J124689L13178j292823
$$ 9173194 10250917 8483927 3935281 354523 -500517 271001 1395690 1708868 416045
40845D16045m88139M638787Q317296L243006o505143q664821q78350N374885K865482
$$ 416045 -72094 4566693 12883989 16126995 9621852 957031 78681 5453566 8319048
40836H319048j024827J325464M489466R28758m344235k254104L923818L872590
$$ 8319048 7294221 8619685 13109151 14037909 9693674 7439570 11363388 15235978
40828A5235978k028857l727285J187346M286319J354667j496836L19795K593557
$$ 15235978 13207121 9479836 10667182 14953501 16308168 14811332 15131127 17724684
40820A7724684J178050q81088q0111J198088L47287J41757L075055N418219K933187
$$ 17724684 18902734 18021646 17941535 19139623 19486910 19628667 22703722 28121941 31055128
40811C1055128j422002j569979K366960M574119K392588l62041N21309L730947
$$ 31055128 29633126 28063147 30430107 35004226 37396814 37034773 37556082 41287029
40803D1287029M147661o35327o593834o948108j21655P497978Q789524M321856
$$ 41287029 45434690 44799363 38205529 31257421 31135766 38633744 47423268 51745124
40795E1745124L59205J5013J112965K095435M051157O078556N047554K234217
$$ 51745124 52104329 52119342 53232307 55327742 59378899 65457455 70505009 72739226
40787G2739226L829400J1237301J6964793J5304179J1914751J6286049K8172398
$$ 72739226 76568626 87805927 104770720 120074899 131989650 148275699 176448097
40780A76448097L8388268M1107114L8627596L4680748K9523333K2348890J3169523
$$ 176448097 214836365 255943479 294571075 329251823 358775156 381124046 394293569
40773C94293569J148060j4475602l0682832m1899640m6013874m5578860m2408048
$$ 394293569 395441629 380966027 350283195 308383555 262369681 216790821 174382773
40766A74382773l5361098k5029957j6126505j2202568j1104202q733690m955023
$$ 174382773 139021675 113991718 97865213 85662645 74558443 65824753 60869730
40759F0869730k644573k698089l414860m008173n363018p091780o780632l426513
$$ 60869730 58225157 55527068 52112208 48104035 42741017 35649237 28868605 25442092
40751B5442092L45083J284590k20441r15950L37455P62738j693144m095821k183204
$$ 25442092 25787175 27071765 26851324 25935374 26272829 27035567 25342423 21246602 19063398
40742A9063398K539594L844129M590k920943k21652L694480K075946l098029m183714
$$ 19063398 21602992 25447121 25451711 22530768 22309116 26003596 28079542 24981513 20797799
40733B0797799n53701M39076l715249n997693j957859K098482k26085l774907
$$ 20797799 20244098 20683174 16967925 10970232 9012373 11110855 10884770 7109863
40725G109863k03261O796510N935523l354300q862645m050225K494299J322521
$$ 7109863 6906602 13703112 19638635 16284335 7421690 3371465 5865764 7188285
40717G188285l563851k596519L873505P337066M751753J084542m60477j893131
$$ 7188285 3624434 1027915 4901420 12238486 16990239 18074781 17614304 15721173
40709A5721173l587907k265034J881722L222971n78409l801259r92345M665747
$$ 15721173 12133266 9868232 11749954 14972925 14394516 10593257 9600912 14266659
40701A4266659O243041K820307q66887k208237k716043l187086k062112P89883
$$ 14266659 20509700 23330007 22463120 20254883 17538840 14351754 12289642 13079525
40693A3079525K655454J608310j047760k858352k749966j007370J438282L311750
$$ 13079525 15734979 17343289 16295529 13437177 10687211 9679841 11118123 14429873
40685A4429873M083145M756683O156715O985215N556346K965105K166368M097963
$$ 14429873 18513018 23269701 29426416 36411631 41967977 44933082 47099450 51197413
40677E1197413P126689J0076958J2838095J3817131J0394042L364059k122950
$$ 51197413 58324102 68401060 81239155 95056286 105450328 108814387 106691437
40670A06691437k248603Q88062K303113r7056m730753r441735j2764514j3280801
$$ 106691437 104442834 105330896 107634009 107536953 102806200 93364465 80599951 67319150
40662F7319150j0668815p331791o507360q150923q527756m867000P46400L328359
$$ 67319150 56650335 49318544 42811184 34660261 26132505 21265505 22011905 25340264
40654B5340264N69199m505722o867981m956690j819694o79157r40433o0790J871460
$$ 25340264 25909463 21403741 14535760 9579070 7759376 7080219 6139786 6078996 7950456
40645G950456K116859j48221k181446j812581o73192j221861k550710k019128
$$ 7950456 10067315 9919094 7737648 5925067 5251875 4030014 1479304 -539824
40637e39824n0444L2055k588801l952934l97901N626361P366825J792309n976918
$$ -539824 -590268 -558213 -3147014 -7099948 -7497849 -1871488 5495337 7287646 1310728
40628A310728p909437k317654M122900M479430k47806l340769j621345J105214
$$ 1310728 -6598709 -8916363 -4793463 -314033 -561839 -3902608 -5523953 -4418739
40620d418739N96357j509655p24030L130763N448308L231027j182126l621521
$$ -4418739 -3822382 -5332037 -6056067 -2925304 2523004 5754031 4571905 950384
40612I50384l111095k019541k320018l007459j274695L884258R245322R508945
$$ 950384 -2160711 -4180252 -6500270 -9507729 -10782424 -6898166 2347156 11856101
40604A1856101L179682m400146o115024j445001K724074R83080l417738l198570
$$ 11856101 15035783 10635637 4520613 3075612 5799686 6782766 3365028 166458
40596A66458K499703O456088L124038l728693o090677k110674K571826L289396
$$ 166458 2666161 9122249 12246287 8517594 2426917 316243 2888069 6177465
40588F177465J677568J138375R84771j457843n111538n693907j882647K563217
$$ 6177465 7855033 8993408 9978179 8520336 3408798 -2285109 -4167756 -1604539
40580a604539L774031K145819L29766q47530k158861k921483j057465L194439
$$ -1604539 2169492 4315311 4645077 3797547 1638686 -1282797 -2340262 854177
40572H54177N791508L116799k831340n766814k597197K414669L165739j22647
$$ 854177 6645685 9762484 6931144 1164330 -1432867 981802 4147541 4024894
40564D024894j859959J30975J624057m11295k212428N65897M828379M100482j229519
$$ 4024894 2164935 2295910 3919967 3508672 1296244 1862141 6690520 10791002 9561483
40555I561483m168443j663644J351692J19390l202317l804054j030669K304836
$$ 9561483 5393040 3729396 5081088 5200478 1998161 -1805893 -2836562 -531726
40547e31726M364709M983657M099819K035210j90072k219025m098069m223607
$$ -531726 3832983 8816640 12916459 14951669 14761597 12542572 8444503 4220896
40539D220896r92433K696680J390752m289894o311738l94760O599096O040111
$$ 4220896 3228463 5925143 7315895 3026001 -3285737 -3680497 2918599 8958710
40531H958710J09731k129278J244497L094851o37346m835701l786343N18377K708357
$$ 8958710 9068441 6939163 8183660 11278511 10641165 5805464 2019121 2537498 5245855
40522E245855K273174K662350M332350L573710j239125n643971l777635L602449
$$ 5245855 7519029 10181379 14513729 18087439 16848314 11204343 7426708 11029157
40514A1029157Q380487M232664m880743q773617l781135K766197K822885j978905
$$ 11029157 19409644 23642308 18761565 9987948 6206813 8973010 11795895 9816990
40506I816990m271947j926104M89403j59327j590001o56003K505367N726052P024071
$$ 9816990 5545043 3618939 4108342 3949015 2359014 1703011 4208378 9934430 16958501
40497A6958501N271042J403746j363254j180997k41401q13325q58839J987091
$$ 16958501 22229543 23633289 22270035 21089038 20847637 20034312 19175473 21162564
40489B1162564M582313K586115j197856k73473M501439N931896L164039L644369
$$ 21162564 25744877 28330992 27133136 26859663 31361102 37292998 40457037 44101406
40481D4101406R614690J2623768O812579j395526l909164l217777n473317q215260
$$ 44101406 53716096 66339864 73152443 71756917 67847753 64629976 59156659 50941399
40473E0941399n285269P16947J848502j907517l554147j933542k680442o232609
$$ 50941399 45656130 46373077 48221579 46314062 42759915 40826373 38145931 31913322
40465C1913322o203120j739097l61860m497926n805213R83968Q078828O537702
$$ 31913322 25710202 23971105 23609245 19111319 13306106 14290074 22368902 28906604
40457B8906604M14812n53393L199791L220226j871166m411185r19031K641906
$$ 28906604 29321416 28768023 31967814 35188040 33316874 28905689 27986658 30628564
40449C0628564J163209k301117l167003k635121l863979n669382m802625j497010
$$ 30628564 31791773 29490656 26323653 23688532 19824553 14155171 9352546 7855536
40441G855536J280549K046577J220169o29711k335984k098857l04727Q7011j666769
$$ 7855536 9136085 11182662 12402831 11773120 9437136 7338279 7033552 7120563 5453794
40432E453794k115436M96704K134398o39577l656557q17252N348650O157282l72400
$$ 5453794 3338358 3835062 5969460 5329883 1673326 856074 6204724 12362006 11989606
40423A1989606o443135n614309l15841L878894N088333L505825o86343m280562
$$ 11989606 5546471 -67838 -383679 3495215 8583548 12089373 11403030 7122468
40415G122468k185926M206298O223725N46990m293823q18449N191836M753046
$$ 7122468 4936542 9142840 15366565 15913555 11619732 10801283 15993119 20746165
40407B0746165J530179N101277J2259660J0113832j821438q231861j245236P430966
$$ 20746165 22276344 27377621 39637281 49751113 47929675 39697814 38452578 45883544
40399D5883544N605664r57233m50521M664287L275397m197499o069997J368837
$$ 45883544 51489208 50531975 50081454 54745741 58021138 53823639 47753642 49122479
40391D9122479Q288509O839886R76919k734955m559970o899729p756936m902245
$$ 49122479 57410988 64250874 65227793 62492838 57932868 51033139 43276203 38373958
40383C8373958j583763k339807o009155p506199m733207k81472K375142J929570
$$ 38373958 36790195 34450388 28441233 20935034 16201827 15920355 18295497 20225067
40375B0225067k44054j170731M84371J706056j471310p244202q927622m366673
$$ 20225067 19981013 18810282 19294653 21000709 19529399 12285197 3357575 -1009098
40367a009098K44807p77996m459558m597023j536753l15116j301506R1574M375766
$$ -1009098 -764291 -1542287 -6001845 -10598868 -12135621 -12450737 -13752243 -13660669 -9284903
40358i284903N837698J731354k352299l00073N404555P033691K005361m412263
$$ -9284903 -3447205 -1715851 -4068150 -4368223 1036332 8070023 10075384 5663121
40350E663121o175571k759824J793011L539300J831517n87865n47317J659973
$$ 5663121 -512450 -3272274 -1479263 2060037 3891554 3303689 2756372 4416345
40342D416345K372563j48515k512910j087837J803638J053846k657308l269204
$$ 4416345 6788908 6640393 4127483 3039646 4843284 5897130 3239822 -29382
40334b9382O29510K693417p98914l789047J69065O253917M628859l868553p970252
$$ -29382 600128 3293545 2494631 -1294416 -1125351 5128566 9757425 5888872 -2081380
40325b081380k864179K669343n557o617700p348469j272794M039036M293414K501113
$$ -2081380 -4945559 -2276216 -2281773 -8899473 -16247942 -17520736 -13481700 -9188286 -6687173
40316f687173K096565K359738J413675p04563k832109l638106k000964J027845
$$ -6687173 -4590608 -2230870 -817195 -1521758 -4353867 -7991973 -9992937 -8965092
40308h965092J894947q31036l404427k176068N02364O01270R7937L495243Q116893
$$ -8965092 -7070145 -7901181 -11305608 -13481676 -12979312 -12378042 -12280105 -8784862 -667969
40299f67969O355458j601246o115192k127663L470553L116336m80510r79440O98377
$$ -667969 5687489 4086243 -2028949 -4156612 -686059 2430277 1949767 970327 1668704
40290A668704J22374r99473J846902N828142L728875l377152o028464q01804L980164
$$ 1668704 1791078 791605 2638507 8466649 12195524 8818372 2789908 1988104 5968268
40281E968268R92538n015531m884293J200725M746505J843659j857869k42573
$$ 5968268 6960806 1945275 -2939018 -1738293 3008212 4851871 2994002 2751429
40273B751429M270745M219630k351085q476025o532828K033067P859281M702248
$$ 2751429 7022174 11241804 8890719 414694 -6118134 -4085067 3774214 8476462
40265H476462l352952p413639m256720J605106M844012M425785J920631j194903
$$ 8476462 5123510 -2290129 -6546849 -4941743 -97731 4328054 6248685 5053782
40257E053782l150114k086363J212651L050377J330003j423384j499687J088397
$$ 5053782 1903668 -182695 1029956 4080333 5410336 3986952 2487265 3575662
40249C575662L222926L019001J312926n69269k313677l672757l645715j497255
$$ 3575662 6798588 9817589 11130515 10561246 8247569 4574812 929097 -568158
40241e68158J720634L217370Q23928m003627o361894k839885L849569P264043
$$ -568158 1152476 4369846 5193774 1190147 -5171747 -8011632 -4162063 3101980
40233C101980M655050k33657k603931k300788k271896l393681l452246o48607
$$ 3101980 7757030 7523373 4919442 2618654 346758 -3046923 -6499169 -7147776
40225g147776L830799O733650N493679P48966l443983l223308O96217L895156
$$ -7147776 -3316977 3416673 8910352 9659318 6215335 2992027 3688244 7583400
40217G583400L930973K676438K121718J208663r65483k095906j99698K335784
$$ 7583400 11514373 14190811 16312529 17521192 16555709 14459803 14260105 16595889
40209A6595889K058063j26474q21793K28671P43800P79932K072885L210048Q54919
$$ 16595889 18653952 18527478 17705685 17934356 18678156 19458088 21530973 24741021 25595940
40200B5595940l875464n562061k209498K021074L352850K970496L053550K871146
$$ 25595940 21720476 16158415 13948917 15969991 19322841 22293337 25346887 28218033
40192B8218033J700775J701398M485434P667302P916766N330284K421095Q70870
$$ 28218033 29918808 31620206 36105640 43772942 51689708 57019992 59441087 60311957
40184F0311957J096123K625638L353784J188425k225592k790772k83679P63537
$$ 60311957 61408080 64033718 67387502 68575927 66350335 63559563 63275884 64039421
40176F4039421j735156m160398l576297k092226j653482k44839K521914K186071
$$ 64039421 62304265 58143867 54567570 52475344 50821862 50577023 53098937 55285008
40168E5285008k709774n751115k475795J075832j881932o371893l495200L772435
$$ 55285008 52575234 46824119 44348324 45424156 43542224 37170331 33675131 37447566
40160C7447566N140452P68410M53567N138602M324288m797775j0574166n814075
$$ 37447566 42588018 43356428 43809995 48948597 53272885 48475110 37900944 32086869
40152C2086869J57993k347339p033289l194205N513200P394198K123174Q586M260758
$$ 32086869 32244862 29897523 22864234 19670029 25183229 32577427 34700601 34709187 38969945
40143C8969945O998995L270307k309442m909337n871825o858675n753425k070701
$$ 38969945 45968940 49239247 46929805 42020468 36148643 29289968 23536543 21465842
40135B1465842J5224k054706m727894l563561O80059L920446L807323R65653k191378
$$ 21465842 21481066 19426360 14698466 11134905 11814964 15735410 19542733 20508386 18317008
40126A8317008k614848Q03065M982377N586227K453737q02502k357326l531192
$$ 18317008 15702160 16505225 21487602 27073829 29527566 28725064 26367738 22836546
40118B2836546m588674l650874o81898J668080K368957L136853M179013L191558
$$ 22836546 18247872 14596998 13915100 15583180 17952137 21088990 25268003 28459561
40110B8459561R6389j770716j244602j556262m361356o030551l338685J081678
$$ 28459561 28555950 26785234 25540632 23984370 19623014 13592463 10253778 11335456
40102A1335456K899006K343069K097370J860659k23518k728857k465851J52031
$$ 11335456 14234462 16577531 18674901 20535560 20312042 17583185 15117334 15269365
40094A5269365J729251J304447R25980J139161K27536j747569k345693j077583
$$ 15269365 16998616 18303063 19229043 20368204 20595740 18848171 16502478 15424895
40086A5424895m63293j507423j897324n03026R0756j729639k759655L53414M915695
$$ 15424895 14961602 13454179 11556855 11053829 11144585 9414946 6655291 7008705 11924400
40077A1924400N244585J011089k235488j300694N79524l21152k469231k417868
$$ 11924400 17168985 18180074 15944586 14643892 15223416 14902264 12433033 10015165
40069A0015165n84328M46313J178134L919891P159829O441689J405571l033763
$$ 10015165 9430837 9877150 11055284 14975175 22135004 28576693 29982264 26948501
40061B6948501m093544m804667p579895q870362m762045J508327L288726K93145
$$ 26948501 22854957 18050290 10470395 1600033 -3162012 -1653685 1635041 1928186
40053A928186j129335K189660N552729L690370j342063l092164L59786M076875
$$ 1928186 798851 2988511 8541240 12231610 10889547 7797383 8157169 12234044
40045A2234044L129434j068565l274147j879459o07494k043283l226969r00875
$$ 12234044 15363478 14294913 11020766 9141307 8533813 6490530 3263561 2362686
40037B362686K003411N54477l221633k635130K314423M096205L10920j887678
$$ 2362686 4366097 4920574 1698941 -936189 1378234 5474439 5785359 3897681
40029C897681J353702K874281k594522o791439m18321R521764Q721038j695138
$$ 3897681 5251383 8125664 5531142 -1260297 -1678618 7843146 16564184 14869046
40021A4869046o564361n20598N128373K426845j440313J081190M631906J604165
$$ 14869046 8304685 7784087 12912460 15339305 13898992 14980182 19612088 21216253
40013B1216253m261807n001555j336949J248274K784483N524990O157188J406540
$$ 21216253 16954446 11952891 10615942 11864216 14648699 20173689 26330877 27737417
40005B7737417l246314r13699M136925K120214o074530r366087l173637M602474
$$ 27737417 24491103 23577404 27714329 29834543 23760013 14393926 11220289 15822763
39997A5822763N941141K255776r60229j828720j501734j245069k285597m479571
$$ 15822763 21763904 24019680 23059451 21230731 19728997 18483928 16198331 11718760
39989A1718760m624039n12873L873336K794791k119428l650503m6948K708739
$$ 11718760 7094721 6581848 10455184 13249975 11130547 7480044 7433096 10141835
39981A0141835P79516k449497l248779k864220l157830k824045j083445j16777
$$ 10141835 10921351 8471854 5223075 2358855 -798975 -3623020 -4706465 -4823242
39973d823242r55632j486056p80239o45147r53419J120706M972604N571920J428232
$$ -4823242 -5778874 -7264930 -8045169 -8690316 -9643735 -8523029 -3550425 2021495 3449727
39964C449727k446513k757312k676056m339275l506388K503250P725756N601666
$$ 3449727 1003214 -1754098 -4430154 -8769429 -12275817 -9772567 -2046811 3554855
39956C554855n24801k478888O20871K867941J647418l86110j772059l240280l150342
$$ 3554855 3030054 551166 1172037 4039978 5687396 5301286 3529227 288947 -2861395
39947b861395P61603N288334M529518q05999l787426j863234l7785j610745k790359
$$ -2861395 -2099792 3188542 7718060 6912061 3124635 1261401 1223616 -387129 -3177488
39938c177488K4404L562593K803507j405742m254527l587154q57841K101157L787245
$$ -3177488 -3153084 409509 3213016 1807274 -2447253 -6034407 -6892248 -4791091 -1003846
39929a003846K562345j106296l439547j561136K101393K564128j069758m325228
$$ -1003846 1558499 452203 -2987344 -4548480 -2447087 117041 -952717 -5277945
39921e277945k912521K190466N787537M103209p99108k866202P18150N291381
$$ -5277945 -8190466 -6000000 -212463 3890746 3091638 225436 943586 6234967
39913F234967M208843k087391o304279m163933L49665J631684O3678m82332O78663
$$ 6234967 10443810 8356419 2052140 -2111793 -1762128 -130444 -66766 -549098 129565
39904A29565J254516P35579N33728O05006Q514j14629J840192M072705L298853
$$ 129565 1384081 2119660 2653388 3258394 3266908 3152279 4992471 9065176 12364029
39895A2364029J38659j671350j247316j146843j841099p76767J927737K166797
$$ 12364029 12502688 10831338 9584022 8437179 6596080 5819313 7747050 9913847
39887I913847j547680n018579m726504k745178k039226j371056R64350K535397
$$ 9913847 8366167 3347588 -1378916 -4124094 -6163320 -7534376 -6570026 -4034629
39879d034629R80888p46239Q85653K993025O46731l934535m138658q503J777463
$$ -4034629 -3053741 -3799980 -2914327 78698 725429 -3209106 -7347764 -7356267 -5578804
39870e578804l68041j92744M520981O300584j4677p038297m707705M252803P698641
$$ -5578804 -5946845 -6139589 -1618608 4681976 4667299 -2370998 -7078703 -2825900 4872741
39861D872741J164168o883263p453377j453440M313871N730088L089043j315527
$$ 4872741 6036909 -846354 -8299731 -9753171 -5439300 290788 3379831 2064304
39853B064304m118197k420294K691658O201587M883439J017971j380560j666953
$$ 2064304 -2053893 -4474187 -1782529 4419058 9302497 10320468 8939908 7272955
39845G272955j488718q12157J538711M176825L488605j451487o574845p002378
$$ 7272955 5784237 4972080 6510791 10687616 14176221 12724734 6149889 -852489
39837h52489k738107J201432O37707k711211l347391P25361M842891L604973j596414
$$ -852489 -3590596 -2389164 -1751457 -4462668 -7810059 -7084698 -2241807 1363166 -233248
39828b33248m172142j149675L430321M953725M012400L164635J661782k214257
$$ -233248 -4405390 -5555065 -2124744 2828981 6841381 10006016 11667798 9453541
39820I453541n839721m671378L21674K873370K39789k883353j518841K590192
$$ 9453541 3613820 -1057558 -735884 2137486 2377275 -506078 -2024919 565273
39812E65273M410100K951231J278660J155360J644594J979376K108752J092639
$$ 565273 4975373 7926604 9205264 10360624 12005218 13984594 16093346 17185985
39804A7185985j427510k828738n74895K799649K455133r66498j854247J016977
$$ 17185985 15758475 12929737 12354842 15154491 17609624 16643126 14788879 15805856
39796A5805856K020791j624322m306909j138608L277826K063663k480279k894705
$$ 15805856 17826647 16202325 11895416 10756808 14034634 16098297 13618018 10723313
39788A0723313Q15290J777657j540940l421543k002731k353422n656984n281203
$$ 10723313 11538603 13316260 11775320 8353777 6351046 3997624 -1659360 -6940563
39780f940563J203789N255090O8566p349882n909141K882677P705379M063383
$$ -6940563 -5736774 -481684 -413118 -7763000 -13672141 -10789464 -3084085 979298
39772I79298j456466k616327k96708K552301M661508L974826j172855o719096
$$ 979298 -477168 -3093495 -3390203 -837902 3823606 7798432 6625577 -93519
39764i3519n695697J390777N703214K470457k280495j354009L092902L864046
$$ -93519 -5789216 -4398439 1304775 3775232 1494737 140728 3233630 7097676
39756G097676n92406n238333n784694k439668K061447M553677L043576p90343
$$ 7097676 6505270 1266937 -4517757 -6957425 -4895978 -342301 2701275 1910932
39748A910932k294305L95786L395924K673319J01712J66906K542996K485219j766059
$$ 1910932 -383373 12413 3408337 6081656 6183368 6350274 8893270 11378489 9612430
39739I612430o058658n670998r31269L499679L610898p2272l038536j782207J649643
$$ 9612430 3553772 -2117226 -3048495 451184 4062082 3989810 951274 -830933 818710
39730H18710K067446j329234l168466J24919M200654K855549k279080l676594
$$ 818710 2886156 1556922 -1611544 -1486625 2714029 5569578 3290498 -386096
39722c86096J048489N737677M587803m42825l640753l176949j432308j37372J078812
$$ -386096 662393 6400070 10987873 10545048 6904295 3727346 2295038 2157666 3236478
39713C236478K058647J327043j409618l972421l965687j458982J313366K431336
$$ 3236478 5295125 6622168 5212550 1240129 -2725558 -4184540 -2871174 -439838
39705d39838J767361K51651j281925j983770p19638K574436N443149M662784J78268
$$ -439838 1327523 1579174 297249 -1686521 -2406159 168277 5611426 10274210 10452478
39696A0452478m204749n074546l004002p58676M67587J183443J300241J87693
$$ 10452478 6247729 1173183 -1830819 -2589495 -2121908 -938465 361776 549469
39688E49469j473842k254467k221019k345517j827808J138294N280401N978823
$$ 549469 -924373 -3178840 -5399859 -7745376 -9573184 -8434890 -3154489 2824334
39680B824334J065496n189694o423012j637114L878241M800156J079495l064469
$$ 2824334 3889830 -1299864 -7722876 -9359990 -5481749 -681593 397902 -2666567
39672b666567l808753r12043K609264L433045J186764j151132q05432J197238
$$ -2666567 -6475320 -7387363 -4778099 -1345054 -158290 -1309422 -2114854 -917616
39664i17616J490320n76402j641335O86413L779462L421951j00576k573721k123229
$$ -917616 572704 -3698 -1645033 -958620 2820842 6242793 6142217 3568496 1445267
39655A445267j215196j633130j418643Q41647K161066n68252m580550m110005
$$ 1445267 230071 -1403059 -2821702 -1980055 181011 -387241 -4967791 -9077796
39647i077796J304794N899520N646456K846012J183963L39115j420848k431062
$$ -9077796 -7773002 -1873482 3772974 6618986 7802949 8142064 6721216 4290154
39639D290154K01793M784159N860176J621781l124995l451346j139988j758365
$$ 4290154 4491947 9276106 15136282 16758063 13633068 10181722 9041734 7283369
39631G283369n899827p447019k090350N844362Q626832N306002J889045J508811
$$ 7283369 1383542 -6063477 -8153827 -2309465 6317367 11623369 13512414 15021225
39623A5021225K85109m478873p739751l932365K981636L963293j717392n214915
$$ 15021225 15306334 10827461 3087710 -844655 2136981 6100274 4382882 -832033
39615h32033j489373L468298K470264k021062k625728J311088L515204R81071
$$ -832033 -2321406 1146892 3617156 1596094 -1029634 281454 3796658 4777729
39607D777729j952534q39927K426550K997366Q229k829119k515115m9585J838902
$$ 4777729 2825195 1985268 4411818 7409184 7417413 4588294 2073179 2023594 3862496
39598C862496K295837K314330K111457O78742j698021k657665j004701R79883
$$ 3862496 6158333 8472663 10584120 11262862 9564841 6907176 5902475 6882358
39590F882358O00519j159439j209619P73157J987008R18562o90254o65427J072305
$$ 6882358 7482877 6323438 5113819 5886976 7873984 8792546 8102292 7436865 8509170
39581H509170L022713L262871N37368l682456n257001k218892J844955K653812
$$ 8509170 11531883 14794754 15332122 11649666 6392665 4173773 6018728 8672540
39573H672540J510442J924453K094301k198634p932632o789882J526298O843282
$$ 8672540 10182982 12107435 14201736 12003102 4070470 -2719412 -1193114 5650168
39565E650168L267794k148529j291660K310667O66665m779155n916925j422898
$$ 5650168 8917962 6769433 5477773 7788440 8455105 3675950 -2240975 -3663873
39557c663873J979917Q43394q40354M32299K571934K532910Q72610k91418m21706
$$ -3663873 -1683956 -840562 -1680916 -1248617 1323317 3856227 4728837 4437419 4015713
39548D015713l40484j058879k939089m416523k854196J478621M563626M040824
$$ 4015713 3675229 2616350 -322739 -4739262 -7593458 -6114837 -1551211 2489613
39540B489613K345390J647823j30423m039483n475452r25228M461549L299262
$$ 2489613 4835003 6482826 6352403 2312920 -3162532 -4087760 373789 3673051
39532C673051k598068m856309j095200K898456K993491J191775J6464o68243n65319
$$ 3673051 1074983 -3781326 -4876526 -1978070 1015421 2207196 2223660 1555417 990098
39523I90098J203572K723769J340176j232268j467483m34274j199100j761986
$$ 990098 2193670 4917439 6257615 5025347 3557864 3123590 1924490 162504
39515A62504J407756M567509J203999n343476m887581K932349O824652J755348
$$ 162504 1570260 6137769 7341768 1998292 -2889289 43060 6867712 8623060
39507H623060l245885m38388M615475L563368j644296m207954l343025j797611
$$ 8623060 5377175 4938787 9554262 13117630 11473334 7265380 3922355 2124744
39499B124744P76796M265886M087209j543232o032850l703062R61394J217451
$$ 2124744 2901540 7167426 11254635 9711403 3678553 -24509 936885 2154336
39491B154336m97097J998064O561190N914120j72139n178346o213678n517834
$$ 2154336 1657239 3655303 10216493 16130613 15958474 10780128 4566450 -951384
39483i51384l524513J001251N135421M285780j40958k803385k980214l741402
$$ -951384 -4475897 -3474646 1660775 5946555 5805597 3002212 21998 -3719404
39475c719404m117170l85778N430018O833424L144679O73667K529406M479421
$$ -3719404 -7836574 -8222352 -2792334 4041090 7185769 7859436 10388842 14868263
39467A4868263K459154k137189o025054p348734m890708N10863L898767J526256
$$ 14868263 17327417 15190228 9165174 1816440 -3074268 -2563405 1335362 2861618
39459B861618k374344r63890L905556M041035j430928m227800n31757L192527
$$ 2861618 487274 -476616 3428940 7469975 6039047 1811247 1279490 4472017
39451D472017J624869j136093J75091L150956L011054N35656j130212k353513
$$ 4472017 6096886 4960793 5135884 8286840 11297894 11833550 10703338 8349825
39443H349825m123804m063579q65452J601071J03636k060006n59097K395796J994293
$$ 8349825 4226021 162442 -703010 898061 1001697 -1058309 -1617406 778390 2772683
39434B772683q60903j535259L52776J265243N85742R50810K380945J906856p43205
$$ 2772683 1911780 376521 729297 1994540 2580282 3531092 5912037 7818893 7075688
39425G075688k202284q73052J077980J837030K050932J939929J22377l184305
$$ 7075688 4873404 4000352 5078332 6915362 8966294 10906223 11028600 7844295
39417G844295m893948k855140J093636L390840K651334K01272k033990l011414
$$ 7844295 2950347 95207 1188843 4579683 7231017 7432289 5398299 2386885
39409B386885k562284q48644J908558M941969O288359L829679j938326o891932
$$ 2386885 -175399 -1024043 884515 5826484 12114843 15944522 14006196 7114264
39401G114264o603638j073846M624850N088665J29907m738811m136445Q52676
$$ 7114264 510626 -563220 4061630 9150295 9280202 4541391 404946 1257622
39393A257622L746048R36979l311553k614777K598938N771278L340839j148323
$$ 1257622 5003670 5940649 2629096 14319 2613257 8384535 11725374 10577051
39385A0577051k950070k064872j286516j505573j534167o91952N24808J196279
$$ 10577051 7626981 5562109 4275593 2770020 1235853 543901 1068709 2264988
39377B264988L87223j813949l363322k329132J57665J561483K090908L577482
$$ 2264988 2652211 838262 -2525060 -4854192 -4696527 -3135044 -1044136 2533346
39369B533346M659015K146375k304570k935799Q80164K703868m62409k689833
$$ 2533346 7192361 9338736 7034166 4098367 4978531 7682399 7219990 4530157
39361D530157O75894L991775M972p419114q242819j296985M794438M950053K888683
$$ 4530157 5206051 9197826 9202798 1783684 -6459135 -7756120 -2961682 1988371 4877054
39352D877054K229122J114551j495978j901672J597614M059807J141818l398455
$$ 4877054 7106176 8220727 6724749 4823077 6420691 10480498 11622316 8223861
39344H223861k955904J882781M141509M94456m412506m629246m31899K862655
$$ 8223861 5267957 7150738 11292247 11786703 7374197 2744951 2313052 5175707
39336E175707K026974n10290o88465J342454J631329j444953m384022l529672
$$ 5175707 7202681 6692391 6003926 7346380 8977709 7532756 3148734 -380938
39328c80938k12695J935315K672286M136764N290386K343236m457946q965599
$$ -380938 -593633 1341682 4013968 8150732 13441118 15784354 11326408 2360809
39320B360809o422942K74942M098747J951143k835024n001044k701252J299656
$$ 2360809 -4062133 -3787191 311556 2262699 -572325 -5573369 -8274621 -6974965
39312f974965K915597J196035q85294n10656J432772K302379J619912O75462l19691
$$ -6974965 -4059368 -2863333 -3748627 -4259283 -2826511 -524132 1095780 1771242 1451551
39303A451551j503209r74528K814617O746603N703549L6416m230388l754246j697587
$$ 1451551 -51658 -1026186 1788431 8535034 14238583 14274999 10044611 6290365 4592778
39294D592778j422839j356619P87618L090846K775024J100880P03055Q02025m87429
$$ 4592778 3169939 1813320 2600938 5691784 8466808 9567688 10270743 11072768 10585339
39285A0585339j441804O30030L499484K187857l191172o925959n760948k590944
$$ 10585339 9143535 9773565 13273049 15460906 12269734 5343775 -417173 -3008117
39277c008117n78925J588399N477253P841619M485918k404154n632113k244550
$$ -3008117 -3587042 -1998643 3478610 11320229 15806147 13401993 7769880 5525330
39269E525330K541603K543072j357717l510022j894502O0206l8137j4671J885231
$$ 5525330 8066933 10610005 9252288 5742266 3847764 3907970 3869833 3855162 5740393
39260E740393K827239J30133l078329k216683P02918k49884m559249m820331J402474
$$ 5740393 8567632 8697765 5619436 3402753 4105671 3855787 -703462 -5523793 -4121319
39251d121319O423512L460135l086837m315452L83873L976525K805504m6942j665487
$$ -4121319 2302193 5762328 2675491 -1639961 -1256088 2720437 5525941 5478999 3813512
39242C813512k757526l379906j283124L363658O314243M802042J246583p13608
$$ 3813512 1055986 -2323920 -3607044 -243386 6070857 10872899 12119482 11405874
39234A1405874p50139l40719L30680J567772K403481J774584o2278k492300m974484
$$ 11405874 10655735 10315016 10645696 12213468 14616949 16391533 16329255 13836955 8862471
39225H862471n677922k516000K961532N697526L289391o97600j896930p17567
$$ 8862471 3184549 668549 3630081 9327607 12616998 11919398 10022468 9304901
39217I304901J50625P53893K286033K846701j04259m099149l895896L71741K603242
$$ 9304901 9455526 10209419 12495452 15342153 15237894 11138745 7242849 7614590 10217832
39208A0217832k63541l735434k995034j86734l21624k953606k992482J192534
$$ 10217832 9954291 6218857 3223823 3037089 2715465 -238141 -3230623 -2038089
39200b038089N237846M965487J382388j902393l467821m279764m668939l244139
$$ -2038089 3199757 8165244 9547632 7645239 4177418 -102346 -4771285 -8015424
39192h015424J100293O834685R867661O930687j72215m930185l016288J846834
$$ -8015424 -6915131 -80446 9787215 16717902 16545687 11615502 8599214 10446048
39184A0446048K132239l166814o666018l125490K407678J496340n217149q384579
$$ 10446048 12578287 9411473 2745455 -380035 2027643 3523983 -1693166 -10077745
39176a0077745k899142N185397P048980K243926k133680j101478L111395N070589
$$ -10077745 -12976887 -7791490 -742510 1501416 -632264 -1733742 1377653 6448242
39168F448242K390277k376862m505205j569593L890638O454080L459967j936824
$$ 6448242 8838519 6461657 1956452 386859 4277497 10731577 14191544 12254720
39160A2254720m358778k264960Q73470J194757j093898k271504M12363N113475
$$ 12254720 7895942 5630982 6504452 7699209 6605311 4333807 4746170 9859645
39152I859645O653183K221282m452075o454841j875504L510613L439588r04282
$$ 9859645 16512828 18734110 14282035 7827194 5951690 9462303 12901891 11997609
39144A1997609l006941j00065L509378K947557n97485k096633J60569K544221
$$ 11997609 8990668 8890603 12399981 15347538 14750053 12653420 12813989 15358210
39136A5358210J364038k198805l965163k438051m91801j115053l408928m171429
$$ 15358210 16722248 14523443 10558280 8120229 7628428 6513375 3104447 -1066982
39128a066982k166017R74869L266176L807608K373792j08564j165768M29303J884376
$$ -1066982 -3232999 -2258130 1008046 4815654 7189446 7080882 5915114 6344417 8228793
39119H228793j84340l747443l370804R34184K488515j664017m934800q39163O252855
$$ 8228793 8044453 4297010 926206 1860390 4348905 2684888 -2249912 -3089075 3163780
39110C163780O961070P73025l727295j998699R35744j41386k712875j740520K096101
$$ 3163780 10124850 10897875 7170580 5171881 6107625 5966239 3253364 1512844 3608945
39101C608945L904445J707513j834839l634750l140154j428618O20430K745478
$$ 3608945 7513390 9220903 7386064 3751314 611160 -817458 -197028 2548450
39093B548450M373573L889689K42747m182315m747914o84823K625769Q20605k706645
$$ 2548450 6922023 10811712 11054459 6872144 2124230 1439407 4065176 4885781 2179136
39084B179136k020465J745232K430921n86226j499482J470934K660409j218155
$$ 2179136 158671 1903903 4334824 3748598 2249116 3720050 6380459 5162304
39076E162304n098829l678141M78004J810518k2044j621462j597060m33058J791916
$$ 5162304 63475 -3614666 -3136662 -1326144 -1348188 -2969650 -4566710 -4999768 -3207852
39067c207852L675976K289206j779966l644680j878762j361130l986544l529529
$$ -3207852 468124 2757330 977364 -2667316 -4546078 -5907208 -9893752 -13423281
39059a3423281L576749R414049N772106j641488j451828M797539N132860k971278
$$ -13423281 -9846532 -432483 5339623 3698135 2246307 7043846 12176706 9205428
39051I205428q628705n263854M54133J555092R93988K832750L467720m70187l720734
$$ 9205428 576723 -4687131 -4232998 -2677906 -1683918 1148832 4616552 4146365 425631
39042D25631p18369L993689K894093j664251j473615L433151M752887l49211m861616
$$ 425631 -292738 3700951 6595044 4930793 3457178 6890329 11643216 11294005 6432389
39033F432389l165618J352648L343748L560984M985167N562296J026106o676037
$$ 6432389 3266771 4619419 7963167 11524151 16509318 22071614 23097720 16421683
39025A6421683r739929m497705L105312M608957p48129n937633n209276K3438
$$ 16421683 6681754 2184049 5289361 9898318 9150189 3212556 -1996720 -1973282
39017a973282M491070N003485J955416k079380l475568j26015M899522N221852
$$ -1973282 2517788 7521273 9476689 7397309 3921741 3795726 8695248 13917100
39009A3917100n97759o021011n361682j771898j064989j452237K567767Q179281
$$ 13917100 13319341 7298330 1936648 164750 -900239 -2352476 215291 8394572
39001H394572O115379m185987j1072550o393774L454707P552660M563970N03297
$$ 8394572 14509951 10323964 -748586 -7142360 -3687653 3865007 8428977 8932274
38993H932274j707273k935064k189447J729515M975268K470838l643567n889797
$$ 8932274 7225001 4289937 2100490 3830005 8805273 11276111 7632544 1742747
38985A742747j909538K771430L183039Q59337k70081K73719J46493j679701l362892
$$ 1742747 -166791 2604639 5787678 6647015 6376934 6650653 6797146 5117445 1754553
38976A754553k268980J600489M333257K122512k789180l607985J360510M837920
$$ 1754553 -514427 1086062 5419319 7541831 4752651 1144666 2505176 7343096
38968G343096P78344n537870m441456L265298O742754J063000n634460m422550
$$ 7343096 8121440 2583570 -1857886 1407412 8150166 9213166 3578706 -843844
38960h43844J956280M535047J318171j747917j028574L88988o57766j964892j51765
$$ -843844 1112436 5647483 6965654 5217737 4189163 4578151 3920385 1955493 1803728
38951A803728L138951L172900q40123m340763l623336m10552J403720J148077
$$ 1803728 4942679 8115579 7275456 2934693 -688643 -1099195 304525 1452602
38943A452602R37621J453464J381961N36165L40931J072554J511095J479979J678979
$$ 1452602 2390223 3843687 5225648 5761813 6102744 7175298 8686393 10166372 11845351
38934A1845351R50788k492202o559730o375792j375848L013273K877982P22564
$$ 11845351 12796139 10303937 3744207 -2631585 -4007433 -994160 1883822 2606386
38926B606386L25254J086764P99151n7225m98863j689121l604468l062628P83243
$$ 2606386 2931640 4018404 4817555 4760330 4261467 2572346 -1032122 -4094750 -3311507
38917c311507L337455J725460K67386K836090M790495M71934n401803l631127
$$ -3311507 25948 1751408 2018794 4854884 9645379 10117313 4715510 1084383
38909A084383M257754P200984J142280n802004o534535l662968j703599M60604
$$ 1084383 5342137 12543121 13685401 7883397 1348862 -2314106 -4017705 -3557101
38901c557101M427007O818977M521867J12224k618759l893372m714012l349331
$$ -3557101 869906 7688883 12210750 12322974 9704215 5810843 1096831 -2252500
38893b252500O58237L603433L055774J757959J974088R68201k915158m824243
$$ -2252500 -1594263 2009170 5064944 6822903 8796991 9765192 6850034 2025791
38885B025791m64231N563337N675352O20238k594796k058483k183653m166201
$$ 2025791 1561560 7124897 12800249 13420487 10825691 8767208 6583555 2417354
38877B417354l600073Q49253L960193K284441k85103O38684K625463J051560k580857
$$ 2417354 -1182719 -333466 3626727 5911168 5626065 6264749 8890212 9941772 7360915
38868G360915k903770K61847J202100k593675o007628l744470J680763L567502
$$ 7360915 4457145 4718992 5921092 3327417 -2680211 -6424681 -4743918 -1176416
38860a176416N73735k254241j748628o11875j257672p41621L843056Q429209O358921
$$ -1176416 -602681 -2856922 -4605550 -5217425 -6475097 -7216718 -3373662 5055547 11414468
38851A1414468j436019o646710m684023q1723J149806m01153m81763J529996K530799
$$ 11414468 9978449 3331739 -1352284 -1434007 -284201 -685354 -1167117 362879 2893678
38842B893678J112776p44015r60131L67948J871900K195544N46344k486125m652078
$$ 2893678 4006454 3262439 2302308 2670256 4542156 6737700 7284044 4797919 145841
38833A45841l681030N03151N347357P342070M672120q56751m961983n081957k842610
$$ 145841 -3535189 -3032038 2315319 9657389 14329509 13472758 8510775 3428818 586208
38824E86208j177899m30243M95376P95031q09890k272896k60081L961586N298728
$$ 586208 -591691 -1021934 -526558 268473 -541417 -2814313 -3074394 887192 6185920
38815F185920K328758o67914o62949k6264j283055k388050p78285J655086J770013
$$ 6185920 8514678 7846764 7183815 7157551 5874496 3486446 2708161 4363247 6133260
38806F133260N38336Q94034K068809M54382m378465q125155o763960j145572L851922
$$ 6133260 6671596 7565630 9634439 10088821 5710356 -2414799 -9178759 -10324331 -6472409
38797f472409M058538K25351k511443m78074L817884N032031K317696k05798j58032
$$ -6472409 -2413871 -2188520 -4699963 -5178037 -1360153 3671878 5989574 5783776 5625744
38788E625744M34155M2285L12443J859134K043269l64565k480816k091366j102693
$$ 5625744 6059899 6102184 6414627 8273761 10317030 9952465 7471649 5380283 4277590
38779D277590j347407j203180L17374M79190k222220m062075j405069L446178
$$ 4277590 2930183 1727003 2044377 2523567 301347 -3760728 -5165797 -1719619
38771a719619N898027N167127K789796j047568n251139o010828k353152M28130
$$ -1719619 4178408 9345535 12135331 11087763 5836624 -174204 -2527356 -2099226
38763b099226j642891m233873j478976M148871N862007L265369J375976J364951
$$ -2099226 -3742117 -7975990 -9454966 -5306095 555912 3821281 5197257 6562208
38755F562208K85815j530798q76235J321859J080033j057317j004461Q62737M11674
$$ 6562208 6848023 5317225 4440990 5762849 6842882 5785565 4781104 5643841 6055515
38746F055515k038857k336586r22180j830046l419296r0301N898406N437117k032835
$$ 6055515 4016658 1680072 757892 -1072154 -4491450 -4581751 1316655 6753772 4720937
38737D720937n785410j091476K617645j977273o965825k580505N542042N174544
$$ 4720937 -1064473 -2155949 461696 -1515577 -8481402 -11061907 -5519865 -345321
38729c45321k246950l930322L664139R693332N968919k022796n013386k298366
$$ -345321 -2592271 -6522593 -2858454 6834878 12803797 10781001 5767615 3469249
38721C469249P93038J691085J486420O10372j605045m421742n757743m197714
$$ 3469249 4262287 5953372 7439792 8050164 6445119 2023377 -3734366 -7932080
38713g932080R2972N065269P022118L667268k119146m353991j423285J360694
$$ -7932080 -7839108 -2773839 4248279 7915547 5796401 1442410 19125 1379819
38705A379819q33071n038286m504890J258955N288326K904845j856731k478676
$$ 1379819 546748 -4491538 -8996428 -7737473 -2449147 455698 -1401033 -3879709
38697c879709P37964K091929l05063k052325K2790K852244K330302k77730r13482
$$ -3879709 -3141745 -1049816 -1354879 -3407204 -3384414 -532170 1798132 1520402 606920
38688F06920P55767J625036P55133M64320J827377K746163J329914j442429l273640
$$ 606920 1362687 2987723 3742856 4207176 6034553 8780716 10110630 8668201 5394561
38679E394561k940772q42621J266014J295282q23847k459882j698886j72462p1484
$$ 5394561 2453789 1611168 2877182 4172464 3348617 888735 -810151 -982613 -1054097
38670a054097K7758K766531O524517O741781K710388j363158k784194l460964
$$ -1054097 -1026339 1740192 8264709 15006490 17716878 16353720 13569526 10108562
38662A0108562n076446n394129k036346L050065N727867M458165Q61325k847010
$$ 10108562 5032116 -362013 -2398359 651706 6379573 10837738 11699063 8852053
38654H852053n006266m458479j408197K086844L725912K962500J065093m10522
$$ 8852053 3845787 -612692 -2020889 65955 3791867 6754367 7819460 7408938
38646G408938j105235j958418l332726l293904K47676N194663O151434J553027
$$ 7408938 6303703 4345285 1012559 -2281345 -2033669 3160994 9312428 10865455
38638A0865455l306005l266126j15929J336552P25584P46496J135422j25137j611777
$$ 10865455 7559450 4293324 4177395 5513947 6239531 6986027 8121449 7996312 6384535
38629F384535o42150J001654L2657j369385R33308L966286J145375n230441n264378
$$ 6384535 5742385 6744039 6776696 5407311 6340619 10306905 11452280 6221839 957461
38620I57461K622741P507330K188404n947146o638205j312759J656816K05025
$$ 957461 3580202 11087532 13275936 7328790 690585 -622174 1034642 1239667
38612A239667r90020M79262K565470L395726K538952k61972l361028l087872O70658
$$ 1239667 249647 728909 3294379 6690105 9229057 8967085 5606057 2518185 3188843
38603C188843K412311j036465m486159j602141N239325Q071013L957798k751975
$$ 3188843 5601154 4564689 78530 -1523611 3715714 11786727 15744525 12992550
38595A2992550o870740o406045k061856K995444M651116K608721J251265K800763
$$ 12992550 6121810 -284235 -2346091 649353 5300469 7909190 9160455 11961218
38587A1961218L452924J40805l409504k620174J24720j92564k498591k021999
$$ 11961218 15414142 15554947 12145443 9525269 9649989 9457425 6958834 4936835
38579D936835R80719J821770m81041j982567l93730K254175L303348J985314p90169
$$ 4936835 5917554 7739324 7258283 5275716 4881986 7136161 10439509 12424823 11634654
38570A1634654k251263K34300M203803L247800l237121o897303k346537L746849
$$ 11634654 9383391 9617691 13821494 17069294 13832173 6934870 4588333 8335182
38562H335182K739629k527948l371025L88405K019058L86055j12152K51668k126156
$$ 8335182 11074811 8546863 5175838 5564243 7583301 7969356 7857204 8108872 5982716
38553E982716m120687N75011Q070686P379069j700460o979958l180941N77593
$$ 5982716 1862029 2437040 10507726 17886795 16186335 9206377 6025436 6603029
38545F603029k332578m910675n1761O417903N989552J531403N96980J865205p72360
$$ 6603029 4270451 -640224 -691985 5725918 11715470 13246873 13843853 15709058 14936698
38536A4936698n632258n674591o92508K835746K588372K196811K917897J857844
$$ 14936698 9304440 3629849 2937341 5773087 8361459 10558270 13476167 15334011
38528A5334011j093199j964245L73138K117037R49959n71147K44605K290071L184853
$$ 15334011 14240812 12276567 12649705 14766742 15716701 15145554 15390159 17680230 20865083
38519B0865083K414824N44606j901744l657179l376451k065257k317139l994951
$$ 20865083 23279907 23824513 21922769 18265590 14889139 12823882 10506743 6511792
38511F511792l334192J601506O650752N893920j65118m233752j594843L216955
$$ 6511792 3177600 4779106 11429858 17323778 17158660 12924908 11330065 14547020
38503A4547020K712085k417568m086381O57715M523844J090851n039282n469406
$$ 14547020 17259105 14841537 10755156 11412871 15936715 17027566 11988284 6518878
38495F518878q24119J623489L32137M24454L057871L323113j00580k168912n86341
$$ 6518878 5694759 7318248 7650385 8074839 11132710 14455823 14355243 12186331 11599990
38486A1599990Q38876O22876K449026N984689M481613k969648o399235J34742
$$ 11599990 12438866 13061742 15510768 21495457 25977070 23007422 16608187 16742929
38478A6742929P308895L976001n169973o767290R87084P407698O596826L689493
$$ 16742929 24051824 28027825 22857852 16090562 17077646 24485344 31082170 34771663
38470C4771663L422336L540376K184200K504008N984047Q275630N629510J18061
$$ 34771663 38193999 41734375 43918575 46422583 52406630 60682260 66311770 66429831
38462F6429831m598752p801047r393426p942402l883618m47417J098258K920396
$$ 66429831 61831079 54030032 44636606 36694204 32810586 32363169 33461427 36381823
38454C6381823N135791L830779k102227o841574m878168J087983M356573L828776
$$ 36381823 41517614 45348393 43246166 36404592 31526424 32614407 36970980 40799756
38446D0799756M113645P161542R182560O751736J814187j289989j069949R85466
$$ 40799756 44913401 52074943 61257503 68009239 69823426 68533437 67463488 68448954
38438F8448954L735818P179974J0219074J0294291O759697L109370L415312O706155
$$ 68448954 72184772 79364746 89583820 99878111 106637808 109747178 113162490 119868645
38430A19868645P564863L327457j935462k777840L87404K463017Q32677k211094
$$ 119868645 127433508 130760965 128825503 126047663 126435067 128898084 129730761 127519667
38422A27519667l991176m738997n434741n424569l843089j422039M36692Q14069
$$ 127519667 123528491 118789494 113354753 107930184 104087095 102665056 103101748 103915817
38414A03915817j153685n617652r939368r946826n200344p04065q99434l898698
$$ 103915817 102762132 97144480 87205112 77258286 72057942 71353877 70454443 66555745
38406F6555745m709836k649222j659402l636086n630321m730696k069230j19684
$$ 66555745 61845909 59196687 57537285 53901199 48270878 43540182 41470952 41351268
38398D1351268Q25160J082740n60470m136762n986218k992437K157646M320900
$$ 41351268 42176428 43259168 42698698 38561936 32575718 29583281 31740927 36061827
38390C6061827L460966L703189N148434L038334l267382p143138m333929J03473
$$ 36061827 39522793 43225982 48374416 51412750 48145368 41002230 36668301 36771774
38382C6771774k00915k925238j812772K115497K135202k700174n745296l206905
$$ 36771774 36570859 33645621 31832849 33948346 36083548 33383374 27638078 24431173
38374B4431173P46738J308869n66865j685339j582437j247981p95890o51942j643973
$$ 24431173 25177911 26486780 25919915 24234576 22652139 21404158 20608268 19956326 18312353
38365A8312353k451692p18570K227622K254866o83116j691886J026418K778623
$$ 18312353 15860661 15142091 17369713 19624579 18941463 17249577 18275995 21054618
38357B1054618M7727l714005l874304j570385m12270j39320J560529L681539L036684
$$ 21054618 21102345 17388340 13514036 11943651 11531381 11392061 12952590 16634129 19670813
38348A9670813p76756m922596o472166m101910R57188M310558K293681k199036
$$ 19670813 18894057 13971461 7499295 3397385 4354573 8665131 10958812 8759776
38340H759776k466026J902255L874188M70824k167662K62729K308284j277759
$$ 8759776 6293750 8196005 12070193 12541017 10373355 10636084 12944368 11666609
38332A1666609n180968k240168L567987L441217j286208k020392J704303J854711
$$ 11666609 6485641 4245473 7813460 11254677 9968469 7948077 9652380 11507091
38324A1507091l236906n558790j110711L754411L282981N04382J84599J346584
$$ 11507091 8270185 2711395 1600684 5355095 8638076 9142458 9327057 10673641
38316A0673641J413457J333667K078586J522886j049673k252096k11859J737219
$$ 10673641 12087098 13420765 15499351 17022237 15972564 13720468 13508609 15245828
38308A5245828O42625j198680p24507N79395j67854k037164k075625M1921K230588
$$ 15245828 15888453 14689773 13965266 14544661 14376807 12339643 10264018 10305939 12536527
38299A2536527K997932K080603n0362j940571k392047k405217l324241l467123
$$ 12536527 15534459 17615062 17564700 15624129 13232082 10826865 7502624 4035501
38291D035501n15018L124970K549370j596142l075222O05806M716516N118414
$$ 4035501 3520483 6645453 9194823 7598681 4523459 5129265 9845781 14964195
38283A4964195L596989K791647J761477m5863N503K727961M333264K535374O46233
$$ 14964195 18561184 21352831 23114308 23068445 23073948 25801909 30135173 32670547 33316780
38274C3316780J761092L736544M043693M711362P901475J1189166J1959631J2087731
$$ 33316780 35077872 38814416 42858109 47569471 55470946 66660112 78619743 90707474
38266I0707474J3592454J4388669J3594693J6341821K7277466M3076867N6670648
$$ 90707474 104299928 118688597 132283290 148625111 175902577 218979444 275650092
38259B75650092O4122797O1464977M1184411J800411m2134199o9708627p3349041
$$ 275650092 339772889 401237866 442422277 444222688 402088489 332379862 259030821
38252B59030821o1992993m6858748l2728900k1894234j6278085j3532964q953731
$$ 259030821 197037828 150179080 117450180 95555946 79277861 65744897 56791166
$$ [...]
##END NTUPLES=NMR SPECTRUM
##END=
