##TITLE=31Pdec_SR82 Leu'
 CDCl3, 24 sc
 1.09.2021
##JCAMPDX= 6.0         $$ Bruker NMR JCAMP-DX V2.0
##DATA TYPE= NMR SPECTRUM
##DATA CLASS= NTUPLES
##ORIGIN= UXNMR, Bruker Analytische Messtechnik GmbH
##OWNER= root
$$ XWIN-NMR		Version 3.5
$$ Wed Sep  1 16:10:38 2021 Russian Standard Time (UT+4h)  she@DPX200
##.OBSERVE FREQUENCY= 81.013821
##.OBSERVE NUCLEUS= ^31P
##.ACQUISITION MODE= SIMULTANEOUS
##.ACQUISITION SCHEME= undefined
##.AVERAGES= 24
##.DIGITISER RES= 16
##SPECTROMETER/DATA SYSTEM= spect
##.PULSE SEQUENCE= zgpg30
##.SOLVENT NAME= CD2Cl2
##.SHIFT REFERENCE= (INTERNAL, CD2Cl2, 0, 248.564)
##AUDIT TRAIL= $$ (NUMBER, WHEN, WHO, WHERE, WHAT)
$$ ##TITLE= Audit trail, XWIN-NMR		Version 3.5
$$ ##JCAMPDX= 5.01
$$ ##ORIGIN= Bruker BioSpin GmbH
$$ ##OWNER= she
$$ F:/spectra/data/she/nmr/P31/1/pdata/1/auditp.txt
$$ ##AUDIT TRAIL=  $$ (NUMBER, WHEN, WHO, WHERE, WHAT)
(   1,<2021-09-01 16:09:26.45 +0400>,<she>,<DPX200>,
      <created by zg, POWCHK disabled, PULCHK disabled
       configuration hash MD5:
       00 E9 B6 7A A2 85 ED C7 34 08 36 98 17 FE 4E 26
       data hash MD5: 32K
       2C 4E E1 C0 ED CC 95 A1 48 59 1B 93 8D CF DA 76>)
(   2,<2021-09-01 16:09:31.95 +0400>,<she>,<DPX200>,
      <Start of raw data processing
       efp BC_mod = 2 LB = 1 FT_mod = 6 PKNL = 1 PHC0 = -7706.115 PHC1 = -3.529686 SI = 64K 
       data hash MD5: 64K
       34 D5 96 0D A5 C4 ED 84 61 33 3A 07 82 2D 29 CF>)
(   3,<2021-09-01 16:10:07.17 +0400>,<she>,<DPX200>,
      <pk PHC0 = -43.4954 PHC1 = 125.2 
       data hash MD5: 64K
       BE 9F 53 C9 13 B7 A6 EF CE D1 36 46 EE 05 CB 8B>)
$$ ##END=
$$ 
$$ hash MD5
$$ D4 79 96 51 45 5F 05 F6 13 A5 8E 13 B0 58 DD 2B
##$RELAX= 
##$RELAX= 
##$RELAX= 
##$RELAX= 
##$RELAX= 
##$RELAX= 
##$RELAX= 
##$RELAX= 
$$ Bruker specific parameters
$$ --------------------------
##$DU= <F:/spectra>
##$EXPNO= 1
##$NAME= <P31>
##$PROCNO= 1
##$TYPE= <nmr>
##$USER= <she>
##$AMP= (0..31)
100 100 100 100 100 100 100 100 100 100 100 100 100 100 100 100 100 100 
100 100 100 100 100 100 100 100 100 100 100 100 100 100 
##$AQSEQ= 0
##$AQ_mod= 1
##$AUNM= <au_zg>
##$AUTOPOS= <>
##$BF1= 81.014009
##$BF2= 200.13
##$BF3= 200.13
##$BF4= 200.13
##$BF5= 200.13
##$BF6= 200.13
##$BF7= 200.13
##$BF8= 200.13
##$BYTORDA= 1
##$CFDGTYP= 0
##$CFRGTYP= 5
##$CHEMSTR= <none>
##$CNST= (0..31)
1 1 145 1 1 1 1 1 1 1 1 1 1 1 1 1 1 1 1 1 1 1 1 1 1 1 1 1 1 1 1 1 
##$CPDPRG= <waltz16>
##$CPDPRG1= <>
##$CPDPRG2= <waltz16>
##$CPDPRG3= <>
##$CPDPRG4= <mlev>
##$CPDPRG5= <mlev>
##$CPDPRG6= <mlev>
##$CPDPRG7= <mlev>
##$CPDPRG8= <mlev>
##$CPDPRGB= <>
##$CPDPRGT= <>
##$D= (0..31)
0 1 0 0 0 0 0 0 0 0 0 0.03 2e-05 3e-06 0 0 0 0 0 0 0 0 0 0 0 0 0 0 0 0 
0 0 
##$DATE= 1630498165
##$DBL= (0..7)
120 120 120 11 120 120 24 19 
##$DBP= (0..7)
150 150 150 150 150 150 150 150 
##$DBP07= 0
##$DBPNAM0= <>
##$DBPNAM1= <>
##$DBPNAM2= <>
##$DBPNAM3= <>
##$DBPNAM4= <>
##$DBPNAM5= <>
##$DBPNAM6= <>
##$DBPNAM7= <>
##$DBPOAL= (0..7)
0.5 0.5 0.5 0.5 0.5 0.5 0.5 0.5 
##$DBPOFFS= (0..7)
$$ [...]
##$SUBNAM2= <"">
##$SUBNAM3= <"">
##$SUBNAM4= <"">
##$SUBNAM5= <"">
##$SUBNAM6= <"">
##$SUBNAM7= <"">
##$SUBNAM8= <"">
##$SUBNAM9= <"">
##$SW= 501.771253377433
##$SWIBOX= (0..15)
0 1 3 0 0 0 0 0 0 0 0 0 0 0 0 0 
##$SW_h= 40650.406504065
##$TD= 32768
##$TD0= 1
##$TE= 0
##$TE2= 300
##$TE3= 300
##$TEG= 300
##$TL= (0..7)
0 120 53 12 22 120 120 120 
##$TP= (0..7)
150 150 150 150 150 150 150 150 
##$TP07= 0
##$TPNAME0= <>
##$TPNAME1= <>
##$TPNAME2= <>
##$TPNAME3= <>
##$TPNAME4= <>
##$TPNAME5= <>
##$TPNAME6= <>
##$TPNAME7= <>
##$TPOAL= (0..7)
0.5 0.5 0.5 0.5 0.5 0.5 0.5 0.5 
##$TPOFFS= (0..7)
0 0 0 0 0 0 0 0 
##$TUNHIN= 0
##$TUNHOUT= 0
##$TUNXOUT= 0
##$USERA1= <user>
##$USERA2= <user>
##$USERA3= <user>
##$USERA4= <user>
##$USERA5= <user>
##$V9= 5
##$VALIST= <valist>
##$VCLIST= <CCCCCCCCCCCCCCC>
##$VD= 0
##$VDLIST= <DDDDDDDDDDDDDDD>
##$VPLIST= <PPPPPPPPPPPPPPP>
##$VTLIST= <TTTTTTTTTTTTTTT>
##$WBST= 1024
##$WBSW= 4
##$XGAIN= (0..3)
0 0 0 0 
##$XL= 0
##$YL= 0
##$YMAX_a= 1701
##$YMIN_a= -3689
##$ZGOPTNS= <>
##$ZL1= 120
##$ZL2= 120
##$ZL3= 120
##$ZL4= 120
##$ABSF1= 0
##$ABSF2= 0
##$ABSG= 0
##$ABSL= 0
##$ALPHA= 0
##$AQORDER= 0
##$ASSFAC= 0
##$ASSFACI= 0
##$ASSFACX= 0
##$ASSWID= 0
##$AUNMP= <proc_1d>
##$AZFE= 0.1
##$AZFW= 0.5
##$BCFW= 0
##$BC_mod= 2
##$BYTORDP= 0
##$COROFFS= 0
##$CY= -3
##$DATMOD= 1
##$DC= 0
##$DFILT= <>
##$DTYPP= 0
##$F1P= 0
##$F2P= 0
##$FCOR= 1
##$FTSIZE= 65536
##$FT_mod= 6
##$GAMMA= 0
##$GB= 0
##$INTBC= 1
##$INTSCL= 5.30512e-09
##$ISEN= 30
##$LB= 1
##$LEV0= 0
##$LPBIN= 0
##$MAXI= 10000
##$MC2= 0
##$MEAN= 0
##$ME_mod= 0
##$MI= 50
##$NCOEF= 0
##$NC_proc= -8
##$NLEV= 6
##$NOISF1= 182.463
##$NOISF2= 159.3651
##$NSP= 0
##$NTH_PI= 0
##$NZP= 0
##$OFFSET= 248.5645
##$PC= 4
##$PHC0= -7749.611
##$PHC1= 121.6703
##$PH_mod= 1
##$PKNL= yes
##$PPARMOD= 0
##$PSCAL= 0
##$PSIGN= 0
##$REVERSE= no
##$SF= 81.014009
##$SI= 65536
##$SIGF1= 159.3651
##$SIGF2= -187.1042
##$SINO= 113.3802
##$SIOLD= 16384
##$SREGLST= <1H.CDCl3>
##$SSB= 0
##$STSI= 65536
##$STSR= 0
##$SW_p= 40650.406504065
##$SYMM= 0
##$S_DEV= 0
##$TDeff= 32768
##$TDoff= 0
##$TI= <>
##$TILT= no
##$TM1= 0
##$TM2= 0
##$TOPLEV= 0
##$USERP1= <user>
##$USERP2= <user>
##$USERP3= <user>
##$USERP4= <user>
##$USERP5= <user>
##$WDW= 1
##$XDIM= 65536
##$YMAX_p= 499160845
##$YMIN_p= -153103983
$$ End of Bruker specific parameters
$$ ---------------------------------
##NTUPLES= NMR SPECTRUM
##VAR_NAME=  FREQUENCY,     SPECTRUM/REAL,   SPECTRUM/IMAG
##SYMBOL=    X,             R,               I
##VAR_TYPE=  INDEPENDENT,   DEPENDENT,       DEPENDENT
##VAR_FORM=  AFFN,          ASDF,            ASDF
##VAR_DIM=   65536,         65536,           65536
##UNITS=     HZ,            ARBITRARY UNITS, ARBITRARY UNITS
##FACTOR=    0.620285442955139, 1,           1
##FIRST=     20137.2065510759, 0,            0
##LAST=      -20513.1999529892, 0,           0
##MIN=       -20513.1999529892, -153103983,  0
##MAX=       20137.2065510759, 499160845,    0
$$ Real data points
##PAGE= N=1
##DATA TABLE= (X++(R..R)), XYDATA
$$ [...]
##PAGE= N=2
##DATA TABLE= (X++(I..I)), XYDATA
40680b2960584k378623N31645J102229j789237k807853J364447N992541M561429
$$ -22960584 -25339207 -24807562 -23705333 -25494570 -28302423 -26937976 -20945435 -16384006
40672a6384006j593975m519803l71991N260444M839513j123800n048082k339555
$$ -16384006 -17977981 -22497784 -22869775 -17609331 -12769818 -13893618 -18941700 -21281255
40664b1281255L322390N506802K590429j854358l688600j389910L160756N345368
$$ -21281255 -17958865 -12452063 -9861634 -11715992 -15404592 -16794502 -13633746 -8288378
40656h288378J804306m292811n184693J371987P485103N018191k991254o635299
$$ -8288378 -6484072 -10776883 -15961576 -14589589 -7104486 -2086295 -5077549 -11712848
40648a1712848k944307J454380J304415p82660o27191J010689J492054J144541
$$ -11712848 -14657155 -13202775 -11898360 -12681020 -13308211 -12297522 -10805468 -9660927
40640i660927J455101J791369J108508K69296K6701q13900k832481l970749k317123
$$ -9660927 -8205826 -6414457 -5305949 -5036653 -5009952 -5823852 -8656333 -12627082 -14944205
40631a4944205J173059M407379O189846N248421O26231m970863n973584j094096
$$ -14944205 -13771146 -9363767 -3173921 2074500 2700731 -2270132 -8243716 -9337812
40623i337812L673348K703636j651300l198713j001489O40302j88333p94783N95352
$$ -9337812 -5664464 -2960828 -4612128 -7810841 -8812330 -8172028 -8360361 -9155144 -8559792
40614h559792J902888J176183j20012K76339J924109K669934J630116l92444k450979
$$ -8559792 -6656904 -5480721 -5600733 -5324394 -3400285 -730351 899765 507321 -1943658
40605a943658l915027l864356j531342K215866M769241M123073J095121j717295
$$ -1943658 -5858685 -9723041 -11254383 -9038517 -4269276 -146203 948918 -768377
40597g68377k999925l328083k815754o24950K299185L045791J357493J185766
$$ -768377 -3768302 -7096385 -9912139 -10537089 -8237904 -5192113 -3834620 -2648854
40589b648854M381802O230674K139160m143024n376559j929750l28933j530284
$$ -2648854 1732948 7963622 10102782 5959758 583199 -1346551 -1675484 -3205768
40581c205768J64851N183244N752458r37042o180895k956680K583437J245801
$$ -3205768 -3040917 2142327 7894785 6957743 776848 -2179832 403605 1649406
40573A649406m256231m545963O42822K890602m38266k853527n01149K344701J822021
$$ 1649406 -2606825 -7152788 -6509966 -3619364 -4057630 -6911157 -7412306 -5067605 -3245584
40564c245584K95502M31354M13065j144890j379657J419108L301090K69201m840459
$$ -3245584 -2950082 -2518728 -2105663 -3250553 -4630210 -3211102 89988 359189 -4481270
40555d481270n703012r24646M742785O622183M407344P30205j906144k514925
$$ -4481270 -10184282 -11108928 -6366143 256040 4663384 5393589 3487445 972520
40547I72520j655771o74145m28557p19350r66775r19590n65068Q2944Q73266J470826
$$ 972520 -683251 -1357396 -1785953 -2505303 -3472078 -4391668 -4956736 -4873792 -4000526 -2529700
40537b529700J443554M34639j277167k429849j834970J46133K058985L018983
$$ -2529700 -1086146 -651507 -1928674 -4358523 -6193493 -6047360 -3988375 -969392
40529i69392K753211Q53819j924037k716395j13959K308430M02674l314178k696736
$$ -969392 1783819 2637638 713601 -2002794 -2116753 191677 594351 -2719827 -5416563
40520e416563J619862K328557k161749m045594Q78314N274947K167154l138057
$$ -5416563 -3796701 -1468144 -3629893 -7675487 -6797173 -1522226 644928 -2493129
40512b493129j921789L541091M673053R31035j420426j413859k900352m356461
$$ -2493129 -4414918 -873827 3799226 4730261 3309835 1895976 -1004376 -5360837
40504e360837j125456L369403J184505n308177n246381K465858O303206J068367
$$ -5360837 -6486293 -3116890 -1932385 -7240562 -12486943 -10021085 -3717879 -2649512
40496b649512l879082j034915L536247K565580q9287J290478K985435J60924k326922
$$ -2649512 -6528594 -7563509 -4027262 -1461682 -1550969 -260491 2724944 2885868 558946
40487E58946J346509N797871K895056l416325l226583K511827M096097k69172
$$ 558946 1905455 7703326 10598382 7182057 3955474 6467301 10563398 10294226
40479A0294226k832919j033066j208013n557611p037667j543859M378948L569946
$$ 10294226 7461307 6428241 5220228 -337383 -7375050 -8918909 -4539961 -970015
40471i70015j183055k503805O70688L283784K320595j72312j150760k63610N30994
$$ -970015 -2153070 -4656875 -3986187 -702403 1618192 1445880 295120 31510 562504
40462E62504m38985k433387k899760p52870J959564K881366K333653J735479R50379
$$ 562504 123519 -2309868 -5209628 -5962498 -4002934 -1121568 1212085 2947564 3897943
40453C897943l82545q32870N86909J933622J064761r59534k125108k800295l575882
$$ 3897943 3515398 2682528 3269437 5203059 6267820 5308286 3183178 382883 -3192999
40444c192999k618564P82310K983613J063603j804594j452448q8060j999288m674720
$$ -3192999 -5811563 -5029253 -2045640 -982037 -2786631 -4239079 -4327139 -6326427 -11001147
40435a1001147k249891L641457N234255J008883j957374N50914M242337M424145
$$ -11001147 -13251038 -9609581 -4375326 -3366443 -5323817 -4772903 -530566 3893579
40427C893579K193383k03295l030926n054816k882717K215886L676456l21842
$$ 3893579 6086962 5883667 2852741 -2202075 -5084792 -2868906 807550 485708
40419D85708l060139j3695L600881J726702k548483k897151l90305l97624k494113
$$ 485708 -2574431 -2588126 1012755 2739457 190974 -2706177 -3096482 -3494106 -5988219
40410e988219j585002K651962M949224K813124m47553j376220j62428J504031
$$ -5988219 -7573221 -4921259 27965 2841089 2393536 1017316 854888 2358919
40402B358919K366248J325669j408062l156277j623450J743312L621278K688693
$$ 2358919 4725167 6050836 4642774 1486497 -136953 1606359 5227637 7916330
40394G916330m39676m617969o906994l480137M215179P859946K168708o630623
$$ 7916330 7476654 2858685 -4048309 -7528446 -3313267 4546679 6715387 84764
40386H4764q323180k240558L522994M420048L060269J332629k218750n895166
$$ 84764 -8238416 -10478974 -6955980 -2535932 524337 1856966 -361784 -6256950
40378f256950m374800K133889N808440K320622k605762k374061Q62096J370951
$$ -6256950 -10631750 -8497861 -2689421 -368799 -2974561 -5348622 -4486526 -3115575
40370c115575n43251o74169R85084J111396j29741L41782K234270K287634N85204
$$ -3115575 -3658826 -4332995 -3347911 -2236515 -2366256 -2024474 209796 2497430 3082634
40361C082634O31399K846042L618932J818624P28251J677171J100593l027691
$$ 3082634 3714033 6560075 10179007 11997631 12725882 14403053 15503646 12475955
40353A2475955o510024m834552l23290J410889m6851j89083K403832L717020J076812
$$ 12475955 5965931 1131379 808089 2218978 2172127 1983044 4386876 8103896 9180708
40344I180708k299778k084552Q85268K117888l73417m127008n696764l928495
$$ 9180708 6880930 4796378 5681646 7799534 7426117 3299109 -2397655 -6326150
40336f326150k53381K544023K302430k44012j754945k80105K047199K195456Q27123
$$ -6326150 -6579531 -4035508 -1733078 -1977090 -3732035 -4012140 -1964941 230515 1057638
40327A057638Q34308K092845J397468k033542m759451m097469j536211M71426
$$ 1057638 1891946 3984791 5382259 3348717 -1410734 -5508203 -7044414 -6572988
40319f572988J818587K733334J811814j004300k444091m38344J840650M63212
$$ -6572988 -4754401 -2021067 -209253 -1213553 -3657644 -4095988 -2255338 -1792126
40311a792126k782185k984422J45286K152123J097442j70965M22087J287150J232822
$$ -1792126 -4574311 -7558733 -7413447 -5261324 -4163882 -4334847 -3912760 -2625610 -1392788
40302a392788J800367L354588K945238r93247m982653m756080j007871K013719
$$ -1392788 407579 3762167 6707405 5714158 731505 -4024575 -5032446 -3018727
40294c018727K033380K70351j264415j586317o87119M76909O39328J3111K65595
$$ -3018727 -985347 -714996 -1979411 -3565728 -4252847 -3775938 -3136610 -3123499 -2857904
40285b857904J779898K634405J450892o05658j866512k117729j377614O20128
$$ -2857904 -1078006 1556399 3007291 2401633 535121 -1582608 -2960222 -2340094
40277b340094K221363M18073l974487n182206n8838O229772O544506J532169j930529
$$ -2340094 -118731 299342 -3675145 -8857351 -8916189 -2686417 3858089 5390258 3459729
40268C459729o58169J772810J565787p47946k900086l735888k723119k89360J003165
$$ 3459729 2801560 4574370 6140157 5392211 2492125 -1243763 -3966882 -4256242 -3253077
40259c253077p11992k734177j063164K678268K948067o43359k242743N34697K537082
$$ -3253077 -3965069 -6699246 -7762410 -5084142 -2136075 -2779434 -5022177 -4487480 -1950398
40250a950398J27682k212747M50332M632267L726597j488427m424084k539909
$$ -1950398 -1822716 -4035463 -3585131 1047136 4773733 3285306 -1138778 -3678687
40242c678687Q43927L107725M273856L218571j410116o235423n500561M58022
$$ -3678687 -2834760 272965 4546821 7765392 6355276 119853 -5380708 -4922686
40234d922686M882595M181273K007638J727113J039208k163448m107406p30523
$$ -4922686 -40091 4141182 6148820 7875933 8915141 6751693 2644287 1913764
40226A913764M581742M699117j275748o820978o576386k057779J588015J432701
$$ 1913764 6495506 11194623 9918875 3097897 -3478489 -5536268 -3948253 -2515552
40218b515552j250327k702488p7937N251849Q068010M763226j973606n914361
$$ -2515552 -3765879 -6468367 -6546304 -1294455 6773555 11536781 9563175 3648814
40210C648814m390047m26014K050474K443397K169318J641298M81218o02956l58416
$$ 3648814 -741233 -1167247 883227 3326624 5495942 7137240 7618458 7015502 6657086
40201F657086O60465R2928k968463n812906m831374l57984L063430K264410m33312
$$ 6657086 7317551 7410479 4442016 -1370890 -6202264 -6560248 -3496818 -1232408 -1665720
40192a665720o90474J632338K791769J260653k38252L13005R89666k46841j720245
$$ -1665720 -2356194 -723856 2067913 3328566 3090314 3403319 4392985 4146144 2425899
40183B425899j029904N95604M00574j125141j242504K13709O68664p89646k214761
$$ 2425899 1395995 1991599 2392173 1267032 24528 238237 906901 117255 -2097506
40174b097506k176957j316030k51569J122387J820493K35929k690002l513270
$$ -2097506 -4274463 -5590493 -5842062 -4719675 -2899182 -2663253 -5353255 -8866525
40166h866525p55592K899181M072990K429607m5216j522107j041761J266310L435786
$$ -8866525 -9622117 -6722936 -2649946 -220339 -265555 -1787662 -2829423 -1563113 1872673
40157A872673K910295j83760k596417j950206M42738J936975J947968J434568
$$ 1872673 4782968 4599208 2002791 52585 495323 2432298 4380266 5814834
40149E814834N81319j042833k930790l986630l900760k894284q06114K132292
$$ 5814834 6396153 5353320 2422530 -1564100 -5464860 -8359144 -9165258 -7032966
40141g032966M133893L131033n01832l598876l308274k90559J920416J186689
$$ -7032966 -2899073 231960 -269872 -3868748 -7177022 -7467581 -5547165 -4360476
40133d360476m10333M46515K938205K688774j286039l964856j625663J849460
$$ -4360476 -4770809 -4324294 -1386089 1302685 16646 -3948210 -5573873 -3724413
40125c724413Q50465k589913j935031K624513L979072m7568k993653q43499J354160
$$ -3724413 -2873948 -5463861 -7398892 -4774379 -795307 -842875 -3836528 -4680027 -3325867
40116c325867j053782l693804r30973L757827L490234k18075m53310K809837K961682
$$ -3325867 -4379649 -8073453 -9004426 -5246599 -1756365 -1974440 -2427750 382087 3343769
40107C343769j289971l637855j118188J362363J39030j362488K58380K151555
$$ 3343769 2053798 -1584057 -2702245 -1339882 -1200852 -2563340 -2304960 -153405
40099a53405R30542q52826N15788K667997P05225m153263n379923n69842M640849
$$ -153405 777137 -75689 440099 3108096 3813321 -339942 -5719865 -6289707 -1648858
40090a648858L702980k424885o185239k445277N033034P785673L060794k855987
$$ -1648858 2054122 -370763 -6556002 -9001279 -3968245 3817428 6878222 4022235
40082D022235l351657j14909P69199j480750k333602m80286K60449j671652k594111
$$ 4022235 670578 555669 1324868 -155882 -2489484 -2969770 -2709321 -4380973 -6975084
40073f975084j2107L384458M460968L510171J348373k338803n602920m737114
$$ -6975084 -6987191 -3602733 858235 4368406 5716779 3377976 -2224944 -6962058
40065f962058p50553N27276k228966k958060J441869M985752K315799k282523
$$ -6962058 -7712611 -7185335 -9414301 -12372361 -10930492 -5944740 -3628941 -5911464
40057e911464k430721K665N9946m53289K488015N331204K030685m209097n119040
$$ -5911464 -8342185 -8339520 -8279574 -8732863 -6244848 -913644 1117041 -3092056 -8211096
40048h211096j322274o68114l380240j294670O616219J0544286N631770j47243
$$ -8211096 -9533370 -10201484 -13581724 -14876394 -8260175 2284111 7915881 7768638
40040G768638L11181K101256j615319p124310o587501p09248L717644M443776
$$ 7768638 8079819 10181075 8565756 1441446 -5146055 -5855303 -2137659 2306117
40032B306117L919406K468270q96893l553905k514724m72557j752301m319648
$$ 2306117 6225523 8693793 7796900 4242995 1728271 1255714 -496587 -4816235
40024d816235k950231J370820K888723J038847Q59517L074558K175847l286275
$$ -4816235 -7766466 -6395646 -3506923 -2468076 -1608559 1465999 3641846 355571
40016C55571o362056j998953M485897M806335m74412l485569m37413M232867N082082
$$ 355571 -6006485 -8005438 -3519541 1286794 812382 -2673187 -3110600 1122267 6204349
40007F204349K227777q24630k426303l233214l254039j566611J048272J939422
$$ 6204349 8432126 7607496 5181193 1947979 -1306060 -2872671 -1824399 115023
39999A15023K97516j083887J99698K092193R58043k413424l459040p05766K058890
$$ 115023 412539 -671348 -471650 1620543 2578586 165162 -3293878 -3999644 -1940754
39990a940754J807179N09903J011814K222551J643045p6252o85691m14230r33435
$$ -1940754 -133575 376328 1388142 3610693 5253738 5177486 4491795 4077565 3144130
39981C144130j818970j529443o23654o04287p58649L76801J559833O16050j227636
$$ 3144130 1325160 -204283 -827937 -1432224 -2190873 -1814072 -254239 361811 -865825
39972h65825q42942J379093J813435m80940k242666j299006L05436r2189j919399
$$ -865825 -1708767 -329674 1483761 1002821 -1239845 -2538851 -2233415 -2325604 -4245003
39963d245003k646711r95109K076865M205420L469794Q98331J27445K356318L400626
$$ -4245003 -6891714 -7886823 -5809958 -1604538 1865256 2763587 2891032 5247350 8647976
39954H647976n42943n776167n013052J806155O526684L976185j544243l543949
$$ 8647976 8105033 2328866 -2684186 -878031 5648653 9624838 8080595 4536646
39946D536646j882754l39377l0574J98419n9083j497050k059953L21856L393586
$$ 4536646 2653892 2314515 2283941 2482360 2423277 926227 -1133726 -811870 2581716
39937B581716L334513Q51442k8576J096073K08481l926755o493907l364075K247198
$$ 2581716 5916229 6767671 6739095 7835168 8043649 4116894 -2377013 -5741088 -3493890
39928c493890L723840J13605k905254j390361J508707Q21572k523994l178320
$$ -3493890 229950 343555 -2561699 -3952060 -2443353 -1621781 -4145775 -7324095
39920g324095L70128L516116K623072K45242N67562K859484L185277N76400k430835
$$ -7324095 -6953967 -3437851 -814779 -569537 -1975 2857509 6042786 6619186 4188351
39911D188351m090306m378676k748180P94236L109347J108719k688226k732436
$$ 4188351 98045 -4280631 -7028811 -6234575 -3125228 -2016509 -4704735 -7437171
39903g437171J180532L524309J932467M99011K056586L242576R47819j714684
$$ -7437171 -6256639 -2732330 -799863 -300852 1755734 4998310 5946129 4231445
39895D231445p72845J503698M34453l011595l757864q02316J522882L62513j961140
$$ 4231445 3458600 4962298 5396751 2385156 -1372708 -2175024 -652142 -289629 -2250769
39886b250769j806067J068176L400668J881506k931112n903360k631357M114009
$$ -2250769 -4056836 -2988660 412008 2293514 -637598 -6540958 -9172315 -5058306
39878e058306O826079L361605k33822M62819J500628j585585m979024k904667
$$ -5058306 1767773 5129378 4895556 5358375 6859003 5273418 294394 -2610273
39870b610273J644138J368712k698807k821990J791966L355456q16467l314133
$$ -2610273 -966135 402577 -2296230 -5118220 -3326254 29202 -787265 -4101398
39862d101398N29891M216162R18482m860869m542043Q97551L387198J003122k77496
$$ -4101398 -3571507 644655 1563137 -3297732 -7839775 -6942224 -3555026 -2551904 -2829400
39853b829400K249549L522968l08620n004269m313678J048285M686181K944452
$$ -2829400 -579851 2943117 2634497 -2369772 -6683450 -5635165 -948984 1995468
39845A995468j414930l418331j198297L029211N503587M005902l23616l684049
$$ 1995468 580538 -2837793 -4036090 -1006879 4496708 8502610 8178994 4494945
39837D494945l043040N46733K902935J649075r46191j387562j2846j77377k753019
$$ 4494945 1451905 1998638 4901573 6550648 5604457 4216895 4204049 4026672 1273653
39828A273653m557367l100757O4590K222467K874166K329118o6294l554906m615982
$$ 1273653 -3283714 -6384471 -6319881 -4097414 -1223248 1105870 1039576 -2515330 -7131312
39819g131312j403790K749498L798394K567981J926592J147926j676140l949344
$$ -7131312 -8535102 -5785604 -1987210 580771 2507363 3655289 1979149 -1970195
39811a970195j759248K534705K954534k49003j028771J676142K047860j675069
$$ -1970195 -3729443 -1194738 1759796 1510793 482022 2158164 4206024 2530955
39803B530955l264532M58361L197607k62657m630657k745794K426507K987265
$$ 2530955 -733577 -275216 2922391 2659734 -1970923 -4716717 -2290210 697055
39795F97055j043200l000360j017235N79686q9725p32927j126291l056976m257249
$$ 697055 -346145 -3346505 -4363740 -3784054 -3873779 -4606706 -5732997 -8789973 -13047222
39786a3047222n96700N180661N362139n81445m227059j135559K974795K829178
$$ -13047222 -13643922 -8463261 -3101122 -3682567 -7909626 -9045185 -6070390 -3241212
39778c241212J807997L794856M649974k76910o053871m782340J342966L187926
$$ -3241212 -1433215 2361641 7011615 6734705 680834 -4101506 -2758540 429386
39770D29386p71342k925413m7627J612802j971350m727011k77888O938208P867738
$$ 429386 -341956 -3267369 -3314996 -1702194 -3673544 -8400555 -8678443 -1740235 6127503
39761F127503K296528j837561j019706L7137j981485l212323N8556M216099L569687
$$ 6127503 8424031 6586470 5566764 5603901 3622416 410093 468649 4684748 8254435
39752H254435r26750l630414k709455j213061o95624N54629K617140K709894L40200
$$ 8254435 7327685 3697271 987816 -225245 -920869 -366240 2250900 4960794 5300994
39743E300994j093526J15134J194609J13304p97127M43426J380073k87069j967137
$$ 5300994 4207468 4322602 5517211 5630515 4833388 5276814 6656887 6369818 4402681
39734D402681q28849L67068k079321n144269l052073K486331L647330j442338
$$ 4402681 3573832 3940900 1861579 -3282690 -6334763 -3848432 -201102 -1643440
39726a643440n473604k887802K628075M840723L474903J942990J137426M8627
$$ -1643440 -7117044 -10004846 -7376771 -2536048 938855 2881845 4019271 4067898
39718D067898o51660J0380O19793k37239r37981M28801K307146K119806O41443
$$ 4067898 3416238 3426618 4046411 3809172 2871191 3299992 5607138 7726944 8368387
39709H368387L65001R88519J62620k240145m016888m190512l672876k907442j567864
$$ 8368387 8733388 9721907 9884527 7644382 3627494 -563018 -4235894 -7143336 -8711200
39700h711200p4242J034786K504505M754733N850710L713586m49855l401990l633016
$$ -8711200 -8785442 -7750656 -5246151 -491418 5359292 9072878 8623023 5221033 1588017
39691A588017j620574J984485N478016N340391L86213m639830m157261K60773
$$ 1588017 -32557 1951928 7429944 12770335 13156548 8516718 4359457 4620230
39683D620230J884715j263722l853875j703871K341203L263259M99132k828011
$$ 4620230 6504945 5241223 1387348 -316523 2024680 5287939 5787071 2959060
39675B959060m120522k610641O32195K318461k03192m151672l348514K780255
$$ 2959060 -1161462 -3772103 -3139908 -821447 -1024639 -5176311 -8524825 -5744570
39667e744570O782892L257089l008211l883452N06715L064995P71641k029807
$$ -5744570 1038322 4295411 1287200 -2596252 -2089537 975458 1747099 -282708
39659b82708j476801O48775J246752O49883O18947R74159P35653L08278L65022
$$ -282708 -1759509 -1110734 136018 785901 1404848 2379007 3114660 3422938 3787960
39650C787960K72314n90885j396413j257447p00444l96638J62858J259659J613289
$$ 3787960 4060274 3469389 2072976 815529 115085 -281553 -118695 1140964 2754253
39641B754253K33101j496315j559090l60277J44327o3373R59834L280144L993229
$$ 2754253 2987354 1491039 -68051 -428328 -284001 -347374 612460 3892604 7885833
39632G885833J516276j346840j188994O87359J70519k825239l525829L00441L969540
$$ 7885833 9402109 8055269 6866275 7553634 7724153 4898914 1373085 1673526 5643066
39623E643066K028714l891239p278650n283848r23201K468529M439468M891762
$$ 5643066 7671780 3780541 -3498109 -8781957 -9705158 -7236629 -2797161 2094601
39615B094601L049753K61393l53808J227179J349718j199259k797653j244012
$$ 2094601 5144354 5405747 5051939 6279118 7628836 6429577 3631924 2387912
39607B387912J28245j767180m065948k634217J013394K580129J906054J603895
$$ 2387912 2516157 748977 -3316971 -5951188 -4937794 -2357665 -451611 1152284
39599A152284J319575o51134k076387K23718L438032K012848k643958l390659
$$ 1152284 2471859 1820725 -255662 -31944 3406088 5418936 2774978 -615681
39591f15681J145395M279410K258316n10800k77606j10967k746687m451298j742723
$$ -615681 529714 4809124 7067440 6556640 6279034 6168067 3421380 -1029918 -2772641
39582b772641J771327J501412l07028N81010K279572O69688k306131j823501J115496
$$ -2772641 -1001314 500098 193070 774080 3053652 3723340 1417209 -406292 709204
39573G09204J886160J011698K563015N139054L259729k195261l967065l92562
$$ 709204 2595364 3607062 6170077 11309131 14568860 12373599 8406534 8013972
39565H013972J478896k124397n071260j721233L338095K678295k065360l289587
$$ 8013972 9492868 7368471 2297211 575978 3914073 6592368 4527008 1237421
39557A237421M16095K850690N03089k556798j790357R65513R48592k116265l725020
$$ 1237421 1653516 4504206 5007295 2450497 660140 1625653 2574245 457980 -3267040
39548c267040j246105K228473K205838q13890k116805J58392K292710J131469
$$ -3267040 -4513145 -2284672 -78834 -892724 -3009529 -2851137 -558427 573042
39540E73042n97407J112329M268139L498140j094539l573302j229932J699968
$$ 573042 -24365 1087964 5356103 8854243 7759704 4186402 2956470 4656438
39532D656438J136180j259831k158013j585030q61897M11203K168937K439684
$$ 4656438 5792618 4532787 2374774 789744 -72153 339050 2507987 4947671
39524D947671J185491J670713M611257N183926J40209o088981p425351m749460
$$ 4947671 6133162 7803875 12415132 17599058 17739267 11650286 4224935 -524525
39516e24525k916449k412722m74503J893075J249098j120404p09611J818134J247462
$$ -524525 -3440974 -5853696 -6328199 -4435124 -3186026 -4306430 -5016041 -3197907 -1950445
39507a950445k519604l168309J570176N598544M017387L52905j95185J057442
$$ -1950445 -4470049 -7638358 -6068182 -469638 3547749 3900654 3705469 4762911
39499D762911J76420j862515j402980J147592K279893J033671r96078l163947
$$ 4762911 4939331 3076816 1673836 2821428 5101321 6134992 5138914 1974967
39491A974967m702608k655291L658305Q226760M842585l049143o014643k171338
$$ 1974967 -2727641 -5382932 -1724627 6502133 11344718 8295575 2280932 109594
39483A09594O90145j746207l413996J273405P032400N574070r43007l093603J105227
$$ 109594 799739 -946468 -4360464 -3087059 3945341 9519411 8576404 5482801 6588028
39474F588028L737970J22947m121551k660180J865501L052989O90925p37154l98398
$$ 6588028 10325998 10448945 6327394 3667214 5532715 8585704 9276629 8539475 8141077
39465H141077j268999l221716k644892N44284J623657j374319m083197k453100
$$ 8141077 6872078 3650362 1005470 1549754 3173411 1799092 -2284105 -4737205
39457d737205J416888L225340K471325J002977j077206l888114m707144j050298
$$ -4737205 -3320317 -94977 2376348 3379325 2302119 -1585995 -6293139 -7343437
39449g343437M559957P098844N388989K193856q02517l763272n301709l287805
$$ -7343437 -2783480 4315364 9704353 11898209 11095692 7332420 2030711 -1257094
39441a257094P25336K574639J659177J438272K864873K467350j025080l319190
$$ -1257094 -531758 2042881 3702058 5140330 8005203 10472553 9447473 6128283
39433F128283j207621J816753R98276j955930j776225J589921K646707j082278
$$ 6128283 4920662 6737415 7735691 5779761 4003536 5593457 8240164 7157886
39425G157886m992726l689923J831417N687918M335093J16472k300579j368666
$$ 7157886 2165160 -1524763 306654 5994572 10329665 10446137 8145558 6776892
39417F776892N79576J299475J201615J063605l42744l544668n067121j146563
$$ 6776892 7356468 8655943 9857558 10921163 10578419 7033751 1966630 820067
39409H20067N553236P811519L498955j587159k597527k093459m022562o204378
$$ 820067 6373303 14184822 17683777 16096618 13499091 11405632 7383070 1178692
39401A178692m291131K13052K112416Q17905L15367J719374K039193N05987R3410
$$ 1178692 -3112439 -2899387 -786971 30934 346301 2065675 4104868 4610855 4704265
39392D704265J581843J703146q48814k594923j015186J283757J127661k96775
$$ 4704265 6286108 7989254 7140440 4545517 3530331 4814088 5941749 5644974
39384E644974m07751P6554q75848k308263j814993R6684Q37286J03540o5618N55080
$$ 5644974 5237223 5313777 4437929 2129666 314673 411357 1248643 1352183 1286565 1841645
39374A841645m59284l884496o271266l672007K880529P518468N921614N79739
$$ 1841645 1382361 -2502135 -8773401 -12445408 -9564879 -2046411 3875203 4454942
39366D454942k012708N52103L789148L060131J95352j56984J420098J89617l921740
$$ 4454942 2442234 2994337 6783485 9843616 10038968 9881984 11302082 11491699 7569959
39357G569959m943249l52654L981008K254661k670292m126606j466100O98973
$$ 7569959 2626710 2274056 6255064 8509725 5839433 1712827 246727 945700
39349I45700O50449P32800J409084M38955j691869j442807J341217K143034q34194
$$ 945700 1596149 2328949 3738033 4176988 2485119 1042312 2383529 4526563 3692369
39340C692369l036341o02190L246508L134247k36526j715739M7624J145186p69041
$$ 3692369 656028 53838 3300346 6434593 6198067 4482328 4529952 5675138 4906097
39331D906097k961827k479704p13205m57028j020518K99995K972673L164714m47444
$$ 4906097 1944270 -535434 -1248639 -1705667 -2726185 -2426190 546483 3711197 3263753
39322C263753l934668l105272Q63137L355458K684035J432100J576289J652695
$$ 3263753 -670915 -3776187 -2913050 442408 3126443 4558543 6134832 7787527
39314G787527M4414j819416j842352q27823r42907j816976j109044J395720L105227
$$ 7787527 7831941 6012525 4170173 3342350 2399443 582467 -526577 869143 3974370
39305C974370K416206P22178k16679p86614k067418l416825l225191j493481j57363
$$ 3974370 6390576 7112754 6896075 6109461 4042043 625218 -2599973 -4093454 -4250817
39296d250817o03582j694651r57998K186739N065637M598990J337221r82082m77629
$$ -4250817 -4854399 -6549050 -7507048 -5320309 -254672 4344318 5681539 4699457 4221828
39287D221828L83248r72733k666683j307770J723683J431115k690900m470021
$$ 4221828 4605076 3632343 965660 -342110 1381573 2812688 121788 -4348233
39279d348233J29470N879466M858818j724269m365087J144159O971083M114937
$$ -4348233 -4218763 1660703 6519521 4795252 430165 1574324 8545407 12660344
39271A2660344m348457p372164j825329L389171J142597l394039j652654M352646
$$ 12660344 8311887 939723 -885606 2503565 3646162 252123 -1400531 2952115
39263B952115N288914m74928m472404j794662J952896J098734q57343J436300
$$ 2952115 8241029 7766101 3293697 1499035 3451931 4550665 3693322 5129622
39255E129622N122131M109081l31039k249776j430143k394810m582760k901194
$$ 5129622 10251753 14360834 14029795 11780019 10349876 7955066 3372306 471112
39247D71112J656499J595051m422772p534072j757344O497590P738747K314946
$$ 471112 2127611 3722662 -700110 -8234182 -9991526 -3493936 4244811 6559757
39239F559757k161141j905372P06588K717422K695887l31792m802270n719734
$$ 6559757 4398616 2493244 3199832 5917254 8613141 8281349 3479079 -2240655
39231b240655r56042L882515K424643k797836m016152j35801K283948J24803j759445
$$ -2240655 -3196697 685818 3110461 312625 -3703527 -3839328 -1555380 -1430577 -3190022
39222c190022O22428L683477K377823j822480l762718k360517q65205r21859o81995
$$ -3190022 -2567594 1115883 3493706 1671226 -2091492 -4452009 -5317214 -6239073 -6921068
39213f921068J296802L641371M394192L448700J844507Q6507j761139l043577
$$ -6921068 -5624266 -1982895 2411297 5859997 7704504 7791011 6029872 2986295
39205B986295k757894r95232O41556P60513P850K36729J824420K964912K068994
$$ 2986295 228401 -766831 -125275 635238 643088 879817 2704237 5669149 7738143
39196G738143k72843k378238l338013k955160j163622J192554K148829P79478
$$ 7738143 7465300 5087062 1749049 -1206111 -2369733 -1177179 971650 1751128
39188A751128j222755j659357q07441o62370j748740k430960j263961J431759
$$ 1751128 528373 -1130984 -1938425 -2600795 -4349535 -6780495 -8044456 -6612697
39180f612697M300392O011726N623093L052870n04105l197118l772167k376688
$$ -6612697 -2312305 3699421 9322514 12375384 11871279 8674161 4901994 2525306
39172B525306n90643k88093j443675j648526M66718K125569k63750m826005n344447
$$ 2525306 1934663 1646570 202895 -1445631 -978913 1146656 882906 -3943099 -9287546
39163i287546Q7443N661629N400339M06597m065919n058511k395550L143494Q103965
$$ -9287546 -9200103 -3538474 1861865 2268462 -1797457 -6855968 -9251518 -6108024 1995941
39154A995941O894176p94770o660638l794732L167287M755729P68837p72896K407803
$$ 1995941 8890117 8095347 1434709 -2360023 807264 5562993 6331830 5558934 7966737
39145G966737L513389j187203n952315n064166j316950j84988j268003q03870
$$ 7966737 11480126 10292923 4340608 -723558 -2040508 -2225496 -3493499 -4297369
39137d297369J442978K882733K913013K718301K237272P90806q16202j359871
$$ -4297369 -2854391 28342 2941355 5659656 7896928 8687734 7871532 6511661
39129F511661q65046L04837J903045K379489L9015l331721l682079q11981J001133
$$ 6511661 5646615 5951452 7854497 10233986 10273001 6941280 3259201 2447220 3448353
39120C448353K1267m17613J274898J493111j376632k283238K337328O792117L600786
$$ 3448353 3469620 3052007 4326905 5820016 4443384 2160146 4497474 11289591 14890377
39111A4890377m606043q256197m317978P48296J323622r65557k311236k281696
$$ 14890377 10284334 2028137 -2289841 -1541545 -217923 -1183480 -3494716 -5776412
39103e776412k115277j731928p05664N55234J935536L592523M305237K490218
$$ -5776412 -7891689 -9623617 -10329281 -9774047 -7838511 -4245988 59249 2549467
39095B549467o99535k080512q61402L62111j39186o47732R15349L359678L546164
$$ 2549467 1849932 -230580 -1091982 -729871 -869057 -1516789 -601440 2758238 6304402
39086F304402N89763k719505l097069r20362o7656k650880n303090l423004J642812
$$ 6304402 6894165 4174660 1077591 157229 89573 -2561307 -7864397 -11287401 -9644589
39077i644589L850493J411634o20762J182638L135063J346918j150265J33873
$$ -9644589 -5794096 -4382462 -5003224 -3820586 -685523 661395 -488870 -354997
39069c54997K915221K279136k15048M69467K751804L35872n850832p065936m98292
$$ -354997 2560224 4839360 4624312 5093779 7845583 8181455 2330623 -4735313 -5233605
39060e233605N107311K091354m944081o456469j367285L289202L187315R94786
$$ -5233605 -126294 1965060 -2979021 -9435490 -10802775 -7513573 -4326258 -3331472
39052c331472O76748K418323L759967K874767J48431k225314k505758j665669
$$ -3331472 -2654724 -236401 3523566 6398333 6546764 4321450 1815692 150023
39044A50023j958440l005814k021008J102972K362728m56271l659044k707601
$$ 150023 -1808417 -4814231 -6835239 -5732267 -3369539 -3825810 -7484854 -10192455
39036a0192455J019667K434804L04424j522450l02867J934407J952297j10487
$$ -10192455 -9172788 -6737984 -6433560 -7956010 -8258877 -6324470 -4372173 -4482660
39028d482660j323917O7156K516211K912206J66248l166320l532125o48281K211088
$$ -4482660 -5806577 -5739421 -3223210 -311004 -144756 -3311076 -6843201 -7491482 -5280394
39019e280394K614595J760273J627160J444722n23545l010503k773972M50244
$$ -5280394 -2665799 -905526 721634 2166356 1642811 -1367692 -4141664 -3691420
39011c691420L058138K496528M27139n41029r25185k647716m643074l456711J508432
$$ -3691420 -633282 1863246 2290385 1749356 824171 -1823545 -6466619 -9923330 -8414898
39002h414898O193545O665880L624426M02755j730815l740419n326858m493722
$$ -8414898 -2221353 4444527 8068953 8471708 6740893 3000474 -2326384 -6820106
38994f820106j076704J986803K188746M29556p74095n92445j14486l41561j084258
$$ -6820106 -7896810 -5910007 -3721261 -3291705 -4065800 -4658245 -4772731 -5114292 -6198550
38985f198550j275381L6203K280579L272018J984071P39928K060956L824267J437027
$$ -6198550 -7473931 -7437728 -5157149 -1885131 98940 838868 2899824 6724091 8161118
38976H161118m531758p417636l314197L271841N660454L252406K779j925545k614060
$$ 8161118 3629360 -3788276 -7102473 -3830632 1829822 5082228 5085007 3159462 545402
38967E45402j237703K554075N624494M331238k82654l992006m877249l793161
$$ 545402 -692301 1861774 7486268 11817506 11534852 7542846 2665597 -1127564
38959a127564j226477K079244L113675R809l786174l561069l91759Q54310n62374
$$ -1127564 -2354041 -274797 2838878 2848687 -937487 -4498556 -4890315 -4036005 -4598379
38950d598379r22792R30544K046627J006648k73602o87230q81552j64886K346567
$$ -4598379 -5521171 -4590627 -2544000 -1537352 -1810954 -2498184 -3379736 -3544622 -1198055
38941a198055L971981J642961j781090j002906K398038J881777k630068m043937
$$ -1198055 2773926 4416887 2635797 1632891 4030929 5912706 3282638 -761299
38933g61299k66203K288167K61717j162261J207976K069327k111287n110446j122431
$$ -761299 -1027502 1260665 1522382 360121 1568097 3637424 1526137 -3584309 -4706740
38924d706740M441789L270332k450457m336224j332717N51100o06856r86943O42924
$$ -4706740 -264951 3005381 554924 -3781300 -5114017 -4562917 -5169773 -6156716 -5513792
38915e513792J337786N53921J009700K714002K501076p9003j899881j475246k72369
$$ -5513792 -4176006 -3622085 -2612385 101617 2602693 2523690 623809 -851437 -1123806
38906a123806P51552J387818J14306l297121m677130n67455N017630N126031R6695
$$ -1123806 -372254 1015564 1129870 -2167251 -6844381 -7411836 -2394206 2731825 2828520
38897B828520l285385k109627J78111J283964K424044K649583j034198o040637
$$ 2828520 -456865 -2566492 -2388381 -1104417 1319627 3969210 2935012 -3105625
38889c105625m914428K971946Q134592M128412k824070l349976J472620L259585
$$ -3105625 -8020053 -5048107 3086485 7214897 4390827 1040851 2513471 5773056
38881E773056m04307l590462k104614R80902J257978o49881j245291K88308J527823
$$ 5773056 5368749 1778287 -326327 654575 1912553 1262672 17381 305689 1833512
38872A833512Q02896n57667m41278R52986J628518J045401Q79001J804182J813226
$$ 1833512 2636408 2078741 1637463 2590449 4218967 5264368 6143369 7947551 9760777
38863I760777l29445k150995j105919N72093j038691m291040l150592L110217
$$ 9760777 9431332 7280337 6174418 6746511 5707820 1416780 -1733812 1376405
38855A376405O800661J987478o146457p305552J8892O128836K845260n724960
$$ 1376405 8177066 10164544 4018087 -3287465 -3268573 2860263 5705523 -19437
38847a9437q658589k390467N190704N589771L07849k761864n57804K799142L929802
$$ -19437 -8678026 -11068493 -5877789 -288018 19831 -2742033 -3299837 -500695 3429107
38838C429107M154397M156231J222123m396151o131406L6093P445323O401056
$$ 3429107 7583504 11739735 12961858 8565707 2434301 2470394 9915717 16316773
38830A6316773k277168q446602o603757j643845l4521j715443k724933p89882
$$ 16316773 14039605 5593003 -1010754 -2654599 -2689120 -4404563 -7129496 -7919378
38822g919378L740067Q424195Q826486K368981o462548r163065l387906L828805
$$ -7919378 -4179311 4244884 13071370 15440351 8977803 -185262 -3573168 255637
38814B55637M903122J7282n162881o279976k804552K651894N534936L135323j301608
$$ 255637 5158759 5176041 13160 -6266816 -9071368 -6419474 -884538 2250785 949177
38805I49177j843653J665953L124258j95551l221570j456459J950609K180828
$$ 949177 -894476 771477 3895735 3700184 478614 -977845 972764 3153592
38797C153592P49602J644123L381664J672519k360969l473381p79428J483237
$$ 3153592 3903194 5547317 8928981 10601500 8240531 4767150 3987722 5470959
38789E470959J423805J458573K246169R13526k833661m464539j438302K233142
$$ 5470959 6894764 8353337 10599506 11513032 8679371 4214832 2776530 5009672
38781E009672J724822j709191l274105j599398N91731J235395P65371k6618p57143
$$ 5009672 6734494 5025303 1751198 151800 743531 1978926 2744297 2717679 1960536
38772A960536m19845J491209K983800J626901j301347j902046M95178J999281
$$ 1960536 1540691 3031900 6015700 7642601 6341254 4439208 4934386 6933667
38764F933667J16688k405918k124665j44374N24556K40364J191594K481381J572243
$$ 6933667 7050355 4644437 2519772 2375398 2899954 3140318 4331912 6813293 8385536
38755H385536m30985k14528J382352K51897l195498l497489P77644L896623K006993
$$ 8385536 7954551 7740023 9122375 9374272 6178774 2681285 3458929 7355552 9362545
38746I362545r69347o62703O16408n61572j732222L22602K343053J47142k577646
$$ 9362545 8393198 7730495 8346903 7785331 6053109 6375711 8718764 8865906 6288260
38737F288260L14489N925553N565064j535011p011986o127741k874422j297140
$$ 6288260 6602749 12528302 18093366 16558355 9546369 3418628 544206 -752934
38729g52934m31572J95614j478534l845769j554032M875765P309286K254129k771540
$$ -752934 -1184506 -988892 -2467426 -6313195 -7867227 -2991462 4317824 6571953 3800413
38720C800413o86495M182759L420420k404769n479341k531454K051270L623023
$$ 3800413 3113918 7296677 10717097 8312328 2832987 301533 2352803 5975826
38712E975826K168621j8390j499542k138973k387158k103393j53911L084234L910834
$$ 5975826 8144447 8126057 6626515 4487542 2100384 -3009 -156920 2927314 6838148
38703F838148m3527m232794k132769M181974N714960K33446m051075j683199J891717
$$ 6838148 6794621 2561827 429058 4611032 10325992 10559438 6508363 4825164 6716881
38694F716881N27731k670275k447612r21686j893909k187047K149415O310140
$$ 6716881 7244612 4574337 2126725 1205039 -688870 -2875917 -726502 5583638
38686E583638L435692k981408l756391J265945L513464j96786l898885l360605
$$ 5583638 9019330 6037922 2281531 3547476 7060940 6864154 2965269 -395336
38678c95336j493297j236788j027150M46966J567120J809318K811266M114363
$$ -395336 -1888633 -3125421 -4152571 -3705605 -2138485 -329167 2482099 6596462
38670F596462L123781J24304j787091j998310k301179j898372J333368M801369
$$ 6596462 9720243 9844547 8057456 6059146 3757967 1859595 3192963 7994332
38662G994332L369220j843908l892891m64492K989972K183492p40746k778281
$$ 7994332 11363552 9519644 5626753 5162261 8152233 10335725 9594979 6816698
38654F816698m102797m243032j007662L950678N040410J325023j180117Q87293
$$ 6816698 2713901 -1529131 -2536793 1413885 6454295 7779318 6599201 7486494
38646G486494K992794J095671j464606p00065N66687j680032m538847k721055
$$ 7486494 10479288 11574959 10110353 9410288 9976975 8296943 3758096 1037041
38638A037041K207526M093810J728614l44878L49924J396635N82169r25637j246304
$$ 1037041 3244567 7338377 9066991 8722113 9072037 10468672 11050841 10125204 8878900
38629H878900k98479R38574J388932J35851k356926l647891j753296K047175M107206
$$ 8878900 8580421 9518995 10907927 11043778 8686852 5038961 3285665 5332840 9440046
38620I440046J961866l257902p159782n410925J293763O304277M155150j889594
$$ 9440046 11401912 8144010 984228 -4426697 -3132934 3171343 7326493 5436899
38612E436899l590202R89628N178990L745660n20949k660375k350131j480233
$$ 5436899 1846697 2836325 8015315 11760975 11240026 8579651 6229520 4749287
38604D749287q9646J330801K39277l088087l812974q8043K724598O06338j746033
$$ 4749287 4659641 5990442 6229719 3141632 -671342 -759385 1965213 2571551 825518
38595H25518J210694N639440M284260j085061k619721L22086Q93732k486275l333978
$$ 825518 2036212 7675652 11959912 10874851 8255130 8577216 9470948 6984673 3650695
38586C650695J024699M255439J485549k913192k768551Q02943K631458J186136
$$ 3650695 4675394 8930833 10416382 7503190 4734639 5537582 8169040 9355176
38578I355176j292421k661729j552938K141470M920006K301882l632497m823154
$$ 9355176 8062755 5401026 3848088 5989558 10909564 13211446 9578949 4755795
38570D755795J142773O036502K594443m766971p252710m391611j632107L21196
$$ 4755795 5898568 11935070 14529513 9762542 2509832 -1881779 -3513886 -3192690
38562c192690M347525P749303M717364k326043m191965P70229L886433O03033
$$ -3192690 1154835 8904138 13621502 11295459 7103494 7873723 11760156 12363189
38554A2363189k422184L29446L477074P12705l680401k532025J281410K31865
$$ 12363189 9941005 10270451 13747525 14460230 10779829 8247804 9529214 9761079
38546I761079l648052j665813N744269Q072558J306044n408752l769117K149815
$$ 9761079 6113027 4447214 10191483 18264041 19570085 14161333 10392216 12542031
38538A2542031L986691J428014k23651L48851K94380r60282j378144r63586j544936
$$ 12542031 16528722 17956736 17733085 18081936 18376316 17416034 16037890 15074304 13529368
38529A3529368k625967j753999J162551L287332K738373O93724n12891n9729N84093
$$ 13529368 10903401 9149402 10311953 13599285 16337658 17031382 16518491 16458762 17042855
38520A7042855n08046k419158j408251L175377N249455l36385p897625o576425
$$ 17042855 16534809 14115651 12707400 15882777 21132232 20795847 12898222 6321797
38512F321797L350087R203661M333150k178942o11192M185559K260960m291748
$$ 6321797 9671884 18875545 23208695 21029753 20418561 24604120 26865080 22573332
38504B2573332n469343k22789K965501O68817j606778j68586K199847L117057
$$ 22573332 17103989 16881200 19846701 20515518 18908740 18740154 20940001 24057058
38496B4057058L491391K880285j28588k781354j142123K349799K429028Q07005
$$ 24057058 27548449 30428734 30300146 27518792 26376669 28726468 31155496 31962501
38488C1962501L018199O780521M592397k236784m242415L38818K907083O1966
$$ 31962501 34980700 41761221 46353618 44116834 39874419 40213237 43120320 43182286
38480D3182286j140797K683532M866945J755297k87545K774684N124669K672738
$$ 43182286 42041489 44725021 49591966 51347263 51059718 53834402 58959071 61631809
38472F1631809P08651L012368M759512L283943L923483Q073843Q693759N193005
$$ 61631809 62340460 65352828 70112340 73396283 77319766 85393609 94087368 99280373
38464I9280373P308777J5373369J5585241P054897J0191400K7524849K0778061
$$ 99280373 106589150 121962519 137547760 144602657 154794057 182318906 203096967
38457B03096967l8906179j13066863j29731043p3904658n256119K1095745J3566004
$$ 203096967 164190788 51123925 -78607118 -152511776 -157767895 -136672150 -123106146
38450a23106146R059101J5088010J4680969N427896J464635N764388P039477J820166
$$ -123106146 -114047045 -98959035 -84278066 -78850170 -77385535 -71621147 -64581670 -62761504
38442f2761504r36090K714309O049592M793212K875109L253638L290186J275965
$$ -62761504 -63697594 -60983285 -54933693 -50140481 -47265372 -44011734 -40721548 -39445583
38434c9445583l55419r199P47833O75232K88314O057K23874J876082M159065M249556
$$ -39445583 -39801002 -39810201 -39062368 -38387136 -38098822 -38092765 -37868891 -35992809 -31833744 -27584188
38424b7584188J925482Q29331K313038K674925m5853j870089K10310K619083J550446
$$ -27584188 -25658706 -24829375 -22516337 -19841412 -19887265 -21757354 -21547044 -18927961 -17377515
38415a7377515m29578L43497K029142J810480J692564L474723L431843r02869
$$ -17377515 -17807093 -17463596 -15434454 -13623974 -11931410 -8456687 -5024844 -5927713
38407e927713m067829p87034M224574L341243j480255k738941j76326O77151r7520
$$ -5927713 -9995542 -10782576 -6558002 -3216759 -4697014 -7435955 -7612281 -6935130 -7032650
38398g032650K199627N970674M631409j128392l382837m39452N68315l018205
$$ -7032650 -4833023 1137651 5769060 4640668 1257831 818379 1386694 -1631511
38390a631511m242422R27307N595917K720618l567991m432453Q30590N038016
$$ -1631511 -5873933 -4946626 649291 3369909 -198082 -4630535 -3799945 1238071
38382A238071L417814j724622n285721m600624j110591J304817N57531q80697
$$ 1238071 4655885 2931263 -2354458 -6955082 -8065673 -6760856 -6203325 -7084022
38374g084022M37062L142378K661188j305161l623334j328747K183071K682419
$$ -7084022 -6646960 -3504582 -843394 -2148555 -5771889 -7100636 -4917565 -2235146
38366b235146Q40273j49476N05854J371562J671220J676638J566751J294857O27398
$$ -2235146 -1394873 -1544349 -1038495 333067 2004287 3680925 5247676 6542533 7169931
38357G169931r14140k905725l517247k068291q55279j776765k658958m42169L402707
$$ 7169931 6255791 3350066 -167181 -2235472 -3090751 -4867516 -7526474 -7968643 -4565936
38348d565936M803297L290887J771649J103171j84525j542548j021597L33010
$$ -4565936 237361 3528248 5299897 6403068 6218543 4675995 3654398 3987408
38340C987408P3036m31050J674217M028448J783444l186777l803649N69944K456707
$$ 3987408 4060444 3629394 5303611 9332059 11115503 7928726 4125077 4695021 7151728
38331G151728j517141n133006k895666J852534L544549K373708J069143k40500
$$ 7151728 5634587 501581 -2394085 -541551 3002998 5376706 6445849 6205349
38323F205349j390214l1671L512972M594008J340577k155529l275676m972442
$$ 6205349 4815135 4783464 8296436 12890444 14231021 12075492 8799816 3827374
38315C827374q442250q969789m187145O87880J509758J790570M482754N087458
$$ 3827374 -4614876 -13584665 -17771810 -17083930 -15574172 -13783602 -9300848 -4213390
38307d213390M52098l427136j186849J869326n55317l440893N42471O342063M309955
$$ -4213390 -3761292 -7188428 -8375277 -6505951 -7061268 -10502161 -9959690 -3617627 692328
38298F92328k356025k729184K549429K939547k223244k387127M243814O301647
$$ 692328 -1663697 -4392881 -1843452 1096095 -1127149 -3514276 729538 7031185
38290G031185o46343n580677p28950N635829M167089m44414R164K361568k34428
$$ 7031185 6384842 804165 75215 5711044 9878133 9433719 9442883 11804451 11570023
38281A1570023m076125j307148N015502N034538j793683o533225n279392k856176
$$ 11570023 7493898 6186750 11202252 16236790 14443107 7909882 2630490 -225686
38273b25686k175026l21353L248069L883567J5155l239150k026878P61312J203179
$$ -225686 -2400712 -2722065 526004 4409571 4424726 1185576 -841302 -79990 1123189
38264A123189K17792K58508O65874N6747l12674O38632P44553j559148k854197
$$ 1123189 1340981 1599489 2265363 2322110 2009436 2648068 3392621 1833473 -1020724
38255a020724Q78787O709502P012581J5373o898747o845218k238087p2624j490300
$$ -1020724 -141937 6567565 13580146 13595519 6696772 -148446 -2386533 -2459157 -3949457
38246c949457j479013K048580M942858L852097J128494K6924k60751j170472o59901
$$ -3949457 -5428470 -3379890 1562968 5415065 6543559 6570483 6309732 5139260 4479359
38237D479359K728380N102176K102237l570781n161904j223756L320658M620968
$$ 4479359 7207739 12309915 14412152 10841371 5679467 4455711 7776369 12397337
38229A2397337L229996O91786j937817k546890r300K681073K216096P65106K326601
$$ 12397337 15627333 16319119 14381302 11834412 11825112 14506185 16722281 17487387 19813988
38220A9813988M827233K918049k230840l997739j337945k12398k793169l992809
$$ 19813988 24641221 27559270 25328430 21330691 19992746 19780348 16987179 12994370
38212A2994370j104554J550179P54025n88119K44732J762410L123882N354172
$$ 12994370 11889816 13439995 14194020 13605901 13850633 15613043 18736925 24091097
38204B4091097N781279L12813o600465m919865M879161J0389166O201073J306819
$$ 24091097 29872376 30185189 23584724 18664859 23544020 33933186 40134259 41441078
38196D1441078J983986J825732k985956l739110M329100J0393384O125692R55959
$$ 41441078 43425064 45250796 42264840 38525730 42854830 53248214 59373906 60329865
38188F0329865M261288P411290J562861k149092P657126J7585387J0919297N74151
$$ 60329865 64591153 72002443 73565304 71416212 79073338 96658725 107578022 108152173
38180A08152173Q452620K3360500J9200182Q169935K5263032N3597646K3527250
$$ 108152173 116604793 139965293 159165475 167335410 192598442 246196088 269723338
38173B69723338q3945814j82292650j75370544p7945167R849182L0080753J5109948
$$ 269723338 185777524 3484874 -171885670 -249830837 -239981655 -209900902 -194790954
38166a94790954J3114304K2884251K0694980Q347703L950072Q499597R307519
$$ -194790954 -181676650 -158792399 -138097419 -129749716 -125799644 -117300047 -107992528
38159a07992528M618015L135846N945712O146356K646950Q72006K105819K743155
$$ -107992528 -103374513 -100238667 -94292955 -88146599 -85499649 -84627643 -82521824 -79778669
38151g9778669K388073L959888O895374P391799M755000J973897P04315J86764
$$ -79778669 -77390596 -73430708 -66535334 -59143535 -54388535 -52414638 -51710323 -51523559
38143e1523559L98054K357618N445783P072054N165130K10217m409064m488714
$$ -51523559 -51125505 -48767887 -43322104 -36250050 -31084920 -30874703 -35283767 -39772481
38135c9772481L49231M675754L243285j560989k605301J748358N637355M825884
$$ -39772481 -39423250 -34747496 -31504211 -33065200 -35670501 -33922143 -28284788 -23458904
38127b3458904K052622J114228J155391R3458r77046n46528j37356j390138k760953
$$ -23458904 -21406282 -20292054 -19136663 -19043205 -20020251 -20566779 -20704135 -22094273 -24855226
38118b4855226k320104j037145m56268J5090Q29264M25261j537491k250625j29247
$$ -24855226 -27175330 -28212475 -28668743 -28653653 -27824389 -27399128 -28936619 -31187244 -31316491
38109c1316491K033282J567423L75245J125365K139673N87835j774627j170067
$$ -31316491 -29283209 -27715786 -27340541 -26215176 -24075503 -23487668 -25262295 -26432362
38101b6432362J524430J986610k92901j262868P33590K272077P43521j331736
$$ -26432362 -24907932 -22921322 -23214223 -24477091 -23743501 -21471424 -20727903 -22059639
38093b2059639o08159J440024N89733l596233o521740m344721J167422M980775
$$ -22059639 -22667798 -21227774 -20638041 -24234274 -30756014 -35100735 -33933313 -28952538
38085b8952538M864830L110945K201309J276165j347197m045767l381351O55457
$$ -28952538 -24087708 -20976763 -18775454 -17499289 -18846486 -22892253 -26273604 -25618147
38077b5618147L995042L716572J286598m31180r76993j602441k586728k858235
$$ -25618147 -21623105 -17906533 -16619935 -17051115 -18028108 -19630549 -22217277 -25075512
38069b5075512j374659J852971N151648N696245K401038j827291l053133j450545
$$ -25075512 -26450171 -24597200 -19445552 -13749307 -11348269 -13175560 -16228693 -17679238
38061a7679238n89093j560056j595668O36170K580741K419523J993374K639001
$$ -17679238 -18268331 -19828387 -21424055 -20787885 -18207144 -15787621 -13794247 -11155246
38053a1155246K203439n60293k507585j018157J033801j53770k699036k218110
$$ -11155246 -8951807 -9512100 -12019685 -13037842 -12004041 -12157811 -14856847 -17074957
38045a7074957O47660J669944O07268J158632L648618M040459J158027j041778
$$ -17074957 -16427297 -14757353 -14150085 -12991453 -9342835 -5302376 -4144349 -5186127
38037e186127k91775K90666k016322m838492n047011l674422k771512j026788
$$ -5186127 -5477902 -5187236 -7203558 -12042050 -17089061 -20763483 -23534995 -24561783
38029b4561783K942717N759648L190965k306161l520247J469000O113651M189356
$$ -24561783 -21619066 -15859418 -12668453 -14974614 -18494861 -17025861 -10912210 -6722854
38021f722854k139529n903520m284524n91796J318023J031969L5992o64187m23295
$$ -6722854 -8862383 -14765903 -19050427 -19642223 -18324200 -17292231 -17256239 -17920426 -18343721
38012a8343721J135558K818090K496932M96321J63723K885245M688403J265945
$$ -18343721 -17208163 -14390073 -11893141 -11396820 -11233097 -8347852 -3659449 -2393504
38004b393504m900004o867237k846235J274858O95041j698299q95946J967700
$$ -2393504 -7293508 -14160745 -17006980 -15732122 -15037081 -16735380 -17631326 -15663626
37996a5663626J980243j008110j968577J150363M157369L135470p1429j448585
$$ -15663626 -13683383 -14691493 -16660070 -15509707 -11352338 -8216868 -8288297 -9736882
37988i736882o62599k25824r34389j428757j262014j330729j509790n95862J139851
$$ -9736882 -10399481 -10625305 -11559694 -12988451 -14250465 -15581194 -17090984 -17686846 -16546995
37979a6546995J818511J037784P47689J849183K168545q9038k591024j608069
$$ -16546995 -14728484 -13690700 -12943011 -11093828 -8925283 -9014321 -11605345 -13213414
37971a3213414K060657L342397m7421m030686l860007q51136n1865k415546l316480
$$ -13213414 -11152757 -7810360 -7857781 -11888467 -15748474 -16599610 -16651475 -19067021 -22383501
37962b2383501N15268O033101P780976M605124K32275j734237j210469k04593
$$ -22383501 -21868233 -15835132 -8054156 -3449032 -3216757 -4950994 -6161463 -6366056
37954f366056J63733L66911Q86204J073747K89364l81042P81670K790255J833397
$$ -6366056 -6202323 -5835412 -4949208 -3875461 -3586097 -3967139 -3185469 -395214 1438183
37945A438183l570785r040955q943955l703113Q51152J231412k80092m48927N98803
$$ 1438183 -2132602 -11173557 -20117512 -23820625 -22969473 -21738061 -22018153 -22467080 -21868277
37936b1868277J398683J935333K246465J184496j101037j985026o645K575580
$$ -21868277 -20469594 -18534261 -16287796 -15103300 -16204337 -18189363 -18196008 -15620428
37928a5620428L037617J718648K64289j029459j852761q09144J523937J516521
$$ -15620428 -12582811 -10864163 -10599874 -11629333 -13482094 -14291238 -12767301 -11250780
37920a1250780k172308n167120l263150J052284K579208J464583J932878M596995
$$ -11250780 -13423088 -18590208 -21853358 -20801074 -18221866 -16757283 -14824405 -10227410
37912a0227410N762767L797581Q04369j807276m197561m778396j632380K511309
$$ -10227410 -4464643 -667062 137307 -1669969 -5867530 -10645926 -12278306 -9766997
37904i766997K581306p92402j691436J230770K024681k484653o403524l336574
$$ -9766997 -7185691 -7978093 -9669529 -8438759 -6414078 -8898731 -15302255 -18638829
37896a8638829L660970O292326K205816l248603m815136k452508N61155J246700
$$ -18638829 -14977859 -8685533 -6479717 -9728320 -14543456 -16995964 -16434809 -15188109
37888a5188109r25389l333894k569966J120666L707538L090951J954706K645573
$$ -15188109 -16113498 -19447392 -22017358 -20896692 -17189154 -14098203 -12143497 -9497924
37880i497924K728247o01877m570271m138608J98089K860653J245663j109016
$$ -9497924 -6769677 -7371554 -11941825 -16080433 -15882344 -13021691 -11776028 -12885044
37872a2885044k18859L067358M911325L251875n86805l648585l877205j709448
$$ -12885044 -13103903 -10036545 -5125220 -1873345 -2460150 -6108735 -9985940 -11695388
37864a1695388N89302J508246J535133J339883K30098k219135m357734m094404
$$ -11695388 -11106086 -9597840 -8062707 -6722824 -6492726 -8711861 -13069595 -17163999
37856a7163999j536150J396104L039374K561843k670k792964k843117M05317L809479
$$ -17163999 -18700149 -17304045 -14264671 -11702828 -11705498 -14498462 -17341579 -16936262 -13126783
37847a3126783M465020L146001J931472O85895j382067k720024j361091J471473
$$ -13126783 -8661763 -5515762 -3584290 -2898395 -4280462 -7000486 -8361577 -6890104
37839f890104K892479K369262J192041o36592l426323m929138k552555J977579
$$ -6890104 -3997625 -1628363 -436322 -1072914 -4499237 -9428375 -11980930 -10003351
37831a0003351M083272K442095M8029p47249n63127k91451J12088k54192k548707
$$ -10003351 -5920079 -3477984 -3429955 -4177204 -4740331 -5031782 -4919694 -5173886 -7722593
37822g722593m946186l776698J131366N613553O536565M687180J712208j868485
$$ -7722593 -12668779 -16445477 -15314111 -9700558 -3163993 1523187 3235395 1366910
37814A366910m465276l515116J26777J701984r54185l767222k229987J993467
$$ 1366910 -3098366 -6613482 -6486705 -4784721 -5738906 -9506128 -11736115 -9742648
37806i742648L666093J223087j994104k742086j130062Q58846J794293J472039
$$ -9742648 -6076555 -4853468 -6847572 -9589658 -10719720 -9860874 -8066581 -6594542
37798f594542M79717n19667j276293j612202j114074k1878L59696m88198j075387
$$ -6594542 -6114825 -6634492 -7910785 -9522987 -10637061 -10658939 -10299243 -10787441 -11862828
37789a1862828l44059K06460n02821Q807L820616P117991M259718l013512o673649
$$ -11862828 -12206887 -12000427 -12503248 -12494441 -8673825 -1555834 2703884 -309628 -6983277
37780f983277l590821P63038J575739R36523J733942J922287n65701k788947j840487
$$ -6983277 -10574098 -9811060 -8235321 -7298798 -5564856 -3642569 -4208270 -6997217 -8837704
37771h837704k12881r13929j601997Q79910M114648M062665J856248Q50524M07479
$$ -8837704 -9050585 -9964514 -11566511 -10686601 -6571953 -2509288 -653040 197484 604963
37762F04963j308481j928160R99235L817425J972894j685676j687555L8016j982801
$$ 604963 -703518 -2631678 -1632443 2184982 4157876 2472200 784645 822661 -1160140
37753a160140n353836k898644L623221M436002k202437o350232k205268L258128
$$ -1160140 -6513976 -9412620 -5789399 -1353397 -3555834 -9906066 -12111334 -8853206
37745h853206K607089r36902j290623N2509r54375k177434L24180M120387M253266
$$ -8853206 -6246117 -7183019 -8473642 -8421133 -9375508 -11552942 -11228762 -7108375 -2855109
37736b855109J489972j79911q45463k682105l717531n91524M471962N907576K696204
$$ -2855109 -1365137 -1545048 -2390511 -5072616 -8790147 -9381671 -4909709 997867 3694071
37727C694071j381289l680178l871121j501620K241638K856648j512115n038894
$$ 3694071 2312782 -1367396 -5238517 -6740137 -4498499 -1641851 -3153966 -8192860
37719h192860j754613M363947M576779j038375l964049r76418J831110M14591
$$ -8192860 -9947473 -5583526 -1006747 -2045122 -6009171 -6985589 -5154479 -4739888
37711d739888j029837J064967K758477n5966l894771l400840j3117J435464J215918
$$ -4739888 -5769725 -4704758 -1946281 -2002247 -5897018 -9297858 -9310975 -7875511 -6659593
37702f659593K964180N404282L046351m273824q831070m818804L312058O079458
$$ -6659593 -3695413 1708869 4755220 481396 -8349674 -13168478 -9856420 -3776962
37694c776962Q09919n478669n292982M03621M499111L018785j114657l271043
$$ -3776962 -2967043 -8445712 -13738694 -13335073 -8835962 -5817177 -6931834 -10202877
37686a0202877k484087m69958J464792K391371J329234o55478l84994K685850
$$ -10202877 -12686964 -13156922 -11692130 -9300759 -7971525 -8627003 -9011997 -6326147
37678f326147M270464J078712l735453m867335k250993J94537R27124R62295j13253
$$ -6326147 -2055683 -976971 -4712424 -9579759 -11830752 -11636215 -10709091 -9746796 -9860049
37669i860049k605571l060385J397028O479253N658381P14139p06805K228028
$$ -9860049 -12465620 -15526005 -14128977 -7649724 -1991343 -1277204 -1984009 244019
37661B44019K578859j585100l685821r57418K44225l383890m825408R62228O651625
$$ 244019 2822878 1237778 -2448043 -3405461 -3161236 -6545126 -11370534 -10408306 -3756681
37652c756681L766463l122327l945058P32186K423179j79026o25802K346696K876416
$$ -3756681 9782 -3112545 -7057603 -6325417 -3902238 -4081264 -4707066 -2360370 516046
37643E16046n88291k510609o56024K70072k152910l887178k463992j116341j492621
$$ 516046 -72245 -2582854 -3238878 -2968806 -5121716 -9008894 -11472886 -12589227 -14081848
37634a4081848l609M377936N953066J151183m557283m274555O86374M323794M845897
$$ -14081848 -14085457 -9707521 -3754455 -2603272 -7160555 -11435110 -10748736 -6424942 -1579045
37625a579045M320791K995412N3272k289505j247642J325028J303642j141513
$$ -1579045 2741746 5737158 5790430 3500925 2253283 3578311 4881953 3740440
37617C740440k163246p59531Q4172j168140k384135j708840j14511R60045J524045
$$ 3740440 1577194 817663 901835 -266305 -2650440 -4359280 -4473791 -3513746 -1989701
37608a989701J598671N20276j162435j402133L18952J524189j6868k857802l622484
$$ -1989701 -391030 129246 -1033189 -2435322 -2116370 -592181 -609049 -3466851 -7089335
37599g089335j715522k31047j527256l648533k981701L79368K622604J995780
$$ -7089335 -8804857 -9035904 -10563160 -14211693 -17193394 -16814026 -14191422 -12195642
37591a2195642J452152L505357N374519K925712k335581m752485k570972J44524
$$ -12195642 -10743490 -7238133 -1863614 1062098 -1273483 -6025968 -8596940 -8452416
37583h452416K46688m51427M94544J925106J627045k1866j346628j788162j129927
$$ -8452416 -8205728 -8657155 -8162611 -6237505 -4610460 -4632326 -5978954 -7767116 -8897043
37574h897043J081219L621448L883692J741741J06150J10033n49916k582982k848802
$$ -8897043 -7815824 -4194376 -310684 1431057 1537207 1647240 1097324 -1485658 -4334460
37565d334460j4315K063976M30774j810329r70145P39616l69671k245619o67782
$$ -4334460 -4348775 -2284799 -1854025 -3664354 -4634499 -3894883 -4264554 -6510173 -7177955
37556g177955K722846K827118k17665j644772l74121J08372j223682j740987r47282
$$ -7177955 -4455109 -1627991 -1845656 -3490428 -3864549 -3756177 -4979859 -6720846 -7668128
37547g668128q48308n47829K467302N402967K439630m805908p477954k641931
$$ -7668128 -8516436 -9064265 -6596963 -1193996 1245634 -3560274 -11038228 -13680159
37539a3680159K221958J576418M0043K755337N630065K684956l115130m671880
$$ -13680159 -11458201 -9881783 -9841740 -7086403 -1456338 1228618 -1886512 -6558392
37531f558392j933870o0989J48691J634322L299466J427103k284963k390337Q61670
$$ -6558392 -8492262 -8553251 -8404560 -6770238 -3470772 -2043669 -4328632 -6718969 -5857299
37522e857299J800427n48976q67480K405293L700557J38127k907373o71968K974710
$$ -5857299 -4056872 -4605848 -5473328 -3068035 632522 770649 -2136724 -2808692 166018
37513A66018K036961k016645l436517j524432k30266l74515J023303L803572L343312
$$ 166018 2202979 186334 -3250183 -4774615 -5004881 -5379396 -4356093 -552521 2790791
37504B790791k065442p342957o922924j798455K577306L310961J962951N57058
$$ 2790791 725349 -6617608 -13540532 -15338987 -12761681 -9450720 -7487769 -6930711
37496f930711r73201k834887l479645j415861K137071M075080K826845n4491j723649
$$ -6930711 -7903912 -10738799 -14218444 -15634305 -13497234 -9422154 -6595309 -6649800 -8373449
37487h373449p63218J773065L342145K254437k16056p65398J703078L809280J796186
$$ -8373449 -9136667 -7363602 -4021457 -1767020 -1983076 -2748474 -1045396 2763884 4560070
37478D560070k911469n290682l669315j338205o28885J41412J940010K011817
$$ 4560070 1648601 -3642081 -7311396 -8649601 -9278486 -9137074 -7197064 -5185247
37470e185247r56140k968145o32339K689322K114833m68978R2191K627494J223472
$$ -5185247 -6141387 -9109532 -9741871 -7052549 -4937716 -5406694 -5314503 -2687009 -1463537
37461a463537m207836o989294m223148l75556J562550M265168Q066073P196200
$$ -1463537 -5671373 -12660667 -16883815 -17259371 -15696821 -11431653 -3365580 3830620
37453C830620l40702o423495l593551L450138N059119Q62308j975898j522455
$$ 3830620 3489918 -2933577 -6527128 -3076990 1982129 2844437 868539 -653916
37445f53916k263120m579049l197257K379600N172521J703239k352149j770458
$$ -653916 -2917036 -7496085 -10693342 -8313742 -3141221 -1437982 -3790131 -5560589
37437e560589J48112j347428l486087j133599L355422L413991o04472j691147
$$ -5560589 -5412477 -6759905 -10245992 -11379591 -8024169 -4610178 -5214650 -6905797
37429f905797K145358M218342j44548n717194m940054Q89228L817363Q08489k861498
$$ -6905797 -4760439 -542097 -686645 -6403839 -11343893 -10454665 -6637302 -5828813 -8690311
37420h690311k254863O08219J283460j17496m21022O57133O58444m84805k31630
$$ -8690311 -10945174 -10336955 -9053495 -9170991 -9592013 -8934880 -8276436 -8761241 -8992871
37411h992871J313991P22618k545815l828233j94381M155364L580664o66182k615330
$$ -8992871 -7678880 -6956262 -9502077 -13330310 -13524691 -9369327 -5788663 -6454845 -9070175
37402i070175n06517J620591R50346o09505r04527r10803j654597j491641Q50368
$$ -9070175 -9576692 -7956101 -7005755 -7615260 -8519787 -9430590 -11085187 -12576828 -11726460
37393a1726460L092913K147238j305575l389239j740976J935845L990859K788089
$$ -11726460 -8633547 -6486309 -7791884 -11181123 -12922099 -10986254 -6995395 -4207306
37385d207306M35152K09762K069424K263461j181150m632863l509538P99690K851611
$$ -4207306 -3772154 -3562392 -1492968 770493 -410657 -5043520 -8553058 -7753368 -4901757
37376d901757J310679J40489J137513R33814k333450m716608k551833J395079
$$ -4901757 -3591078 -3450589 -2313076 -1379262 -3712712 -8429320 -10981153 -9586074
37368i586074K263012L04778q59202n81859q36936j376504l79240J082997L18427
$$ -9586074 -7323062 -7018284 -7877486 -8459345 -9296281 -10672785 -11052025 -9969028 -9650601
37359i650601j583537o64704L178189N220030K849957q36529k072386j221672
$$ -9650601 -11234138 -11898842 -8720653 -3500623 -650666 -1487195 -3559581 -4781253
37351d781253m92161j95153K71475L70293j62116l069J280355J460000r73812
$$ -4781253 -5273414 -5468567 -5197092 -4826799 -4988915 -4991984 -3711629 -2251629 -3225441
37342c225441l335475j867677K361314M002068L84880m781553o059774k781848
$$ -3225441 -6560916 -8428593 -6067279 -2065211 -1680331 -6461884 -12521658 -15303506
37334a5303506J031605K329497K165736K623721K886552O61227l289891m923206
$$ -15303506 -14271901 -11942404 -9776668 -7152947 -4266395 -3605168 -6895059 -11818265
37326a1818265k039178K665411N149166M736458L377164J897942l41866k839684
$$ -11818265 -13857443 -11192032 -6042866 -1306408 2070756 3968698 3626832 787148
37318G87148l711813k185636N28074K728004L065330O96626l285944n346449l050484
$$ 787148 -2924665 -5110301 -4582227 -1854223 1211107 1907733 -1378211 -6724660 -9775144
37309i775144J247601K936286J088232j007678j034238n631Q01954J654661K228552
$$ -9775144 -8527543 -5591257 -4503025 -5510703 -6544941 -6550572 -5748618 -4093957 -1865405
37300a865405J192923q09231j114867O04696J341891k80869j676169r84358k66131
$$ -1865405 -672482 -1481713 -2596580 -1991884 -649993 -930862 -2607031 -3591389 -3857520
37291c857520j231148j601757N72290K370315L04798l356480l509921R7119K970431
$$ -3857520 -5088668 -6690425 -6118135 -3747820 -3443022 -6799502 -10309423 -10212304 -7241873
37282g241873K761657J285615L0701j562026k989685k347111o1127R23407j82891
$$ -7241873 -4480216 -3194601 -3163900 -4725926 -7715611 -10062722 -10123849 -9200442 -9383333
37273i383333o88890R85831K747957K468132J323990J651676L444718M466422
$$ -9383333 -10072223 -9086392 -6338435 -3870303 -2546313 -894637 2550081 7016503
37265G016503K601158k255174p180962p725639k870699K315772K297757j442087
$$ 7016503 9617661 7362487 181525 -7544114 -10414813 -8099041 -5801284 -7243371
37257g243371k802768m01479J085550m97273j354663P91984K294041N12772q31898
$$ -7243371 -10046139 -10447618 -9362068 -9859341 -11214004 -10422020 -8127979 -7615207 -8447105
37248h447105J594004L970926J622901k348674k100297O00856n60895m808582
$$ -8447105 -6853101 -2882175 -1259274 -3607948 -5708245 -5107389 -5668284 -10476866
37240a0476866m831325O83929M163878J237081k558203j303594K152366K143968
$$ -10476866 -15308191 -14624262 -10460384 -9223303 -11781506 -13085100 -10932734 -8788766
37232h788766k26438l9151K425289K504341m69905k020517j8131K066328Q70753
$$ -8788766 -9015204 -9054355 -6629066 -4124725 -4594630 -6615147 -6633278 -4566950 -3696197
37223c696197k013262l041037j718699j95862M94736J328992K784561L458351
$$ -3696197 -5709459 -8750496 -10469195 -10665057 -10170321 -8841329 -6056768 -2598417
37215b598417J947749q88513k665628k259517p36008O00252J539553J648601l70303
$$ -2598417 -650668 -1539181 -4204809 -6464326 -7200334 -6600082 -5060529 -3411928 -3782231
37206c782231m121552o057485l386187J624825M352079L948247L121316K579632
$$ -3782231 -7903783 -13961268 -17347455 -15722630 -11370551 -7422304 -4300988 -1721356
37198a721356N88978j684107j93438M641349O306396J353795m855132n860602
$$ -1721356 -1132378 -2816485 -3009923 1631426 7937822 9291617 4436485 -1424117
37190a424117k942225j105467n60849J304872K823906O00059k659111j128326
$$ -1424117 -4366342 -5471809 -6032658 -4727786 -1903880 -1303821 -3962932 -5091258
37182e091258L564993L346779l194557p242729k885397L870562M579329N77825
$$ -5091258 -1526265 1820514 -1374043 -8616772 -11502169 -7631607 -3052278 -2474453
37174b474453j010721R50872J525033o61020j322680J557689M115374K825146
$$ -2474453 -3485174 -2534302 -1009269 -1670289 -2992969 -1435280 2680094 5505240
37166E505240m13295j867246j194941m37708k45740P6561J42511j175381l326034
$$ 5505240 5091945 3224699 2029758 1592050 1346310 1422871 1565382 390001 -2936033
37157b936033m248376l249823j924727j536238j149232K93274J459912M85977
$$ -2936033 -7184409 -10434232 -12358959 -13895197 -15044429 -14751155 -13291243 -12805266
37149a2805266j327020p51641J940887K395311r84909l236979K74985N886489
$$ -12805266 -14132286 -14883927 -12943040 -10547729 -11532638 -14769617 -14494632 -8608143
37141h608143N888490k64832m936552l206384J063652K282397Q31450O4127N5346
$$ -8608143 -2719653 -2984485 -7921037 -11127421 -10063769 -7781372 -6949922 -6885795 -6830449
37132f830449r03080j553500M60163L480359L393424p1657k678021j579526J352312
$$ -6830449 -7733529 -9287029 -8826866 -5346507 -1953083 -2024740 -4702761 -6282287 -4929975
37123d929975K542942N95884l018844n155542l215218J773038N015475L297492
$$ -4929975 -2387033 -1791149 -4809993 -9965535 -13180753 -11407715 -6392240 -3094748
37115c094748m32191q66557J902134K326311k247460p013327n713165J175593
$$ -3094748 -3526939 -4393496 -2491362 -165051 -2412511 -9425838 -15139003 -13963410
37107a3963410O894714O246658Q88698l429238l490935j238192K2849P9785P14756
$$ -13963410 -7068696 -822038 66660 -3362578 -6853513 -8091705 -8068856 -7989071 -7274315
37098g274315J632219R17823o38928K320K281596J559278l026507n504442j994314
$$ -7274315 -5642096 -4724273 -5363201 -5360881 -3079285 -1520007 -4546514 -10050956 -12045270
37089a2045270K540765K242854Q1250J848253M572591J018684o271010p068638
$$ -12045270 -9504505 -7261651 -7180401 -5332148 -759557 259127 -6011883 -13080521
37081a3080521l09654L322611r00424l692433K085490Q511898N476377k554545
$$ -13080521 -13390175 -10067564 -10967988 -14660421 -12574931 -4063033 1413344 -1141201
37073a141201m287213J92640J674852j379376j584813K639477M127076O07643
$$ -1141201 -5428414 -5235774 -3560922 -4940298 -6525111 -3885634 241442 849085
37065H49085p37973L642340O717128K707869l119395l364423O2897R33299n73521
$$ 849085 111112 3753452 10470580 13178449 10059054 6694631 6757528 7690827 7117306
37056G117306k23940J183913n01750l997073l483191J734719N228632K325999
$$ 7117306 6893366 8077279 7575529 3578456 95265 1829984 7058616 9384615
37048I384615m059211p869984o451109j601216K941791M268477K644507J077128
$$ 9384615 5325404 -2544580 -8995689 -10596905 -7655114 -3386637 -742130 334998
37040C34998J011930R2905l287351n659802k936789K567086M700572K219708m66397
$$ 334998 1346928 1439833 -1847518 -7507320 -10444109 -7877023 -3176451 -956743 -1423140
37031a423140j025611j664103l074296k206531J663578M238090K615419l17446
$$ -1423140 -2448751 -4112854 -7187150 -9393681 -7730103 -3492013 -876594 -1194040
37023a194040j048277n74973j019613j382414n02175l74073k400445l831580k142430
$$ -1194040 -2242317 -2817290 -3836903 -5219317 -5721492 -6095565 -8496010 -12327590 -14470020
37014a4470020M43743J165300J824710M579057O157743K488213l503633n387438
$$ -14470020 -14026277 -12860977 -11036267 -6457210 -299467 2188746 -1314887 -6702325
37006f702325k803496p60419n93624J029556M266610M819931J613114j189360
$$ -6702325 -9505821 -10266240 -10859864 -9830308 -5563698 -743767 869347 -320013
36998c20013j476132j909668l408410k643335J102873K977544J82016l031419
$$ -320013 -1796145 -3705813 -7114223 -9757558 -8654685 -5677141 -5495125 -8526544
36990h526544k027078J450128L252182L069089K533900J210614j318476k995221
$$ -8526544 -10553622 -9103494 -5851312 -2782223 -248323 962291 -356185 -3351406
36982c351406k694501k393718k663447o72578L509773M212079r78984n248923
$$ -3351406 -6045907 -8439625 -11103072 -11775650 -8265877 -4053798 -5032782 -10281705
36974a0281705k227327L363054K940028j920784k222807L612379P619670N281945
$$ -10281705 -12509032 -9145978 -6205950 -8126734 -10349541 -6737162 882508 6164453
36966F164453J233023N346m60033k724159m374909k862443m63205k35035r89308
$$ 6164453 7397476 7402822 6942789 4218630 -156279 -3018722 -3481927 -3716962 -4706270
36957d706270j838K296644L419625K275170n92829l874353n194740k737137J482944
$$ -4706270 -4708108 -2411464 1008161 3283331 2690502 -1183851 -6378591 -9115728 -7632784
36948g632784K952328P00747j057641J028040M677559N204435J250388m326816
$$ -7632784 -4680456 -3979709 -5037350 -4009310 668249 5872684 7123072 2796256
36940B796256p528941o268324k090998Q61982M14588p54294P83076L633185L888796
$$ 2796256 -4732685 -11001009 -13092007 -12230025 -11815437 -12569731 -11786655 -8153470 -4264674
36931d264674J657019L73147M59125n68061j962216l78135K745765J750499l441573
$$ -4264674 -2607655 -2234508 -1775383 -2343444 -4305660 -4683795 -1938030 -187531 -3629104
36922c629104n619136j472935K932677K121990n27616O6644J887594Q16919j118088
$$ -3629104 -9248240 -10721175 -7788498 -5666508 -6194124 -6127480 -4239886 -3422967 -4541055
36913d541055J1375J822474m38239m679041m613947J2958L315104K609557R46409
$$ -4541055 -4529680 -2707206 -3145445 -7824486 -12438433 -12425475 -9110371 -6500814 -5554405
36904e554405M94493L889o13633O97968L248541K999779j274987n234947m282422
$$ -5554405 -5059912 -5056023 -5669656 -4971688 -1723147 1276632 1645 -5233302 -9515724
36895i515724R25774N363314M480791j528417o962855n794349P21262M644496
$$ -9515724 -8589950 -3226636 1254155 -274262 -7237117 -13031466 -12310204 -7665708
36887g665708K062746j225599Q82789M721859L145674k158144l563186m50061
$$ -7665708 -5602962 -6828561 -5945772 -1223913 1921761 -236383 -3799569 -4249630
36879d249630O68144j538665j373174J991805J738303l698065n551252J206052
$$ -4249630 -3581486 -5120151 -6493325 -4501520 -2763217 -6461282 -12012534 -10806482
36871a0806482P989565N122016k966228m726387J034545M938437K282321j507046
$$ -10806482 -2816917 2305099 -661129 -5387516 -4352971 585466 2867787 1360741
36863A360741j385363P53j514854m374283m169829l11751L445704L582588J74006
$$ 1360741 -24622 -23869 -1538723 -5913006 -10082835 -10394586 -6948882 -3366294 -3192288
36854c192288l283693k902972J427541N031222L446511j726248m325622j326723
$$ -3192288 -6475981 -9378953 -7951412 -2920190 526321 -1199927 -5525549 -6852272
36846f852272L374591M016238j2215l944280l781316r22997J90372j691233k748302
$$ -6852272 -3477681 538557 526342 -3417938 -7199254 -8122251 -7931879 -9623112 -12371414
36837a2371414L75885N087100N952308K477748m69065n40925j063794l892279
$$ -12371414 -11995529 -6908429 -956121 1521627 1052562 511637 -552157 -4444436
36829d444436m583032L81825N917882M693383j277559l110409J367042M630894
$$ -4444436 -9027468 -8645643 -2727761 1965622 688063 -2422346 -1055304 3575590
36821C575590J687328k626174k365031K91011o0685l046278m479772l573487j987312
$$ 3575590 5262918 2636744 271713 562724 502039 -2544239 -7024011 -10597498 -12584810
36812a2584810J238474O945626J0297863N807028k663023n088692M50998M853124
$$ -12584810 -11346336 -4400710 5897153 11704181 9041158 3952466 4403464 9256588
36804I256588J905484l111764l363594j259966k326099m464778k289655J652869
$$ 9256588 11162072 8050308 4686714 3426748 1100649 -3364129 -5653784 -4000915
36796d000915R4917n620481n793869K274483Q850899O001374r65196k624293L37914
$$ -4000915 -3905998 -9526479 -15320348 -13045865 -4194966 1806408 841212 -1783081 -1445167
36787a445167J29600m450488o177554j223781M774775M902737l6737l918577l371323
$$ -1445167 -1315567 -5766055 -11943609 -13167390 -8392615 -3489878 -3526615 -7445192 -10816515
36778a0816515k17624K295419K702513J338007n29722j351843n47139M98120k70565
$$ -10816515 -11034139 -8738720 -6036207 -4698200 -5227922 -6579765 -7126904 -6628784 -6899349
36769f899349k664864l554187l95957M724988O403486K286557l375617m472883
$$ -6899349 -9564213 -13118400 -13514357 -8789369 -2385883 -99326 -3474943 -7947826
36761g947826m72667L278438K537823j124746l200076j515953K365761N178423
$$ -7947826 -8420493 -5142055 -2604232 -3728978 -6929054 -8445007 -6079246 -900823
36753i00823M463069O94068k543799k305280k84859m29211k538884k281112J307703
$$ -900823 3562246 4256314 1712515 -592765 -877624 -1306835 -3845719 -6126831 -4819128
36744d819128L236991L36770l189292k460001O0761p16088k898690l94235N665067
$$ -4819128 -1582137 -1245367 -4434659 -6894660 -6833899 -7549987 -10448677 -10842912 -5177845
36735e177845O686019l21251p056519n442403J138578L669774M62947k212400
$$ -5177845 1508174 1186923 -5869596 -11311999 -10173421 -6503647 -6040700 -8253100
36727h253100o48550J823663J535404o1118j68632K83828r98916k723839j647636
$$ -8253100 -8901650 -7077987 -5542583 -5603701 -5772333 -5488505 -6487421 -9211260 -10858896
36718a0858896J562547K384525o95689l189876q79659L834784N341443K803161
$$ -10858896 -9296349 -6911824 -7607513 -10797389 -11677048 -7842264 -2500821 302340
36710C02340N53553R55343J346941q04770l722551m461604l113281j337708P30428
$$ 302340 855893 1811236 3158177 2353407 -1369144 -5830748 -8944029 -10281737 -9551309
36701i551309L238627M339984K442703m51595q80204J084739J968795J64535j702122
$$ -9551309 -6312682 -1972698 470005 18410 -861794 222945 2191740 2356275 654153
36692F54153p55985J679609J479791k646216o540895n132429P79768M805040L257485
$$ 654153 -101832 1577777 3057568 411352 -6129543 -11261972 -10482204 -5677164 -2419679
36683b419679J35181P18941L224589K197952j652690k241942J150469K074071
$$ -2419679 -2284498 -1565557 1659032 3856984 2204294 -37648 1112821 3186892
36675C186892j807418l972131j87910L426241K53709n350817m772169J145020
$$ 3186892 1379474 -2592657 -2780567 645674 899383 -4451434 -9223603 -8078583
36667h078583L990021R44392k508843k143754K53405J564996O72081k303127m830525
$$ -8078583 -4088562 -3144170 -5653013 -7796767 -7543362 -5978366 -5306285 -7609412 -12439937
36658a2439937k098802N759908R738011L042826o917524p415124O57101M266562
$$ -12439937 -14538739 -8778831 959180 4002006 -2915518 -10330642 -9673541 -5406979
36650e406979j230081n789481k024178L683086L513641P59865J830159M334256
$$ -5406979 -6637060 -12426541 -14450719 -10767633 -7253992 -6494127 -4663968 -329712
36642c29712K510092j563296j700362J270098J063525l323001o270056m351794
$$ -329712 2180380 617084 -1083278 186820 1250345 -2072656 -8342712 -12694506
36634a2694506j66742K615774L058248J755488k45995j304090o85414L70070R25325
$$ -12694506 -12861248 -10245474 -7187226 -5431738 -5677733 -6981823 -7667237 -7297167 -6371842
36625f371842J886981L320622K906676k31529k877247k055477M36374J097103
$$ -6371842 -4484861 -1164239 1742437 1510908 -1366339 -3421816 -2985442 -1888339
36617a888339M442l92899K52816L87404k79586q09189r13329m90341R92614K658603
$$ -1888339 -1883897 -2276796 -2023980 -1636576 -1916162 -2725351 -3638680 -4129021 -3136407 -477804
36607d77804K052749j084862l458517k780735q21354K53587J126860K327572J862592
$$ -477804 1574945 490083 -2968434 -5749169 -6570523 -6316936 -5190076 -2862504 -999912
36598i99912p90572k079927L38568L168452K432955m56011j892286j967750k418186
$$ -999912 -1790484 -3870411 -3531843 -363391 2069564 1613553 -278733 -2246483 -4664669
36589d664669j946428J045869L822301L036554P51128R49893K184494Q8730m165138
$$ -4664669 -6611097 -5565228 -1742927 1293627 2044755 2994648 5179142 5267872 1102734
36580A102734m760545n65852K729566Q42615l793958o071683l586046K475557
$$ 1102734 -3657811 -4223663 -1494097 -651482 -4445440 -10517123 -14103169 -11627612
36572a1627612Q121366Q313817J833338n685898p222311k447896L087987N433502
$$ -11627612 -3506246 4807571 6640909 955011 -6267300 -8715196 -5627209 -193707
36564a93707M545184R02356m390135p005098l353199K692665L512505j071019
$$ -193707 4351477 5253833 863698 -6141400 -9494599 -6801934 -3289429 -4360448
36556d360448l158946R87297N279606L691466q69122k435394j294195j479062
$$ -4360448 -7519394 -6532097 -1252491 2438975 1569853 -865541 -2159736 -3638798
36548c638798k692264j195647K859642M871714K559656j225723k981185k291154
$$ -3638798 -6331062 -7526709 -4667067 204647 2764303 1538580 -1442605 -3733759
36540c733759m86213J297646J766258j36564l125904l940182j304592K119193
$$ -3733759 -4219972 -2922326 -1156068 -1292632 -4418536 -8358718 -9663310 -7544117
36532g544117L332215K924178L131400L280545O63297l898605n372299j460059
$$ -7544117 -4211902 -1287724 1843676 5124221 5787518 1888913 -3483386 -4943445
36524d943445L153059K850454j096713k915179q80697J334187J147921k80366
$$ -4943445 -1790386 1060068 -36645 -2951824 -3832521 -2498334 -1350413 -1630779
36516a630779j980420m247615m936887o30230O455777Q648089L084567l583332
$$ -1630779 -3611199 -7858814 -12795701 -13425931 -6970154 1677935 4762502 1179170
36508A179170m503862j467340J8616m54345J54129J729366J906944Q79422Q2192
$$ 1179170 -3324692 -4792032 -4773416 -5227761 -5073632 -3344266 -1437322 -557900 -475708
36499d75708j333714l790520l957834N30243N751146O373815L241256N65123j372335
$$ -475708 -1809422 -5599942 -9557776 -9027533 -3276387 3097428 6338684 6903807 5531472
36490E531472m284767n595707j731971L994495M641080J51240k837753j507304
$$ 5531472 1246705 -4349002 -6080973 -2086478 2554602 2705842 -131911 -1639215
36482a639215J90965n83061j901281k134602k051519j094753J986027M332132
$$ -1639215 -1448250 -2031311 -3932592 -6067194 -8118713 -9213466 -7227439 -2895307
36474b895307J739367l177447l152206K141006M703905P50622l501368k264691
$$ -2895307 -1155940 -4333387 -7485593 -5344587 -640682 109940 -3391428 -5656119
36466e656119J154498J080746j415770j726007O15765K752986L566508L362311
$$ -5656119 -4501621 -3420875 -4836645 -6562652 -5946887 -3193901 372607 3734918
36458C734918J392477k284902m819181l789301m88929K291059L513390L261572
$$ 3734918 5127395 2842493 -1976688 -5765989 -6254918 -3963859 -450469 2811103
36450B811103J620368k58915q13238q50487k416235m290095k862951J560286M165634
$$ 2811103 4431471 4172556 3359318 2508831 92596 -4197499 -7060450 -5500164 -1334530
36441a334530K786488O24836N3487r12158l526105n059990l658221j522017k91268
$$ -1334530 1451958 2076794 2130281 1218123 -2307982 -7367972 -11026193 -12548210 -12839478
36432a2839478J673703M278319L552444j354419m378853q56295M791905N189436
$$ -12839478 -11165775 -6887456 -3335012 -4689431 -9068284 -9924579 -5132674 56762
36424E6762L78468l448817l048236o73523Q60062J048981M92931J60228R17014
$$ 56762 435230 -3013587 -6061823 -6735346 -5875284 -4826303 -4333372 -4173144 -3256130
36415c256130J638637k37729m239301n690259j639271M563847P205405M526225
$$ -3256130 -1617493 -1855222 -6094523 -11784782 -13424053 -8860206 -1654801 2871424
36407B871424p94981m867068m745799n03324L432113K494661j495297k456245
$$ 2871424 2076443 -2790625 -7536424 -8039748 -4607635 -2112974 -3608271 -6064516
36399f064516N09134J708530j464286m371559l529626j832654j429839Q33207
$$ -6064516 -5555382 -3846852 -5311138 -9682697 -13212323 -15044977 -16474816 -15641609
36391a5641609N464027N776301j343501p183206k639583P507751J1202125N933082
$$ -15641609 -10177582 -4401281 -5744782 -12927988 -15567571 -8059820 3142305 9075387
36383I075387o29674l729311n208372n662237k858613J672901K982503O31194
$$ 9075387 8445713 4716402 -491970 -6154207 -9012820 -7339919 -4357416 -3726222
36375c726222p17021P91655K100683J323934j03200j307878k343361j474805J917583
$$ -3726222 -4443243 -3651588 -1550905 -226971 -330171 -1638049 -3981410 -5456215 -3538632
36366c538632L226528j515849p091550m765938L951215Q314908L989606j648932
$$ -3538632 -312104 -1827953 -8919503 -13685441 -9734226 -1419318 2570288 921356
36358I21356k113966l96603r52849j644580N63129K542487J64061m020156m427752
$$ 921356 -1192610 -1589213 -2542062 -4186642 -3623513 -1081026 -916965 -4937121 -9364873
36349i364873q43319K216208K589362K197941K654687L033389K066434J27933
$$ -9364873 -10208192 -7991984 -5402622 -3204681 -549994 2483395 4549829 4677762
36341D677762j360883j585098j281051j702513k248389o93086K733799L891954
$$ 4677762 3316879 1731781 450730 -1251783 -3500172 -4193258 -1459459 2432495
36333B432495L78525l685847k777926J868861M154126J930849j370387l018060
$$ 2432495 2811020 -874827 -3652753 -1783892 2370234 4301083 2930696 -87364
36325h7364l187735j612421J747025L151094q73136n991415m368433K758961N528498
$$ -87364 -3275099 -4887520 -3140495 10599 -862537 -6853952 -11222385 -8463424 -2934926
36316b934926M95537m172887k380670O63288q81996k442469K580242R852808R596723
$$ -2934926 -2439389 -6612276 -8992946 -8329658 -9211654 -11654123 -9073881 778927 10375650
36307A0375650J581633m904262m685791j711575m50342o4123J247540K207268
$$ 10375650 11957283 7053021 2367230 655655 205313 141190 1388730 3595998
36299C595998J215023p73314k021822k168867j745041j455388j930919k593187
$$ 3595998 4811021 4037707 2015885 -152982 -1898023 -3353411 -5284330 -7877517
36291g877517j758553L87625Q86623j433029k981344n89640K733601J988032j518636
$$ -7877517 -9636070 -9248445 -8361822 -9794851 -12776195 -13365835 -10632234 -8644202 -10162838
36282a0162838j710548K654905N724612L226525j611892l215357r26486J657522
$$ -10162838 -11873386 -9218481 -3493869 -267344 -1879236 -5094593 -6021079 -4363557
36274d363557K027463P78309k60068M9729J281319J613992p0771k052490j544972
$$ -4363557 -2336094 -1557785 -1817853 -1768124 -486805 1127187 1056416 -996074 -2541046
36265b541046J094479K354193O42808j312047q57874L36172p97193l235390k866372
$$ -2541046 -1446567 907626 1550434 238387 -619487 -283315 -1080508 -4315898 -7182270
36256g182270J129437M302201K730981j639626l727346k070754o8467m04705j127467
$$ -7182270 -6052833 -1750632 980349 -659277 -4386623 -6457377 -6525844 -6930549 -8058016
36247h058016R27790M666298N533759J647590l408664m837299j915988K076889
$$ -8058016 -7130226 -2463928 3069831 4717421 1308757 -3528542 -5444530 -3367641
36239c367641L773129K161464j667429n278864n772797j940913L719627O376996
$$ -3367641 405488 2566952 899523 -4379341 -10152138 -12093051 -8373424 -1996428
36231a996428L447780k394380n719277m113039n84838O21719l55085K29282L308866
$$ -1996428 1451352 -943028 -6662305 -10775344 -11360182 -10738463 -11093548 -10864266 -7555400
36222g555400M701993J395657k897281k551900J416664K961644P79158R694K474012
$$ -7555400 -2853407 -1457750 -4355031 -6906931 -5490267 -2528623 -1749465 -1739771 734241
36213G34241K335802l782130q638362l931242N846472Q334548J093473n260573
$$ 734241 3070043 -712087 -9350449 -13281691 -7435219 899329 1992802 -3267771
36205c267771l421215Q77010K39524k170041K50780M649500L078935l323865n205276
$$ -3267771 -6688986 -5811976 -5572452 -7742493 -7491713 -2842213 236722 -3087143 -8292419
36196h292419m7797L874826J069216l025145k053192J206185J163484o72260L49407
$$ -8292419 -8340216 -4465390 -3396174 -6421319 -8474511 -7268326 -6104842 -6777102 -6427695
36187f427695K801734K033780p42646m97589K069458J315302l282603n855613
$$ -6427695 -3625961 -1592181 -2334827 -2832416 -762958 552344 -2730259 -8585872
36179h585872l692093m92451J149641K878327M355654K011270k890131l125066
$$ -8585872 -12277965 -12770416 -11620775 -8742448 -4386794 -2375524 -5265655 -8390721
36171h390721K904641O273043M59580p705858p718607o52937L828100K075083
$$ -8390721 -5486080 786963 1246543 -6459315 -14177922 -14830859 -11002759 -8927676
36163h927676q11595r39283K93910J665881L827294M976808J856081l833775o266915
$$ -8927676 -9739271 -10678554 -10384644 -8718763 -4891469 85339 1941420 -1892355 -8159270
36154h159270l978657j587855j644518q97686K843273N836576M218490N51801
$$ -8159270 -12137927 -13725782 -15370300 -16267986 -13424713 -7588137 -3369647 -2817846
36146b817846J91431L239561M131151q05440p792585q943642j387272P949675
$$ -2817846 -2626415 613146 4744297 3938857 -3853728 -12797370 -14184642 -6234967
36138f234967R122798J174091o273128n435837M577J744699r49768k142834L66527
$$ -6234967 2887831 4061922 -2211206 -7647043 -7642466 -5897767 -6847535 -8990369 -8623842
36129h623842K697024K109297l7165k379051m475674l882977J329892P083110
$$ -8623842 -5926818 -3817521 -3854686 -6233737 -10709411 -14592388 -13262496 -6179386
36121f179386O812438Q80744l894485m190426k709401q56686K806491N888358
$$ -6179386 633052 1513796 -2380689 -6571115 -9280516 -10137202 -7330711 -1442353
36113a442353L082251l868337o217497j550483K107756k70318k768336J28497
$$ -1442353 1639898 -2228439 -8445936 -9996419 -7888663 -8158981 -10927317 -10798820
36105a0798820L635864J858175j389595p186K980716J335519k432799j471371
$$ -10798820 -7162956 -5304781 -6694376 -6701562 -3720846 -2385327 -4818126 -6289497
36097f289497K751072K751189k012253m579461k224006N18125P36787O02394J181493
$$ -6289497 -3538425 -787236 -2799489 -7378950 -9602956 -9084831 -8348044 -7745650 -6564157
36088f564157M78929j259489j162734M50248M41465l81759K046329O519029O264098
$$ -6564157 -6085228 -7344717 -8507451 -8057203 -7615738 -7997497 -5951168 567861 6831959
36079F831959l84795o059278m644615M91094K663044J224493N3448L90475J85206
$$ 6831959 6447164 387886 -4256729 -3765635 -1102591 121902 175350 565825 751031
36070G51031j257405k203912j582295l58364Q0031o88599k137257l267660l256342
$$ 751031 -506374 -2710286 -4292581 -4650945 -4570914 -5259513 -7396770 -10664430 -13920772
36061a3920772j926204M76000L334174N169848M539419K264215Q23444M24973
$$ -13920772 -15846976 -15370976 -12036802 -6866954 -2327535 -63320 760124 1185097
36053A185097j454451m776040n085721m65730L619310J601593l326970l936802
$$ 1185097 -269354 -5045394 -10131115 -10596845 -6977535 -5375942 -8702912 -12639714
36045a2639714o1239K330164J603963J674951K896856Q44600l999223m502152
$$ -12639714 -12700953 -10370789 -8766826 -7091875 -4195019 -3350419 -7349642 -11851794
36037a1851794J281739M944167J34331o858381o054644J720117O988873N289187
$$ -11851794 -10570055 -5625888 -5491557 -12349938 -18404582 -16684465 -9695592 -4406405
36029d406405J172726l13598O24156J698511K058279J405975n76370k712496k872587
$$ -4406405 -3233679 -3547277 -2923121 -1224610 833669 2239644 1663274 -1049222 -3921809
36020c921809q07496J398006J870827N10771j492110k268558m07888K838508L770764
$$ -3921809 -4729305 -3331299 -1460472 -949701 -2441811 -4710369 -5118257 -2279749 1491015
36011A491015O73507l270115l770695q72332J907530K636371K223150J499018
$$ 1491015 2164522 -1105593 -4876288 -5748620 -3841090 -1204719 1018431 2517449
36003B517449L11583o25833k847J694190K548907K061847J201579j93852l056474
$$ 2517449 2829032 2203199 2200352 3894542 6443449 8505296 9706875 9513023 6456549
35994F456549n897637n383809j271652K279053K019171l56425j358575m03132
$$ 6456549 558912 -4824897 -6096549 -3817496 -1798325 -2154750 -3513325 -3916457
35986c916457R35790K043200K670046J102258l363053p069321n296250Q35521
$$ -3916457 -2980667 -937467 1732579 2834837 -528216 -7597537 -12893787 -12058266
35978a2058266M801227L203493n5656l02181J049703o6834k831847k512212J697993
$$ -12058266 -7257039 -4053546 -4109202 -4411383 -3361680 -3428514 -6260361 -8772573 -7074580
35969g074580M825314L178689q55285l026955k861913k416565j911849M7665K954917
$$ -7074580 -2249266 929423 74138 -2952817 -5814730 -8231295 -10143144 -10095479 -7140562
35960g140562M211673K620038p3016j596384j648244j357215j248568p11953N53942
$$ -7140562 -2928889 -308851 -381867 -1978251 -3626495 -4983710 -6232278 -6944231 -6390289
35951f390289J419936O29235r36763r01151J063461K343186J435885L72622O07237
$$ -6390289 -4970353 -4341118 -5277881 -6179032 -5115571 -2772385 -1336500 -963878 -356641
35942c56641m37470m380797o382900j318858O040741N578859k553780o347785
$$ -356641 -794111 -5174908 -11557808 -12876666 -6835925 -1257066 -3810846 -10158631
35934a0158631L90846Q157817N995743k512139o100961k520540J364986K032701
$$ -10158631 -9767785 -1609968 4385775 1873636 -4227325 -6747865 -5382879 -3350178
35926c350178J822557J464540k22539p45608K555328M927543J69740p027926o111660
$$ -3350178 -1527621 -63081 -285620 -1031228 1524100 6451643 6621383 -406543 -6518203
35917f518203J907080M711574j503736n889876j429159L746965J328560k930039
$$ -6518203 -4611123 100451 -1403285 -7293161 -8722320 -4975355 -3646795 -6576834
35909f576834l92925M794259L457658k137860k527007K408885L928821k06677
$$ -6576834 -6969759 -2175500 1282158 -855702 -3382709 -973824 2954997 2748320
35901B748320k857745l91322K220399J087369q22930l20732Q60238L96137q09828
$$ 2748320 -109425 -500747 1719652 2807021 1984091 1663359 2523597 2919734 2109906
35892B109906j364338j302530j38133K446615L652804M18838m614139n593826
$$ 2109906 745568 -556962 -695095 1751520 5404324 5823162 1209023 -4384803
35884d384803k220967p198j185154j891882K20403K180112J671210O26899M08576
$$ -4384803 -6605770 -6612968 -7798122 -9690004 -9469601 -7289489 -5618279 -4991380 -4582804
35875d582804o16134k099015n03712M002004N619220J616350k995754l556640
$$ -4582804 -5198938 -7297953 -7801665 -3799661 1819559 3435909 440155 -3116485
35867c116485k421258k775261k142971J727501M278095J010123l560072k132412
$$ -3116485 -5537743 -8313004 -10455975 -8728474 -4450379 -3440256 -7000328 -9132740
35859i132740L340862M578677J47295l179036j884111J66142M5736k8934J055654
$$ -9132740 -5791878 -1213201 -1065906 -4244942 -6129053 -5962911 -5917175 -5946109 -4890455
35850d890455M97065j914339j521694K904715M987593J22172o155319n472914
$$ -4890455 -4393390 -6307729 -7829423 -4924708 62885 185057 -5970262 -11443176
35842a1443176J125517M924703K055867k188220k055432J107708K234958j5704
$$ -11443176 -10317659 -5392956 -3337089 -5525309 -7580741 -6473033 -4238075 -4253779
35834d253779k114476p61518L035548N273734L550476l44838k788219k673928
$$ -4253779 -6368255 -7129773 -4094225 1179509 4729985 4385147 1596928 -1077000
35826a077000k071981k510826k561026l52341K962293M172833K092442q69892
$$ -1077000 -3148981 -5659807 -8220833 -8573174 -5610881 -1438048 654394 -215498
35818b15498j542215L69674J971470O29133k477692l269053n1099L351128J822901
$$ -215498 -1757713 -1388039 583431 1212564 -1265128 -4534181 -4585280 -1234152 588749
35809E88749m158052q441216o398847J62589N920684P437611M753587K51672k502838
$$ 588749 -3569303 -12010519 -18409366 -18246777 -12326093 -4888482 -134895 116777 -2386061
35800b386061j136731K457513L421490O2923l494566k870914O51506K500536J173941
$$ -2386061 -3522792 -1065279 2356211 2419134 -1075432 -3946346 -3294840 -794304 379637
35791C79637j028973k360244l166821l401287j862637J427887M255585M360206
$$ 379637 -649336 -3009580 -6176401 -9577688 -11440325 -10012438 -5756853 -1396647
35783a396647J601303j868226l035437p85492K064524J485472j933936k874939
$$ -1396647 204656 -1663570 -4699007 -5484499 -3419975 -1934503 -3868439 -6743378
35775f743378Q77063M185876K021558k246656j631458L509140N944608K655265
$$ -6743378 -5866315 -1680439 341119 -1905537 -3536995 -27855 5916753 8572018
35767H572018j370654j736914o96668j842369l946311l744286j257697J055750
$$ 8572018 7201364 5464450 4767782 2925413 -1020898 -4765184 -6022881 -4967131
35759d967131J905737J310958m77026k001736r65607K377913M474123K872290
$$ -4967131 -3061394 -1750436 -2227462 -4229198 -5194805 -2816892 1657231 4529521
35751D529521q85541m053184n561410m914870j693909K117652K935822P26827
$$ 4529521 3643980 -409204 -5970614 -10885484 -12579393 -10461741 -7525919 -6799092
35743f799092m26436R80682J126310k196500m794443k636635J206961J664780
$$ -6799092 -7225528 -6244846 -5118536 -7315036 -12109479 -14746114 -13539153 -11874373
35735a1874373J05565J355349M708051M756614L67659l565064l596718j445687
$$ -11874373 -11768808 -10413459 -5705408 -948794 -581135 -4146199 -7742917 -9188604
35727i188604L93064J808763K907807K919112K177302J712907P31668j848196
$$ -9188604 -8795540 -6986777 -4078970 -1159858 1017444 2730351 3462019 1613823
35719A613823l826321k211819J027088J006098k017503k599453O61708K328843
$$ 1613823 -2212498 -4424317 -3397229 -2391131 -4408634 -7008087 -6346379 -4017536
35711d017536p08886l586030j356265K786191K801074n34621j533586J053677
$$ -4017536 -4726422 -8312452 -9668717 -6882526 -4081452 -4616073 -6149659 -5095982
35703e095982K951629J902781K62784m49460j891150l957956k684671L406854
$$ -5095982 -2144353 -241572 21212 -428248 -2319398 -6277354 -8962025 -5555171
35695e555171Q533734N883699k812857q445016n567311J503263N025780L002331
$$ -5555171 2978563 8862262 6049405 -2395611 -7962922 -6459659 -1433879 1568452
35687A568452o10065k489961k920166k752811j411101R02084K084465J116680
$$ 1568452 958387 -1531574 -4451740 -7204551 -8615652 -7713568 -5629103 -4512423
35679d512423n8633M26714J424938J020628j31257l41053k55876j584696l306560
$$ -4512423 -4571056 -4144342 -2719404 -1698776 -1830033 -2171086 -2426962 -4011658 -7318218
35670g318218k525948Q52704L402521K757552L42521j250447j275524k93920J149612
$$ -7318218 -9844166 -8991462 -5588941 -2831389 -2488868 -3739315 -5014839 -5308759 -4159147
35661d159147K016805Q78018j823307l108037j044097J936330J657842j829431
$$ -4159147 -2142342 -1264324 -3087631 -6195668 -7239765 -5303435 -3645593 -5475024
$$ [...]
##END NTUPLES=NMR SPECTRUM
##END=
