##TITLE=31Pdec_SR81 ASP4
 CDCl3, 124 sc
 1.09.2021
##JCAMPDX= 6.0         $$ Bruker NMR JCAMP-DX V2.0
##DATA TYPE= NMR SPECTRUM
##DATA CLASS= NTUPLES
##ORIGIN= UXNMR, Bruker Analytische Messtechnik GmbH
##OWNER= root
$$ XWIN-NMR		Version 3.5
$$ Wed Sep  1 09:34:27 2021 Russian Standard Time (UT+4h)  she@DPX200
##.OBSERVE FREQUENCY= 81.013821
##.OBSERVE NUCLEUS= ^31P
##.ACQUISITION MODE= SIMULTANEOUS
##.ACQUISITION SCHEME= undefined
##.AVERAGES= 124
##.DIGITISER RES= 16
##SPECTROMETER/DATA SYSTEM= spect
##.PULSE SEQUENCE= zgpg30
##.SOLVENT NAME= CD2Cl2
##.SHIFT REFERENCE= (INTERNAL, CD2Cl2, 0, 248.564)
##AUDIT TRAIL= $$ (NUMBER, WHEN, WHO, WHERE, WHAT)
$$ ##TITLE= Audit trail, XWIN-NMR		Version 3.5
$$ ##JCAMPDX= 5.01
$$ ##ORIGIN= Bruker BioSpin GmbH
$$ ##OWNER= she
$$ F:/spectra/data/she/nmr/P31/1/pdata/1/auditp.txt
$$ ##AUDIT TRAIL=  $$ (NUMBER, WHEN, WHO, WHERE, WHAT)
(   1,<2021-09-01 09:33:16.25 +0400>,<she>,<DPX200>,
      <continue with go, POWCHK disabled, PULCHK disabled
       configuration hash MD5:
       00 E9 B6 7A A2 85 ED C7 34 08 36 98 17 FE 4E 26
       data hash MD5: 32K
       16 DD 57 91 CC F4 8B E7 3F 40 FE 6D 4A 4D C3 36>)
(   2,<2021-09-01 09:33:18.48 +0400>,<she>,<DPX200>,
      <Start of raw data processing
       efp BC_mod = 2 LB = 1 FT_mod = 6 PKNL = 1 PHC0 = -7679.495 PHC1 = -63.72678 SI = 64K 
       data hash MD5: 64K
       79 A7 E8 00 03 77 07 84 DD 2F 26 75 AD 65 B1 89>)
(   3,<2021-09-01 09:33:49.25 +0400>,<she>,<DPX200>,
      <pk PHC0 = -74.47533 PHC1 = 180.3999 
       data hash MD5: 64K
       72 32 54 FC 72 88 DC 62 E0 57 A8 D2 31 61 93 51>)
(   4,<2021-09-01 09:33:52.71 +0400>,<she>,<DPX200>,
      <abs ABSG = 5 
       data hash MD5: 64K
       70 A3 E9 E8 56 F8 5B DC F2 D4 5E 86 0C 59 70 B5>)
$$ ##END=
$$ 
$$ hash MD5
$$ 72 97 72 5F 1A 09 08 A3 2B 76 5E 2E 3A 94 14 83
##$RELAX= 
##$RELAX= 
##$RELAX= 
##$RELAX= 
##$RELAX= 
##$RELAX= 
##$RELAX= 
##$RELAX= 
$$ Bruker specific parameters
$$ --------------------------
##$DU= <F:/spectra>
##$EXPNO= 1
##$NAME= <P31>
##$PROCNO= 1
##$TYPE= <nmr>
##$USER= <she>
##$AMP= (0..31)
100 100 100 100 100 100 100 100 100 100 100 100 100 100 100 100 100 100 
100 100 100 100 100 100 100 100 100 100 100 100 100 100 
##$AQSEQ= 0
##$AQ_mod= 1
##$AUNM= <au_zg>
##$AUTOPOS= <>
##$BF1= 81.014009
##$BF2= 200.13
##$BF3= 200.13
##$BF4= 200.13
##$BF5= 200.13
##$BF6= 200.13
##$BF7= 200.13
##$BF8= 200.13
##$BYTORDA= 1
##$CFDGTYP= 0
##$CFRGTYP= 5
##$CHEMSTR= <none>
##$CNST= (0..31)
1 1 145 1 1 1 1 1 1 1 1 1 1 1 1 1 1 1 1 1 1 1 1 1 1 1 1 1 1 1 1 1 
##$CPDPRG= <waltz16>
##$CPDPRG1= <>
##$CPDPRG2= <waltz16>
##$CPDPRG3= <>
##$CPDPRG4= <mlev>
##$CPDPRG5= <mlev>
##$CPDPRG6= <mlev>
##$CPDPRG7= <mlev>
##$CPDPRG8= <mlev>
##$CPDPRGB= <>
##$CPDPRGT= <>
##$D= (0..31)
0 1 0 0 0 0 0 0 0 0 0 0.03 2e-05 3e-06 0 0 0 0 0 0 0 0 0 0 0 0 0 0 0 0 
0 0 
##$DATE= 1630474228
##$DBL= (0..7)
120 120 120 11 120 120 24 19 
##$DBP= (0..7)
150 150 150 150 150 150 150 150 
##$DBP07= 0
##$DBPNAM0= <>
##$DBPNAM1= <>
$$ [...]
##$SUBNAM3= <"">
##$SUBNAM4= <"">
##$SUBNAM5= <"">
##$SUBNAM6= <"">
##$SUBNAM7= <"">
##$SUBNAM8= <"">
##$SUBNAM9= <"">
##$SW= 501.771253377433
##$SWIBOX= (0..15)
0 1 3 0 0 0 0 0 0 0 0 0 0 0 0 0 
##$SW_h= 40650.406504065
##$TD= 32768
##$TD0= 1
##$TE= 0
##$TE2= 300
##$TE3= 300
##$TEG= 300
##$TL= (0..7)
0 120 53 12 22 120 120 120 
##$TP= (0..7)
150 150 150 150 150 150 150 150 
##$TP07= 0
##$TPNAME0= <>
##$TPNAME1= <>
##$TPNAME2= <>
##$TPNAME3= <>
##$TPNAME4= <>
##$TPNAME5= <>
##$TPNAME6= <>
##$TPNAME7= <>
##$TPOAL= (0..7)
0.5 0.5 0.5 0.5 0.5 0.5 0.5 0.5 
##$TPOFFS= (0..7)
0 0 0 0 0 0 0 0 
##$TUNHIN= 0
##$TUNHOUT= 0
##$TUNXOUT= 0
##$USERA1= <user>
##$USERA2= <user>
##$USERA3= <user>
##$USERA4= <user>
##$USERA5= <user>
##$V9= 5
##$VALIST= <valist>
##$VCLIST= <CCCCCCCCCCCCCCC>
##$VD= 0
##$VDLIST= <DDDDDDDDDDDDDDD>
##$VPLIST= <PPPPPPPPPPPPPPP>
##$VTLIST= <TTTTTTTTTTTTTTT>
##$WBST= 1024
##$WBSW= 4
##$XGAIN= (0..3)
0 0 0 0 
##$XL= 0
##$YL= 0
##$YMAX_a= 4514
##$YMIN_a= -6722
##$ZGOPTNS= <>
##$ZL1= 120
##$ZL2= 120
##$ZL3= 120
##$ZL4= 120
##$ABSF1= 248.5645
##$ABSF2= -253.2056
##$ABSG= 5
##$ABSL= 3
##$ALPHA= 0
##$AQORDER= 0
##$ASSFAC= 0
##$ASSFACI= 0
##$ASSFACX= 0
##$ASSWID= 0
##$AUNMP= <proc_1d>
##$AZFE= 0.1
##$AZFW= 0.5
##$BCFW= 0
##$BC_mod= 2
##$BYTORDP= 0
##$COROFFS= 0
##$CY= -3
##$DATMOD= 1
##$DC= 0
##$DFILT= <>
##$DTYPP= 0
##$F1P= 0
##$F2P= 0
##$FCOR= 1
##$FTSIZE= 65536
##$FT_mod= 6
##$GAMMA= 0
##$GB= 0
##$INTBC= 1
##$INTSCL= 5.30512e-09
##$ISEN= 30
##$LB= 1
##$LEV0= 0
##$LPBIN= 0
##$MAXI= 10000
##$MC2= 0
##$MEAN= 0
##$ME_mod= 0
##$MI= 50
##$NCOEF= 0
##$NC_proc= -7
##$NLEV= 6
##$NOISF1= 182.463
##$NOISF2= 159.3651
##$NSP= 0
##$NTH_PI= 0
##$NZP= 0
##$OFFSET= 248.5645
##$PC= 4
##$PHC0= -7753.97
##$PHC1= 116.6731
##$PH_mod= 1
##$PKNL= yes
##$PPARMOD= 0
##$PSCAL= 0
##$PSIGN= 0
##$REVERSE= no
##$SF= 81.014009
##$SI= 65536
##$SIGF1= 159.3651
##$SIGF2= -187.1042
##$SINO= 113.3802
##$SIOLD= 16384
##$SREGLST= <1H.CDCl3>
##$SSB= 0
##$STSI= 65536
##$STSR= 0
##$SW_p= 40650.406504065
##$SYMM= 0
##$S_DEV= 0
##$TDeff= 32768
##$TDoff= 0
##$TI= <>
##$TILT= no
##$TM1= 0
##$TM2= 0
##$TOPLEV= 0
##$USERP1= <user>
##$USERP2= <user>
##$USERP3= <user>
##$USERP4= <user>
##$USERP5= <user>
##$WDW= 1
##$XDIM= 65536
##$YMAX_p= 397294524
##$YMIN_p= -25940670
$$ End of Bruker specific parameters
$$ ---------------------------------
##NTUPLES= NMR SPECTRUM
##VAR_NAME=  FREQUENCY,     SPECTRUM/REAL,   SPECTRUM/IMAG
##SYMBOL=    X,             R,               I
##VAR_TYPE=  INDEPENDENT,   DEPENDENT,       DEPENDENT
##VAR_FORM=  AFFN,          ASDF,            ASDF
##VAR_DIM=   65536,         65536,           65536
##UNITS=     HZ,            ARBITRARY UNITS, ARBITRARY UNITS
##FACTOR=    0.620285442955139, 1,           1
##FIRST=     20137.2065510759, 0,            0
##LAST=      -20513.1999529892, 0,           0
##MIN=       -20513.1999529892, -25940670,   0
##MAX=       20137.2065510759, 397294524,    0
$$ Real data points
##PAGE= N=1
##DATA TABLE= (X++(R..R)), XYDATA
$$ [...]
##PAGE= N=2
##DATA TABLE= (X++(I..I)), XYDATA
13007c362767L10201N11851o28067l70644J725874J369186k438108l985368J61810
12998f706032M928243M288413q952k139691o61266J314539J531988L41324r58354
12989A930212j007870N33532J736623P77610m65144Q69838K666452K44351m876284
12980B409320n588634m79195K926833k55520m610262l395868J115532K490847
12972e386947L82511q20942r7898J21347k34238R10584L013805L495457K071469
12963C455148L41548j386437k902981k027532J634131L310972r12790o573292
12955e061233n797270J031526N528135L642412N01860Q97950K047493n5157k995808
12946b60092k397573K0301n61191l082426j683708M059313O831234K094943m636848
$$ y = [-3362767, -3052566, -2540715, -3168782, -3539426, -1813552, -444366, -2882474, -6867842, -6706032, -1777789, 2510624, 2501672, 361981, -299285, 1015254, 2547242, 2888566, 1930212, 922342, 1455874, 3192497, 3970107, 3504963, 4374801, 7041253, 7285604, 2409320, -3179314, -3658509, -731676, -987196, -5597458, -8993326, -7877794, -5386947, -5004436, -5825378, -5923276, -5801929, -6036167, -5125583, -2111778, 1383679, 3455148, 3796696, 2410259, -492722, -2520254, -886123, 2424849, 1512059, -5061233, -10858503, -9826977, -4298842, -656430, -154570, 743380, 2790873, 2735716, -260092, -2657665, -2637364, -3198555, -6280981, -7964689, -3905376, 2925858, 5020801, 383953]
12937C83953n312550l24278L144720J612729j434000k305391j600937q12880O41841
12928f006793K748886L278171J539742L62995J439066J913821r14551m318023
12920D3314l664074O57265L933183L648803J606237K60553J83980O28671J36431
12911G434363k274878m509782k471789L463634O476853K137769m185955m517366
12903A552849K1473J821894p66675j999747L26116J372146j277370k956461l64033
12894b269808K588104J999546P72525K686641M831579K259279l270544n558530
12886D038792l123786k99395P1750k61666M09810N51350j407832l526380k439509
12877e986866J780948M851114L264228r51437k518927n0112K145617R03922r46530
$$ y = [383953, -4928597, -5252875, -2108155, -495426, -1929426, -4234817, -5835754, -6648634, -6006793, -3257907, 20264, 1560006, 1923001, 3362067, 5275888, 4361337, 43314, -3620760, -2963495, 969688, 4618491, 6224728, 6485281, 6669261, 7297932, 7434363, 5159485, 649703, -1822086, 1641548, 8118401, 10256170, 6070215, 1552849, 1574322, 3396216, 2629541, 629794, 955910, 2328056, 1050686, -1905775, -2269808, 318296, 2317842, 3090367, 5777008, 10608587, 12867866, 9597322, 4038792, 915006, 615611, 687361, 425695, 835505, 1386855, -20977, -3547357, -5986866, -4205918, 645196, 3909424, 2957987, 439060, 388948, 2534565, 3438487, 2491957]
12868B491957m7543J050711j414015m273564j571906M431180N136883q06627m965908
12859C1168k720604P641j685375k586630K813031Q941132O941619j042761n212312
12850E486909l045791j121626k782226l546213k97169L326294L777338L081293
12842D878809L635214K973380j589507o787222o918863j917758K429093K068379
12834a228475r69631k459564j510181m93575p89882q02880J366773M720373O107863
12825C940821L815009o13127m069904m668104l005078j332037j186245j469823
12817h588488J61433L497019N273513L847103J873770J749792J116362k879114
12809F051390p052082n755103k75092J986766j272013l682559n49956L743711
$$ y = [2491957, 2444414, 3495125, 2081110, -2192454, -3764360, 666820, 5803703, 4997076, 31168, -2689436, -2681795, -4367170, -6953800, -4140769, 4800363, 11741982, 10699221, 5486909, 2441118, 1319492, -1462734, -5008947, -5306116, -1979822, 1797516, 4878809, 8514023, 11487403, 9897896, 3110674, -3808189, -5725947, -3296854, -1228475, -2198106, -4657670, -6167851, -6661426, -7451308, -8254188, -6887415, -2167042, 3940821, 7755830, 7142703, 3072799, -1595305, -4600383, -5932420, -7118665, -8588488, -8427055, -4930036, 343477, 4190580, 6064350, 7814142, 8930504, 6051390, -1000692, -6755795, -7030887, -5044121, -6316134, -9998693, -10548649, -6804938]
12801f804938L205259k40925n50586K631148M233479K165663m21506j048468r56221
12792B212905j379604r57204J295325L187428J840465k027248m203781j840610
12784a872324K698593M226622J221929j990682j111920K125114K829211L10686
12776H437229j637370j377021j530722l538411m687496k527312J378853M044989
12768a437261M364212K468235r30758l383514k513494j48870o53616l957281m917159
12759a1109506j313491K650728L261799K445237K841955K924669R73409q32479
12751A842321o83791j119702m013523n690465k351703L009340M618209K293792
12743b095522N63496J399749K720175K607234P95906k550951n932617o204652
$$ y = [-6804938, -3599679, -3840604, -4391190, -1760042, 2473437, 4639100, 4217594, 3169126, 2212905, 833301, -123903, 1171422, 4358850, 6199315, 4172067, -31714, -1872324, 826269, 5052891, 6274820, 4284138, 3172218, 5297332, 8126543, 8437229, 6799859, 5422838, 3892116, 353705, -4333791, -6861103, -5482250, -1437261, 2926951, 5395186, 4464428, 1080914, -1432580, -1581450, -2235066, -6192347, -11109506, -12422997, -9772269, -6510470, -4065233, -1223278, 1701391, 2674800, 1842321, 1158530, 38828, -3974695, -9665160, -12016863, -9007523, -4389314, -2095522, -1532026, -132277, 2587898, 5195132, 5991038, 3440087, -2492530, -8697182]
12735h697182k481723J791149L535769L871738M341713L227633n37136l773040
12727A278921l718392k368090j818462O1914M200801N795829J720861k572883
12719B580499j224742J705851q60440n851191m593989J676384K821292l222241
12711f968577o288158k5529Q220080Q716970K528644k436526k718226q94035K61233
12702C95876J61649q81802j791622r70386J564240L713873L882431K336312j02889
12693H307682k580768l746811l099237k032561j289609P47902M237092N165296
12685E708986R43567l994436l716061L92639K439022J376246N03267l35733l710230
12676c92733o757343l542470M215115P788629M236438k00139j247478j944588
$$ y = [-8697182, -11178905, -9387756, -5851987, -1980249, 2361464, 5589097, 5051961, 1278921, -2439471, -4807561, -6626023, -6564109, -2363308, 3432521, 5153382, 2580499, 1355757, 3061608, 2201168, -3650023, -8244012, -6567628, -3746336, -6968577, -13256735, -13282264, -5062184, 3654786, 6183430, 3746904, 1028678, 134643, 395876, 557525, -324277, -2115899, -3086285, -1522045, 2191828, 6074259, 8410571, 8307682, 5726914, 1980103, -1119134, -3151695, -4441304, -3693402, 543690, 5708986, 6652553, 2658117, -1057944, -665305, 1773717, 3149963, 3653230, 3317497, -392733, -7150076, -10692546, -6477431, 1311198, 5547636, 5347497, 4100019, 2155431]
12668B155431m070577l610303R42277M252294L000324J318578K426766K628820
12660I043610o86307k700534M41911L738169J295057l579074m031622o35631J139384
12651D024963N05756N89653J146306l70185k729247k922700k199769l437906m591482
12642i984611j716562L129046M138180R58906j237456l69642O42594M90944J197649
12633b750952K548520J354482k209008l421445k68305L199815L075333P59668
12625B288108n53425p23135j154667j337531J18003K469492L166422Q48508k815672
12616B306103m178769j174141L446024M162924j88986l600743m36144O179864
12608F516132Q052756K970917l185453n440526n069393m456222k454470J662802
$$ y = [2155431, -1915146, -5525449, -4583172, -330878, 2669446, 3988024, 6414790, 9043610, 8357303, 5656769, 6098680, 9836849, 11131906, 7552832, 3521210, 2885579, 4024963, 4530719, 5120372, 6266678, 5896493, 3167246, 244546, -1955223, -5393129, -9984611, -11701173, -8572127, -4433947, -3475041, -4712497, -5082139, -4439545, -3948601, -2750952, -202432, 1152050, -1056958, -4478403, -4746708, -1546893, 1528440, 2288108, 1734683, 1011548, -143119, -1480650, -1362647, 1106845, 4273267, 5121775, 2306103, -1872666, -3046807, 399217, 4562141, 4373155, 772412, 336268, 6516132, 14568888, 17539805, 14354352, 8913826, 3844433, -611789, -3066259, -1403457]
12600a403457M260616K009237k375561l725886j927284j071646k056940j293658
12592g584579K417203M679886J835656l073425m321805j425055R73743L77726
12584f120650o66476L82693K207085K863414L324021M567172L935304j154495
12576I338068p243615p650030j671757L677855K755753j838698l798205j170297
12568g600926L028595N585809N085168J077179m844900p971083m505299K773758
12560g371699O270113K476334l447003m132162P16633M427492K386117k308769
12552i82944l706566q47252K304862L239805L016931K065080j092692n020207
12544a022983m435665J893236O703929L372823l660453m559455J416069M954398
$$ y = [-1403457, 2857159, 4866396, 2490835, -1235051, -3162335, -4233981, -6290921, -7584579, -5167376, -487490, 1348166, -1725259, -6047064, -7472119, -6498376, -6120650, -6787126, -6404433, -4197348, -1333934, 1990087, 6557259, 10492563, 9338068, 2094453, -5555577, -7227334, -3549479, -793726, -2632424, -6430629, -7600926, -4572331, 1013478, 6098646, 7175825, 2330925, -5640158, -10145457, -7371699, -1101586, 1374748, -2072255, -6204417, -5487784, -1060292, 1325825, -982944, -4689510, -5536762, -3231900, 7905, 3024836, 5089916, 3997224, -1022983, -5458648, -3565412, 3138517, 6511340, 2850887, -1708568, -292499, 4661899]
12536D661899P23805n445479n872934q06781M466983O605007M805390k27787m263445
12527D646658j942599M647101N663877k779575j0539716o611618M380124Q309311
12519E773563J744487m475019k449024K378922J975246j722085j628241K442898
12511D040747M077700O74882l157311l154508j105952q42703k082970j598065
12503c148180R69468K075212l20347l244877k715392N59725K363748J161750j45736
12494b444629R15012K900959L109850J100468j958187m942976o018142k912693
12486a0250338L447658P782668O038374O77635k647322k427072j790842k421403
12478a590642k223454N1544J750636M02990j669095k77655L867911N144390J049636
$$ y = [4661899, 5385704, -59775, -5932709, -6739490, -2272507, 4332500, 9137890, 8910103, 4646658, 2704059, 7351160, 13015037, 10235462, -304254, -6915872, -2535748, 5773563, 7518050, 3043031, 594007, 2972929, 4948175, 3226090, 1597849, 4040747, 8118447, 8793329, 5636018, 2481510, 1375558, 532855, -1550115, -3148180, -2178712, -103500, -423847, -3668724, -6384116, -5824391, -3460643, -2298893, -2444629, -1529617, 1371342, 4481192, 5581660, 3623473, -1319503, -7337645, -10250338, -6802680, 979988, 7018362, 7695997, 5048675, 2621603, 830761, -1590642, -3814096, -3762552, -2011916, -1608926, -3278021, -3555676, 312235, 5456625, 6506261]
12469F506261l207997j673001K954660K436453m202230p720963k083360N516600
12461a473577M729515k429323n022788m6955M184068K054173k082030l441356
12453c528273l905620m906172k355956M770156Q751890L923771l314001l765630
12445d329835P88424K268199J31052L08533L282749L852413J590715J240258K722814
12436A1855322P76249m475431o350787k975428m89325k128436l152326l93330
12428g333492J804036J6407j754631L51155K932508J919350P7397J219866K377535
12419A610131q33459n367789n147641j233353L57404r77936l32368L109190M430796
12410d385025J883921P0563J935346L806893J698887k275857l475232j292980
$$ y = [6506261, 3298264, 1625263, 4579923, 7016376, 2814146, -4906817, -6990177, -1473577, 3255938, 826615, -4196173, -4243128, -59060, 1995113, -86917, -3528273, -7433893, -12340065, -14696021, -9925865, -1173975, 2749796, -564205, -4329835, -3541411, -1273212, -1142160, -833627, 2449122, 6301535, 7892250, 9132508, 11855322, 12631571, 8156140, 1805353, -1170075, -1659400, -3787836, -6940162, -7333492, -5529456, -5513049, -7267680, -6916525, -3984017, -2064667, -1987270, -767404, 1610131, 776672, -4591117, -9738758, -10972111, -10614707, -11592643, -11925011, -8815821, -4385025, -2501104, -2430541, -495195, 3311698, 5010585, 2734728, -740504, -2033484]
12402b033484J320431K423019K006169K51850k103319k924736r82690J619959
12394d22801J713278p10007k687190k407912r82658J770N94566J436224K194283
12385a270447K100691J208868L11463Q7047P10401J724194K076938J082208m11406
12376G619957p81286R8893N50900l62670j372198j077180j32137K3143n04202
12367D063220n07741M65144K025000L477954L165006o63811o145793p508868k126337
12358c756226M171174L640448k634770o085469k621428K821644M720520L556111
12350C812004J656471j136241l902751k681428K922529O140393J843022n033323
12342C620676o071983j260786K293922J347502o52330p54220N9845P97860K176416
$$ y = [-2033484, -713053, 1709966, 3716135, 3967985, 1864666, -1060070, -2042760, -422801, 1290477, 580470, -2106720, -4514632, -5497290, -5495520, -4900954, -3464730, -1270447, 830244, 2039112, 2350575, 2437622, 3148023, 4872217, 6949155, 8031363, 7619957, 6838671, 6937564, 7488464, 7125794, 5753596, 4676416, 4544279, 4567422, 4063220, 3555479, 4020623, 6045623, 9523577, 12688583, 12024772, 5878979, -1629889, -3756226, 414948, 4055396, 1420626, -4664843, -7286271, -4464627, 255893, 3812004, 5468475, 4332234, 429483, -2251945, 670584, 6810977, 8653999, 3620676, -2451307, -3712093, -1418171, -70669, -722999, -1477219, -1417374, -619514, 1556902]
12333A556902L787365M016364K915203J345706j649489o211605q268377m542643
12325g050574O73568O60507k886218k230456L267194N727637K287668P2785L334715
12316C856826N292126k11282p128167o461245j112738p33084m915113l396316
12308a4808993O231798J2374569N935236n566454q064056m18566N058474R62907
12300A704915n149717l121487L983907M460132l643849q321261j166743R150614
12292b103489Q637130j843336q191813l701278K738783J884917k369886j354221
12284f303193L678898M089932k049533p092830n228250J78809K698116J422681
12276h605370M19407K117422M242141L242943p31405l496729k041809J108771
$$ y = [1556902, 5344267, 9360631, 12275834, 13621540, 11972051, 5760446, -2507931, -7050574, -6377006, -5716499, -8602717, -10833173, -7565979, -1838342, 449326, 522111, 3856826, 9148952, 8937670, 1809503, -4651742, -5764480, -6497564, -11412677, -14808993, -8577195, 3797374, 9732610, 4166156, -3897900, -4316466, 742008, 1704915, -3444802, -6566289, -2582382, 1877750, -1766099, -10087360, -11254103, -2103489, 6533641, 4690305, -3501508, -7202786, -4464003, -2579086, -4948972, -6303193, -2624295, 1465637, -583896, -7676726, -12904976, -12726167, -10028051, -8605370, -8185963, -6068541, -1826400, 1416543, 685138, -2811591, -4853400, -3744629]
12268c744629J054159k286189l677363m50917L014850J608024k838955m183423
12260a1504443n27391L948454N025326K661513p23813k927659k605792J799K406362
12251d245644K043445m80543k042437r51955J496026L280750L502575J970559
12243D572776r38936l555982l869168j933405o2892p1684j305847j773805m04156
12234i343099K039744L681402L213600J324928N95p5910m28279k153711l632334
12225e373064k538819P49579L718318N067146N265731M145251P83379l588942
12217H228579n403497l243071m44300q36503l170181k775228J332001M292070
12209b020130J966095k930386m253228p46281K786063K833103J612570K178398
$$ y = [-3744629, -2690470, -4976659, -8654022, -9104939, -6090089, -4482065, -7321020, -11504443, -12031834, -8083380, -3058054, -396541, -1120354, -4048013, -6653805, -6652006, -4245644, -2202199, -2682742, -4725179, -5677134, -4181108, -900358, 2602217, 4572776, 3633840, 77858, -3791310, -5724715, -5787607, -5859291, -7165138, -8938943, -9343099, -7303355, -3621953, -408353, 916575, 917170, 841260, 412981, -1740730, -5373064, -7911883, -7162304, -3443986, 1623160, 6888891, 11034142, 11817521, 8228579, 2825082, -417989, -862289, -1698792, -4868973, -7644201, -6312200, -2020130, -54035, -2984421, -7237649, -7983930, -5197867, -2364764, -752194, 1426204]
12201A426204K891987O29503k926138l116205K68020K399410Q97176r49563k74260
12192A246134N71478j475535m341444l604051O74306L880671L091000J50721j552607
12183a359327r01486P20050J309782J58123j140173j74753K699666L595685m0232
12174D867335m890479n079963k9946M195944K754946j472071k001570J953769
12166B97965M092979N2662n560905m799083K333342P156051M094647j862684l166241
12157B638733q19427j329119m940433m863789J041102N749757L741705m67284
12149G51245J66109M079128M051632j384204o164461n764436k326554l4447J24322
12140f501666l18310N759J533417L552188M190937K358457m14779j826955j880032
$$ y = [1426204, 4318191, 4947694, 2021556, -1094649, -826629, 1572781, 2469957, 1520394, 1246134, 1817612, 342077, -3999367, -7603418, -6929112, -3048441, 42559, 193280, -1359327, -2260813, -1540763, -230981, -72858, -1213031, -1387784, 1311882, 4907567, 4867335, -23144, -5103107, -5133053, -937109, 1817837, 345766, -1655804, 297965, 4390944, 4443606, -1117299, -5916382, -3583040, 3573011, 7667658, 5804974, 2638733, 1819306, 490187, -4450246, -9314035, -8272933, -2523176, 1218529, 751245, 917354, 4996482, 9048114, 7663910, 1499449, -4264987, -6591541, -6625988, -6501666, -6819976, -6814217, -5280800, -1728612, 2462325, 4820782, 4406003, 2579048, 699016]
12131F99016k030809k162353j073474N73421O63200j136852l098878m109161m018857
12122a5694747j856831K999799P754802P803517K574299k879129l434364P56737
12114a975917N260529O031759K572787k034363l903527k270644k22090l64674
12106C093860j347499q90595j61018j382780k750691p22224L262884M032065J055890
12097D189892n48513J098919J325726k415463n041092j986520K604698K163052
12089A390699j882376l005653j95769J853701J727797K489697L838134J342048
12081G558278m501199o387469j294538L559265J402302l221184j506931N429714
12073A038238P844398J977163m768846m967213o27589J921028J338551Q30691
$$ y = [699016, -1331793, -3494146, -4567620, -3994199, -3330999, -4467851, -7566729, -11675890, -15694747, -17551578, -14551779, -6796977, 1006540, 3580839, 701710, -2732654, -1975917, 3284612, 9316371, 11889158, 9854795, 5951268, 3680624, 3458534, 3093860, 1746361, 855766, 694748, -688032, -3438723, -4160947, -898063, 3134002, 4189892, 3641379, 4740298, 6066024, 3650561, -1390531, -3377051, -772353, 1390699, -491677, -3497330, -3693099, -1839398, -111601, 2378096, 6216230, 7558278, 3057079, -3330390, -4624928, -1065663, 336639, -2884545, -4391476, 1038238, 8882636, 10859799, 6090953, 1123740, 496151, 2417179, 3755730, 4586421]
12065D586421J657777J990511R15312n83181k236013m563942o304370n029139
12057i566624j002818K312656K583293J116691j768r14948k374886l002962o72160
12048a1523526L912363P106642O115880J762812k686710m628459l912874k205255
12040f059127r63239j67192Q06270J582223J241484L83479R43622K956391L268123
12031C992034m82171n647252o965240l169587J355793K305856M52549o39009J49195
12022h647832J045489J182209J857535L575015M312478K201567j459726l403563
12014F63172k026201J189028L353104K526261p85288l543964k560281J740137
12006E55968M866733L240739j242379l717190k668293r76726q63502j179376n92501
$$ y = [4586421, 6244198, 8234709, 9150021, 8566840, 6330827, 1766885, -4537485, -9566624, -10569442, -8256786, -5673493, -4556802, -4558570, -5473518, -7848404, -10851366, -11523526, -7611163, -504521, 5611359, 7374171, 4687461, 59002, -3853872, -6059127, -7022366, -7189558, -6383288, -4801065, -3559581, -3176102, -2232480, 723911, 3992034, 3509863, -2137389, -9102629, -12272216, -10916423, -8610567, -8158018, -8797027, -8647832, -7602343, -6420134, -4562599, -987584, 3324894, 5526461, 4066735, 663172, -1363029, -174001, 3179103, 5705364, 4920076, 1376112, -1184169, 555968, 5422701, 8663440, 7421061, 3703871, 1035578, 58852, -804650, -1984026, -2576527]
11997b576527j01754n49040n28914Q75404J772240O24614m28518J314611M197531
11988D599647L987592o31l852789m169502j581569R45244J103638j386208m420596
11979d775174m806120j671168K133482L741979L853429M252694L820129O80605
11971G229856l184625l849556j244307J283087K513829L659053L713129L66681
11963A0487147m039978l894365P09161K827889p44949m211818k201033J607564
11955E39618J032022k230789j735025K950479N707150L356951n80046k210157
11947F830203k170328k695720l623973l340557j556760M16631J232452P21430
11939d186622l6556J4154N33765O37122Q52262K139254K940735M01286m486853
$$ y = [-2576527, -2678281, -3227321, -3756235, -2880831, -1108591, -483977, -912495, 402116, 4599647, 8587239, 8586608, 4733819, 564317, -1017252, -72008, 1031630, -354578, -4775174, -9581294, -11252462, -9118980, -5377001, -1523572, 2729122, 6549251, 7229856, 4045231, 195675, -1048632, 234455, 2748284, 6407337, 10120466, 10487147, 6447169, 2552804, 3261965, 6089854, 5344905, 1133087, -1067946, 539618, 1571640, -659149, -2394174, 556305, 6263455, 9620406, 9040360, 6830203, 4659875, 1964155, -1659818, -5000375, -6557135, -6140504, -4908052, -4186622, -4223178, -4209024, -3675259, -3038137, -2185875, -46621, 2894114, 3295400, -1191453]
11930a191453o535639l146550J844588L505541J887168J62152k22944L56749J531466
11921a808922J999518j81653l612944l596430O23656L134482K01988k982338l87559
11912f610202M361448L280784k901944n519953j166881M048623M391909J455047
11904A338831o73217j168521j012718l72436M40861O65387O57192R07781P7734
11895H60894k425411l404203k36276L289090J515162l746173n230169j263414
11887a0640500K436340K379521J229277J069273L62627p27254M34767K479571
11879i76378O09887m133025m597649N63562L712446R57621j366796J545700M141738
11870D57106O45321m539372m908421k646836k275683q80878M858802Q475714K788330
$$ y = [-1191453, -7727092, -10873642, -9029054, -5523513, -3636345, -3474193, -3697137, -3340388, -1808922, 190596, 8943, -3604001, -7200431, -6576775, -3442293, -3240305, -6222643, -6610202, -2248754, 1032030, -1869914, -7389867, -8556748, -4508125, -116216, 1338831, 665614, -502907, -1515625, -1888061, -1447200, -781813, -124621, 783160, 860894, -1564517, -4968720, -5204996, -1915906, -400744, -4146917, -9377086, -10640500, -8204160, -5824639, -4595362, -3526089, -3163462, -3890716, -3455949, -976378, -366491, -4499516, -9097165, -8533603, -4821157, -3863536, -5230332, -3684632, 457106, 1102427, -3436945, -8345366, -10992202, -13267885, -14148763, -9289961, -814247, 1974083]
11861A974083n549151l966973N852765R433427J367250p443933o987918p66813
11853f087263L073516L202664K299414O61926j814870k927464j782633n59049
11845c933759k7880J595551L511705K216868j408549j774117J947347L350434
11837E477600n93560l970393j707767K262731K313109p3964j185056k453371n600976
11828e531647o091892J7427P017088O474862L43830k134146J074804K960693K8362
11819D159381k759310j460415P27080N9238j696275j570488o62692j270745k374942
11810f849168j413099J647382M264352L866743j80989n241073o446891j926168
11802a2278911L731492M708495J602546n22689m02587r86827k173280l20966L925769
$$ y = [1974083, -3575068, -7542041, -1689276, 7744151, 9111401, 1667468, -5320450, -6087263, -3013747, 188917, 2488331, 3150257, 1335387, -1592077, -3374710, -3933759, -3961639, -2366088, 1145617, 3362485, 1953936, 179819, 2127166, 5477600, 4884040, 913647, -794120, 1468611, 3781720, 3707756, 2522700, 69329, -5531647, -11623539, -11606112, -4589024, 1885838, 2229668, 95522, 1170326, 4131019, 4159381, 1400071, -60344, 666736, 725974, -970301, -2540789, -3203481, -4474226, -6849168, -8262267, -6614885, -2350533, 1516210, 1335221, -3905852, -10352743, -12278911, -8547419, -3838924, -2236378, -2759067, -3161654, -4148481, -6321761, -6642727, -2716958]
11793b716958M737942M84915l006187j781382N79280N81050R58673L888127M877551
11784H603011L25235m485682k776193K716652M350439J778074P24541J846250
11776A3082327K81637m145091n613922k444236o843j170408j704580J330578L674240
11767C283702J056593l276598l666067q23284R6492j885795k323736J269735N080742
11758a188216L938981j342304m113917o5968O585411P830428K362877k771631
11750A1235661k345860J89126n46053l189508l219587j223715q57822j498957
11742a456715k88442Q97936j339427l715848n34901N020344M372387j656256l198848
11733a899770J850404M051132p19005l796460M07505M009507K72258l333183J534040
$$ y = [-2716958, 2020984, 2505899, -500288, -2281670, -1702390, -1121340, -162667, 3725460, 8603011, 8928246, 4442564, 1666371, 4383023, 8733462, 10511536, 11236077, 13082327, 13363964, 9218873, 3604951, 1160715, 1153872, -16536, -1721116, -390538, 3283702, 4340295, 1063697, -2602370, -3425654, -3329162, -5214957, -7538693, -6268958, -1188216, 2750765, 1408461, -2705456, -2771424, 3813987, 11644415, 14007292, 11235661, 8889801, 9078927, 8532874, 5343366, 2123779, 900064, 42242, -1456715, -1745157, -847221, -2186648, -5902496, -6437397, -1417053, 2955334, 1299078, -1899770, -49366, 4001766, 3282761, -513699, -106194, 3903313, 4175571, 842388, 2376428]
11724B376428P802877M062472n457372p142317K05034N040909K545853m60389
11716H973495j45369q93670l846806l483036P64767J536548l234731n296354O5592
11707e559564N323376K759750l429364m753576j234482J280427J308526J539140
11699b765767K253518J935475J639065K692711K727000k88211k799863o36828
11691D757100K974088J126349n817750r691022n814911R02056L256402P72261
11683g535427j434599j00961K961209M259072K905323R62260M49926J007306R47934
11674D422043L5957l7223J740046L681525K910119j199925n484474n487998m34366
11665A45704M567781L444343k904799o445519k110634M819508N427141p47961
$$ y = [2376428, 10179305, 14241777, 8784405, 1642088, 1847122, 6888031, 9433884, 8973495, 8828126, 7934456, 4087650, 604614, 1369381, 2905929, -328802, -5625156, -5559564, -236188, 2523562, -905802, -5659378, -6893860, -5613433, -4304907, -2765767, -512249, 1423226, 3062291, 5755002, 8482002, 8193791, 5393928, 4757100, 7731188, 8857537, 3039787, -6651235, -12466146, -11564090, -8307688, -7535427, -8970026, -9070987, -6109778, -1850706, 1054617, 2016877, 2466803, 3474109, 4422043, 4458000, 4420777, 6160823, 9842348, 12752467, 11552542, 6068068, 580070, 145704, 4713485, 8157828, 5253029, -1192490, -3303124, 1516384, 6943525, 6195564]
11657F195564n568347l837314O67580K034452j9938j946497k046629j022242P07210
11648d836161L063479M907224M907110L183061Q56561j139608k128309j881434
11640F931923j306619j499905j831831p82924J106229J412813m55467k095164
11632A479055j590020N5911J098015J594592K322474K747581J697494o65984k671668
11623F067450k850614j596098r80759k162460l075611o94953L841453N392020
11615C940428J853617k376055k830818j179974r34962q33141J658922L450352
11607B748369m3205n480440m677673K597676P229144L998149j610727k950854
11599A810439j331470j175933k047984q99644J681020K537847R99881q85283j589281
$$ y = [6195564, 627217, -3210097, -2542517, -508065, -528003, -2474500, -4521129, -5543371, -4836161, -1772682, 3134542, 8041652, 11224713, 12081274, 10941666, 8813357, 6931923, 5625304, 4125399, 2293568, 1510644, 2616873, 4029686, 3574219, 1479055, -110965, -55054, 1042961, 2637553, 4960027, 7707608, 9405102, 8739118, 6067450, 3216836, 1620738, 639979, -1522481, -4598092, -5293045, -1451592, 3940428, 5794045, 3417990, 587172, -592802, -1527764, -2360905, -701983, 2748369, 2705164, -2775276, -7452949, -4855273, 2373871, 6372020, 4761293, 1810439, 478969, -696964, -2744948, -3644592, -1963572, 574275, 1574156, 688873, -900408]
11590i00408j187310p34290j608554l403257k651377K802899Q567409P912367
11582H797479J552452k684253j165831R87121j041304m538064m535236q95902
11574c523538L292113N615257M010135k043975p538620n536504K186803N295534
11566A757205k60523n460196k065286M614329M745354q17350l792271k341880
11558c620618j572782k556167q01274M350544P345507M839576L5914k849563l355961
11549A815176k796302j712098n35573J04996L75400P68588J201521J870540L266003
11540D358251M072331J866881k521420m936997l979018k727506k317846M45927
11532e739397N699514P213284J660636m688535m671421m46806J462471M25665
$$ y = [-900408, -2087718, -2822008, -4430562, -7833819, -10485196, -7682297, 885112, 8797479, 10349931, 7665678, 6499847, 7486968, 6445664, 1907600, -2627636, -3523538, -231425, 5383832, 9393967, 7349992, -188628, -5725132, -3538329, 1757205, 1496682, -3963514, -6028800, -1414471, 3330883, 2513533, -1278738, -3620618, -5193400, -7749567, -8550841, -4200297, 3145210, 7984786, 8020700, 5171137, 1815176, -981126, -2693224, -3228797, -3123801, -2748401, -1979813, -778292, 1092248, 4358251, 8430582, 10297463, 7776043, 2839046, -1139972, -3867478, -6185324, -5739397, -39883, 7173401, 8834037, 4145502, -525919, -972725, 489746, 915411]
11524I15411K8656N83633M81555R93962K830623K320080j971392m109571k66882
11515A806075K689665k074655p943757m250431N417164Q034647J781062k646271
11507B813499q61433J2066l271532m255429m26529J004409l186851n027343R94765
11498a2204378P659501O392026K47821k497369p12308J234537J743611J701279
11490C564720N96631j423287j995258j244659k672629n590229l598520M409369
11482g953862R137464L495906o060197q316737k314486L948906N558674L882980
11474A378648J034608j703029k269943n79814k50848k575656k785727J968475
11466e783286N852437K927407k208621j385230L225876K717523k885993m193300
$$ y = [915411, 944067, 1527700, 2009255, 3003217, 5833840, 8153920, 6182528, 2072957, 1806075, 4495740, 2421085, -5522672, -9773103, -4355939, 3678708, 5459770, 2813499, 1952066, 1964132, -1307400, -5562829, -5989358, -4984949, -8171800, -13199143, -12204378, -4544877, 1847149, 2094970, -402399, -1114707, 119830, 1863441, 3564720, 4161351, 2738064, 742806, -501853, -3174482, -8764711, -12363231, -7953862, 1183602, 4679508, -1380689, -9697426, -12011912, -8063006, -2504332, 1378648, 2413256, 710227, -1559716, -2139530, -2390378, -4966034, -7751761, -5783286, 69151, 2996558, 787937, -597293, 2628583, 5346106, 2460113, -1733187]
11458a733187J516533N394887J712932l060092j803951J435980p20354n532719
11450b789971m142656L512143P312038J601213o502968p103334o47511M015143
11442d745903K312410r16569K56481M022438L898363j315309n155826k205925
11434c849840M224548O157306J273276m400071m687184r20361R74071r52472k713825
11425d894552j066488J741136K015721L84719P2710J340289J840337J555404K566629
11416E555905L925039K160104j997787l221289k36599J198394k292271n373651
11408b82155k489724K758596L581917R39129N35153K082224N15666l521483l673645
11399D45678J201002M641340K718843r96395k546894k621824k256261k09083K731069
$$ y = [-1733187, -216654, 5178233, 6891165, 3831073, 2027122, 3463102, 2742748, -2789971, -6932627, -3420484, 3891554, 5492767, -1010201, -8113535, -8761046, -4745903, -2433493, -3350062, -3093581, 928857, 4827220, 3511911, -1643915, -3849840, 374708, 6532014, 7805290, 3405219, -1281965, -2202326, -1228255, -2180727, -4894552, -5961040, -4219904, -2204183, -1819464, -1746754, -406465, 1433872, 2989276, 5555905, 9480944, 11641048, 9643261, 6421972, 6185373, 7383767, 5091496, -282155, -2771879, -13283, 3568634, 4507763, 5042916, 7125140, 7640806, 4119323, 445678, 1646680, 6288020, 9006863, 8010468, 5463574, 2841750, 585489, 376406, 3107475]
11390C107475K938956N1446j853997j338280j708434l800544l485198M73044K968725
11381b646807J037710q24310J311231L662857J405870k803088l324491n03427
11373b684455J121036M32621l57927q43301j794660j580107J240042L467414J024791
11364B5454l803398m433846N11847M703723K602116l059735m720197L90487O448725
11355a334824O024764k39072m186930j533945J884621m67057m694920k479891
11347g027254M426106N808639n79374n063173j702721K652101O40228l660365
11339d505813k672150K163344M091387J872310q23664k409501k817647l46333
11331e448067M294613N458509P71201l274470j092793K422728N86275k791918
$$ y = [3107475, 6046431, 6097877, 4243880, 2905600, 1197166, -2603378, -6088576, -5615532, -2646807, -1609097, -2433407, -1122176, 2540681, 3946551, 1143463, -2181028, -2684455, -1563419, -1130798, -1488725, -2332026, -4126686, -5706793, -4466751, -999337, 25454, -3777944, -8211790, -7699943, -2996220, -394104, -3453839, -8174036, -7783549, -1334824, 4689940, 4450868, 263938, -1270007, 614614, 147557, -4547363, -7027254, -2601148, 3207491, 2628117, -2435056, -4137777, -1485676, -845448, -4505813, -7177963, -5014619, -923232, 949078, 125414, -2284087, -5101734, -5448067, -1153454, 4305055, 5076256, 1801786, 708993, 3131721, 3717996, 926078]
11323I26078l32980M598556K809835m307425o339076j235364J915461j091826
11315c056741l475142p41846J809068N349j413091J491995L562305j98387m569046
11306f585536k237427L375538L046582l200384n561608P19970Q246943Q021824
11298E825902J216979l866519l272548q86171r97792k063942l05917L302703L786330
11289B739025l52516m438898l880836Q6763L032663L058839J439355l13103j445068
11280g3776j581324j338402j753503j949504N0699L129371L520291J147078P19166
11271A870096L726409M785522J95278n340183o077869m105494m061429l830242
11263a2837912J042950P097829O652865L79982l117257m01443K812708J878886
$$ y = [926078, 593098, 5191654, 8001489, 3694064, -2645012, -3880376, -1964915, -3056741, -6531883, -7273729, -5464661, -5459312, -6872403, -5380408, -1818103, -2016490, -6585536, -8822963, -5447425, -2400843, -5601227, -11162835, -10442865, -2195922, 5825902, 7042881, 3176362, -96186, -982357, -1980149, -4044091, -4350008, -1047305, 2739025, 2386509, -2052389, -5933225, -5846462, -2813799, 245040, 1684395, 1371292, -73776, -1655100, -2993502, -4747005, -6696509, -6645810, -3516439, 3852, 1150930, 1870096, 5596505, 10382027, 10577305, 5237122, -840747, -4946241, -9007670, -12837912, -11794962, -4697133, 1955732, 2335714, -781543, -1182986, 1629722, 3508608]
11255C508608o12018r50635K89589J385249K354154K638787O83396k701866m699693
11246A895571m661662l880376j971334J664730M150343K698171K90718J237745
11238A423906L053051O92392l083032j411113L465637K071161o067955r971671
11230i827624m286845K743081L371441J474248L006489N121829K717203j945282
11222B374540l906621l398802k356983M70008M532831M575558m86532l024783
11214a220784J521549N835076K279410m124963m310484j17799O49010j366379
11206h55364J7011L136642J111280m218493m103433J768301M499631J329654q45966
11197A839263P69417K89884m014950m617411J844535P052986L993236k003173
$$ y = [3508608, 2896590, 1945955, 2235544, 3620793, 5974947, 8613734, 9297130, 6595264, 1895571, -2766091, -6646467, -8617801, -6953071, -2802728, -104557, 186161, 1423906, 4476957, 5169349, 2086317, 675204, 4140841, 6212002, 144047, -9827624, -14114469, -11371388, -7999947, -6525699, -3519210, 1602619, 4319822, 2374540, -1532081, -4930883, -7287866, -6817858, -2285027, 2290531, 1803999, -1220784, 300765, 6135841, 8415251, 4290288, -20196, -137995, 511015, -855364, -838353, 2298289, 3409569, -808924, -4912357, -3144056, 1355575, 2685229, 1839263, 2608680, 2898564, -1116386, -5733797, -3889262, 3163724, 7156960, 5153787]
11189E153787k955197n93784m25837p89934K289273M930500R28113n866713n770762
11180c100554J187559M828181J086180j772153K875632Q820730O398977k902285
11172A7422267q841757o647112j582984L16895m07316l14839R47263J525638J159953
11163C578008O95163m31064k915501m847160l648390m67732P91114q31571k091287
11154a0168420r06748O26802L54021l20924M52131J329034M44130q99075o63152
11145i752201L07506Q93847L066979P665557R547121L768110m726959n638426
11137E131534J771981O711275K479252m361807n311108k515284k658600m535918
11129c288675k215363K866793L228940j831200m511952j207608J995802p6973
$$ y = [5153787, 2198590, 1604806, 1178969, 389035, 2678308, 7608808, 8536921, 2670208, -3100554, -1912995, 2915186, 4001366, 2229213, 5104845, 13925575, 20324552, 17422267, 8580510, 1933398, 350414, 667309, 259993, -54846, 892417, 2418055, 3578008, 4273171, 3842107, 926606, -3920554, -7568944, -8036676, -7245562, -8077133, -10168420, -11075168, -10448366, -10094345, -10415269, -9963138, -8634104, -8189974, -9089049, -9752201, -9444695, -8550848, -5483869, 2181688, 11728809, 15496919, 10769960, 5131534, 6903515, 13614790, 16094042, 11732235, 6421127, 3905843, 1247243, -3288675, -5504038, -2637245, 591695, -1239505, -5751457, -6959065, -4963263, -5040236]
11121e040236l409479k108593K138779L783665K220850Q76505M53016j005657
11113b091150k933748k510553M66761L213000L908390K601325n60344m365037
11105b271356n477844k538095M56512l29073j697240J681032O987075N960503
11097B771514j528170n416455j52644O682930N755727p37749l885298j297658
11089B192197J835864K046286Q29413j34378r01245r92474k14394q11527m018923
11080a69181n933212k350491L510024M489606L52554j710169J662824N208573
11072E060528L887205J47585j338692r89001j871307l704600l890925k199269
11064d898476m38274R28534K492379L575273L167322K052799J390881L63615k109758
$$ y = [-5040236, -8449715, -10558308, -8419529, -4635864, -2415014, -1538509, -1085493, -2091150, -5024898, -7535451, -7068690, -3855690, 52700, 2654025, 2093681, -2271356, -7749200, -10287295, -9830783, -10159856, -11857096, -10176064, -3188989, 2771514, 1243344, -4173111, -4325755, 2357175, 8112902, 7375153, 3489855, 2192197, 4028061, 6074347, 6903760, 6769382, 5868137, 4875663, 4661269, 3849742, -169181, -6102393, -8452884, -4942860, -453254, -100700, -1810869, -148045, 5060528, 8947733, 9095318, 7756626, 6767625, 4896318, 1191718, -2699207, -4898476, -5336750, -4408216, -1915837, 1659436, 4826758, 6879557, 8270438, 8634053, 6524295]
11055F524295m388128l809420r88976M93437q27973k002453J81884M206030N064221
11046D452917P17302m582593n307270k049500o18323l083981m001533J246965
11038a3226016Q146649Q524706K272184k807526k443594m01944n34838j321138
11030a791517r65437j317592k787934j462609L647756O046605Q72895n842081
11022c599914m637226L332082P751760L827564k335695l897744j671923L1766
11014a199330J27729p310k9605k62504m12873o52880j630277k246989l35814L284945
11004c364908M713590K451941k92829n49480N57662J002068J364861K297590J765576
10995I946071j558414m718047m218784j433763k54906q60775j78890K278159L617199
$$ y = [6524295, 2136167, -1673253, -2662229, -2168792, -2996765, -4999218, -4817334, -611304, 4452917, 5170219, 587626, -4719644, -6769144, -7387467, -10471448, -14472981, -13226016, -5079367, 3445339, 5717523, 2909997, 466403, 64459, -470379, -1791517, -2756954, -4074546, -6862480, -8325089, -4677333, 1369272, 2242167, -3599914, -8237140, -4905058, 2846702, 6674266, 4338571, 440827, -1231096, -1199330, -1071601, -1078911, -1108516, -1371020, -1783893, -2436773, -4067050, -6314039, -6649853, -3364908, 1348682, 3800623, 3507794, 2958314, 3515976, 4518044, 5882905, 8180495, 9946071, 8387657, 3669610, -549174, -1982937, -2237843, -3098618, -3277508, -999349, 2617850]
10986B617850K663309J458152Q72337j119531n161005q045225o729975k312262
10978a5756350J931775M284553M610549K933640K46341r53195P23553L327375
10970A348241L700957J082579k501760m283740k393417K673981P087307O435666
10962A3149814J141925l160020k604771J64009Q13983m3406J002177L504653L494290
10953A7462654j61986m187708n788523n258973l571563j161633N39471N6131j132035
10944c204165o9412K738404L488756P41421k728492m284786l869897j659344K418475
10935f429040N985228N569097J934153l61124J13591R7156j669767j964499L48031
10926C622826J270566j341000l442220j648426R33588N08174q28271K68315J779104
$$ y = [2617850, 5281159, 6739311, 7611648, 6492117, 1331112, -6714113, -13444088, -15756350, -13824575, -9540022, -4929473, -1995833, -1749492, -2702687, -1979134, 1348241, 5049198, 6131777, 3630017, -653723, -3047140, -373159, 6714148, 13149814, 14291739, 11131719, 8526948, 8690957, 9504940, 9461534, 10463711, 13968364, 17462654, 17300668, 13112960, 7324437, 2065464, -1506099, -2667732, -2128261, -2072130, -3204165, -3273577, -535173, 2953583, 3695004, 966512, -3318274, -7188171, -8847515, -6429040, -443812, 5125285, 7059438, 6698314, 6811905, 6909061, 5239294, 3274795, 3622826, 4893392, 3552392, 110172, -1538254, -604666, -96492, -924763, -656448, 1122656]
10917A122656L80831j827282r77436J500980J853691J086288K488814M584217
10909A0212759L295843p37509l406682l759883l139971k79346N489555Q592141
10901A6266907L360635n444215p310433j052574L923951K174878j446343k083694
10893H389112k032373l748180m168409j117715J494588K48380j674923k25431
10885b834951K481643K107819q06542k553629j913756J03996L100463N895790
10877E580833N334382N95020l852535l559949k45942J051603q95023k829932k215615
10868a037158M8761J494087N86841j924870l076884n10774M020735N967537L475080
10859I043355p59123l499410l879437k004224J499484L727916J647506k618752
$$ y = [1122656, 1503487, -323795, -1301231, 199749, 2053440, 3139728, 5628542, 10212759, 13508602, 12771093, 9364411, 5604528, 2464557, 2185211, 7674766, 16266907, 19627542, 14183327, 6872894, 5820320, 9744271, 11919149, 10472806, 8389112, 6356739, 2608559, -1559850, -2677565, -1182977, -934597, -2609520, -2834951, -353308, 1754511, 947969, -1605660, -3519416, -3415420, -314957, 5580833, 10915215, 11510235, 7657700, 4097751, 3851809, 4903412, 4008389, 1178457, -1037158, -988397, 505690, 1092531, -832339, -3909223, -4419997, -399262, 5568275, 9043355, 8284232, 4784822, 905385, -1098839, 400645, 4128561, 5776067, 3157315]
10851C157315l304370L33048K078622j536684n043001k260486L722572M854314
10843B001330r6473m307103k961452R00987J717510j274549l987105k880435J236693
10834i650597M501475M358691K013010K22277k34033m28376o91973m93317k81947
10825f84790p60030p18654J419974M119505L997773O29799k987693m629465m355058
10816c968639k408486O74142K472034J341403n1831J504973L514845J066240m257431
10807a12750n612590j419210K536603K632291J565013J239475n22723l327669
10799c021560k312059L101476O139673L036950q05216k37680J280890r72858l971613
10790B238003k653056P70668R97072j070953r26002R14116N34657j334617k98934
$$ y = [3157315, -147055, 185993, 2264615, 727931, -4315070, -6575556, -2852984, 2001330, 1904857, -2402246, -5363698, -4462711, -2745201, -4019750, -8006855, -10887290, -9650597, -5149122, -790431, 1222579, 1444856, 1210823, 782447, 90474, -402843, -684790, -1444820, -2163474, -743500, 3376005, 7373778, 8003577, 5015884, 386419, -3968639, -6377125, -5702983, -3230949, -1889546, -1941377, -436404, 3078441, 4144681, -112750, -5725340, -7144550, -4607947, -1975656, -410643, 828832, 306109, -3021560, -5333619, -2232143, 3907530, 6944480, 6139264, 5901584, 7182474, 6209616, 2238003, -415053, 355615, 1352687, 281734, -644268, 269848, 804505, -530112, -829046]
10781h29046L611023N266829J969323l073037m980360j984145L300666N656724
10773H937977K382354k332984j891683K896078M169601r21643n736724n217289
10765B285687l381523m365432m239162P07378M912153J869462m345742n344918
10757a1902097j346153J652130K947469N196941N604918K70028n647158l789191
10749g013113L158491M872605M0726k653491l00782L93321k944630l445346J755737
10740f136482N224798K079194j365374J068503M553200K134588k774875k229803
10732B553749K607675L277714k391075p144631n256089K39723L314638L077455
10724B79159K995822M461319M623033J006500l951024n158821j388168K950958
$$ y = [-829046, 2781977, 8048806, 10018129, 6945092, 1964732, -19413, 3281253, 8937977, 11320331, 8987347, 7095664, 9991742, 14161343, 13239700, 7502976, 2285687, -1095836, -5461268, -9700430, -8993052, -4080899, -2211437, -6557179, -11902097, -13248250, -11596120, -8648651, -3451710, 2153208, 2423236, -3223922, -7013113, -3854622, 1017983, 1058709, -1594782, -1895564, -1502243, -4446873, -7892219, -6136482, -911684, 1167510, -197864, 870639, 5423839, 7558427, 4783552, 2553749, 5161424, 8439138, 6048063, -1096568, -6352657, -6112934, -2798296, 279159, 3274981, 7736300, 12359333, 13365833, 9414809, 4255988, 2867820, 5818778]
10716E818778L527376J111476r30926j616342j976711j822250m48365O52377o15585
10707C699828l183431l808384j570852J227925K306335J366861n58216j860072
10699b380006j296640M35178J356483J151102J120594Q37843j264783l226097
10691c266326r56388L835492L840098k197227n432679j17145O447558M729259
10683F882642k546696n666942k678392P80031K518615M549411N453227K091420
10675A1383316k666960l315009j075272o90415m82785L705762P129570J426330
10667A5414537r395462j1945751l843092K687555P71148j569040K617147P033892
10659A770934M135730j825622l173701j394036j756457k621979L5941L089392
$$ y = [5818778, 9346154, 10457630, 9526704, 7910362, 5933651, 4111401, 3663036, 4315413, 3699828, 516397, -3291987, -4862839, -3634914, -1328579, 38282, -519934, -2380006, -3676646, -3241468, -1884985, -733883, 386711, 1224554, -40229, -3266326, -4222714, -387222, 3452876, 1255649, -4177030, -4294175, 2153383, 6882642, 4335946, -1330996, -4009388, -3229357, -710742, 3838669, 9291896, 11383316, 8716356, 5401347, 4326075, 3635660, 3152875, 6858637, 13988207, 15414537, 6019075, -5926676, -9769768, -7082213, -6311065, -7880105, -5262958, 1770934, 5906664, 4081042, 907341, -486695, -2243152, -4865131, -4829190, -1739798]
10651a739798J135078l020515k215505L180839N995784L617612O43562L21008
10643G918065M58034j095000k582474j747839O98604K512007K429218N88625j744367
10634G434873k707870j542440L57166J048319J49591j306340k117288j416470
10626a00459P83162K908246K917046N18073k712404n039639m926589r58333N603747
10617a007150R121745M770754m044907p952397l103065L685109M179049l59893
10609E289245j904184K334803N836435K113901n812714r010682m316592K041326
10601c428462L477992J215606K33439J033611P54807j34572J084832K784854Q07792
10592G829899l159072k920884J596394L529752P30909r19863J223548J851615
$$ y = [-1739798, -604720, -3625235, -5840740, -2659901, 3335883, 6953495, 7597057, 7918065, 8376099, 7281099, 4698625, 2950786, 3649390, 6161397, 8590615, 9179240, 7434873, 4727003, 3184563, 3541729, 4590048, 4739639, 3433299, 1316011, -100459, 682703, 3590949, 6507995, 7026068, 4313664, -725975, -5652564, -6610897, -1007150, 8114595, 12885349, 8840442, 888045, -2215020, 1470089, 5649138, 5289245, 3385061, 5719864, 11556299, 13670200, 7857486, -1153196, -5469788, -3428462, 49530, 1265136, 1498575, 2532186, 3286993, 3152421, 4237253, 7022107, 7829899, 4670827, 1749943, 3346337, 6876089, 7606998, 6687135, 7910683, 9762298]
10584I762298j391083k474849J634654M284509R75502k123326K10741K200462
10576A3078908j620945m896064o73620M798735K235496m417513n208493j034153
10568B262351L49643p36976J162954L989430K311865p96218K61398J230561l899290
10559F135718q403437k637483P066839P059275m14089j626203M028425M058860
10551A5267905l382835o324388r78401K700990L05220o88911K592375L122972
10543A2614927q95780k093900J144096J565893k015264k245738J812258K977484
10535A2863976R90572K822235O600959K897663o169498p638033l7408L733972
10527A6064438j056531m312891m79546L648714L693690K810907N31997n672585
$$ y = [9762298, 8371215, 5896366, 7531020, 11815529, 12791031, 10667705, 10878446, 13078908, 11457963, 6561899, 5888279, 10687014, 12922510, 8504997, 3296504, 2262351, 2611994, 1875018, 3037972, 7027402, 9339267, 8543049, 8804447, 10035008, 6135718, -2267719, -4905202, 2161637, 9220912, 8806823, 7180620, 11209045, 15267905, 11885070, 5560682, 4582281, 7283271, 7588491, 6899580, 9491955, 12614927, 11719147, 9625247, 10769343, 12335236, 10319972, 8074234, 9886492, 12863976, 13854548, 16676783, 23277742, 26175405, 20005907, 12367874, 12330466, 16064438, 15007907, 10695016, 10215470, 13864184, 17557874, 20368781, 20900778, 15228193]
10519A5228193q409326L16667J0244803N827938n571807m517870N517082M391109
10511B3026789o471644o477176M458243O050087j824358P08970J0825413N189632
10503C5485956j1173724p686369J3315030J5564934l633617n940319J3519779
10496D9451670J3369301j0839493r447667K3189871K3677238j7654485j1410104
10489F0336331P2115613J02244697k9678200k05019020k10743005m1757895R3738914
10482a58762565P2684997l529854p509392L2065283K8438865o268543q016653
10475e0897862J5693111J3293676r884540j0002157R156372R090497p759407o991534
10467c8301844J0006773J1797365k012763m040877N817444K851484j1431841j1270724
$$ y = [15228193, 6818867, 7135534, 17380337, 23208275, 17636468, 13118598, 18635680, 23026789, 16555145, 10077969, 14536212, 20586299, 18761941, 19470911, 30296324, 35485956, 24312232, 16625863, 29940893, 45505827, 41872210, 35931891, 49451670, 62820971, 51981478, 42533811, 65723682, 89400920, 71746435, 60336331, 132451944, 234696641, 205018441, -579, -210743584, -252501479, -158762565, -86077568, -89607422, -97116814, -65051531, -36612666, -42881209, -50897862, -35204751, -21911075, -31795615, -41797772, -32641400, -23550903, -31310310, -38301844, -28295071, -16497706, -18510469, -22551346, -16733902, -13882418, -25314259, -36584983]
10459c6584983M026820R275522L2105l142032L791481L439016n691667n581571
10451c0435309N184379P690347j534120m778891K719127N136576k173496l969606
10443b2160993M834005Q867280O15935o452796k382736M079406M016392K247667
10435f335840L736890L380965k094351o397794m778416r40917J418124K963638
10427i047701K785663p83402l385480o2337M232151J786081l337065j690968M326080
10418e176978M903445P20106j81671L52292n090499j0908610m684117Q880096
10410a1185936J1531892N26018p064266k570707K695312j43678l539491r4973
10402i845829M443508L849715K020386K381478M84254m709376n240718K005364
$$ y = [-36584983, -32558163, -23282641, -23250536, -26392568, -22601087, -19162071, -24853738, -30435309, -25250930, -17560583, -19094703, -23873594, -21154467, -16017891, -18191387, -22160993, -17326988, -8459708, -7843773, -14296569, -16679305, -12599899, -8583507, -6335840, -2598950, 782015, -1312336, -7710130, -12488546, -13429463, -12011339, -9047701, -6262038, -7045440, -10430920, -10493257, -6261106, -4475025, -7812090, -9503058, -5176978, -273533, 446573, 264902, 617194, -4473305, -15381915, -20066032, -11185936, 345956, 871974, -6192292, -8762999, -6067687, -6211365, -9750856, -9845829, -5402321, -1552606, 467780, 2849258, 3333512, -1375864, -6616582, -4611218]
10394d611218P943258N505970j11657k385192l103746m265601k334518J977985
10386a384719M06165p925763j0430284o6700J0866126P945826l579050p377122
10378a1545521L2745P307644O809108K563361J67789p53082k184613l198580k353822
10369c154971m46266Q13353P04690l20378j114808q41530L8842O46712J050252
10360b624104J197497j8583k032200j329378K958247M972617k50219p306699o460852
10351a0893674J599486N964150J612847l828458k709003J700908K165500j104217
10343e492461k346206K29265K676995J708476j206020k069446J008403N335720
10335a55274O069421K005463k588313l692588k542545k069677j713571j35110
$$ y = [-4611218, 3332040, 8838010, 8726353, 6341161, 3237415, -1028186, -3362704, -1384719, -978554, -8904317, -19334601, -19401301, -8535175, -589349, -4168399, -11545521, -11512776, -4205132, 2603976, 5167337, 5335126, 4582044, 2397431, -801149, -3154971, -3601237, -2787884, -2083194, -2403572, -3518380, -4359910, -4321068, -3674356, -2624104, -1426607, -1445190, -3477390, -4806768, -1848521, 3124096, 2873877, -4432822, -10893674, -9294188, -3330038, -1717191, -5545649, -8254652, -6553744, -4388244, -5492461, -7838667, -7609402, -4932407, -3223931, -4429951, -6499397, -5490994, -155274, 5914147, 7919610, 5331297, 1638709, -903836, -2973513, -4687084, -4822194]
10327d822194M44719j603640k150484K612518P639649M923875l502615p290929
10319c749101k436711M289976O224867L908051J98429l664205n417768k683769
10311c330231J630676J694816k136313l526526m49332K238758J657553M09694
10303a810905k34731k417710n071493l632995J337277L695476K162837K161698
10295c810546M564945K834712m325095p878742k209829N426747O302824K526573
10287C431589K72715j142015m492880n978670j287796M780181M615591k7455j556900
10278a385640Q30247J504940p33278j621402l37912m13742j777623m96445K856308
10269a574547K960298n98200j690748J648419K945487j864404o500817l623685
$$ y = [-4822194, -4377475, -5981115, -8131599, -5519081, 2120568, 7044443, 3541828, -3749101, -6185812, -1895836, 4329031, 8237082, 8435511, 4771306, -646462, -3330231, -1699555, -4739, -2141052, -5667578, -6116910, -3878152, -2220599, -1810905, -2045636, -4463346, -9534839, -13167834, -11830557, -8135081, -5972244, -3810546, 754399, 3589111, -735984, -8614726, -10824555, -5397808, 905016, 3431589, 3704304, 2562289, -1930591, -7909261, -9197057, -4416876, 198715, 171260, -1385640, -555393, 949547, 216269, -1405133, -1743045, -2156787, -3934410, -4430855, -1574547, 1385751, 787551, -903197, 745222, 3690709, 1826305, -4674512, -8298197]
10261h298197L195705M541288m74460l264830M63220M022537M79797o036774n984117
10252a1355831J513548P205044M640867j699454l842124r75837J591389J120401
10244a801997Q7286R16873K420356K342391P44150l37739M94995K186218J942135
10235H994668j403300m893268m495951r33699P73215j320387l197868j587595
10227h064185Q38842N10341r36574j61905J780645J961374J226536J966006K872720
10218A993800J525198l07137J04552M09638k935246o878709n424250J49978K668120
10209h694056L96208j075973J018628K674582J151199n56585K8689P68070J5317
10200d273921j61782J033614M78765l090379n529220l185187J564947M075515
$$ y = [-8298197, -5102492, -561204, -1035664, -4300494, -3837274, 185263, 665060, -5371714, -11355831, -9842283, -2637239, 2003628, 304174, -3537950, -4513787, -2922398, -1801997, -1714711, -797838, 1622518, 3964909, 4709059, 4371320, 4866315, 7052533, 8994668, 7591368, 2698100, -1797851, -2731550, -1958335, -3278722, -6476590, -8064185, -7225343, -6715002, -7651576, -7813481, -6032836, -4071462, -2844926, -878920, 1993800, 3518998, 3211861, 3316413, 3726051, 790805, -6087904, -11512154, -11362176, -8694056, -8297848, -9373821, -8355193, -5680611, -4529412, -5085997, -5057308, -4289238, -4273921, -4435703, -3402089, -2923324, -6013703, -11542923, -14728110, -13163163, -9087648]
10192i087648L523215K213114J422487O90295l53314j166382m43227K704938O208085
10183E711563N336543j362350q181642q443383l105099J374983K155985J611662
10175d901738J182242j57346j714380j355132J79703P14564J427252M085607N047341
10166D508113k58311p591073p413327J032699P737925N834633n22176m379189
10158a050706m377170k277987P44003K534929J011041j183347O40181M766598
10150H07542M600661l37593l302210j799984j014774l198066l258384J118976
10142f383832M154310J683263k059586k329477q35790r7015J455231L968993L479365
10133C035462m77734k270132K05751J489618j188072k623230N3031J438310j397842
$$ y = [-9087648, -5564433, -3351319, -1928832, -1238537, -1591851, -2758233, -3201460, -496522, 5711563, 11048106, 9685756, 1504114, -6939269, -10044368, -8669385, -6513400, -4901738, -3719496, -3876842, -5591222, -6946354, -6766651, -6052087, -4624835, -539228, 4508113, 4249802, -3341271, -10754598, -9721899, -1983974, 3850659, 3328483, -1050706, -5427876, -7705863, -6961860, -4426931, -3415890, -4599237, -3959056, 807542, 5408203, 5070610, 1768400, -31584, -1046358, -4244424, -7502808, -6383832, -2229522, -546259, -2605845, -4935322, -5771112, -5868127, -4412896, -443903, 3035462, 2557728, 287596, 493347, 1982965, 794893, -1828337, -1775306, -336996, -1734838]
10124a734838k319899K006144L909051k089082p570908l156688N082870M965853
10116i07497k209441m869756j27355L710343K021326q64356j422651j545008k285333
10107h499728j436125J408854L804630M727124M635203K476881k024833n032368
10099E9638l125890R22364K219757R18168L086o82955k399545l103137j189919
10090f378433J14523j718124k905933R1330L222045J568959j463354r4134L349910
10081d213211K989730Q2947m82819j73747k856004m812887k62823O242537N357242
10072A870965j071543k543591K273236L773344j489764n369158k812367L85806
10064d983072j025541l346647j940583J381760L650548N440066O343898L438428
$$ y = [-1734838, -4054737, -2048593, 1860458, -228624, -7799532, -10956220, -5873350, -907497, -3116938, -7986694, -8114049, -4403706, -2382380, -3246736, -4669387, -6214395, -8499728, -9935853, -8526999, -4722369, 4755, 4639958, 7116839, 5092006, 59638, -3066252, -2143888, 75869, 994037, 997123, 314168, -2085377, -5188514, -6378433, -6263910, -7982034, -10887967, -10796637, -7574592, -6005633, -7468987, -7563121, -4213211, -1223481, -1140534, -1623353, -1797100, -4653104, -9465991, -9728814, -3486277, 1870965, 799422, -1744169, 529067, 4302411, 2812647, -2556511, -5368878, -4983072, -6008613, -9355260, -11295843, -9914083, -6263535, -823469, 5520429, 8958857]
10056H958857k132450m499048k188899m04948j435704j043312K355475L604982
10048C214953R9170l185398k610517j728628l155430k799733J644440M177799
10040d343344j04068n436154l323932M437006Q577364N370855j77891k551713
10032B448123j312930P70092J014322j142300l067665j560378K167146L350489
10024B666899Q25911j182351l55443R5973j820802k342029J254214M532343K270753
10015E945468l024919m909069k431467r6861m50146j958232k852527k539059n05633
10006a2822445K294991K786606L05569o95134K888375O267979K845092m551347
9998f80314n750138K380400J0388218Q426023j017216p267720n460814r70213
$$ y = [8958857, 6826407, 2327359, 138460, -266488, -1702192, -2745504, -390029, 3214953, 3314123, 128725, -2481792, -4210420, -7365850, -10165583, -8521143, -4343344, -4447412, -9883566, -13207498, -8770492, -193128, 5177727, 4999836, 2448123, 1135193, 1905285, 2919607, 1777307, -1290358, -2850736, -683590, 2666899, 3492810, 2310459, 1955016, 2050989, 230187, -2111842, -857628, 3674715, 5945468, 2920549, -1988520, -4419987, -4516848, -4966994, -6925226, -9777753, -12316812, -12822445, -10527454, -7740848, -7435279, -8130413, -5242038, 1025941, 3871033, -680314, -6430452, -4050052, 6338166, 14764189, 13746973, 6479253, 1018439, 48226]
9990D8226k03857k237802k158253P57499K607597J709911J102805K762199L526038
9981G914363J05591m695584n065471k78461M408698M765989J935396m68682n73661
9972H048178Q42773J387466q30277m195131m067525R80940N403247L313049k743324
9963H139396m984388j664302J000016j085487m174432l520506n70394L83442r05727
9954g382382r54017K089958O219267P806092M714597j709741p112602p831384
9946d160212m279297L73521L845238N409769M770223K946836K403751L237374
9938A4547203J648630m003252q587951o712660j071582J643839N14351p05917
9930b727339j668660m154455m943337L46972P306288P072634O19193k424204P7125
$$ y = [48226, -155631, -2393433, -4551686, -3794187, -1186590, 523321, 1626126, 4388325, 7914363, 8019954, 3324370, -1741101, -2019562, 2389136, 7155125, 9090521, 8621839, 8048178, 8890951, 10278417, 9448140, 5253009, 1185484, 2166424, 7569671, 10882720, 8139396, 3155008, 1490706, 2490722, 1405235, -2769197, -6289703, -6860097, -6476655, -7382382, -8336399, -6246441, -27174, 7778918, 12493515, 10783774, 3671172, -4160212, -8439509, -8065988, -4220750, 1189019, 5959242, 8906078, 11309829, 14547203, 16195833, 12192581, 3604630, -3108030, -4179612, -2535773, -2021422, -2727339, -4395999, -8550454, -13493791, -13146819, -5840531, 1232103, 1851296, -572908, -495783]
9921d95783L21142l477518k702674M913000Q264793Q78177o966072m706681J295833
9912b675783k15695n508988k845933O542693R901153L352577l132527j877291
9904C540206L045722M631242K087417j328847l018831j943990N05765P77492j763235
9895F532941k471803J215048M227045J980642r00982J607038N192945J883700
9887A9266574n066132n279419J208848L612640j668343n865778l304691O30809
9879C534508J391087K896329P005536O749532j487437q569922n315466K589393
9871H793560K940280m598206r199164n484326Q59318L844378M261803M154040
9863E571683J990967k843119n935233k842160L956265O968161K612069m186454
$$ y = [-495783, -174641, -3652159, -6354833, -1441833, 6822960, 7701137, 735065, -3971616, -2675783, -2891478, -8400466, -11246399, -4703706, 5197447, 8550024, 5417497, 3540206, 6585928, 11217170, 13304587, 11975740, 8956909, 7012919, 7518684, 8296176, 6532941, 4061138, 5276186, 9503231, 11483873, 10582891, 12189929, 17382874, 19266574, 14200442, 8921023, 10129871, 13742511, 12074168, 6208390, 2903699, 3534508, 4925595, 7821924, 14827460, 21576992, 20089555, 11519633, 6204167, 8793560, 11733840, 7135634, -2063530, -7547856, -6688538, -2844160, 1417643, 5571683, 7562650, 4719531, -1215702, -4057862, -101597, 6866564, 9478633, 5292179]
9855E292179n698582p86110L708613J892534l444321n068930j562193J303243
9847d363567m62931l618211l005825J588322O126696O876875K655465m282315
9839A514509q239488m847262K476996N269309J311543k145741L28729M032974
9831b98431K615603r44869J32199L926258K627526l472264n246997L90166M882194
9822D611385J636956l458017j832897L947411M397592k498442r339068j0238759
9814a2773839o141432K96036P421840J1280578P423703j076087m460192O18635
9806B589242N243262J145391o399095o496336N73248M217849J37568m135239k359158
9797e483268J206424N22789j939274l49059M099111N133670J093453l662260n578817
$$ y = [5292179, -406403, -1192513, 2516100, 4408634, 964313, -4104617, -5666810, -4363567, -4826498, -8444709, -11450534, -9862212, -3735516, 3141359, 5796824, 1514509, -6724979, -11572241, -9095245, -3825936, -2514393, -4660134, -4331405, -298431, 2317172, 1372303, 1504502, 5430760, 8058286, 4586022, -660975, -270809, 4611385, 6248341, 2790324, 957427, 4904838, 9302430, 6803988, -2535080, -12773839, -18915271, -18619235, -11197395, 83183, 7506886, 6430799, 1970607, 2589242, 7832504, 8977895, 2578800, -3917536, -3344288, 873561, 1011129, -3124110, -5483268, -4276844, -3754055, -5693329, -6042388, -1943277, 3190393, 4283846, 621586, -4957231]
9788d957231m768029k236771P31454J434946j118607k853685N59317O254080P046536
9779I2010J732265l214627l056462k56501J112533R78284O80335m37875k507529
9770d877567k965075l61296K573850K829604J455167R57235R47825j90147j463833
9761a094237q45091P69100Q63303l34910l98161Q51401J071585k32466o70670
9752b0146O37222R29169j794038m660951l286207J693562M686385K368298j935505
9743a382211k903362j62343K243739K161695J410135J414345Q38822q72393j500701
9734A247726j97959O3602k301411l455805q2162L888012K767281r63030l9412
9725I26842M816561M522152l743289j0347534o696702K184276N337155J163235
$$ y = [-4957231, -9725260, -11962031, -11230577, -9795631, -10914238, -13767923, -13208606, -6954526, 92010, 1824275, -1390352, -4446814, -4703315, -3590782, -2612498, -1932163, -2370038, -4877567, -7842642, -8203938, -5630088, -2800484, -1345317, -388082, 559743, 369596, -1094237, -1939328, -1170228, -306925, -641835, -1039996, -188595, 882990, 650524, -20146, 617076, 1546245, -247793, -4908744, -8194951, -6501389, -1815004, 553294, -1382211, -4285573, -4447916, -2204177, -42482, 1367653, 2781998, 3620820, 2748427, 1247726, 1049767, 1113369, -1188042, -4643847, -4726009, -837997, 1929284, 966254, 926842, 5743403, 10265555, 6522266, -3825268, -10521970, -8337694, -3000539, -1837304]
9717a837304k579980j345654J378990J513460o9107r90469j489023k682203l512517
9708a1613807j765608K608307O292091N237706o71618o051607n384307o3550L205626
9699h206767J731868M3394J727703L392197R94313k527466j834935J924120L313052
9690E57479J536344M39046Q16870k89322k738573k577231Q58063L248713K112308
9681C963697q3726q52853n31448P38109L312361M432723N33043n500183o263533
9672b51810j124484J997189n81654k006635L120888Q310804M810136m031713p299236
9663B943485k324366L108499L258679P05159m94738p42343k006890l988917n060590
9654d602022m069507q97137K385167K323331r66030k247875J297786M429387J693507
$$ y = [-1837304, -4417284, -5762938, -4383948, -2870488, -2939595, -3930064, -5419087, -8101290, -11613807, -13379415, -10771108, -4479017, 758689, 87071, -5964536, -11348843, -11412393, -8206767, -6474899, -6431505, -4703802, -1311605, -317292, -2844758, -4679693, -2755573, 557479, 2093823, 2532869, 3349739, 3060417, 321844, -2255387, -1397324, 1851389, 3963697, 3879971, 3027118, 2495670, 3233779, 6546140, 10978863, 11511906, 6011723, -251810, -1376294, 620895, 39241, -1967394, 1153494, 9464298, 14274434, 10242721, 2943485, 619119, 3727618, 6986297, 7691456, 7196718, 6454375, 4447485, 458568, -4602022, -8671529, -9568666, -7183499, -4860168, -5826198, -8074073, -6776287, -2346900, -653393]
9645f53393k555078k71064O277498O764788o15540n616555j978868L326818K291010
9636F969616j786102j512484K080486K716737o6257j410250j5917R61206L37322
9627H274357k57914p83145k229437k811149k48963L180617L208343J28534k421157
9618F040086l786868n530000n737512j154598N239085O336922J764205q01789
9610B369531K431889N365890J940920m228393n635042j906741Q14485r03532m402769
9601d153762n686040l464895R09261M460281M277204P48187j907190o87456J981108
9592c523302J707257j605323m069993l427345j003047J533959L855690N012681
9584a519423L252947o35760k506789J85360M114061L632621j564976n318713l004255
$$ y = [-653393, -3208471, -3479535, 2797963, 9562751, 8947211, 3330656, 1351788, 4678606, 6969616, 5183514, 3671030, 5751516, 8468253, 8401996, 6991746, 6975829, 7937035, 8274357, 8016443, 7233298, 5003861, 2192712, 1943749, 5124366, 8332709, 8461243, 6040086, 2253218, -3276782, -9014294, -10168892, -4929807, 1407115, 3171320, 2369531, 4801420, 10167310, 12108230, 7879837, 2244795, 338054, 1152539, 249007, -4153762, -9839802, -13304697, -12395436, -7935155, -3657951, -2909764, -4816954, -5504410, -3523302, -1816045, -3421368, -7491361, -10918706, -11921753, -10387794, -6532104, -1519423, 1733524, 1097764, -1409025, -1223665, 2890396, 6523017, 4958041, -360672, -3364927]
9575c364927J889045K443068j690992l767188l02454L568604K640675L14508K442549
9566D172888O275654M166357k958386n698482j296536J561847k572523o345807
9558b694988k097274M593734L877345j972961k840220J953195L247848j521537
9550B545142m161258m48452K784448J85379k966398j017416J487739j877324p118771
9541a0586911n568852J934331O272397L886033M61184O29866K021539J297793
9533C47380m61712r48831k72583R18980K863185M147966J683895m189293p741828
9524c652841m038892M602118J0640443Q962926J414563n351020o092167k071510
9516D413620L97732k204983n757528m316083R89665L653676J704255j20983R15077
$$ y = [-3364927, -1475882, 967186, -723806, -4490994, -4793448, -1224844, 1415831, 1730339, 4172888, 10448542, 14614899, 11656513, 5958031, 4661495, 6223342, 3650819, -2694988, -4792262, -198528, 3678817, 1705856, -1134364, 818831, 4066679, 2545142, -1616116, -2064568, 719880, 905259, -2061139, -3078555, -1590816, -3468140, -10586911, -16155763, -14221432, -7949035, -4063002, -3601818, -2971952, -950413, 347380, -114332, -1063163, -1335746, -416766, 2446419, 6594385, 8278280, 4088987, -3652841, -7691733, -3089615, 7550828, 16513754, 17928317, 12577297, 6485130, 4413620, 4811352, 2606369, -3151159, -7467242, -6477577, -2823901, -1119646, -1240629, -325552]
9507c25552J283778j425845l232879o82631K334323Q28900k352469j020886L559104
9498a034157M289432m8511k645908M86550M612369L923400o33008m420119n335532
9489h05484l634185L35595M518918M757534K7062m572954l977994l3248J849378
9480a535378Q36202N58086J823323J033078k943587n193752j250539N616097P486869
9471F430399J786035n062441n348732N53257N067611L287353j166029j858820
9463C688633J447853L056415j28013m267208l988372P14323M794449L904673j345962
9454G876791o027732n687628j497195N93839k094012m116438L84589P109058O074498
9445B615770k910535q014349k284654N696136M634403k992025o047763j662706
$$ y = [-325552, 958226, -467619, -3700498, -4383129, -2048806, -1219906, -3572375, -4593261, -1034157, 3255275, 3206764, 560856, 1047406, 5659775, 9583175, 8950167, 4530048, -805484, -4439669, -4104074, 414844, 5172378, 5199440, 626486, -3351508, -3384756, -1535378, -699176, -141090, 1682233, 2715311, -228276, -5422028, -6672567, -1056470, 6430399, 8216434, 3153993, -2194739, -1641482, 3426129, 6713482, 5547453, 3688633, 5136486, 8192901, 8064888, 3797680, -190692, 523631, 5318080, 9222753, 7876791, 1849059, -3838569, -5335764, -4741925, -6835937, -10952375, -10567786, -3458728, 2615770, -294765, -8309114, -10593768, -4897632, -263229, -3255254, -9303017, -10965723]
9437a0965723K845984K898906J656098J895250J792240N34743O04744K160939
9429C423181J598222j927550m334074l254171j410800j156604r57249M16057J388847
9420f214141J521976K708290M259649K471186k365101m566091j895118L94350
9412c685000j666394m111097k067612K279238M265863M074295L698568J766217
9404D554078k161265l182398J570248N668291J988126n068311n404052J041017
9396i94266M482012N90640m454278n150074l368788j812705K97708K087508l0798
9387h353041m649773m521832K222523P463237M826343q78186j890383J100729
9379d680383K660974K411735L381079M390606K171671j188007p16109K662493
$$ y = [-10965723, -8119739, -5220833, -3564735, -1669485, 122755, 657498, 1262242, 3423181, 5021403, 3093853, -1240221, -4494392, -5905192, -7061796, -8019045, -7602988, -6214141, -4692165, -1983875, 2275774, 4746960, 2381859, -2184232, -4079350, -3685000, -5351394, -9462491, -11530103, -9250865, -4985002, -910707, 2787861, 4554078, 2392813, -789585, 780663, 6448954, 8437080, 3368769, -2035283, -994266, 3487746, 4078386, -375892, -5525966, -8894754, -10707459, -10409751, -8322243, -8353041, -13002814, -17524646, -15302123, -7838886, -3012543, -3890729, -5781112, -4680383, -2019409, 392326, 3773405, 8164011, 10335682, 9147675, 8431566, 11094059]
9371A1094059L195274j77472k483250j392763m04839j945068l583741l310993
9363I91207k887246l201379j544851K972191N819105L122317k005810l634329
9355c68795j112742J392875J737063J501946J518896L45325k061494l049122j290832
9346a386880P09527O2664k477474l857700k814990p43188P70021J454390J632107
9337f651523J559333J598317J759018J008259j428496l722763k409703K841573
9329e445985P077009N127300j768831o984055o187364j390874L010701M972142
9321a589957M236935O96823l727742m530437o093M713007L515767j976872m549836
9312c218405j755608J516983J432122L9465k70973r64626k566385j516619L303865
$$ y = [11094059, 14289333, 14111861, 11628611, 10235848, 9831009, 7885941, 4302200, 991207, -1896039, -5097418, -6642269, -3670078, 2149027, 5271344, 3265534, -368795, -1481537, -88662, 1648401, 3150347, 4669243, 5014568, 2953074, -96048, -1386880, -677353, -614689, -3092163, -6949863, -9764853, -10508041, -9738020, -8283630, -6651523, -5092190, -3493873, -1734855, -726596, -2155092, -5877855, -8287558, -5445985, 1631024, 6758324, 4989493, -1994562, -8181926, -9572800, -6562099, -1589957, 2646978, 3343801, -383941, -4914378, -4920471, -207464, 3308303, 1331431, -3218405, -4974013, -3457030, -2024908, -1985443, -2256416, -3221042, -5787427, -7304046, -4000181]
9303d000181N988339J606996n166698o153687j379082K522529L225592L831328
9295D75136M245166O44556n434723o505236n89307M627388L010550j679866l160154
9286d366490j831760j265909j124325M15090J679228R36936R17252L867287N698334
9277D925643J660152m875752o172901j116942L950046M519669K196861R9767q03708
9268D382835p88993p86518j999918l115264n05793N120117O558565K86421n860766
9259C290686l137205L984437M199526k535222n095813M19217M725789R49341n128408
9250A672348n712355k349942l94707m4181N31167k27357k989263l532256O40787
9241a2405759M759805L982777J305489K003256M580071L836717n39891m634210
$$ y = [-4000181, 1988158, 3595154, -1571544, -7725231, -9104313, -6581784, -3356192, 475136, 4720302, 5364858, -69865, -6575101, -7164408, -2537020, 473530, -1206336, -4366490, -6198250, -7464159, -8588484, -8173394, -6494166, -5557230, -4639978, -772691, 4925643, 6585795, 1710043, -4462858, -5579800, -1629754, 2889915, 5086776, 5186543, 4382835, 3593842, 2807324, 807406, -2307858, -2813651, 2306466, 8865031, 9151452, 3290686, 153481, 4137918, 8337444, 5802222, 706409, 1125626, 5851415, 6800756, 1672348, -4040007, -6389949, -6784656, -6828837, -6297670, -6525027, -9514290, -13046546, -12405759, -7645954, -3663177, -2357688, -354432, 4225639, 8062356, 7522465, 2888255]
9233B888255o491853o071300k317859L983706P579630M786911n59048k446510
9225A351932p99059R61468K450158M216102L219585k181435o214481k938684L120658
9216C186244K545185m303108p676952l472249J682054K011528L23526Q46611J889541
9207b967620J10089l203183m297063j952004K349656O160021O500208K177616
9199D877720l115345l918847l41857J911535K4130k143948p45505K107352K063532
9190G18767j111413l868454l513200n05871K306146J912101j556564l789321j220933
9181a0628742L384695L946383l15621l643620k047384J577167K521623O82626
9173d522873n90030M60213K289219K125928r67855m075132k627414L072146N811736
$$ y = [2888255, -3603598, -9674898, -11992757, -8009051, -429421, 4357490, 3798442, 1351932, 552873, 1514341, 3964499, 8180601, 11400186, 9218751, 3004270, 65586, 3186244, 5731429, 1428321, -6248631, -9720880, -8038826, -6027298, -5703772, -4857161, -2967620, -2857531, -6060714, -10357777, -12309781, -9960125, -3800104, 2700104, 4877720, 1762375, -2156472, -2498329, -586794, -562664, -2706612, -3452117, -1344765, 718767, -392646, -4261100, -7774300, -8280171, -5974025, -4061924, -5618488, -9407809, -10628742, -7244047, -3297664, -3613285, -7256905, -9304289, -7727122, -5205499, -4522873, -5112903, -4652690, -2363471, -237543, -1205398, -5280530, -7907944, -4835798, 975938]
9164I75938M31877p132067o291438L055024R431896N646737j871073l526965L21942
9155A041871K513437O73208j026029L37208K786984L482668K199449K33848j525061
9146A0717583k851248l785204m093467k972818k61214K171273K086943M8081j268997
9137b09068j077022j200115k420366k951597j392924J252036L159663L141519
9129a697874O41785l080081m315116q58368L897112M722369J869005O0420O66795
9120A906047M63139j530858k084232R5287K108128K379464K703514L205299J364212
9111A0610000k134258l045119j038517m99459j752344K30602N229961N362755
9103A2963621j634876o440993k597417K503116J95062m678067k898219K508876
$$ y = [975938, 1407815, -5724252, -12015690, -8960666, 471230, 6117967, 4246894, 719929, 1041871, 3555308, 4228516, 3202487, 3539695, 6326679, 9809347, 12008796, 12242644, 10717583, 7866335, 4081131, -12336, -2985154, -3246368, -1075095, 1011848, 1059929, -209068, -1286090, -2486205, -4906571, -7858168, -9251092, -7999056, -4839393, -1697874, -1056089, -4136170, -8451286, -9309654, -5412542, -690173, 1178832, 1239252, 1906047, 2369186, 838328, -1245904, -1150617, 957511, 3336975, 6040489, 9245788, 10610000, 8475742, 5430623, 4392106, 3892647, 2140303, 2370905, 7600866, 12963621, 11328745, 4887752, 2290335, 4793451, 4988513, 310446, -2587773, -78897]
9095g8897K101553k532183j734541M099757M440575k691415o645942k157472K151046
9086c047519q57873m875148j654346M844726N300543p1079k902169J56857L925907
9077H19899L496398J72479j834394n65771K361001L470376Q25381l266171m479367
9068I99831k123766R2840k1102p8309J932929L401368J239717k467651k892992
9059H2865Q19790M553706M240874m20011o315791r038129n974002N72664M553933
9050f924101K623550j705897k515905J023817M191133L264198r1723j560882M59222
9041a236588L342926L661200J294151o82206l89206J38830j653974m170949l620838
9032c316654k62671J391077m52905k025752l41105J874691J191900k96107J286106
$$ y = [-78897, 2022656, -509527, -2244068, 1855689, 6296264, 3604849, -3041093, -5198565, -3047519, -3905392, -8780540, -10434886, -5590160, -289617, -360696, -3262865, -3106008, 819899, 4316297, 4488776, 2654382, 2088611, 4449612, 7919988, 8745369, 5479198, 999831, -1123935, -1031095, -1052197, -1130506, 802423, 4203791, 5443508, 2975857, 82865, 902655, 5456361, 9697235, 9277224, 2961433, -6076696, -12050698, -11478034, -6924101, -4300551, -6006448, -8522353, -7498536, -3307403, -43205, -134928, -1695810, -1236588, 2106338, 5767538, 7061689, 6379483, 5990277, 6129107, 4475133, 304184, -3316654, -3579325, -2188248, -2641153, -4666905, -5008010, -3133319, -1941419, -2237526, -951420]
9023i51420M181179L271789j180990l385825j274985M09775j386358k536078Q64676
9014a988237M567392K064476m283770n460294Q31805O340936M407266n60299p67742
9005E151533K570331J664746m758869q607743m358539K713901M313744N56143
8997g54753j796379j29538J122051j382283m390127l252768J128613M100869L972809
8988a381506L067641K653078R30755k630708m488047j558445L463343N061035
8980E117146K479269K14208M53298k12921m126256p216214m882588N5349J236094
8971f882615j095200o86387L780798N721232J187481m306001l960289N72638L011115
8962b657228J922369L80353p68860k584080k825911J583996P113281O115556j631787
$$ y = [-951420, 3229759, 6501548, 5320558, 1934733, 659748, 1069523, -316835, -2852913, -1988237, 2579155, 4643631, 359861, -5100433, -4268628, 2072308, 6479574, 5919275, 5151533, 7721864, 9386610, 4627741, -3980002, -8338541, -5624640, -1310896, -754753, -2551132, -2680670, -1558619, -2940902, -7331029, -10583797, -9455184, -5354315, -1381506, 1686135, 4339213, 5269968, 2639260, -1848787, -3407232, 56111, 5117146, 7596415, 7810623, 8263921, 8051000, 3924744, -3291470, -8174058, -8118709, -6882615, -7977815, -8664202, -4883404, 837828, 2025309, -2280692, -6240981, -5668343, -2657228, -734859, -354506, -1123366, -3707446, -6533357, -4949361, 2163920, 8279476, 6647689]
8953F647689o916504l787620K082253K516958r87336r14863L477667M911540j13426
8944F916358n515495m679133J09266K020209R2218o19684J651194K278479j663119
8935E90293n626688m088886P98728K489653K49011j21156L745986O287138K473602
8926F797681l961856n297639l61163M262483L010037k241778n143962k256144
8918e192341L314081N346350J806301k134366n78918M281823M207747l113516
8910G937161r487543p235795k7466K906175M3602j888482N99918L102337J418592
8901b631501j865798j849855J664729M613059L836324j57208l989283m102569
8893d482102l86862K742903J087843l718000o090965l759705J77064K447324L062975
$$ y = [6647689, -268815, -4056435, -1974182, 542776, -444560, -1359423, 2118244, 7029784, 6916358, 1400863, -3278270, -3169004, -1148795, -1056577, -1676261, -25067, 2253412, 590293, -5036395, -9125281, -8326553, -5836900, -5587889, -5709045, -1963059, 4324079, 6797681, 2835825, -2461814, -2822977, 1439506, 4449543, 2207765, -2936197, -5192341, -1878260, 3468090, 5274391, 3140025, 2561107, 6842930, 11050677, 7937161, -1550382, -8786177, -8813643, -5907468, -5863866, -7752348, -7152430, -4050093, -2631501, -4497299, -6347154, -4682425, -69366, 3766958, 3609750, -379533, -4482102, -4868964, -2126061, -1038218, -4756218, -10847183, -14606888, -14429824, -11982500, -8919525]
8884h919525L070457K739094K893717M267146M698304J216538m028853m907246
8876A029632l44593L094756Q13856k902232k124418J223066J090586k591201m177308
8867d887856j422111J936540K768135K176009J593783K8500l082583n725588n651881
8858a2267052k616065K194199O562588P326294L289956j894317l197506o43736
8850a245639J478484J674636K524594M216106K813596k503792o286403m753261
8842b081679j591833j105272q75080K415812M678429L94084o184752n700206J224818
8833h825679M115863n98192l873583N76222N677084L146319k493481j858714L438079
8824f96082M039376j194285l904049n82168K514194O78184k414208k452215j076332
$$ y = [-8919525, -5849068, -3109974, -216257, 4050889, 8749193, 9965731, 5936878, 1029632, 685039, 3779795, 4593651, 1691419, -432999, 790067, 1880653, -710548, -4887856, -6309967, -4373427, -1605292, 570717, 2164500, 2193000, -889583, -6615171, -12267052, -14883117, -12688918, -6126330, 1199964, 4489920, 2595603, -601903, -1245639, 232845, 1907481, 4432075, 8648181, 11461777, 8957985, 2671582, -2081679, -3673512, -4778784, -5653864, -3238052, 1440377, 1834461, -4350291, -10050497, -8825679, -4709816, -5308008, -9181591, -8605369, -2928285, 218034, -2275447, -4134161, -696082, 3343294, 2149009, -1755040, -2337208, 176986, 855170, -1559038, -4011253, -5087585]
8815e087585p54773M9670K244262K682262J5965j429952J413797M474982L028953
8806F637581k61535M3619K795673K191936k598261o123194m784154j051755R43595
8797b206495P4595j969722k560818R9821M641671O741393M107212j19463j648040
8788G160154q54567r10953k053565k036444r48907p65232p19907J744077N149995
8779E764651M380242j505411o430000m949306N55415L391218J250684j752856
8771G04637j281794J634281K450084m06653k987008j126919L181468L908322m44276
8762E632142m323057k934275J189291K468057J9009k657054l411663k774094j077355
8753g868999J701983M046115M243452K889497J339134p93079l628776m603222
$$ y = [-5087585, -5842358, -5792688, -3548426, -866164, -850199, -2280151, -866354, 3608628, 6637581, 6376046, 6419665, 9215338, 11407274, 8809013, 2685819, -2098335, -3150090, -2206495, -2131900, -4101622, -6662440, -6562619, -1920948, 4820445, 8927657, 8808194, 7160154, 6305587, 5394634, 3341069, 1304625, 355718, -409514, -1129421, 614656, 5764651, 10144893, 8639482, 2209482, -2739824, -2184409, 1206809, 2457493, 704637, -577157, 1057124, 3507208, 3100555, 113547, -1013372, 2168096, 6076418, 5632142, 1309085, -1625190, -435899, 2032158, 2051167, -605887, -4017550, -6791644, -7868999, -6167016, -2120901, 2122551, 5012048, 6351182, 5558103, 1929327, -2673895]
8745b673895j791223K100958K955847Q46780j288228k443808k884528j261595
8737f439692K575714M421269J220146k633806j244305K709369J915875k836613
8729c12043l371201J799564M216233o08386n499798l126859K674397L711703k14310
8720g30700k787475j272042J401363K547474K277569J263125M7885k74006N07332
8711B980525R51176N85770R30392J896449M44427m200079p238437m159465K391186
8702e418056N686931L408816p37112k878622k665682j273275Q25930L093439M043993
8693D086362K524986n77221k618164j677770J061526K267315N20885j800633k004363
8684A782923q10692n04745j069518r75665l00703Q9666Q91705K476470K634879
$$ y = [-2673895, -4465118, -2364160, 591687, 1438467, 150239, -2293569, -5178097, -6439692, -3863978, 557291, 1777437, -856369, -2100674, 608695, 2524570, -312043, -3683244, -1883680, 2332553, 1724167, -3775631, -6902490, -4228093, -516390, -730700, -3518175, -4790217, -3388854, -841380, 1436189, 2699314, 2747199, 2473193, 2980525, 3931701, 4517471, 5447863, 7344312, 7788739, 3588660, -3649777, -7809242, -5418056, 268875, 3677691, 2940579, 61957, -2603725, -3877000, -3051070, 42369, 4086362, 6611348, 6034127, 3415963, 1738193, 2799719, 5067034, 5587919, 3787286, 1782923, 972231, 467486, -602032, -1577697, -1878400, -1788734, -897029, 1579441, 4214320]
8675D214320K37390j280975Q62418K809191k08772m636432l278354K272183L419282
8666D410251j237459l880319j238945N75127j573003j790658K947443N398801
8658C611238K08993n566285l082664M257650O733184K821164j327730k715113
8650D940437l084146k804527j002625O65092P61929J436123L422838K426900l092014
8641C670007o268881j969315L251066J019814m288865k397186N168982P071448
8633E257070N83544m877698l556591n30532m86698m62230K138941L756663J653305
8624C475774r38024r97631n45475j584774k268760j382422q87267j203585J85732
8615f146432K936095K982558J55369j84510L479187M912009K37508m736881l309936
$$ y = [4214320, 4451710, 3170735, 4033153, 6842344, 6633572, 1997140, -1281214, 990969, 4410251, 3172792, -707527, -1946472, -1371345, -2944348, -4735006, -1787563, 3611238, 3820231, -1746054, -4828718, -571068, 6162116, 8983280, 7655550, 4940437, 1856291, -948236, -1950861, -1285769, -523840, 912283, 4335121, 6762021, 3670007, -2598874, -4568189, -1317123, -297309, -4586174, -6983360, -1814378, 5257070, 5840614, 962916, -2593675, -3124207, -3610905, -4073135, -1934194, 1822469, 3475774, 2537750, 1540119, 994644, -590130, -2858890, -4241312, -5128579, -6332164, -6146432, -3210337, -227779, -72410, -256920, 3222267, 8134276, 8371784, 3634903, 324967]
8606C24967J413835J586789l064259n123814o91026N251363N718996M89335l833761
8597B072425j950610L114480L374793k744358o602980j431301O087671M604600
8589F524720l892519o019705J982906P564086J367907q165612q389973j296701
8581a0324891K165952r096q73149J292554J283335j372406q80997L347995M493602
8572h77101M76480j700080J716858L779900j637560q389423o665027J719139N902247
8563e674567J907442l064070k762794R6059P74401L28799J689067L119514J489619
8554b096530j160748n56663K131271K128141q348J372472O481908P488278M45585
8545A6225366o917291n598624J300646L151885k862090q895577q362537l149830
$$ y = [324967, 1738802, 3325591, 261332, -4862482, -5553508, -302145, 5416851, 5906186, 2072425, 121815, 3236295, 6611088, 3866730, -2736250, -4167551, 1920120, 6524720, 2632201, -3387504, -1404598, 6159488, 7527395, -638217, -9028190, -10324891, -8158939, -8168035, -9041184, -7748630, -6465295, -7837701, -8718698, -5370703, -877101, -400621, -2100701, -383843, 3396057, 1758497, -6630926, -13295953, -11576814, -5674567, -3767125, -6831195, -9593989, -9497930, -8723529, -8394730, -6705663, -3586149, -2096530, -3257278, -3813941, -1682670, 445471, 437123, 1809595, 8291503, 15779781, 16225366, 9308075, 3709451, 5010097, 8161982, 5299892, -3595685, -11958222, -15108052]
8537a5108052K084203N813332P444156N292012L28047k547896o25666K603103
8529E283239K728201N06913p25556q48420k132766m344978m665320k136537Q33227
8520e501997J671602M24852r45127r80767k41466m54839j778077j757937J249030
8511h314726M456207L505163r80063l351146o09444L496286M057442J375085r19644
8502B715160j250558m71568Q11067J882455P53639k971548n478323l030708J910694
8493e129690L295832K84633j435509J371844M169044J881599k520255k277760
8485c60262K134639L042600k340854o720294l631566K188902J990376l041109
8477f737568l514972L129298Q287224N147641k058930n740237m823025k070232
$$ y = [-15108052, -13023849, -7210517, 233639, 5525651, 5853698, 3305802, 2680136, 5283239, 8011440, 8518353, 7792797, 6944377, 4811611, 466633, -4198687, -6335224, -5501997, -3830395, -3405543, -4350670, -5331437, -5572903, -6027742, -7805819, -9563756, -8314726, -3858519, -353356, -1333419, -4684565, -5294009, -1797723, 2259719, 3634804, 2715160, 1464602, 993034, 1804101, 3686556, 4440195, 1468647, -4009676, -7040384, -5129690, -1833858, -1549225, -2984734, -1612890, 2556154, 4437753, 1917498, -360262, 1774377, 4816977, 2476123, -4244171, -7875737, -5686835, -3696459, -6737568, -10252540, -7123242, 1163982, 6311623, 4252693, -1487544, -6310569, -8380801]
8469h380801J861568N716112N106656l66214l131826J443286N919246J963321
8461A0131348m892551l609805L300128L417799m155042o805018p9057M620606
8453A928408k24419n777413k933403K259874N07733m113577k297898L674692M719998
8444b256005J111419M33207K767820J228161m022740n025667L2242L582151J252326
8435h97086k410145l112588k439621j642680J323850N246962M559399j072256
8427d44165l841879N87530N609812L653984k344434m216422r56108J372154k14858
8418g94386k405913k083065l63694O06239P42261O94913K72883n76734r58753
8409d866249j73139J220152J979618J487482M75484M04695J546157J931911m16192
$$ y = [-8380801, -6519233, -803121, 4303535, 3937321, 805495, 2248781, 8168027, 10131348, 5238797, 1628992, 4929120, 8346919, 4191877, -2613141, -2692198, 1928408, 1703989, -4073424, -7006827, -4746953, -4239220, -8352797, -10650695, -6976003, -2256005, -1144586, -711379, 2056441, 3284602, -738138, -5763805, -5731563, -2149412, -897086, -3307231, -6419819, -8859440, -10502120, -9178270, -3931308, 628091, -444165, -4286044, -3698514, 1911298, 5565282, 3220848, -995574, -1951682, -579528, -794386, -3200299, -5283364, -5647058, -5040819, -4298558, -3603645, -3330762, -3907496, -4866249, -5039388, -3819236, -1839618, -352136, 123348, 528043, 2074200, 4006111, 3589919]
8400C589919m118192n182133j936039K596412M560918L843004K873717K174880
8392H402486j07148m110971o441024m160469Q02657L449705J736225j292602j959918
8383c681059l73703J163797K139676L467381M322368K867825J06513o96498O28865
8374I945165Q0431m246938q093899o279239K4975M443657L084351j332252k992789
8365e366538N59020N521685N666582p2337n352858m414361l27469k39573l711087
8356g736936l319329K299379N120045J181596j986602J951438O672138L743747
8348G925476k456002j968273L328175K560807n649394j0683896o754541n5764
8340a3753412L197398M415779M999273K198239k749418k799207K973882N520676
$$ y = [3589919, -528273, -5710406, -7646445, -5050033, -489115, 3353889, 6227606, 8402486, 8295338, 4184367, -2256657, -6417126, -5614469, -2164764, -428539, -1721141, -3681059, -4054762, -2890965, -751289, 2716092, 7038460, 9906285, 10012798, 9316300, 9945165, 10025596, 5778658, -2315241, -8594480, -8569505, -4125848, -1041497, -2373749, -5366538, -4807518, 714167, 6380749, 6308412, 955554, -3458807, -3786276, -4025849, -7736936, -11056265, -8756886, -3636841, -2455245, -4441847, -2490409, 4181729, 7925476, 5469474, 3501201, 6829376, 9390183, 3740789, -6943107, -13697648, -13753412, -10556014, -6140235, -1140962, 1057277, -1692141, -4491348, -1517466, 4003210]
8332D003210L20554m037592K09292O544157M542979l479658p038674l624869N35215
8323b025386K326244L666338L774201o0625m828152m570789n79653L11415k415037
8314d401444k247712K345285M773221J471616k651129l042223j731998j267753
8306f752137j62603J590575N2409m720762n529674J132614P606009N587496j234580
8297b430653l181471P22853L022710Q09614r40632M84277Q67537k420320m412883
8288g478968j15098O430508O557215r68489p554116n547636K250921O627929L847911
8279D050177m08136M1452L034254K123985k824185n108021j702681K021455R78085
8270B206385j867644j114116K127289K821932N78362q40927q53793k128042l883828
$$ y = [4003210, 4323764, 286172, 495464, 7039621, 11582600, 8102942, 1064268, -2560601, -2025386, 300858, 3967196, 7741397, 7680772, 2852620, -1718169, -2297822, -1986407, -4401444, -6649156, -4303871, 469350, 1940966, -710163, -3752386, -5484384, -6752137, -6914740, -5324165, -5271756, -9992518, -15522192, -14389578, -6783569, -1196073, -2430653, -5612124, -4889271, -1866561, -1056947, -1997579, -1513302, -645765, -3066085, -7478968, -7594066, -1163558, 5393657, 4425168, -3128948, -8676584, -6425663, 202266, 4050177, 3642041, 3683493, 6717747, 8841732, 6017547, 909526, -793155, 1228300, 2206385, 338741, -775375, 1351914, 4173846, 4752208, 3911281, 3057488, 929446, -2954382]
8261b954382k154772K447330M076669Q29139j783500L81316L665509L102113L07205
8252G916627k85674O75669q46234m757605o673589m719940j675675r0758O72025
8243i785154J715141K239666J282964k46148n70963P63181K225208J678887j032713
8234a729931k900441q36775L599232N129770J790200j871931j056700K513282
8226D636706L354005k23696m794789o646267m753616m37511K873440J522321l244893
8217g714300m553979J198267P491028N824595j437636m119322M57155M054616
8209A200424J105283l244486k782026J0254k09329k242906j612423J228859K779836
8200c766514L241338M594059M641909K66723m967593m158992J960418M795922
$$ y = [-2954382, -5109154, -2661824, 1414845, 2243984, 460484, 841800, 4507309, 7609422, 7916627, 7630953, 8306622, 7460388, 2702783, -3970806, -8690746, -10366421, -10457179, -9785154, -8070013, -5830347, -4547383, -4793531, -5364494, -4601313, -2376105, -697218, -1729931, -4630372, -5467147, -1867915, 3261855, 5052055, 3180124, 2123424, 4636706, 7990711, 7767015, 2972226, -3674041, -8427657, -8865168, -5991728, -4469407, -7714300, -12268279, -11070012, -3578984, 2245611, 807975, -3311347, -2854192, 1200424, 2305707, -938779, -3720805, -3710551, -3919880, -6162786, -7775209, -6546350, -3766514, -525176, 4068883, 8710792, 8977515, 4009922, -149070, 1811348, 6607270]
8192F607270K03744n543816m948090Q86133N268747M940523K111479k86443j706714
8183G532833k912862m107027m309348k202425J662001L900699J682429k809407
8175a563107m109882o11147K990524K184916j194764k084538N19044K792562J866230
8166G89838r27101k817649k796229j278001R64171K297327Q50555k553445l851724
8157i322258m90065M438180N571770K267187r51077j097600k54856j072019k415773
8148c326511k155457j202068j259810r56066J660091M470767L700453k3575k692766
8139a784942l263641l813760l771274j92422N343656O721257K531927q54196J215781
8130B132386M844289M318111M16938k694556m126785m691543l005660J258389
$$ y = [6607270, 6811014, 1267198, -3680892, -2794759, 2473988, 7414511, 9525990, 9239547, 7532833, 4619971, 512944, -3796404, -5998829, -4336828, -436129, 1246300, -1563107, -5672989, -6284136, -3293612, -1108696, -2303460, -4387998, -3868954, -1076392, 789838, -137263, -2954912, -5751141, -7029142, -6064971, -3767644, -2917089, -5470534, -9322258, -9812323, -5374143, 197627, 2464814, 1513737, 416137, 161281, -910738, -3326511, -5481968, -6684036, -7943846, -8899912, -7239821, -2769054, 931399, 907824, -1784942, -5048583, -8862343, -12633617, -12826039, -7482383, -761126, 1770801, 916605, 2132386, 6976675, 11294786, 11711724, 9017168, 4890383, 198840, -2806820, -1548431]
8122a548431M006679K273548m21359N7420J211923r62310l690963k075256J451627
8113C02878J169739j169886M47864M100239K115340m546573o064085j15759L528325
8104b31918p78487n233464k196693L083264K109212k584309k718745J745900L938417
8095b866823J993079K69482N03854K53137n81751O81832L345964L330696j47519
8086F781951l394287m082100l397861k312007m82885R84565K40118j595324j544852
8077h802682L58749J335681P80316O72634J173840K89688j732357k038513P2590
8068g890054K003633K242485K118198K345047J473294j075528l497288m051229
8060f331442k488958R99637N289214P067999L797205j924351m660553l000141
$$ y = [-1548431, 2458248, 4731796, 4310437, 4367857, 5579780, 4617470, 926507, -1148749, 302878, 1472617, 302731, 750595, 4850834, 6966174, 2419601, -3644484, -3760243, -231918, -1010405, -6243869, -8440562, -5357298, -3248086, -5832395, -8551140, -6805240, -2866823, -873744, -604262, -100408, 152729, -429022, 252810, 3598774, 6929470, 6781951, 3387664, -694436, -4092297, -6404304, -6887189, -5902624, -5662506, -7257830, -8802682, -8443933, -7108252, -6327936, -5655302, -4481462, -4191774, -5924131, -7962644, -7890054, -5886421, -3643936, -1525738, 819309, 2292603, 1217075, -2280213, -6331442, -8820400, -7820763, -2531549, 4536450, 8333655, 6409304, 1748751, -1251390]
8052a251390l54768J012773K178006L305224K292385p72492k419695j082068N19685
8043C427660K47739k34097P31005J702874J267747N86807M21142p76600l293898
8034D080379m250220j952617J125833K225711J842638J156402k62452j783118
8026B182556j052130J252077Q14130k865743l899204O22459M456913J512786l954546
8017i30702m006978L94311K149029L45624K72687K519082K062052j345784j672755
8008b13434K472398M515157P73409l547959l282761q92841n35634j158690o13582
7999b483937p95819l190837m340122j344371K497289K986846J721550J880131
7991c069270J630180j762164m941747k889150K184669L827171J674829J270978
$$ y = [-1251390, -1606158, -593385, 1584621, 4889845, 7182230, 6409738, 3990043, 2907975, 3427660, 3675399, 3441302, 4172307, 5875181, 7142928, 7729735, 8150877, 7374277, 4080379, -169841, -2122458, -996625, 1229086, 3071724, 4228126, 3965674, 2182556, 1130426, 2382503, 3196633, 330890, -3568314, -2945855, 1511058, 3023844, -930702, -4937680, -4543369, -2394340, -2048716, -1776029, 743053, 2805105, 1459321, -213434, 2258964, 6774121, 7547530, 3999571, 716810, -176031, -711665, -1870355, -2483937, -3279756, -6470593, -10810715, -12155086, -9657797, -6670951, -4949401, -3069270, -1439090, -3201254, -8143001, -11032151, -8847482, -5020311, -3345482, -2074504]
7983b074504M118513N409336K400490j679623l478608l394191k190591O67562
7975b21616L675799L600612Q74749m73549R5159j591132o193186p759809k935653
7966a0928626K447189J566316k959449l361251J244163M160732J877314j186158
7958g139770k31236K971674L647600J105139j150652q52957N61905Q89915K72544
7949G4162L31829J357441J909844J214921L79774K87884l29712k834546n436216
7940c044619m582930j2714L991366L689970M78195j263792J75355K142618J410712
7931B984161j716285l701278j887893K259885M660453L266627N7247j984910k154848
7922A783159j160458Q89161L322550L563194K12139l583157l480255k30962J228842
$$ y = [-2074504, 2044009, 7453345, 9853835, 8174212, 4695604, 1301413, -889178, -221616, 3454183, 7054795, 7929544, 7455995, 7551154, 5960022, -233164, -7992973, -10928626, -8481437, -6915121, -9874570, -13235821, -11991658, -7830926, -5953612, -7139770, -7371006, -4399332, -751732, 353407, -797245, -1650202, -1088297, -198382, 74162, 405991, 1763432, 3673276, 4888197, 5267971, 5555855, 5226143, 2391597, -3044619, -7627549, -7640263, -3648897, 41073, 519268, -744524, -569169, 1573449, 2984161, 1267876, -2433402, -4321295, -2061410, 2599043, 5865670, 5922917, 3938007, 1783159, 622701, 1511862, 4834412, 8397606, 8609745, 5026588, 1546333, 1315371, 2544213]
7913B544213r17410l075854k178388L8868M57613q76013j608869l25292K349072
7904c592060M137038K516789j891885m139963q53215L629804K329475l489607
7896a353624n314638l61694M172489K700599r46420j929500k577112n498652n958529
7887a7067081J27565O498383M977371o58797l84936N067367N209313k199939o816781
$$ y = [2544213, 1626803, -1449051, -3627439, -3588571, -3130958, -4006971, -5615840, -5941132, -3592060, 544978, 3061767, 1169882, -2970081, -3823296, -193492, 2135983, -1353624, -6668262, -7029956, -2857467, -156868, -1103288, -3032788, -5609900, -11108552, -17067081, -16939516, -10441133, -5463762, -6122559, -6507495, -1440128, 3769185, 1569246, -5247535]
$$ [...]
##END NTUPLES=NMR SPECTRUM
##END=
