##TITLE=31Pdec_SR81 ASP3
 CDCl3, 124 sc
 31.08.2021
##JCAMPDX= 6.0         $$ Bruker NMR JCAMP-DX V2.0
##DATA TYPE= NMR SPECTRUM
##DATA CLASS= NTUPLES
##ORIGIN= UXNMR, Bruker Analytische Messtechnik GmbH
##OWNER= root
$$ XWIN-NMR		Version 3.5
$$ Tue Aug 31 13:27:15 2021 Russian Standard Time (UT+4h)  she@DPX200
##.OBSERVE FREQUENCY= 81.013821
##.OBSERVE NUCLEUS= ^31P
##.ACQUISITION MODE= SIMULTANEOUS
##.ACQUISITION SCHEME= undefined
##.AVERAGES= 124
##.DIGITISER RES= 16
##SPECTROMETER/DATA SYSTEM= spect
##.PULSE SEQUENCE= zgpg30
##.SOLVENT NAME= CD2Cl2
##.SHIFT REFERENCE= (INTERNAL, CD2Cl2, 0, 248.564)
##AUDIT TRAIL= $$ (NUMBER, WHEN, WHO, WHERE, WHAT)
$$ ##TITLE= Audit trail, XWIN-NMR		Version 3.5
$$ ##JCAMPDX= 5.01
$$ ##ORIGIN= Bruker BioSpin GmbH
$$ ##OWNER= she
$$ F:/spectra/data/she/nmr/P31/1/pdata/1/auditp.txt
$$ ##AUDIT TRAIL=  $$ (NUMBER, WHEN, WHO, WHERE, WHAT)
(   1,<2021-08-31 13:20:23.20 +0400>,<she>,<DPX200>,
      <continue with go, POWCHK disabled, PULCHK disabled
       configuration hash MD5:
       00 E9 B6 7A A2 85 ED C7 34 08 36 98 17 FE 4E 26
       data hash MD5: 32K
       E5 77 DF A4 53 BB 76 B4 7C 1A 47 4D A8 1C 57 9E>)
(   2,<2021-08-31 13:24:59.29 +0400>,<she>,<DPX200>,
      <Start of raw data processing
       efp BC_mod = 2 LB = 1 FT_mod = 6 PKNL = 1 PHC0 = -7663.485 PHC1 = -84.32671 SI = 64K 
       data hash MD5: 64K
       FE 38 0A 7A E1 37 42 E9 E3 94 F4 E6 F1 7D ED 56>)
(   3,<2021-08-31 13:25:36.34 +0400>,<she>,<DPX200>,
      <pk PHC0 = -88.22736 PHC1 = 214.5999 
       data hash MD5: 64K
       7E 6B DF 7B 44 4B 76 1E AC 51 5B C9 1C 1F 2F BD>)
(   4,<2021-08-31 13:25:39.48 +0400>,<she>,<DPX200>,
      <abs ABSG = 5 
       data hash MD5: 64K
       0D 4E 0D 96 F1 FE 13 87 75 0E F6 C1 B0 3B 7A A4>)
$$ ##END=
$$ 
$$ hash MD5
$$ 4B 9E CB 73 AF 76 22 6C 12 78 2E 1C 37 10 6E B4
##$RELAX= 
##$RELAX= 
##$RELAX= 
##$RELAX= 
##$RELAX= 
##$RELAX= 
##$RELAX= 
##$RELAX= 
$$ Bruker specific parameters
$$ --------------------------
##$DU= <F:/spectra>
##$EXPNO= 1
##$NAME= <P31>
##$PROCNO= 1
##$TYPE= <nmr>
##$USER= <she>
##$AMP= (0..31)
100 100 100 100 100 100 100 100 100 100 100 100 100 100 100 100 100 100 
100 100 100 100 100 100 100 100 100 100 100 100 100 100 
##$AQSEQ= 0
##$AQ_mod= 1
##$AUNM= <au_zg>
##$AUTOPOS= <>
##$BF1= 81.014009
##$BF2= 200.13
##$BF3= 200.13
##$BF4= 200.13
##$BF5= 200.13
##$BF6= 200.13
##$BF7= 200.13
##$BF8= 200.13
##$BYTORDA= 1
##$CFDGTYP= 0
##$CFRGTYP= 5
##$CHEMSTR= <none>
##$CNST= (0..31)
1 1 145 1 1 1 1 1 1 1 1 1 1 1 1 1 1 1 1 1 1 1 1 1 1 1 1 1 1 1 1 1 
##$CPDPRG= <waltz16>
##$CPDPRG1= <>
##$CPDPRG2= <waltz16>
##$CPDPRG3= <>
##$CPDPRG4= <mlev>
##$CPDPRG5= <mlev>
##$CPDPRG6= <mlev>
##$CPDPRG7= <mlev>
##$CPDPRG8= <mlev>
##$CPDPRGB= <>
##$CPDPRGT= <>
##$D= (0..31)
0 1 0 0 0 0 0 0 0 0 0 0.03 2e-05 3e-06 0 0 0 0 0 0 0 0 0 0 0 0 0 0 0 0 
0 0 
##$DATE= 1630401456
##$DBL= (0..7)
120 120 120 11 120 120 24 19 
##$DBP= (0..7)
150 150 150 150 150 150 150 150 
##$DBP07= 0
##$DBPNAM0= <>
##$DBPNAM1= <>
$$ [...]
##$SUBNAM3= <"">
##$SUBNAM4= <"">
##$SUBNAM5= <"">
##$SUBNAM6= <"">
##$SUBNAM7= <"">
##$SUBNAM8= <"">
##$SUBNAM9= <"">
##$SW= 501.771253377433
##$SWIBOX= (0..15)
0 1 3 0 0 0 0 0 0 0 0 0 0 0 0 0 
##$SW_h= 40650.406504065
##$TD= 32768
##$TD0= 1
##$TE= 0
##$TE2= 300
##$TE3= 300
##$TEG= 300
##$TL= (0..7)
0 120 53 12 22 120 120 120 
##$TP= (0..7)
150 150 150 150 150 150 150 150 
##$TP07= 0
##$TPNAME0= <>
##$TPNAME1= <>
##$TPNAME2= <>
##$TPNAME3= <>
##$TPNAME4= <>
##$TPNAME5= <>
##$TPNAME6= <>
##$TPNAME7= <>
##$TPOAL= (0..7)
0.5 0.5 0.5 0.5 0.5 0.5 0.5 0.5 
##$TPOFFS= (0..7)
0 0 0 0 0 0 0 0 
##$TUNHIN= 0
##$TUNHOUT= 0
##$TUNXOUT= 0
##$USERA1= <user>
##$USERA2= <user>
##$USERA3= <user>
##$USERA4= <user>
##$USERA5= <user>
##$V9= 5
##$VALIST= <valist>
##$VCLIST= <CCCCCCCCCCCCCCC>
##$VD= 0
##$VDLIST= <DDDDDDDDDDDDDDD>
##$VPLIST= <PPPPPPPPPPPPPPP>
##$VTLIST= <TTTTTTTTTTTTTTT>
##$WBST= 1024
##$WBSW= 4
##$XGAIN= (0..3)
0 0 0 0 
##$XL= 0
##$YL= 0
##$YMAX_a= 3109
##$YMIN_a= -6908
##$ZGOPTNS= <>
##$ZL1= 120
##$ZL2= 120
##$ZL3= 120
##$ZL4= 120
##$ABSF1= 248.5645
##$ABSF2= -253.2056
##$ABSG= 5
##$ABSL= 3
##$ALPHA= 0
##$AQORDER= 0
##$ASSFAC= 0
##$ASSFACI= 0
##$ASSFACX= 0
##$ASSWID= 0
##$AUNMP= <proc_1d>
##$AZFE= 0.1
##$AZFW= 0.5
##$BCFW= 0
##$BC_mod= 2
##$BYTORDP= 0
##$COROFFS= 0
##$CY= -3
##$DATMOD= 1
##$DC= 0
##$DFILT= <>
##$DTYPP= 0
##$F1P= 0
##$F2P= 0
##$FCOR= 1
##$FTSIZE= 65536
##$FT_mod= 6
##$GAMMA= 0
##$GB= 0
##$INTBC= 1
##$INTSCL= 5.30512e-09
##$ISEN= 30
##$LB= 1
##$LEV0= 0
##$LPBIN= 0
##$MAXI= 10000
##$MC2= 0
##$MEAN= 0
##$ME_mod= 0
##$MI= 50
##$NCOEF= 0
##$NC_proc= -7
##$NLEV= 6
##$NOISF1= 182.463
##$NOISF2= 159.3651
##$NSP= 0
##$NTH_PI= 0
##$NZP= 0
##$OFFSET= 248.5645
##$PC= 4
##$PHC0= -7751.712
##$PHC1= 130.2732
##$PH_mod= 1
##$PKNL= yes
##$PPARMOD= 0
##$PSCAL= 0
##$PSIGN= 0
##$REVERSE= no
##$SF= 81.014009
##$SI= 65536
##$SIGF1= 159.3651
##$SIGF2= -187.1042
##$SINO= 113.3802
##$SIOLD= 16384
##$SREGLST= <1H.CDCl3>
##$SSB= 0
##$STSI= 65536
##$STSR= 0
##$SW_p= 40650.406504065
##$SYMM= 0
##$S_DEV= 0
##$TDeff= 32768
##$TDoff= 0
##$TI= <>
##$TILT= no
##$TM1= 0
##$TM2= 0
##$TOPLEV= 0
##$USERP1= <user>
##$USERP2= <user>
##$USERP3= <user>
##$USERP4= <user>
##$USERP5= <user>
##$WDW= 1
##$XDIM= 65536
##$YMAX_p= 191480576
##$YMIN_p= -186858132
$$ End of Bruker specific parameters
$$ ---------------------------------
##NTUPLES= NMR SPECTRUM
##VAR_NAME=  FREQUENCY,     SPECTRUM/REAL,   SPECTRUM/IMAG
##SYMBOL=    X,             R,               I
##VAR_TYPE=  INDEPENDENT,   DEPENDENT,       DEPENDENT
##VAR_FORM=  AFFN,          ASDF,            ASDF
##VAR_DIM=   65536,         65536,           65536
##UNITS=     HZ,            ARBITRARY UNITS, ARBITRARY UNITS
##FACTOR=    0.620285442955139, 1,           1
##FIRST=     20137.2065510759, 0,            0
##LAST=      -20513.1999529892, 0,           0
##MIN=       -20513.1999529892, -186858132,  0
##MAX=       20137.2065510759, 191480576,    0
$$ Real data points
##PAGE= N=1
##DATA TABLE= (X++(R..R)), XYDATA
$$ [...]
##PAGE= N=2
##DATA TABLE= (X++(I..I)), XYDATA
13013i179581p00510J21187K578068M034537K709241M46389l81230J83360Q38483
13004F49944O44397p80144k438753k028010P28929K467848J008611n92159J031323
12995F91986L313346J930178j261562j192853J211436N10388l065330l173006
12987a035417J812562N476356L196828j718022m405843m455592k704586J466886
12979b366828O074677N884460J99027l973093j306692L810766L892654o32780
12971A1582191k989795p46350J163377j387413n434630n412516j355288J069535
12963c510889j042497l136792k7562N317090N547424O81678j512942J571475K973006
12954F859991j118545l818227J677L196087j302848o181735j317401P026271M863195
$$ y = [-9179581, -9880091, -9758904, -7180836, -3146299, -437058, 9331, -371899, -188539, 649944, 1294341, 514197, -1924556, -3952566, -3223637, -755789, 252822, -339337, 691986, 4005332, 5935510, 4673948, 3481095, 4692531, 5202919, 2137589, -1035417, 777145, 6253501, 9450329, 7732307, 3326464, -1129128, -3833714, -2366828, 3707849, 9592309, 9791336, 5818243, 4511551, 8322317, 12214971, 11582191, 8592396, 7846046, 9009423, 7622010, 2187380, -3225136, -4580424, -3510889, -4553386, -7690178, -7717740, -2400650, 3146774, 3828452, 2315510, 3886985, 6859991, 5741446, 1923219, 1924896, 5120983, 3818135, -2363600, -3681001, 3345270, 8208465]
12945H208465n412294p708361J238411O832498J422411m371156j838231J571465
12937e6792k084826o350707k959498K930133K705906l32490J618517N909340M610777
12928E990360j158511m010824k976339k514737k639664l60858K130750N01949
12920e037874k898393k170631K210305M620502L418128J582914M82166k88350
12912A918767N10309K936746K798253k176527o606458m507270J462666M291685
12904F28171K431253q69251l661950m488830o76368N877562P183571O95120m598177
12895B521101j909084J791612j461212n222784l6621P416991L804705o923351
12887a8643q137323K063919P602073J039400n508211j985127M229762L197791
$$ y = [8208465, 2796171, -4912190, -3673779, 3158719, 4581130, 209974, -1628257, -56792, -2141618, -8492325, -11451823, -8521690, -5815784, -6148274, -4529757, 1379583, 5990360, 4831849, 821025, -2155314, -4670051, -7309715, -7670573, -5539823, -5037874, -7936267, -10106898, -7896593, -3276091, 142037, 1724951, 2207117, 1918767, 2429076, 5365822, 8164075, 5987548, -618910, -5126180, -3663514, 628171, 3059424, 2190173, -1471777, -5960607, -6636975, -759413, 6424158, 7119278, 2521101, 612017, 2403629, 942417, -4280367, -4316988, 3100003, 6904708, -18643, -8155966, -6092047, 1510026, 2549426, -2958785, -4943912, -714150, 2483641]
12879B483641j729280k993975k170349l703210m388329M82434P040974Q181637
12871C203543M114103P7537j935822k735741j830545K77381J51557k893340l878714
12862e450041M767L818218K547164q53715r98771J224579J766450Q42909P57420
12853C658980J55990k862208n131267k695285J783672K525376k91490j400798
12845d257030P56245K328601R04008j408942k097820j031782J159134L750877
12837A03291M842004K905699n04689k363269k182310j824687j925886j349723
12829b299570L9936P02664k51932j807137k169031l05868K868609M334707J759976
12820B872354k731255m026597o20581L067238K877402K96262j079417j331182
$$ y = [2483641, 754361, -2239614, -4409963, -8113173, -12501502, -12019068, -4978094, 3203543, 7317646, 7395183, 5459361, 2723620, 893075, 1170456, 1322013, -1571327, -5450041, -5445274, -1627056, 920108, 66393, -932378, 292201, 2058651, 2901560, 3658980, 3814970, 952762, -4178505, -6873790, -5090118, -2564742, -2856232, -4257030, -3500785, -1172184, -268176, -1677118, -3774938, -4806720, -3647586, 103291, 4945295, 7850994, 7346305, 4983036, 2800726, 976039, -949847, -2299570, -2259634, -1556970, -1808902, -3616039, -5785070, -6090938, -3222329, 1112378, 2872354, 141099, -3885498, -4506079, -1438841, 1438561, 1734823, 655406, -675776]
12812f75776k587108l896926k323999J710837M367429L683296J523003M5154p34601
12803A111309j378718j616546j237058o07112P1156O49348M39202o77385j083511
12794d329315N87811K723567K460374J94529m10906K163186M503206K816951j536451
12785I172952l670774j728885Q56689K58634k835483m729717l604611q75639J437406
12776e719428K371093J441840r40533k348835n43280K590228K563720j117806
12768a703001l654589k219429k44051j121745k048886P21295M141355K609519
12760c519532k166703l102493Q63242L078681J70462k794780j013084K823069
12752e661138L922750K527848J312770L05959j078223j004096J128214J705453
$$ y = [-675776, -3262884, -7159810, -9483809, -7772972, -3405543, 277753, 1800756, 1845910, 1111309, -267409, -1883955, -3121013, -3728125, -3656969, -3007621, -2568419, -3245804, -4329315, -3741504, -1017937, 1442437, 1636966, 1226060, 3389246, 7892452, 10709403, 9172952, 5502178, 3773293, 4629982, 4888616, 2053133, -2676584, -6281195, -7156834, -5719428, -3348335, -1906495, -2847028, -5195863, -5739143, -3148915, -585195, -1703001, -5357590, -7577019, -7821070, -8942815, -10991701, -10270406, -6129051, -3519532, -5686235, -8788728, -7925486, -4846805, -4676343, -7471123, -8484207, -5661138, -1738388, 789460, 2102230, 2408189, 1329966, 325870, 1454084, 3159537]
12744C159537j488524m239316k130176J363849j40772m800838m326057K790652
12736i811645P783774M222484k604664l767868N56897K617228o74904l537431
12728e216129m44592N571740P014989J873656m178812n260089j909028Q86126
12720a662139J78341k388615l573448k002899J268049L834919L303313n86571
12712a629050m442945l771698J343811M794831J434131n181884n861670K042201
12704a1272273R411387O306418m176042q940981k238824O612948O434101o96933
12696A439801m013103j80023L422145J081519l755932n408628l453176j97588
12688a1064985L390607N651639L585240j671107l717541K87838M434124K596768
$$ y = [3159537, 1671013, -2568303, -4698479, -3334630, -3475402, -8276240, -12602297, -9811645, -2027871, 2194613, -410051, -4177919, -3621022, -1003794, -1678698, -5216129, -5660721, -88981, 6926008, 8799664, 4620852, -639237, -2548265, -1662139, -1483798, -3872413, -7445861, -9448760, -8180711, -4345792, -1042479, -1629050, -6071995, -9843693, -8499882, -3705051, -2270920, -7452804, -13314474, -11272273, -1860886, 4445532, 269490, -8671491, -10910315, -4297367, 2136734, 1439801, -2573302, -2753325, 668820, 1750339, -2005593, -7414221, -10867397, -11064985, -7674378, -2022739, 1562501, -108606, -3826147, -3538309, 895815, 3492583]
12680C492583k453231m133245k015995k96866K04497J570343K883573J784830
12672A036489M3404P83898J886846p52993m791045l932697J541755M410580J284786
12663A511023l262948m402512k539036j6993J839710J550076j192861k805532
12655i319073m3944L644907K592546j183394o71453L816315M601361J33881j904333
12646A666813J803764M044446j62271m477289k243964J821594j98458n880699
12638c626064o692532j756757K083273J983197J997547M302724N242329J906366
12630E440083k830602m157987j031165L478939N522853L462489r71626m139982
12622D773002l907316j461924M87315M83759q40570j616330m93879J477489J644399
$$ y = [3492583, 1039352, -3093893, -5109888, -5406754, -5202257, -3631914, -748341, 1036489, 1079893, 1863791, 3750637, 2997644, -1793401, -5726098, -4184343, 226237, 1511023, -1751925, -6154437, -8693473, -8710466, -6870756, -5320680, -6513541, -9319073, -9363017, -5718110, -3125564, -4308958, -4980411, -1164096, 3437265, 3571146, 1666813, 3470577, 7515023, 7352752, 2875463, 631499, 2453093, 2254635, -3626064, -10318596, -12075353, -9992080, -8008883, -6011336, -1708612, 3533717, 5440083, 2609481, -1548506, -2579671, 899268, 6422121, 9884610, 8912984, 4773002, 865686, -596238, -108923, 374836, -465734, -2082064, -2575943, -1098454, 545945]
12613E45945k91509j141656O36454J539626j367766m442219k583880K042607L104917
12604a957481L07829r81306N27130P86597j086668j468857o9481n59920k396239
12595f898396j054489K310276J349875l399656l740046J896660M958454J868029
12587b709293K69278M070585N036826k048350p978446l849528L398251K687876
12579a122801k793322k567266K646091L795244K38950o16578K185423K430617
12571D196358p87209k277643j672487l177107m821327k29870Q013844Q984868
12563H229427R8488p864062o382838k66026J792264k64635n92962K664935N743769
12554C158360M917072L33505m505619n861639l469162o37881N31533J652053L696995
$$ y = [545945, 254436, -887220, -250766, 1288860, -78906, -4521125, -7105005, -5062398, -1957481, -1649652, -2630958, -2103828, -1317231, -2403899, -3872756, -3942237, -4502157, -6898396, -7952885, -5642609, -4292734, -7692390, -11432436, -9535776, -4577322, -2709293, -2440015, 1630570, 6667396, 4619046, -3359400, -7208928, -3810677, -1122801, -3916123, -6483389, -3837298, -42054, 196896, -419682, 1765741, 4196358, 3409149, 1131506, -540981, -3718088, -8539415, -8769285, -755441, 8229427, 8327915, 463853, -5918985, -6185011, -4392747, -4657382, -5250344, -2585409, 3158360, 8075432, 8408937, 3903318, -1958321, -5427483, -6065364, -5533831, -3881778, -184783]
12545a84783L937082Q56707j936192j315646O7708o74967o49510K780893M808355
12536G689647J36461o761035p174228j203736L443704L443630J989155R10411
12528B474009p19321j701788m80235L08086j276054p11110M897912P766789J00964
12519A0659252j0247544q777494L013887R102195L242852l713603l155011O7077
12511A91611L72829R82975M211505M821833K66216l303523j995331q04069k844429
12502A899617k705011K141813M070191j715679o761276k167403O265741O725310
12494G753303o75318n636975l692379k67509k44001j972685j844843R23093M343273
12485a314041N423275K892204m47449q10939O50052l23031l045611k428509J209156
$$ y = [-184783, 3752299, 4609006, 2672814, 1357168, 1424876, 749909, 100399, 2881292, 7689647, 7826108, 1065073, -6109155, -7312891, -3869187, -425557, 1563598, 2474009, 1754688, 52900, -427335, -119249, -1395303, -2106413, 2791499, 10558288, 10659252, 411708, -8365786, -5351899, 3750296, 6993148, 3279545, 124534, 191611, 564440, 1547415, 5758920, 10580753, 10846969, 7543446, 5548115, 4744046, 1899617, -805394, 1336419, 5406610, 3690931, -3070345, -5237748, 1027993, 7753303, 7077985, 1441010, -2251369, -2518878, -2762879, -4735564, -6580407, -5657314, -1314041, 4109234, 7001438, 6553989, 5743050, 6393102, 6070071, 3024460, 595951, 1805107]
12476A805107J158153l952638o225607q93804N606768N575815O93718l018414
12468G49098m004241l351667r59890J130910j287835o136533m742568M183196
12460a4419530R491810L989851l563225k270319L891859M181743r34677k406500
12452b038988J563769M499882L609240J843889J76646k446533l691270j312276
12444B204359Q25834j134637k902539M53694L651144o12243o833568l677565O484224
12435a541297R654656K010771n014388l815419n95646j701100l121405m09393
12427d533221J991911n84683l673441j318187L456773L892529M04755j366473
12419a730037j07709O13493m42332n31862J847446M519111M713440J963109j970694
$$ y = [1805107, 2963260, -989378, -7214985, -8108789, -2502021, 3073794, 3767512, 749098, -3255143, -6606810, -7566700, -6435790, -7723625, -13860158, -18602726, -14419530, -4927720, -937869, -4501094, -6771413, -2879554, 1302189, 367512, -2038988, -475219, 4024663, 7633903, 9477792, 9654438, 7207905, 3516635, 2204359, 3030193, 1895556, -1006983, -553289, 3097855, 2485612, -4347956, -8025521, -1541297, 8113359, 10124130, 5109742, 1294323, 698677, -1002423, -4123828, -4533221, -2541310, -3125993, -6799434, -8117621, -4660848, -768319, -363564, -1730037, -1837746, -1224253, -1666585, -2198447, -351001, 4168110, 8881550, 10844659, 8873965]
12410H873965m407065l593443n71630J450592N19847j861914k492657l5565L221092
12401A103222L190469j481398o747944p041823k113858K909385M824152N454692
12393I6897O024778L950797j399592n221954m191967j822490j845528j796411
12385f205470O42052J053881l723272o793275p72765Q208581Q083875o9166l594460
12376c170019J414993N041066J134201l334804j564599K109899J381179j335551
12368A676365q23461J686192K367153J975319K577221K179551j224988m601142
12360E812210m448012k571342k367149l110241k442506q38190M55040K049576
12352g460614L438849J975410j532472j614432L038356N410625N57650n447768
$$ y = [8873965, 4466900, 873457, 301827, 1752419, 2272266, 410352, -2082305, -2117870, 1103222, 4293691, 2812293, -3935651, -10977474, -13091332, -10181947, -5357795, 96897, 6121675, 10072472, 8672880, 3450926, -741041, -2563531, -4409059, -6205470, -5563418, -4509537, -8232809, -15026084, -15798849, -7590268, 493607, 424441, -3170019, -1755026, 3286040, 4420241, 1085437, -479162, 1630737, 3011916, 1676365, 852904, 2539096, 4906249, 6881568, 9458789, 11638340, 10413352, 5812210, 1364198, -1207144, -3574293, -6684534, -9127040, -9965230, -9510190, -7460614, -4021765, -2046355, -3578827, -5193259, -2154903, 3255722, 3813372, -1634396]
12344a634396m090925K566005N442674K051228j635180j515722J98780Q37550
12336B220014Q09247N60759m79948j221324M7393J549022k74969m349760n055219
12327f194785j73319N301543N336018Q5299m901024n045434j056466K380677J929586
12318b337905m12645j73693K452623J913667l791488p681093k579990P236571
12310e373953J0132013K747940n497130n628709l43097K177398N34354K4970K714781
12301A488567M356230J919613j330587j054412J436597J300947k635412o371284
12293h89741o171113k497198J856858M745685M884144J888310k127159l270973
12285a581187m03810K779680K407118n19761k259982j872352j379778j385802
$$ y = [-1634396, -5725321, -3159316, 2283358, 4334586, 2699406, 1183684, 1382464, 2220014, 3029261, 3590020, 3110072, 1888748, 1936141, 3485163, 3210194, -1139566, -6194785, -6368104, -1066561, 4269457, 4354756, -546268, -5591702, -6648168, -4267491, -2337905, -2750550, -2924243, -471620, 1442047, -2349441, -10030534, -12610524, -5373953, 4758060, 7506000, 2008870, -3619839, -3962936, -1785538, -1251184, -1226214, 1488567, 5844797, 7764410, 6433823, 5379411, 6816008, 8116955, 5481543, -889741, -7060854, -9558052, -7701194, -2955509, 1928635, 3816945, 1689786, -1581187, -1984997, 794683, 3201801, 2682040, 422058, -1450294, -2830072, -4215874]
12277d215874j68847K687881M807131L926968M28434l264108m496692k311832
12269b606939R63301J427625j342798l068101r19718K027957K034513J063878
12261d20282K760111M964491K889814k062205m092486k721353k639150l943695
12253e264755j637961L734567M780731l8365k239847K710732O637219J564876
12245A0247197o566981o757891P4968L550577K87105k704969p83639J871683P31732
12236e0218j730822p99031L057615N023990K198645k910456m673714n02094M875993
12227D489908L820891l912032r034168m439442M636489P422005J891288m028556
12219H46383m251091q56210J756642K739454K814269J374856j541264l462166
$$ y = [-4215874, -4384721, -1696840, 3110291, 7037259, 7465693, 4201585, -295107, -2606939, -1643638, -216013, -1558811, -4626912, -5546630, -3518673, -1484160, -420282, 2339829, 7304320, 10194134, 8131929, 4039443, 1318090, -1321060, -5264755, -6902716, -3168149, 1612582, 1574217, -665630, 2045102, 8682321, 10247197, 3680216, -3077675, -3002707, 547870, 834975, -1869994, -2653633, -781950, -50218, -1781040, -2580071, 477544, 5501534, 7700179, 4789723, 116009, -386085, 4489908, 8310799, 4398767, -4635401, -9074843, -4438354, 2983651, 4874939, 846383, -3404708, -4260918, -2504276, 235178, 3049447, 4424303, 2883039, -579127]
12211e79127k244538J005268L321327L079727J056411q18639j458596j718999
12203A642834k897495m084243k932770L36095K454317J902377R48302J108490
12195a522093N05576j507873j479646K311311N264495K796343k230369m017286
12187A20458k587399j827157j667104O61520L569851K910985j80687p82603J025756
12178A243620O05286k033457j606350K899620O067667N102165L281893K386916
12170A7947360l31770m886360o282354l095856o09225j417472r13556L001568
12162C412335M174839j117321n675741k177009M075231L267643k757008l687966
12154d84997K059554M942364J632n494336l609862L102519O531998L560947k406354
$$ y = [-579127, -2823665, -1818397, 1502930, 4582657, 5639068, 4820429, 3361833, 1642834, -1254661, -5338904, -8271674, -7935579, -5481262, -3578885, -2630583, -1522093, -1016517, -2524390, -4004036, -1692725, 3571770, 6368113, 4137744, 120458, -2466941, -4294098, -5961202, -5299682, -1729831, 1181154, 1000467, 217864, 1243620, 1848906, -184551, -1790901, 1108719, 7176386, 12278551, 15560444, 17947360, 17615590, 12729230, 6446876, 3351020, 2741795, 1324323, 410767, 3412335, 7587174, 6469853, 794112, -1382897, 2692334, 5959977, 3202969, -484997, 1574557, 6516921, 6518553, 1024217, -2585645, 516874, 7048872, 10609819, 8203465]
12145H203465o415479n194274R86657O772618N485805k598933q961540o972549
12137h694230j76564L340934J979102R11472K757507L864698R72282l405013m912000
12128c361812l131052l00028K877015O170271O635327J628055n292187o865385
12120a639796j850829K842937K080807o62915j91021J859700J226876l08295J802671
12111E160135N063113K248818o078280j0177787m932082K749539M405379J119765
12103d41400r99851p14682q75119j844473j897238j418103j215477P18609N278177
12094c409557P752370L527150l622329n663328j824164R36517q86737k793835
12086e983913o44336K827436K964157j96586l535906n309729m922146j582366
$$ y = [8203465, 1787986, -3406288, -2419631, 4352987, 9838792, 7239859, -1721681, -8694230, -8870794, -5529860, -3550758, -2639286, 118221, 3982919, 4955201, 1550188, -3361812, -6492864, -6792892, -3915877, 2254394, 8889721, 10517776, 5225589, -1639796, -3490625, -647688, 1433119, 770204, 579183, 2438883, 3665759, 3357464, 5160135, 10223248, 12472066, 6393786, -3784001, -8716083, -5966544, -1561165, -441400, -1441251, -2155933, -3031052, -4875525, -6772763, -8190866, -9406343, -8687734, -3409557, 4342813, 7869963, 4247634, -1415694, -3239858, -2303341, -3190078, -5983913, -6628249, -3800813, -836656, -1033242, -4569148, -9878877, -14801023, -16383389]
12078a6383389L520820O336420M567054J261456P51723K650795L118021R82145
12070F805045r40305o42492K12648o08813k301062k410176o63816P38396O14068
12061H03493M63767J587969K345195M96822k690601l637770j765333l20183r72984
12052c689625j172092J067613L241829K417685K92877K68521J784135J997782
12044F208725J241403J733105K134206q14259n519611o584202l343467r76695
12036e920795j450601k59520M500926O765533J786874m841781m634934J062601
12028b991697L777996J336980j16781K206597K976492j195703m707854j676639
12020c90609L752251K927348m151777q548535n139887J011473K885323N42034
$$ y = [-16383389, -12862569, -6526149, -1959095, -697639, 54084, 2704879, 5822900, 6805045, 5864740, 5222248, 5434896, 4826083, 2525021, 114845, -548971, 189425, 803493, 1267260, 2855229, 5200424, 5697246, 3006645, -631125, -2396458, -2716641, -3689625, -4861717, -3794104, -552275, 1865410, 2158287, 2426808, 4210943, 6208725, 7450128, 9183233, 11317439, 10503180, 4983569, -1600633, -4944100, -5920795, -7371396, -7630916, -3129990, 3635543, 5422417, 580636, -4054298, -2991697, 786299, 2123279, 2006498, 4213095, 7189587, 5993884, 1286030, -390609, 3361642, 6288990, 2137213, -6411322, -11551209, -10539736, -7654413, -7112379]
12012g112379j400160j156144l27270L88168J506357K040667P88546k67140J800556
12003c738799N315253N406928J619555j022394k18437j02949l522695o094421
11995b357959l148371J793199K057412j509006k239309J276380L568248K130681
11987A571275J116053K978031L551852o55754n942652o791684l631924p39132
11979h543935L67636J096367J887235K214334K565863L015027J813946j449060
11971B967413l598929k116204P37262J548960R76027J340925J572588o16351l425848
11962f14157l112041l04047J035414K20202Q0262J007074M91250j097905k91582
11953b585530K615147K462834k486150o516743m229734J888635N467207M494459
$$ y = [-7112379, -8512539, -9668683, -9995953, -9607785, -8101428, -6060761, -5272215, -5539355, -3738799, 1576454, 6983382, 8602937, 7580543, 7362106, 7259157, 3736462, -2357959, -5506330, -3713131, -1655719, -3164725, -5404034, -4127654, -559406, 1571275, 2687328, 5665359, 9217211, 8561457, 2618805, -4172879, -7804803, -8543935, -8176299, -7079932, -5192697, -2978363, -412500, 2602527, 4416473, 2967413, -631516, -2747720, -2010458, -461498, 514529, 1855454, 3428042, 2811691, -614157, -3726198, -4030245, -2994831, -2774629, -2694367, -1687293, -1196043, -2293948, -2585530, 29617, 2492451, 6301, -6510442, -10740176, -8851541, -3384334, 1110125]
11945A110125J723074m86863j709399j600121k74684M77827m63776r29535J684591
11936d68761N568147N839455J048735m502596n996042l648847j555926k004768
11928e720603k741391m85860L894385N642611K265012k477854k986490Q11124
11920a799066L583650K095113q61199j302938K71976M77749j613503l396928k464797
11911e009943M23120K179428O05255k992912m698035k499188Q76082J624410L62793
11902i128990O63954K671861K864402Q71171R21578L972354M186911k030783q397138
11893c404680o718115N95390L625018l48585l275093Q06286O632665N830927p29560
11884C014253m419629r36408M303662L723282k819148q172745o520311K87092
$$ y = [1110125, 2833199, 2346336, 636937, -963184, -1237868, -760041, -1223817, -2153352, -468761, 5099386, 10938841, 11987576, 7484980, 1488938, -2159909, -3715835, -5720603, -8461994, -8947854, -5053469, 589142, 2854154, 376300, -2610190, -1799066, 1784584, 3879697, 3018498, 1715560, 1987536, 2465285, 851782, -2545146, -5009943, -4586823, -2407395, -1802140, -4795052, -9493087, -11992275, -11116193, -9491783, -9128990, -8465036, -5793175, -2928773, -2057602, -1136024, 2836330, 7023241, 4992458, -3404680, -10122795, -9527405, -5902387, -6250972, -9526065, -8719779, -2087114, 3743813, 3014253, -1405376, -2341784, 1961878, 5685160, 2866012, -5306733, -11827044, -11539952]
11876a1539952N577026N445993J770502j498821k305754m61278L137192N665813
11868E790721L747978j839292n393336l204887J076703J512184j822790l902388
11860d035107k619349o67508m5775L08772R14050M05177j092342j271432M86800
11851g616714K154331K826093L620483M031038J833928j981445k960017q1134
11843A826563J791039o28073l632726k535530Q29837J451829q45295j966540m89699
11834d198595J115193J570363K149912K631523N15189m154466o798268l605551
11826a0774700L118602P255887N845748J862913k09942K5316n95478l106443m142406
11817g20503j210784K472246K283439l44648j37271K644993J838538l590422n516919
$$ y = [-11539952, -5962926, -516933, 1253569, -245252, -2551006, -3012284, 124908, 5790721, 9538699, 7699407, 2306071, -898816, 177887, 1690071, -132719, -4035107, -6654456, -7321964, -7367739, -7058967, -6144917, -5739740, -6832082, -8103514, -7616714, -5462383, -2636290, 984193, 5015231, 6849159, 4867714, 1907697, 1826563, 3617602, 2989529, -643197, -3178727, -2348890, -897061, -1742356, -3708896, -4198595, -3083402, -1513039, 636873, 3268396, 3783585, -370881, -7169149, -10774700, -7656098, -400211, 5445537, 7308450, 7098508, 7123824, 6528346, 3421903, -720503, -1931287, 540959, 2824398, 2479750, 2342479, 4987472, 6826010, 3235588, -2281331]
11808b281331J246023R020831O972648l087398r235575o326736j306345n72257
11800e570140r37912K569363O872157N386775j109148m889116k127692K154996
11792B349283J643497k594049m174587o83667K909461J409933l011634l889751
11784f041514O2986L273245J977492n49060m01809K14830k214198m760288k039475
11775a0477791L806775M869326l61388m204732j411114L475200M102781J408311
11767A207368k68758q79602k331155k526389J094184M516058J504611n550779
11759c234462p155387n38724N695666M180571q75700j425510J892138K396072
11751I34664o32802j134124K737241N029705J681105l247904m666841l655141
$$ y = [-2281331, -1035308, 7985523, 14958171, 11870773, 2635198, -3691538, -4997883, -5570140, -6508052, -3938689, 2933468, 8320243, 7211095, 2321979, 194287, 2349283, 3992780, 1398731, -2775856, -3459523, -550062, 859871, -2151763, -6041514, -5978528, -2705283, -727791, -1276851, -1678660, -1463830, -3678028, -8438316, -10477791, -6671016, -1801690, -2163078, -6367810, -7778924, -4303724, -200943, 1207368, 938610, 59008, -2272147, -4798536, -3704352, 811706, 2316317, -3234462, -10389849, -10928573, -5232907, -1052336, -1928036, -3353546, -1461408, 934664, 301862, -832262, 1904979, 6934684, 8615789, 5367885, 701044, -2954097]
11743b954097k905308o69481M439855P237900K420716n551564p427935k641493
11735h051407R69799M88344J102633M572549N068497M18242k599887J0777J913485
11726C893032j990443n387992j302114M809770L814960j486993j967050J248426
11718A631596m03892o000075n778699J127986M438293P54901p03595M598875P358214
11709G023604L31797q426654p801772m8021M710563L377117R3033k529774l647425
11700f917532q95427M798629O169933l43712o735859m457430J989414K644852
11692c747132j431582j196801L679583M217882j698858n239029j413043L228021
11684c600959K106633j514680j608233J099726K482213K302076K553380K537551
$$ y = [-2954097, -5859405, -6528886, -2089031, 5148869, 7569585, 2018021, -5409914, -8051407, -7081608, -6593264, -5490631, -918082, 4150415, 4568657, 1968770, 1979547, 3893032, 1902589, -3485403, -4787517, 22253, 3837213, 2350220, 383170, 1631596, 1227704, -4772371, -10551070, -9423084, -4984791, -4229890, -4933485, -334610, 7023604, 7355401, -1071253, -8873025, -8921046, -4210483, -833366, -740333, -3270107, -6917532, -7812959, -3014330, 3155603, 2811891, -3923968, -8381398, -6391984, -3747132, -5178714, -6375515, -2695932, 1521950, -176908, -5415937, -6828980, -3600959, -1494326, -3009006, -4617239, -3517513, -1035300, 1266776, 3820156, 6357707]
11676F357707O14967j865307k403624j086862L77902J277000J281075m57454l368005
11667G27399m695404k738797P48098K841048K553966P15073j483237k918495l005350
11658g255699k167754p45797J737580M438024M123868m18291m509162k687848
11650g485079L035239N236309J576726k303683j691885R05207J026299p77846
11642d78713q39321J645617L835350L080791l39782l357222k694317J020190K504292
11633D376885j751057p269632o412918O92974N638689L425237j093453j217194
11625c610469K351885M249611K529634m34151k641078l853429l544401j002824
11617e955222K639363M677688L441942N5357k266971j240031J409199J475552
$$ y = [6357707, 6972674, 5107367, 2703743, 1616881, 1994783, 3271783, 4552858, 4095404, 727399, -3968005, -6706802, -5958704, -3117656, -563690, 151383, -1331854, -4250349, -7255699, -9423453, -10169250, -8431670, -3993646, 130222, -288069, -4797231, -7485079, -4449840, 786469, 2363195, 59512, -1632373, -727166, 299133, -478713, -1318034, 327583, 4162933, 7243724, 6903942, 3546720, 852403, 1872593, 4376885, 2625828, -4643804, -11056722, -10363748, -4725059, -1299822, -2393275, -3610469, -1258584, 2991027, 5520661, 5086510, 2445432, -1407997, -4952398, -5955222, -3315859, 1361829, 4803771, 4859128, 2592157, 1352126, 2761325, 4236877]
11609D236877j558551k747817P11482L703551O05827m717625m191152J064093
11601b893315K257011j993809l000118K746086O687327K211792m280136l958697
11593b223859Q43127K304990L2084r17170j89351j010700k097621L16137M183450
11584A241087L554579k038649o925752p177656l441579K304008P098685O597612
11576A212335O47241l416813P9600N696772M593341j223289k219882K526496L750176
11567A1645977k216415p182254m519333P49053R38808k735751m076718j986449
11559i383082j7594Q22102K618201N219624N346891J366863l898926n886584k986547
11550f799052J638638L376351J708834P36670K770058M280106J553542k539656
$$ y = [4236877, 2678326, -69491, 641991, 4345542, 4951369, 233744, -3957408, -2893315, -636304, -2630113, -5630231, -2884145, 3803182, 6014974, 1734838, -2223859, -1380732, 924258, 956342, 39172, -150179, -1160879, -3258500, -2942363, 1241087, 4795666, 2757017, -4168735, -11346391, -14787970, -12483962, -5385277, 1212335, 1859576, -1557237, -1477637, 4219135, 8812476, 7589187, 5369305, 7895801, 11645977, 9429562, 2247308, -2272025, -1522972, -584164, -3319915, -7396633, -9383082, -9400676, -8578574, -5960373, -740749, 4606142, 5973005, 2074079, -3812505, -6799052, -5160414, -1784063, -75229, 661441, 3431499, 7711605, 9265147, 6725491]
11542F725491k618779L04114L51966l309321m903212j388164L089699M164262
11534B416056K839481J414045p68701l881329m420449N2368N620174N707515p03208
11525H275952p359276p409449p19234N801428N712314O81146j888209M22656J411619
11516D928947l315943p819855m410711L483115N896553J512800j614472j7547
11508a357113J105487p65309q29178K720778L796585r27942n295276l669086J70939
11499e050115O97487q147K092935M272374K029828k036623k414758m9986J52641
11490c14364j768667j864949L9770P40063P0499M96870J710738J528958O65941
11481A304859R74622P67974k177398m784771k323292L310092N513122K608774
$$ y = [6725491, 4106712, 4410826, 4762792, 1453471, -3449741, -4837905, -1748206, 2416056, 5255537, 6669582, 5900881, 2019552, -2400897, -2348529, 3271645, 8979160, 8275952, 916676, -6492773, -7212007, -1410579, 4301735, 4982881, 3094672, 3517328, 4928947, 1613004, -6206851, -10617562, -7134447, -1237894, 274906, -1339566, -1357113, -251626, -1016935, -1846113, 874665, 4671250, 3743308, -1551968, -5221054, -5050115, -4352628, -4360775, -2267840, 2004534, 4034362, 1997739, -417019, -467005, -314364, -2083031, -3947980, -3908210, -3168147, -3097648, -2600778, -890040, 638918, 1304859, 2279481, 3047455, 870057, -3914714, -6238006, -2927914, 2585208, 5193982]
11473E193982p80117j669897j579254j255538Q56276L699455L346476l88318k550581
11464D872484o07204J583714K38889k379171k183776j21458m00819l375502m461784
11455f834627o59710M860607O431227K768544j919116l554675k487031j048096
11447b442877M03869K071833J708496k304256o017180l857211K238550M104606
11439d094170n06678l905653q6545O124929O646773J485408l370584n042364m463660
11430g212544j495087L924771P881778O095726M20050l363523l096538j162846
11422A991787M98392J813090K459474K249918J998127J120574k512702p337349
11414B281311p429187j320712L921539K819785k75982K49766J094718k687123
$$ y = [5193982, 4413865, 2743968, 1164714, -90824, 765452, 4464907, 7811383, 7423065, 4872484, 4265280, 5848994, 6087883, 3708712, 1524936, 1403478, 1002659, -2372843, -6834627, -7494337, -2633730, 3797497, 6566041, 4646925, 1092250, -1394781, -2442877, -2039008, 32825, 1741321, -562935, -6580115, -10437326, -8198776, -4094170, -4600848, -8506501, -8593046, -2468117, 4178656, 5664064, 2293480, -2748884, -7212544, -8707631, -4782860, 3098918, 9194644, 9614694, 6251171, 3154633, 1991787, 2490179, 4303269, 6762743, 9012661, 11010788, 12131362, 9618660, 2281311, -5147876, -6468588, -2547049, 272736, -3246, 246520, 1341238, -1345885]
11406a345885o437141l044936L365681L370689j338418j000730M334121M520199
11398B423580k396844o343036k616843J073868l30405p93923L679670O129739
11390H25806J134966m709600l950161n11133j192861l180772l63741M481168M413923
11381c052405M39523j187951j52662r46514l155303k130872J946855L968352K398870
11372a872107Q47991J340764K007634J345294q2913j616884k300042m82590K618513
11363A805660K022780l645509p491909l159550M813231O617198J131578l404874
11355a311395j937846J871263L300353K621159J580410k33978k823999l892876
11347h26909k078077P92609K253033J681504l47916k590346k731875N57888M550310
$$ y = [-1345885, -7783026, -10827962, -7462281, -4091592, -5430010, -6430740, -2096619, 2423580, 26736, -6316300, -8933143, -7859275, -8189680, -8983603, -5303933, 825806, 1960772, -2748828, -6698989, -7210122, -8402983, -11583755, -11947496, -7466328, -3052405, -2612882, -3800833, -3953495, -4900009, -8055312, -10186184, -8239329, -4270977, -1872107, -1024116, 316648, 2324282, 3669576, 3586663, 1969779, -330263, -812853, 1805660, 3828440, 182931, -7308978, -10468528, -5655297, 961901, 2093479, -1311395, -3249241, -1377978, 1922375, 4543534, 6123944, 5889966, 3065967, -826909, -2904986, -2112377, 140656, 1822160, 1474244, -1116102, -3847977, -3290089, 1260221]
11338A260221M297163j250627o961030o673045R6411P134772P384406N18717n823430
11329a6442m412316K442025N716255J795645l355632l828206j553958p61032n63245
11320d536906J357514K694352Q69504o32488K155859N076674J508445n352201
11312C140753n627158J632293N918371J049522n562238m426604K305859N225350
11304C656148J573224k090279j10624M797245N679219K75008o129518o817029
11296H33394j573597L167192K392851j798014m157325l049389l54102K644062
11288a894928N231152N254593J817151j465118p45394J693923N74000l794268
11280F671111n855009l542602o58559m7289m17502q56892k246210k736954J429565
$$ y = [1260221, 5557384, 4306757, -2654273, -9327318, -9230907, -2096135, 5288271, 5806988, -16442, -4428758, -1986733, 3729522, 5525167, 2169535, -1658671, -3212629, -3973661, -4536906, -3179392, -485040, 384464, -248024, 1907835, 6984509, 8492954, 3140753, -2486405, -854112, 5064259, 6113781, 551543, -3875061, -1569202, 3656148, 5229372, 3139093, 3028469, 7825714, 13504933, 13779941, 7650423, 833394, -740203, 2426989, 4819840, 3021826, -1135499, -4184888, -4538990, -1894928, 3336224, 8590817, 10407968, 8942850, 8197456, 9891379, 10465379, 6671111, 816102, -2726500, -3385059, -3432348, -3849850, -4706742, -6952952, -9689906, -8260341]
11271h260341Q011467Q576357M87123o996300m345449M892237Q792277K700200
11263A3857571o010512q261556l143753L284145N281953K027427k966471n545436
11255a476632m426171j496732R34036K270537L005744L242162K466188L49482
11247D868614k208283k898024l59484K772469J941959k515887m299481j86062
11239b884179M019266K029073k312516p98349N169908O107724j2881m179137r23464
11230F215445L502930K197586k167437m165957m601881n708824m596679N62648
11222h762169M009933P02700m089950k650718K262848K394894j602786j773650
11214i508898K894349N211609K827760J330243K721943J704389l347221n915078
$$ y = [-8260341, -248874, 8327483, 8814606, 1818306, -2527143, 2365094, 11157371, 13857571, 7847059, -414497, -3558250, -274105, 5007848, 7035275, 4068804, -1476632, -5902803, -7399535, -6465499, -4194962, -1189218, 2052944, 4519132, 4868614, 2660331, -237693, -597177, 2175292, 4117251, 1601364, -2698117, -2884179, 1135087, 3164160, 851644, 53295, 5223203, 11330927, 11318046, 7138909, 6215445, 9718375, 11915961, 9748524, 5582567, 980686, -4728138, -9324817, -8762169, -4752236, -4049536, -8139486, -10790204, -8527356, -6132462, -7735248, -9508898, -6614549, -1402940, 1424820, 2755063, 5477006, 7181395, 3834174, -2080904]
11206b080904k422649J379396N24651j101390Q69976K611983n96991m802630l559332
11197i177890J121354K648115J030839J293152L258423K225545j249745j614482
11189d64689J316994J465407k402914l773939J54848K840802o23080m556694j673856
11180g717121M801877O096871J405793j870756N4768L157153L405997J789014
11172A1123596K73198j224395k085720o17056J593249K07018m477438n949762
11164a157310q09656N173814M876032k52624l324949k144338m11701n36478j179577
11155B33213j510196k311970k421641O81300N504721O564005J825603l753111
11147D811924m465852o24569L073599L364823N26306l166794n132857m217623
$$ y = [-2080904, -4503553, -3124157, -2599506, -3700896, -2830920, -218937, -815928, -5618558, -9177890, -8056536, -5408421, -4377582, -3084430, 173993, 2399538, 1149793, -464689, 852305, 2317712, -85202, -3859141, -3704293, -863491, -1486571, -6043265, -7717121, -2915244, 3181627, 4587420, 2716664, 2771432, 5928585, 9334582, 11123596, 11396794, 10172399, 8086679, 7469623, 9062872, 9269890, 4792452, -1157310, -1966966, 3206848, 8082880, 7830256, 4505307, 2360969, 1949268, 1412790, 233213, -1276983, -3588953, -6010594, -5329294, 175427, 6739432, 8565035, 4811924, 346072, -278497, 2795102, 6159925, 6686231, 3519437, -1613420, -5831043]
11139e831043j998973q24297k42004K048018N407042O112232L184495L36388J08553
11130H300411K38243j327288k147118o2022J649054q69280m840472m394553K26359
11121c226666K963012R95545k164268k944602j776869j02085J684439K198304
11113b373190j78141l151146j995512L087453O002257L314993j224105l337421
11105A45188l996548m854478l448324J652639N507064L169737j790355k096116
11097e711193K025344L714503N06174l015912l629344l034099k059128J081548
11089a0122107M798288M090718m68156j513596L058568M877494j718389q864337
11081e861517o345441K231120N049915M63613j855754K530431O794262N310580
$$ y = [-5831043, -7830016, -8654313, -8896317, -6848299, -1441257, 4670975, 7855470, 8191858, 8300411, 8538654, 7211366, 5064248, 5002226, 6651280, 5782000, 941528, -3453025, -3226666, -263654, 731891, -1432377, -4376979, -6153848, -6255933, -4571494, -2373190, -2551331, -5702477, -7697989, -4610536, 1391721, 4706714, 3482609, 145188, -3851360, -8705838, -12154162, -10501523, -4994459, -1824722, -3615077, -5711193, -3685849, 28654, 534828, -2481084, -6110428, -9144527, -11203655, -10122107, -5323819, -1233101, -1701257, -3214853, -156285, 4721209, 3002820, -5861517, -12206958, -9975838, -4925923, -4462310, -6318064, -3787633, 3006629, 8317209]
11073H317209J360339j333372m690449q616249o831376K220909Q544234L966837
11065B938082m074665k971032N155687O450047k761150j0021285n776103L146054
11057g914365N385776J468802j19745K386936K828702j315318m960561m138415
11049f378188j727228j567839j879213J325700O914694R045706M621280k713591
11041G641321o690044m665742Q23831N045844M659700n5195m953460n124185j92007
11032c509937M250439K851083k398956m445758q18960L007674J808200j843944
11024a100159k034286J321136K870908L99306k355764k184756p71982m51676K12943
11015d094330L155249N899385M208529j146711m221206j384411L879251N448131
$$ y = [8317209, 9677548, 8344176, 3653727, -4962522, -11793898, -9572989, -1028755, 2938082, -1136583, -4107615, 1048072, 7498119, 4736969, -5284316, -11060419, -7914365, -2528589, -1059787, -1179532, 1207404, 4036106, 2720788, -2239773, -6378188, -8105416, -9673255, -11552468, -10226768, -3312074, 5733632, 10354912, 7641321, 951277, -3714465, -2890634, 2155210, 6814910, 6759715, 1806255, -3317930, -3509937, 740502, 3591585, 1192629, -3253129, -4072089, -1064415, 743785, -1100159, -3134445, -1813309, 1057599, 1456905, -898859, -3083615, -3855597, -4307273, -4094330, -939081, 4960304, 9168833, 8022122, 3800916, 2416505, 6295756, 11743887]
11007A1743887K103404j788286k603162j648592j863202k868211k280857p34653
10999F0328j456697m202858m024293J321817O524432N459315K13835j829510J125568
10990C191937L109659n8327m532181m491174l18677K952586K866131J380692N50351
10981D650997j10569j578397l027973k729742m70666J667418J280201j400728
10973a719459l199187j756711J024783J313734j004484j826862R53414L634859
10965b579913J656203l519310n831065k615292K035221K933638L33610j265631
10957h852539M78638L212613L909895K831313J841641P32198j856622m448631
10949b151494l191023K551811P909617P829463K824241k417561m408525l018683
$$ y = [11743887, 13847291, 12059005, 9455843, 7807251, 5944049, 3075838, 794981, 60328, -1396369, -5599227, -9623520, -8301703, -1777271, 3682044, 3895879, 2066369, 3191937, 6301596, 6243269, 1711088, -2780086, -3098763, -146177, 2719954, 4100646, 4650997, 4540428, 2962031, -65942, -2795684, -3266350, -1598932, -318731, -1719459, -4918646, -6675357, -5650574, -4336840, -5341324, -7168186, -6214772, -2579913, -923710, -4443020, -10274085, -12889377, -10854156, -7920518, -7586908, -8852539, -8373901, -5161288, -1251393, 1579920, 3421561, 4153759, 2297137, -2151494, -5342517, -2790706, 5118911, 12948374, 15772615, 13355054, 8946529, 5927846]
10941E927846j63098J486435K10041k248648j976634J102705J606427l418214
10933B526860q357764o133916J067887M854822L166851J999112M055794M135516
10925G315162r92591n729877l958410J446674L425648J071183r78885q01624o59420
10916A37860j432900j226271M64793J679424J445954Q24423L61554m53630j245865
10907E55342j089502o06463j063809j784662j224182p0415j54636p21915O05046
10898e555196L090222L110120R8785j678666O25631L768090L005200r27139l000308
10889B536739j099308J616515J986429J148294J659139K649919R84423l299695
10881H182455o042269m566103j436142l81899p12907P39905L281506K478435k519343
$$ y = [5927846, 5764748, 7251183, 7461224, 5212576, 3235942, 4338647, 5945074, 2526860, -5830904, -11964820, -10896933, -6042111, -2875260, -876148, 3179646, 7315162, 6322571, 592694, -3365716, -1919042, 1506606, 2577789, 1598904, 797280, 137860, -1295040, -2521311, -2056518, -377094, 1068860, 1893283, 2254837, 1801207, 555342, -534160, -1140623, -2204432, -3989094, -5213276, -5283691, -5438327, -6160242, -5555196, -2464974, 645146, 743931, -934735, -309104, 3458986, 6464186, 5537047, 2536739, 1437431, 3053946, 5040375, 6188669, 7847808, 10497727, 11482150, 8182455, 2140186, -2425917, -3862059, -4243958, -4956865, -4216960, -935454, 1542981, -976362]
10872i76362o079387l233274L167299N915143K658734j835205k477215K19881
10864b640386K137921J410777K95391J441294L923034M302000J380154j920785
10856A0329400k508296j267855j090577j989172j372333J045526K245528O74930
10848F067151j458911k202683k759309m060675l669258M29059N091925N086625
10840B523924K27500m048474l483779L53850K930006K243517L49192K33491K098252
10831C427479L130707J114896k521364m502713l869745k264345n18703J968002
10823d035786M162924L474511L32377j042698J268333L526188J926713j813908
10815G798654l916434m348871m977870m796858k044148R92381P53547j311599
$$ y = [-976362, -7055749, -10289023, -7121724, -1206581, 1452153, -383052, -2860267, -2640386, -502465, 908312, 1203703, 2644997, 6568031, 10870031, 12250185, 10329400, 7821104, 6553249, 5462672, 3473500, 2101167, 3146693, 5392221, 6067151, 4608240, 2405557, -353752, -4414427, -8083685, -7654626, -2562701, 2523924, 2751424, -1297050, -4780829, -4426979, -1496973, 746544, 1095736, 1329227, 3427479, 6558186, 7673082, 5151718, 649005, -3220740, -5485085, -6003788, -4035786, 127138, 3601649, 3934026, 2891328, 4159661, 7685849, 9612562, 7798654, 3882220, -466651, -5444521, -10241379, -12285527, -11293146, -10539599, -11851198]
10807a1851198q60380J776978K204210K0371k76721K540314M025890J989738K63599
10798a67199J285615J419768j614472k778715K230394P793853N399833k884083
10790A0684994o856855l461566l64598k531786m374735n812O166723O048480L34185
10781E639030l147590j237289J580929J403270m13884j481554j749749j373636
10773g80473J70669J652095J051177k05111J271886M222289L337826j716455m351741
10764D652162j455781R77543k160537n778817k598510M308513N823541J011887
10756D780001k251439l34576J682747K9959j806007m35196J246855k85309k635458
10747h423j542746J868474K592033r12162m346810k677520L585177P596361L159967
$$ y = [-11851198, -12711578, -10934600, -8730390, -8710019, -8986740, -6446426, -2420536, -430798, -167199, 1118416, 2538184, 923712, -1855003, 375391, 8169244, 13569077, 10684994, 3828139, 366573, 1975, -2529811, -6904546, -6910358, -743635, 5304845, 5639030, 2491440, 1254151, 2835080, 4238350, 3824466, 2342912, 593163, -780473, -609804, 1042291, 2093468, 1888357, 3160243, 7382532, 10720358, 9003903, 4652162, 3196381, 4173924, 2013387, -3765430, -6363940, -2055427, 3768114, 4780001, 2528562, 2193986, 3876733, 3906692, 2100685, 1665489, 2912344, 2627035, -8423, -1551169, 317305, 2909338, 1997176, -2349634, -5027154, -1441977, 6154384, 9314351]
10738I314351o446623j0019619k441300O779088N542808l411709o584748l46096
10730g613848M176142j96659n057417p85050P229538P116188q13668n350065j936097
10721c230936J995948J36312l548012k389018K621750M952259K043270j789087
10713G92486j807071Q86529J465586j270618k830814J92070M490959M895884K325239
10704I140250J461158K038933n13474n636655o813259k320328J100152r02689
10696b445912l256090n03425L845159L501678l80826k151457q34717M93026J401862
10687c30702L440802M946272K893860j303738l292856k156711q15807j131139
10679B249981k403052l409630k811522N42425M981368O298111L198417p57681
$$ y = [9314351, 2867728, -7151891, -9593191, -2814103, 2728705, -683004, -7267752, -7613848, -3437706, -3634365, -8691782, -9476832, -2247294, 4868894, 4055226, -1294839, -3230936, -1234988, -1098676, -4646688, -7035706, -4413956, 538303, 2581573, 792486, -1014585, -128056, 1337530, 66912, -2763902, -2571832, 1919127, 6815011, 9140250, 10601408, 12640341, 12126867, 6490212, -323047, -2643375, -1543223, -2445912, -5702002, -6205427, -2360268, 1141410, 760584, -1390873, -2225590, -1732564, -330702, 3110100, 8056372, 10950232, 9646494, 6353638, 4196927, 3381120, 2249981, -153071, -3562701, -6374223, -5831798, -850430, 5447681, 8646098, 7888417]
10671G888417k749804l741688l810719p14614L504821J983597n630597r123131
10663a2393718k155463O776060O754958R36477j46497L736184L943567r73128
10655F478440l421981n05175K130563J180830l6987J60991j121609l816685l151208
10646b102821J668138M566779J561241l437394m531534q60354L949781N483754
10638F297590J488326n088584p238298k322462L160042K474196j319828j260575
10630c809593J439555L28395l962510m562476m25312K573150K264198K021046
10622d133547K171936k33854l055004j168551K655096M82590o023224o012582
10614a5317140K628128Q471550M325166k292931k655661L34620L82313p92619
$$ y = [7888417, 5138613, 1396925, -2413794, -3128408, 376413, 2360010, -3270587, -12393718, -14549181, -7773121, -1018163, -81686, -228183, 3508001, 7451568, 6478440, 3056459, 2551284, 4681847, 5862677, 5825690, 5986681, 4865072, 1048387, -2102821, -434683, 4132096, 5693337, 2255943, -2275591, -3135945, 813836, 6297590, 7785916, 2697332, -4540966, -6863428, -3703386, -1229190, -2549018, -3809593, -2370038, -2041643, -6004153, -10566629, -10991941, -8418791, -6154593, -4133547, -1961611, -2195465, -5250469, -6419020, -3763924, -3281334, -9304558, -15317140, -12689012, -4217462, 107704, -2185227, -4840888, -4506268, -4123955, -4916574]
10606d916574J129777L746521K463787j180699k908902k691427k412505j348847
10598h118869O80623O34818k123452k598816K153777O922957N338615j047778
10590A841875n545921m699722o1956M687770N382827M34591n222638m359310K115741
10581e426743N257591J339994k535276l20284L341632J540045l601493n345063
10573e749597k913215k58061J805673M918205P296799N432486L63649l307140
10565G588799l739243k744249j513113L22782K033982J843864l42434k608877
10557H41511l408118k959292k479493k514637j924972O25768L710347M000129
10549d108757J535138O65068L061122M195191R96287j988855j60807K322661q07897
$$ y = [-4916574, -3786797, -40276, 2423511, 1242812, -1666090, -4357517, -6770022, -8118869, -7438246, -6803428, -8926880, -11525696, -9371919, -2448962, 2889653, 1841875, -3704046, -8403768, -8465724, -3777954, 1604873, 2039464, -3183174, -7542484, -5426743, -169152, 1170842, -1364434, -1684718, 1656914, 3196959, -404534, -5749597, -8662812, -8920873, -7115200, -2196995, 5099804, 10532290, 10895939, 7588799, 3849556, 1105307, -407806, -85024, 1948958, 3792822, 3450388, 841511, -2566607, -5525899, -8005392, -10520029, -12445001, -11819233, -8108886, -4108757, -2573619, -1908551, 1152571, 5347762, 6344049, 4355194, 4194387, 6517048, 5709151]
10540E709151o486139o550527p24803L759740L559460J542796k42083j516490
10532i48895l11267L120852K736165m086811r002279m615189K438612K430560
10524h238252p48039J643732N372484J560874m225559j003899N765129L195553
10516C322023l891555j284707O150145J950924r182625o807016P516745J0744463
10508H518397r91615o620483K76578K239664m796501l298691P404171N228635
10500G960155j0000965r898217R097948J3610829n499655j2662515N417686J0915895
10492H941161j1328804j6849925J0047293J686049q0976182j43805139p3342465
10485c05628012P9419242J47713751P6972524j3802107j8872609K1042062K1538306
$$ y = [5709151, -776988, -7327515, -8052318, -4292578, -733118, 809678, 567595, -948895, -1260162, 1860690, 4596855, 510044, -8492235, -13107424, -10668812, -8238252, -8986291, -7342559, -1970075, -409201, -4634760, -5638659, 126470, 3322023, -569532, -1854239, 4295906, 6246830, -2935795, -9742811, -2226066, 8518397, 7526782, 906299, 1182877, 3422541, -1373960, -4672651, 2731520, 7960155, -2040810, -11939027, -2841079, 10769750, 5270095, -7392420, -1974734, 8941161, -2387643, -19237568, -9190275, -7504226, -88480408, -232285547, -305628012, -226208770, -78495019, -1522495, -15324602, -34197211, -13155149, 8383157]
10478H383157r535186j3989689P981499J2640720l447291p266564N185623Q337876
10470H290145j580930n397582j323714l272149p811795j220411Q938164M641952
10462A263680q142537q834757J591366N280873R80688K007873P125071L768159
10454E040416m481339k904055N622632N119889l328854l872190L516594K733244
10446G446337p807900j1368057k539015M474357J677098j558429J398824L926118
10438d350667J800673R61543L673515L288408j877403m297337j250239Q52108
10430a199399m42997Q6316L081921K357946k240937l235602M71240J423382j748457
10421a446587j210993N025928Q370024M313202o92464j609521k114877m653738
$$ y = [8383157, -1152029, -15141718, -7160219, 5480501, 2033210, -5233354, -47731, 8290145, 6709215, 1311633, -12081, -3284230, -11096025, -12316436, -3378272, 1263680, -6878857, -15713614, -14122248, -8841375, -7860687, -5852814, 1272257, 5040416, 559077, -2344978, 3277654, 8397543, 5068689, 1196499, 4713093, 7446337, -361563, -11729620, -14268635, -9794278, -8117180, -9675609, -8276785, -4350667, -2549994, -1588451, 2085064, 5373472, 3496069, -801268, -2051507, -1199399, -1642396, -1556080, 1525841, 3883787, 1642850, -1592752, -1121512, 301870, -1446587, -2657580, 2368348, 10738372, 15051574, 14359110, 12749589, 10634712, 5980974]
10413E980974m696376n19541J690394j607312m813795k870233Q77730J854599
10405d103560J596425K515555K171618j676940n639044n224342r46391L420469
10397g886210N226477L666665k47897l304961l132011j550895j238902o56541
10389i124275K637653N763289M274881N14675N34486L422584K049714m866711
10381E206296r598693o454817P46410M792698L422936n65119l379957k871187
10373h701433j24706J247948l51879k164239j628537j41515Q32806K914930N908671
10364b207954N312445K49506k421317J094031L636990j005866n703683j311149
10356b356997N988129L283932o942139r470429n16817O932585M276027j353508
$$ y = [5980974, 1284598, 765057, 2455451, 848139, -3965656, -6835889, -5958159, -4103560, -2507135, 8420, 2180038, 503098, -5135946, -10360288, -11306679, -7886210, -2659733, 1006932, 759035, -2545926, -5677937, -7228832, -8467734, -9124275, -6486622, -723333, 3551548, 4066223, 4600709, 8023293, 10073007, 5206296, -4392397, -10847214, -10100804, -5308106, -1885170, -2450289, -5830246, -8701433, -8826139, -7578191, -7930070, -10094309, -11722846, -11864361, -11031555, -8116625, -2207954, 3104491, 3353997, 932680, 2026711, 5663701, 4657835, -1045848, -2356997, 3631132, 6915064, -27075, -9497504, -10014321, -3081736, 1194291, -159217]
10348a59217j471522J436939K008519J127968O18009j608553n052754l951227
10340g051838K953380P809023M757638j314301k875827l75695R22422n03580k414624
10331A906598l330951k752957j81987L058953M177202K794455J075819l62439
10323F384693k264596k943991m34951K194153N94079k431763n96804L886510K088436
10314F475766o159456r474427j896272P378482P340900o8341n325991m703405
10306f432744j327557J877317L663171K686612j77081q95112K053921M493687
10298E942214K754864p73290k080655j673641k236121l447853l094766r88296
10290e597544J231652K245864J342817j022680k238490k55312K635841K717970
$$ y = [-159217, -1630739, -193800, 1814719, 2942687, 3560696, 1952143, -3100611, -7051838, -4098458, 3710565, 8468203, 7153902, 4278075, 3902380, 4824802, 4321222, 1906598, -1424353, -4177310, -4359297, -1300344, 2876858, 5671313, 6747132, 6384693, 4120097, 1176106, 741155, 2935308, 3529387, 1097624, 500820, 4387330, 6475766, 316310, -9158117, -11054389, -3675907, 3664993, 3596652, -1729339, -6432744, -7760301, -5882984, -2219813, 466799, 289718, -605394, 1448527, 5942214, 8697078, 7923788, 5843133, 4169492, 1933371, -1514482, -4609248, -5597544, -4365892, -2120028, -777211, -1799891, -4038381, -4293693, -1657852, 1060118]
10282A060118R41228P92840R50364k662018p402578n421119L181559P933203L008853
10273B382450l828111l130293K688848M708368R15019l041334l091461l83673
10265b780187K198204K304955j163918n923820p070801k933248K331937M225449
10257h811429K823972L21422k320983m011003l043102l72660Q07390N95776K420842
10248a1589775N722076M998188q01839m805585k479303J394215J450669P86381
10240e324973M126731P631714M400763l098009n326727K27791N480234L623956
10232A1741480j985719l603337N44918M971394M290406p09841m727579m582615
10224E939107k447056j596806j279076R92889L596266K164605k952097n695271
$$ y = [1060118, 2001346, 2794186, 3744550, 1082532, -6320046, -11741165, -8559606, -626403, 2382450, -1445661, -4575954, -1887106, 2821262, 3736281, 694947, -2396514, -2780187, -581983, 1722972, 559054, -5364766, -12435567, -15368815, -13036878, -8811429, -5987457, -5666035, -7987018, -11998021, -15041123, -15413783, -14606393, -14010617, -11589775, -5867699, -869511, -1671350, -6476935, -8956238, -7562023, -6111354, -5324973, -1198242, 6433472, 10834235, 7736226, 2409499, 2637290, 8117524, 11741480, 9755761, 6152424, 6697342, 11668736, 15959142, 15249301, 10521722, 5939107, 3492051, 1895245, 616169, 1609058, 5205324, 7369929, 4417832, -1277439]
10216a277439k565034K317934K800383j665044o006946n153877J143176P301914
10208c104933O457860j400106p757250n866755J18125J983560J42026J105336
10200h322137M444079K977206l587080o509748k297924J729792M58813q73187
10192a1980186K655791O461871N031464J439665P66856J171473q36501k658885
10184B051548r34831J104980o30960l127250j700078J304843J009838r79605R8199
10175a803316L226426L626881J144011k84535N47988J668560K028610J143455
10167A1298080k258815o571334o342243p3831N467111M262564l16701j772030
10159C692801l62495j25425r54312q84966j676468m556847m924787O13706O201515
$$ y = [-1277439, -3842473, -1524539, 1275844, -389200, -6396146, -11550023, -10406847, -3104933, 3352927, 1952821, -5804429, -11671184, -11553059, -9569499, -9427473, -8322137, -3878058, -900852, -4487932, -10997680, -13295604, -11565812, -11106999, -11980186, -9324395, -2862524, 2168940, 3608605, 4375461, 5546934, 4710433, 2051548, 1116717, 2221697, 1590737, -1536513, -3236591, -1931748, -921910, -1901515, -1803316, 1423110, 5049991, 6194002, 5909467, 6457455, 8126015, 10154625, 11298080, 9039265, 2467931, -3874312, -3948143, 1518968, 5781532, 5464831, 3692801, 3330306, 3204881, 2250569, 1365603, -310865, -4867712, -9792499, -9178793, -2977278]
10150b977278M419450j711814l466698O8088K597683K085372J841978J949724
10142D806505n16797l529986j973319K618202L322045q07097l462442j971012
10134a513901q04025k608465l760223j279458K495298M465736M522247L193746
10126D710955N62888j588580j330086m73584k059271m385823k982820J798215
10118e748106M760417L299191l26042l537929n040380l123185J822109M533174
10110c360751J016338m033418k999492K877378N437813K494156K195J001420J470704
10101C906343r27987k507071r44145M12766r27009k104610l90117K274440L339018
10092B131628L419421L248803J383199k373404n193127n197847l838612k692377
$$ y = [-2977278, 1442172, -269642, -3736340, -3668252, -1070569, 1014803, 2856781, 4806505, 4289708, 759722, -1213597, 1404605, 4726650, 3919553, 457111, -1513901, -2317926, -4926391, -8686614, -9966072, -7470774, -3005038, 1517209, 4710955, 5273843, 3685263, 2355177, 1881593, -177678, -4563501, -7546321, -5748106, -987689, 2311502, 1985460, -1552469, -6592849, -9716034, -7893925, -3360751, -2344413, -6377831, -9377323, -6499945, -1062132, 1432024, 1434219, 2435639, 3906343, 2978356, 471285, -472860, -60094, -987103, -3091713, -3481830, -1207390, 2131628, 5551049, 8799852, 10183051, 7809647, 2616520, -2581327, -6419939, -9112316]
10084i112316j204560J063641K976264L579276K919252J187080o80442p68223
10076d0028Q93891J427860K0849J33594K953722L568081p79422m269880j863542
10067B045125R41660k388301n936335k65692R161895P960663l585892r312455
10059a379332k083016O160421M648511j020121j942022p84023l313802n673234
10051e386618j547682N215493N970874N99219l621562l089813m29693J204660
10043a085122N87637k031948l802942j442165K643884K035225k981482l866102
10035i943015K634525P799036M175320k581626l311610J83832p3906l984473m159370
10026i261287J359877O297996N614279R11774l413181m473977k162455L48203
$$ y = [-9112316, -10316876, -9253235, -6276971, -2697695, 221557, 1408637, 728195, -40028, 853863, 2281723, 2302572, 2436166, 5389888, 8957969, 8178547, 3908667, 2045125, 2986785, 598484, -5337851, -5603543, 3558352, 11519015, 7933123, -1379332, -3462348, 2698073, 7346584, 6326463, 4384441, 3600418, 286616, -5386618, -6934300, -1718807, 4252067, 4851286, 1229724, -1860089, -2289782, -1085122, -497485, -2529433, -6332375, -7774540, -5130656, -3095431, -6076913, -9943015, -7308490, 490546, 4665866, 2084240, -1227370, -1043538, -1117444, -5101917, -9261287, -7901410, -1603414, 4010865, 4922639, 1509458, -2964519, -5126974, -4778771]
10018d778771p08399l989042l728375J378025N435707M795765L358595L786827
10010E550332J534822n299021q361719j102650Q205803P089941k044629n962888
10002c90009j276671K125962j306487m602040j288624M027746L805152j026676
9994F8353l715393j472413K171705K769441j01518k523897n56043M223244N396116
9985F259595K10814n655780n776492k030206l69940o23360J996932O684258O783049
9976G478870N77666n391311o040017m070709l536674k998948N63357N078077N480705
9967b858984J036533l108671k015345L130505O208068L522032j161767j353427
9959C398944K712523L811826j345531o214544l681240L330383O394898L447140
$$ y = [-4778771, -5487170, -9476212, -13204587, -11826562, -6390855, -1595090, 1763505, 5550332, 7085154, 1786133, -6575586, -7678236, 527567, 7617508, 5572879, -390009, -1666680, 459282, -847205, -5449245, -6737869, -2710123, 1095029, 68353, -3647040, -5119453, -2947748, -178307, -279825, -2803722, -3359765, 863479, 6259595, 6470409, 814629, -4961863, -6992069, -7362009, -7985369, -5988437, 695821, 7478870, 8056536, 2665225, -3374792, -7445501, -10982175, -13981123, -13417766, -8339689, -2858984, -1822451, -4931122, -6946467, -3815962, 2392106, 5914138, 4752371, 3398944, 6111467, 9923293, 8577762, 2363218, -1318022, 2012361, 8407259, 11854399]
9951A1854399n18120k452607l816359m887007l511481j28181J920760J877723
9943C39127K031182K200419n31695n414064p009680k838806K522605L531971L97337
9934d771604k609833k798761p74580J671436L359812L815421K533111r27021m942054
9925e444073n149582N40844O525574M882458k377425l897872M152716J0130472
9917I363112L323718r024097j1520940k571823N341615N072803K172649K295758
9909D452795K803444N5223l939727n758251m937394k087705J512475K072647k371951
9900h198444o257479k877785M211262N304689j09543k543361J830943N723074
9892b916644L628227m86175k179503l281228n358915n501558k651832J38946K269870
$$ y = [11854399, 11336279, 8883672, 5067313, 180306, -3331175, -3459356, -1538596, 339127, 2370309, 4570728, 4039033, -1375031, -8384711, -11223517, -8700912, -5168941, -4771604, -7381437, -10180198, -10954778, -9283342, -5923530, -2108109, 425002, -502019, -5444073, -10593655, -10052811, -3527237, 1355221, -1022204, -4920076, -767360, 9363112, 12686830, 3662733, -7858207, -10430030, -5088415, -15612, 2157037, 4452795, 7256239, 7311462, 3371735, -2386516, -7323910, -9411615, -7899140, -5826493, -8198444, -14455923, -17333708, -13122446, -7817757, -7927300, -10470661, -8639718, -2916644, 711583, 225408, -1954095, -5235323, -10594238, -16095796, -18747628, -18608682, -16338812]
9883a6338812N321151N475262j782646q768995l367793P762811M054047j3446968
9875b1091943j4804254J4717421M4821916L8076047K394224k1663169j7074455
9868B5375787m527574k706643m456000Q33585O547605L178552m267203n968871
9860A4009238k499410q5621j57403j695877n300416q344992m936052L430908O629503
9851A049878J281367k809490J383218O275777K832469m083681m437439M72154
9843A964253K050884l66616m05562K230302J294084l810031n737866p11170N605442
9834B113720O029171L06892n918163o906299j404219N501995O246124l27157o183999
9825e41935m185244K006123L608788j92192j892312K217833O812867N929342P30438
$$ y = [-16338812, -11017661, -5542399, -7325045, -16094040, -19461833, -11699022, -7644975, -21091943, -35896197, -21178776, 23643140, 61719187, 64113411, 42450242, 25375787, 20848213, 18141570, 13685570, 14519155, 21066760, 24245312, 19978109, 14009238, 11509828, 11424207, 11266804, 9570927, 4270511, -4074481, -9010533, -5579625, 1049878, 2331245, -478245, 904973, 7180750, 10013219, 5929538, 1492099, 1964253, 4015137, 3648521, 3242959, 5473261, 6767345, 2957314, -2780552, -3491722, 2113720, 8142891, 8449783, 2531620, -4374679, -5778898, -276903, 5969221, 5642064, -541935, -4727179, -2721056, 887732, 695540, -1196772, 1021061, 7833928, 13763270, 14493708]
9816A4493708l673119m883488l861288j699024J391002M629146N802208K621452
9808A4820597m029411q547504n440328K901720P069093K272236m729232m803626
9800d86455R55664L888517P65209l000388k777027l34287J199299J801925J845524
9791C857981J65801k629465l337181j166046L95960p58639j681804O30272L908649
9782f14472L859289N42286j929441r80656J805768L197111J742344j038986k254398
9773D328845r60012M74623l00475j877812j306869Q08388J217421j41416J46984
9764B389677K496355K537650j899642o484078o151403j598491K962624N081098
9756f66210M100275k57041n525923o298242q97877M726006M489281O41016o14629
$$ y = [14493708, 10820589, 5937101, 2075813, 376789, 1767791, 6396937, 12199145, 14820597, 10791186, 2243682, -3196646, -294926, 6774167, 9046403, 4317171, -486455, 469209, 4357726, 5122935, 2122547, -654480, -988767, 210532, 2012457, 3857981, 4023782, 1394317, -1942864, -3108910, -2712950, -3471589, -5153393, -4523121, -614472, 3244817, 3787103, 1857662, 877006, 2682774, 5879885, 7622229, 6583243, 4328845, 3368833, 3843456, 3542981, 1665169, 358300, 1166688, 2384109, 2242693, 2389677, 4886032, 7423682, 5524040, -960038, -7111441, -8709932, -5747308, -666210, 3434065, 3177024, -2348899, -8647141, -9545018, -4819012, -329731, 311285, -303344]
9747c03344Q70641L48556k269789j914582K020182L372252p63501m498681k002886
9738e141152L297211L818788r80228m176492j285084M188556N894187K216344
9730G832130k696757m017706j130879K417196L287709J781829K74878n12100j549895
9721E686405k425864j319926J320342K181095k39845k954848k532283L02604K312705
9712B330385K160880Q49091o26946j592265j117426K89585p6040l141433m802856
9703e727025o91734O404979Q630651L475221k460724k356970K115598M320317
9695A3710313J871977j949827m304928n447913n285472k127878L175555N640704
9687E282531K033271l682769m478851O25358N087100L315575k376752n305598
$$ y = [-303344, 567297, 915853, -1353936, -3268518, -1248336, 2123916, 1360415, -3138266, -5141152, -1843941, 1974847, 994619, -3181873, -4466957, -278401, 5615786, 7832130, 5135373, 1117667, -13212, 2403984, 5691693, 7473522, 7748400, 7236300, 5686405, 3260541, 1940615, 3260957, 5442052, 5202207, 2247359, -284924, 17680, 2330385, 4491265, 5340356, 4713410, 3121145, 2003719, 2293304, 2217264, -924169, -5727025, -6418759, -13780, 8616871, 12092092, 9631368, 7274398, 9389996, 13710313, 15582290, 13632463, 9327535, 3879622, -1405850, -3533728, -358173, 5282531, 7315802, 3633033, -845818, -220460, 4866640, 8182215, 5805463, 499865]
9679D99865k831373J573504L784519L270101J335680j616577m870808n759945
9671d615034k630232J357806J132274k955989m396532P57973P515115P810364
9663C975745J076258n139719m918671l40003K871502K443871K18107j553385j887118
9654c253413o38292J167786J528317j34754j812704j803308j239860j581175j236974
9645i004377K218457P309809R442027O525330J211084k571694l057083r94135
9637A1079418Q86152o80491n543754q305670m327891K734956M342385j156696
9629i71591n702611k991777K650718L308269q03787k607237P33152M123573K546308
9620B85017k114377m412011k593422J80252R67748Q84288K553577N000544M108688
$$ y = [499865, -2331508, -758004, 3026515, 6296616, 7632296, 6015719, 1144911, -4615034, -7245266, -5887460, -4755186, -7711175, -12107707, -11349734, -3834619, 3975745, 5052003, -87716, -5006387, -5346390, -2474888, -31017, 187090, -1366295, -3253413, -3891705, -2723919, -1195602, -1330356, -3143060, -4946368, -6186228, -7767403, -9004377, -6785920, 523889, 9965916, 16491246, 17702330, 15130636, 12073553, 11079418, 11965570, 11285079, 5741325, -2564345, -6892236, -4157280, 185105, -971591, -6674202, -9665979, -7015261, -3706992, -4510779, -7118016, -6384864, -2261291, 285017, -1829360, -6241371, -8834793, -8654541, -7686793, -6802505, -4248928, 751616, 4860304]
9611D860304p35127l940110j197193L211922K168566k920021l833416J240544
9603a144531M629127J725985k031907j232290Q05467k84389j250365J740343M143119
9594G100559M78799m841567m448647j117163k510792o433335m171644L180019
9586a2763771N428194O91370j721983J904547L835455k2006k622648M75175K464699
9577b330968j799194n629599k309770K983099K891140N63023K124031M467600
9569I59362J891227j890779k70525L378117J663329k663094j456597L380196K831947
9560G823183k735734m048603J68853R05804m452886o824534j070797N332046M993844
9551I1176J329819J45569K8620j585325j161422L725630O618294Q42052q397973
$$ y = [4860304, 4125177, 185067, -1012126, 2199796, 4368362, 1448341, -2385075, -1144531, 3484596, 5210581, 3178674, 1946384, 2751851, 2467462, 1217097, 2957440, 7100559, 7579358, 2737791, -1710856, -2828019, -5338811, -11772146, -15943790, -12763771, -7335577, -6644207, -8366190, -6461643, -2626188, -2648194, -5270842, -4795667, -2330968, -4130162, -9759761, -12069531, -9086432, -6195292, -5632269, -3508238, 959362, 2850589, 959810, 689285, 4067402, 5730731, 3067637, 1611040, 4991236, 7823183, 5087449, 1038846, 1207699, 2113503, -2339383, -9163917, -10234714, -4902668, 91176, 1420995, 1566564, 1595184, 9859, -1151563, 2574067, 9192361, 10034413, 1636440]
9542A636440r809756j967529M915682L320817k487808l766574J073165N403495
9534a682068L372537k772813n579277j878559L273579L773653O26483r49568k56519
9525b072552j114479l698564l096400K317060P032946N892252Q67254k591159
9517C536358k320755j480J883862J591063o17080j777894O0863J693680r57203
9508C091414m893842l175460L272103N193921q46691o340797l733649K381368
9500e051633L520149J57139j367300J83375J117201O17865P59288R85362n77277
9491C44169k157213r20790J396490J417252N03680J899849L604735J069245m289585
9482B867832o368661l756752j082308q47625l99896K057152M197749L729708J324712
$$ y = [1636440, -8173316, -10140845, -5225163, -1904346, -4392154, -8158728, -7085563, -1682068, 1690469, -1082344, -6661621, -8540180, -5266601, -1492948, -866465, -1816033, -2072552, -3187031, -6885595, -9981995, -7664935, -631989, 5260263, 6127517, 3536358, 1215603, 1214123, 3097985, 4689048, 4071968, 2294074, 2354937, 4048617, 3091414, -1802428, -4977888, -1705785, 3488136, 2641445, -3699352, -7433001, -5051633, -1531484, -1374345, -2741645, -2558270, -1441069, -823204, -63916, 921446, 344169, -1813044, -2733834, -1337344, 79908, 583588, 2483437, 6088172, 7157417, 2867832, -3500829, -7257581, -8339889, -9187514, -9587410, -7530258, -3332509, 397199, 1721911]
9473A721911j494506l586523l265228j6913L186921L105482R16357j62451k53286
9464A51764j177447j442842J429406N101944N031727J679123j008341k719640
9456G045694n430440o597203k074640M780477N977971J390372q60765K164483
9448F395949M071107R11504k627586k641559k286359l831570l272952J371833
9440a909633M465379J796632k011913j600114M92224j6566j022276O94006K234487
9431C122226J93035k161812r04175R28372m71321j679688J214923L723614M71785
9422D436959l869530j983641K561060J231724l726438k728751L919502O071686
9414E912571J011180k972636j710876m86936j685370m32359L562701K970653l168226
$$ y = [1721911, 227405, -3359118, -6624346, -6641259, -3454338, -348856, 567501, 405050, 151764, -1025683, -2468525, -1039119, 4062825, 9094552, 10773675, 9765334, 7045694, 1615254, -4981949, -7056589, -2276112, 3701859, 5092231, 4231466, 6395949, 10467056, 11378560, 8750974, 6109415, 3823056, -8514, -3281466, -1909633, 2555746, 4352378, 2340465, 740351, 1232575, 1216009, 193733, 887739, 3122226, 3315261, 1153449, 249274, 1177646, 706325, -973363, 241560, 3965174, 4436959, 567429, -1416212, 1144848, 2376572, -1349866, -4078617, -159115, 5912571, 6923751, 3951115, 2240239, 1753303, 67933, -364426, 3198275, 6168928, 3000702]
9405C000702n310701K77716L866394r65921n424915p24136O215817M874037n35772
9396E273221Q22343O812112O189374j709742o262663l447201m13447j528794k789309
9387B945894k076208l008184n587740m024171K337994O017448L526112R17180
9379A048325K496585L484482j16197l265767q85428K526088O07928l666277l375044
9370a145305M44186J460040n71993l77272K520225L059205N1085k007569j379317
9361B053285j600854l826048l919940l8625L289755K371899K59405J105355K967643
9352B661875J312131l106482n074218k534711J089148K181641R98848j61432j93521
9343b826721M17255Q13547N28149j61376l56139L80087J218177J086451J92831
$$ y = [3000702, -2309999, -2032283, 1834111, 868190, -4556725, -5280861, 934956, 5808993, 5273221, 6095564, 12907676, 19097050, 17387308, 11124645, 7677444, 7263997, 5735203, 2945894, 869686, -2138498, -7726238, -11750409, -9412415, -3394967, 131145, 1048325, 3544910, 7029392, 6913195, 3647428, 2762000, 5288088, 5896016, 2229739, -1145305, -701119, 758921, 186928, -190344, 2329881, 5389086, 5440171, 3432602, 2053285, 452431, -3373617, -7293557, -7332182, -4042427, -1670528, -1411123, -305768, 2661875, 3974006, 867524, -4206694, -6741405, -5652257, -3470616, -2471768, -2633200, -2826721, -2409466, -1595919, -1067770, -1229146, -1585285, -1205198, 12979, 1099430, 1292261]
9334A292261m05760m88790p54772j165269m90063J810923M128660M231476K067488
9325A0226154r2800p27574j127003l091861n315208m401922r6326L057927J412859
9316a55754k255569k109083K491588N777601L450891j640698l736903j471995
9308C50078J760098L058250K576577J490364L25426m27897l33311j85799j322667
9299G291119l207131l502777j428578O03736O6841k045437k281345P97970M555922
9290H50320N171960K011518j568591k032097J12224Q74518k017465n719664n589411
9281g906688j246666K852333L160113J066545M7997Q79333J717188J584929J261950
9272C417034J108434L45908j271673k887900l775452l409979n91510M862975R235803
$$ y = [1292261, 886501, 397711, -357061, -1522330, -2012393, -201470, 3927190, 8158666, 10226154, 10133354, 9405780, 8278777, 5186916, -128292, -4530214, -4626540, -1568613, -155754, -2411323, -4520406, -2028818, 3748783, 7199674, 5558976, 1822073, 350078, 2110176, 5168426, 7745003, 9235367, 9560793, 9132896, 8799585, 8613786, 7291119, 4083988, 581211, -847367, -243631, -176790, -2222227, -4503572, -3705602, 850320, 6022280, 8033798, 6465207, 4433110, 4545334, 5419852, 3402387, -2317277, -7906688, -9153354, -6301021, -3140908, -2074363, -2026366, -1147033, 570155, 2155084, 3417034, 4525468, 4871376, 3599703, 711803, -3063649, -6473628, -7065138, -2202163, 7033640]
9263G033640P165204j309772q851383q753445k649320K657926L880753K794157
9255A967760Q64888k214233m622115k863151K031334L989215N44790k730764m39442
9246c471718M161920M076003r85028m843544l932943m85630K445343L607481J807537
9237B379421k578214m595170K61055P512383P460597q16220p041624m591696L64792
9228a644676K0155k481723L36303O691549Q091594K693531l004602m725343m222850
9219A753938k793588P28234M571506M298634K37155k053178m14510J280295O98638
9210H307124L63552J304013N05647k450949l257929p47942L02733j806180j599415
9201I20654L331088N825126J88554p084680o383752M38541L946207J738945o07352
$$ y = [7033640, 14198844, 12889072, 4037689, -4715756, -7365076, -4707150, -826397, 1967760, 2832648, 618415, -4003700, -6866851, -4835517, -846302, -301512, -3032276, -3471718, 690202, 4766205, 3781177, -1062367, -4995310, -5480940, -3035597, 571884, 2379421, -198793, -4793963, -4532908, 2979475, 10440072, 9623852, 2582228, -2009468, -1644676, -1624521, -4106244, -3769941, 2921608, 11013202, 13706733, 10702131, 5976788, 1753938, -1039650, -311416, 4260090, 8558724, 8795879, 6742701, 6328191, 7608486, 8307124, 8670676, 9974689, 10480336, 8029387, 4771458, 4023516, 4326249, 2520069, 920654, 4251742, 10076868, 10265422, 3180742, -3203010, -2764469, 1181738, 2920683, 2313331]
9192B313331o99419j346228k431153o31333K453335J224613l683528m933613j56914
9183g890909M219858L319080K05352r52448p90236o76358L42224J379426o03791
9174a447802l861757k140329M365052O542838J41345o124784l293049M217053
9166a601433O146037J813707j379999q71608o24803j956354j828388K48278J457254
9157A402691J516561K269066K218404j219985m771345k677046K940185L675363
9149E353894j918006n424767j706057L424125L097733l11226o04006K003466K477576
9140F392732n07234l457949l734937j819190Q39390K766417K512693M91975p53754
9131B730143k90601m95159k642702l748528j201287K157860J851994j200530k120240
$$ y = [2313331, 1613912, 267684, -2163469, -2794802, -341467, 883146, -2800382, -7733995, -7890909, -3671051, -351971, -146619, -1099067, -1889303, -2565661, -2223437, -844011, -1447802, -5309559, -7449888, -3084836, 3458002, 3599347, -2525437, -5818486, -1601433, 4544604, 6358311, 4978312, 4106704, 3481901, 1525547, -302841, -54563, 1402691, 2919252, 5188318, 7406722, 6186737, 1415392, -1261654, 1678531, 5353894, 3435888, -1988879, -3694936, -270811, 2826922, 2515696, 1911690, 3915156, 6392732, 5885498, 2427549, -1307388, -3126578, -2287188, 479229, 2991922, 3483897, 2730143, 2439542, 1944383, -698319, -4446847, -5648134, -3490274, -1638280, -2838810, -4959050]
9122d959050L60454K428386J393993r45478k035484j901287j330493N8437K001899
9113d928623K398893K22281k136122j784828N17970J498266J08094j283310o14722
9104f002101J221605K325999K444009K253645J543603j6242j342751j292033p81870
9095C53864j189458j330485P93934L351509J806325m020330p987680n314751R47106
9086a2589966M208492K606510k88585j020900Q06225L633018N106125L616407
9078F077326R18768Q31142L031537J904983m832409j0694952q869413k099935
9070a3732953K246304L184217M444964N241069K200638j617395l25027L012021
9062D653838n1972p426370p302178K199155Q135227L260652k490343K31155M265963
$$ y = [-4959050, -4598596, -2170210, -776217, -1721695, -3757179, -5658466, -6988959, -6930522, -4928623, -2529730, -2307449, -4443571, -6228399, -5710429, -4212163, -4104069, -5387379, -6002101, -4780496, -2454497, -10488, 2243157, 3786760, 3770518, 2427767, 1135734, 353864, -835594, -2166079, -1372145, 1979364, 3785689, -234641, -8222321, -13537072, -12589966, -8381474, -5774964, -6063549, -7084449, -6278224, -2645206, 2460919, 6077326, 6996094, 7827236, 10858773, 12763756, 7931347, -2763605, -11633018, -13732953, -11486649, -8302432, -3857468, 1383601, 3584239, 1966844, 1641817, 4653838, 4601866, -2824504, -10126682, -7927527, 207700, 3468352, 978009, 1209164, 5475127]
9053E475127o5424o412513l066809N688445N727036l329099p509411j210953N145442
9044D41841K850185l233724n037619k493879O32615L204844M334145K033420j847232
9035H84596k147551J192308K342637l38433j539610O51222O12795l979558o145277
9026h466871q43166N651857N216539K37095j666012N0689N49695l64257Q91485
9017A257054L064952J445082k717225k797352K143792M700613K24752n760342
9009A561326n301984R80454N188770K733704k437275l769149n84133J724676l83968
9000b87579l510282k386995K224224M805554L384092J485387J275002M16150k143005
8991E262548k914403Q694K550832Q67553k214395j902705R77278K336187J688698
$$ y = [5475127, 5409703, -1002810, -4069619, 1618826, 7345862, 4016763, -3492648, -4703601, 441841, 3292026, 58302, -4979317, -7473196, -6840581, -3635737, 698408, 2731828, 884596, -1262955, -70647, 2271990, 1933557, 393947, 1045169, 1657964, -2321594, -8466871, -9310037, -3658180, 1558359, 1795454, 129442, 180131, 729826, 365569, 1257054, 4322006, 5767088, 3049863, 252511, 2396303, 7096916, 7321668, 1561326, -3740658, -2760204, 2428566, 5162270, 2724995, -1044154, -1628287, 96389, -287579, -3797861, -6184856, -3960632, 844922, 4229014, 5714401, 6989403, 7405553, 5262548, 2348145, 2356839, 4907671, 5775224, 3560829, 1658124, 2635402, 4971589, 6660287]
8982F660287J180369L72093k256867m681192l949268j616888q73341l13802L008326
8973b470283O283639M293355r39557k179738J112092J764932k458270m393491
8965A012679L84535N366829L084476l217672m924146p42700L011825K427584r5973
8956F307437j050642J50415K126695K921486R87750k546912l975913j894330J81380
8947C207366r55636l026080k218603K60570M91177j182805j039737J037352J320700
8938b105696p92084j353852J236164L219946J630620j087385j442508j42274J91218
8929f45851l89003j81324O39272P24905M15272J039797K238581K439719J449168
8920G730536M56930k53570j817022m771580p382016o359441l0444Q200474J0983551
$$ y = [6660287, 7840656, 8212749, 5955882, 1274690, -2674578, -4291466, -5164807, -5478609, -2470283, 3813356, 8106711, 7167154, 4987416, 6099508, 7864440, 5406170, 1012679, 1397214, 6764043, 9848519, 6630847, 1706701, 964001, 3975826, 6403410, 6307437, 5256795, 5407210, 7533905, 10455391, 11443141, 8896229, 4920316, 3025986, 3207366, 2251730, -774350, -2992953, -2732383, -2241206, -3424011, -4463748, -3426396, -2105696, -2897780, -4251632, -3015468, 204478, 1835098, 747713, -694795, -837069, -645851, -1034854, -1216178, -576906, 147999, 563271, 1603068, 3841649, 6281368, 7730536, 8187466, 7933896, 6116874, 1345294, -6036722, -12396163, -12426607, -4226133, 6757418]
8911F757418M655268m821152p700526k635377K068001Q28980j944608p40471J639618
8902a892849L12009j528695K018004P143160M200447o010631j0989169m548935
8894a1296659M157831M798085q1313k144423n97729L28970J291466N185631Q247212
8885I889071M313789l507845n878585k075696j088418n680429o480364K330595
8877h177882J1148696P882014l468240p952887j210137N125780J494447n891802
8869a050011n502170J898139N020770l53184n039312p81149O908995P144748J61883
8860H408709l787616q58367J337880k293952n374809j389044M402014L425229
8852C870044j839048k607350Q54628N19155m056889m397935J221734L381232k613994
$$ y = [6757418, 11412686, 6591534, -1108992, -3744369, -1676368, -847388, -2791996, -3532467, -1892849, -1580840, -3109535, -1091531, 6051629, 10252076, 4241445, -6747724, -11296659, -7138828, -2340743, -2422056, -4566479, -5164208, -4835238, -3543772, 1641859, 9889071, 14202860, 10695015, 4816430, 2740734, 1652316, -4028113, -10508477, -8177882, 2970814, 10852828, 7384588, -568299, -1778436, 3347344, 4841791, -1050011, -6552181, -4654042, 366728, 13544, -5025768, -5806917, 1102078, 8246826, 8408709, 4621093, 3762726, 5100606, 2806654, -2568155, -3957199, 444815, 3870044, 2030996, -576354, 278274, 797429, -3259460, -7657395, -6435661, -3054429, -5668423]
8843e668423p879168l878324M365807P227714M800621L180232K748590O6521k938395
8834B025175j718202J557288Q51196l099660l920120m56361K203439K212031K711415
8825B366201L668972Q46359n309703p970533l842028K255534N244460N427591
8817B686853L895360k97497n043026m702904Q64115L802190l0641l746462l54422
8808b926434N331572M035587l270545p290806m710342j290598j071997j329215
8800a2522778L34873J716644J425438J928334M009048L977692J32069l062212
8792b060892j569302J671935J594789j045327j901613o95344p30637j997310r71426
8783g705127K441808L807330J632015L27885K761807M809425J733613l643816
$$ y = [-5668423, -13547591, -17425915, -13060108, -5832394, -1031773, 2148459, 4897049, 4963570, 2025175, 306973, 1864261, 2715457, -384203, -4304323, -4760684, -2557245, -345214, 2366201, 6035173, 6881532, 1571829, -6398704, -10240732, -7985198, -2740738, 2686853, 6582213, 6284716, 1241690, -3461214, -2597099, 1205091, 1174450, -2572012, -2926434, 2405138, 6440725, 3170180, -4120626, -8830968, -10121566, -11193563, -12522778, -12187905, -10471261, -9045823, -7117489, -3108441, 869251, 1001320, -2060892, -3630194, -1958259, -363470, -1408797, -3310410, -4005754, -4736391, -6733701, -7705127, -5263319, -1455989, 176026, 503911, 3265718, 8075143, 9808756, 6164940]
8775F164940m514250j2463L794975K577648j348887l424491k169676R21379L491876
8766E481051L348581L13726k396465j778667m5035j712604n385933m394686K290541
8757d279491O504027K775383k511860q09788M583352L360829n009910r495966
8749d883424l930568M002715M470115r72835l478565p309M144898M161559J417225
8740D923811n8971Q43932J606239m60177m693251p062986m494297R05142L807394
8731d683164K224829l27763k44789J398405J583302M14662K81065J146894J97881
8722A991322l324256n683497k884672L639557P595368M829143j497483m533072
8714A32410k076626J489987K259729J996239L531154M662260J636405l454929
$$ y = [6164940, 1650690, 1638227, 5433202, 8010850, 6661963, 3237472, 1067796, 1989175, 5481051, 8829632, 9143358, 6746893, 4968226, 4923191, 3210587, -2175346, -6570032, -4279491, 2224536, 4999919, 2488059, 1678271, 6261623, 9622452, 4612542, -4883424, -8813992, -4811277, -341162, -1313997, -4792562, -4799871, -654973, 3506586, 4923811, 4864840, 5708772, 7315011, 6854834, 2161583, -4901403, -9395700, -8490558, -4683164, -2458335, -2786098, -3030887, -1632482, -49180, 365482, 646547, 1793441, 1991322, -1332934, -7016431, -9901103, -6261546, 1333822, 6162965, 4665482, 132410, -1944216, -454229, 1805500, 3801739, 7332893, 11995153, 13631558, 10176629]
8706A0176629m816846j944549k42303k072073l545931j895087K85453P01676J037008
8697b316023J714198n28034n380445n849699J443767Q608095O632345j321281
8689C002923n059956k277987Q17988J450241K666382M287375K071825k456278
8681D502513j725917M796644P085428l76157q805484p784840n69101K180208r95671
8672a692377k023167K369511N772174K695803l677725o947412n248959j068601
8664i820753K479987K990973l75l033740j283153M710753Q047369L981311l241049
8655D831323n567818j551681K440241J431346j644067p29086M359683P160466
8647A0730407L145481l831341o109433j983806K515057K176420o82606o85002
$$ y = [10176629, 5359783, 3415234, 3172931, 1100858, -2445073, -4340160, -4054707, -3353031, -2316023, -601825, -1129859, -6510304, -12360003, -10916236, -2308141, 4324204, 3002923, -2057033, -4335020, -3517032, -2066791, 599591, 4886966, 6958791, 4502513, 2776596, 7573240, 14658668, 14282511, 5477027, -2307813, -2876914, -696706, -1692377, -3715544, -1346033, 4426141, 7121944, 3444219, -3503193, -8752152, -9820753, -7340766, -4349793, -4350168, -7383908, -8667061, -3956308, 4091061, 8072372, 4831323, -736495, -2288176, 152065, 1583411, -60656, -789742, 3569941, 10730407, 13875888, 10044547, 3935114, 1951308, 4466365, 6642785, 5960179, 5275177]
8639E275177K208905L107795J57978k716778k288429j054930k936508o666749
8631d913539p067066k009051M866132Q347012O485144J388618k806582k783066
8623A507602J083310M361780K943457j818931m371715k077907J277984P96378
8615C701958k764116m282305j480898K230885K576014m87470l693143m579306
8607h778381l071847k77475K435513L684475L000990J470412N28225N35074J314087
8598H41073K964396M592711L502113j654155p301088p719012k133629L847589
8590c060002N069243K240783j043059l352133m608601l259225J345468N312879
8582a354647L793873j910619n290200l230015O23625K127411J693087J024581
$$ y = [5275177, 7484082, 10591877, 10749855, 8033077, 5744648, 4689718, 1753210, -4913539, -11980605, -13989656, -9123524, -776512, 5708632, 7097250, 4290668, 1507602, 2590912, 6952692, 9896149, 8077218, 3705503, 1627596, 2905580, 3701958, 937842, -3344463, -4825361, -2594476, -18462, -505932, -4199075, -8778381, -11850228, -12127703, -9692190, -6007715, -3006725, -1536313, -1008088, -473014, 841073, 3805469, 8398180, 11900293, 10246138, 2945050, -4773962, -6907591, -3060002, 2009241, 4250024, 3206965, -145168, -4753769, -8012994, -6667526, -1354647, 2439226, 528607, -4761593, -7991608, -7367983, -5240572, -3547485, -2522904]
8574b522904o37337l530191m307788m23036M774079N948406L355465J758492K466358
8565F881544J667972k486019o075820n051102j022773J575043J635340J425568
8557a450247J862997J211041j298476l298314k215443Q98022K232768P4858k621746
8548d604540j777918K352671N263969M063391R49893n03642j95580j87476n22968
8539D837800J33179O92449j380078n012950n507447r80026M500064O030673L399882
8530F713546l07954k933814l835003k577799L22031K791744L417125K908532J864474
8521H362882o69636m264721n369676j891433K436196K328053j445075l095423
8513c608833l42632K698486K308934N34193J184333L621071L975471J080619k079180
$$ y = [-2522904, -3160241, -6690432, -10998220, -11421256, -6647177, -698771, 2656694, 4415186, 6881544, 8549516, 6063497, -12323, -5063425, -6086198, -4511155, -2875815, -1450247, 412750, 1623791, 325315, -2972999, -5188442, -4290420, -2057652, -1982794, -4604540, -6382458, -4029787, 1234182, 5297573, 6247466, 5743824, 5548244, 5360768, 4837800, 4970979, 5663428, 4283350, -729600, -6237047, -7217073, -2717009, 3313664, 6713546, 6405592, 3471778, -363225, -2941024, -2618993, 172751, 3589876, 6498408, 8362882, 7693246, 3428525, -1941151, -3832584, -1396388, 931665, -513410, -3608833, -3951465, -1252979, 1055955, 1590148, 2774481, 6395552, 10371023, 11451642, 9372462]
8504I372462k639286j009849O58014J148885M14117j395265l683535m780682l077681
8495d992820Q59905M263025M821472K833332L23899j184321j367326n21639M72033
8486E507560K24185j661070l439186k979895m25901K253636L808091M034511K333613
8477I655544j386035m611856m269003j342412o4058j503938j771430J492365M776546
8468I75723M011591Q56683l75999M71395L73063p21455L8445K413397K391417
8459A0434260j321579m663739m198812k020895j839960l003452k005256J485850
8451g133583L882040L056018J204906J098010K033611J736655N36611N02866R40519
8442G857653j384034o286288q216639l292877M404990P411494M114255n51745
$$ y = [9372462, 6733176, 5723327, 6381341, 7530226, 7944343, 6549078, 2865543, -1915139, -4992820, -4132915, 130110, 4951582, 7784914, 8108813, 6924492, 5557166, 5035527, 5507560, 5731745, 4070675, 631489, -2348406, -2774307, -520671, 3287420, 7321931, 9655544, 8269509, 3657653, -611350, -1953762, -2017820, -3521758, -5293188, -3800823, 975723, 4987314, 5843997, 5467998, 5939393, 6312456, 5591001, 5629446, 8042843, 10434260, 9112681, 4448942, 250130, -1770765, -3610725, -6614177, -8619433, -7133583, -3251543, -195525, 1009381, 2107391, 4141002, 5877657, 6414268, 6917134, 7857653, 6473619, 187331, -8029308, -11322185, -6917195, 494299, 4608554, 4056809]
8434D056809k386640j485173O71195K750063K327760j798999n783165m426210
8426f074360R60311M103565L412070L082147L800228J068773m536187n091766
8418G24781J583295N940372R12011o525206o641882j836878J4627q0202L274365
8409b634717O522717K150314n924992o147654K145170P691774N463239K228491
8401A1494342K044366J31069m760671n379211M94185L709548j480226o984128
8393g30726l817046L583538N331675J239900j431442j71125J499854J251181o44075
8384F111734l766514n886506l124485L173480N175937k59641n419944l346061
8376g342000J128573K54643l055830q15722N392879O681146J710864j674070L45561
$$ y = [4056809, 1670169, 184996, 856191, 3606254, 5934014, 4135015, -1648150, -6074360, -5114049, -1010484, 2401586, 5483733, 9283961, 10352734, 5816547, 724781, 2308076, 8248448, 9160459, 2635253, -4006629, -5843507, -5828880, -5909082, -2634717, 3888000, 6038314, 113322, -6034332, -3889162, 3802612, 9265851, 11494342, 13538708, 13669777, 8909106, 3529895, 4024080, 7733628, 6253402, -730726, -4547772, -964234, 4367441, 5607341, 4175899, 4004774, 5504628, 6755809, 6111734, 2345220, -3541286, -6665771, -3492291, 1683646, 1424005, -3995939, -7342000, -6213427, -5958784, -9014614, -9830336, -4437457, 2243689, 3954553, 2280483, 2626044]
8367B626044K571769M44865l481537m794533k699553J244733M755313M711428
8359E378529K82665m056046l508090j0077J056545k28159P73748M261186N129611
8350I079912J616820j936087k222728r76376n56424q07875j323705j965383q27413
8341H0741L129721N671915J751217n536479p581841k844103Q94559q91853k644750
8332g970873J284461O865933O574778N30985m574367m717630j520780J872159
8324a655334L336144J705959j872669l606916j297875K180164K523753j06039
8316A207187j886826j116018R6477j34328p74442j81194J020714R51991n50646
8307a367085j579186q74576M73186R65081J175009K436921L705604K518898n56338
$$ y = [2626044, 5197813, 5642678, 2161141, -2633392, -5332945, -4088212, 667101, 5378529, 5661194, 1605148, -1902942, -1913019, -856474, -1084633, -310885, 3950301, 9079912, 10696732, 8760645, 6537917, 5561541, 5005117, 4197242, 2873537, 908154, 80741, 3210462, 8882377, 10633594, 5097115, -2484726, -5328829, -4434270, -5326123, -7970873, -6686412, 179521, 6754299, 7285284, 2710917, -2006713, -3527493, -1655334, 1680810, 3386769, 1514100, -2092816, -3390691, -1210527, 1313226, 1207187, -679639, -1795657, -1699180, -1833508, -2607950, -2789144, -1768430, -816439, -1367085, -2946271, -3820847, -3347661, -2382580, -1207571, 1229350, 4934954, 7453852, 6897514]
8298F897514j694348M77265K124653l13866m548008n492987k127874J770330K592695
8289c14626J45077k916470l119951O01843M377168K962332k603830n080122j289790
8280g238369K823056J478694k086657j920294O49514Q88919K98936L307727O998460
8271E199986M176054l884622p641804l359608K078784K476323O7921q46684m17402
8262b151052O1320J530449L785170M036540J564983j003518k603442m483606n176873
8253d440029j463255M187117M640056j004687n093088l008301O17543R17503L1808
8244d615333O55327K62923k302106j856178M355590R180868M917969m385787q059060
8235a845787l274569K961414M336341J234607k578924l877539j455021K326057
$$ y = [6897514, 5203166, 5680431, 7805084, 7491218, 2943210, -2549777, -4677651, -2907321, -314626, -169549, -3086019, -6205970, -5604127, -1226959, 1735373, -868457, -5948579, -7238369, -4415313, -2936619, -5023276, -6943570, -6294056, -5405137, -5106201, -1798474, 5199986, 9376040, 5491418, -2150386, -5509994, -3431210, -954887, -886966, -1733650, -2151052, -2089732, -559283, 3225887, 7262427, 8827410, 7823892, 5220450, 736844, -4440029, -5903284, -1716167, 2923889, 1919202, -3173886, -6182187, -5564644, -4647141, -4615333, -3960006, -3697083, -5999189, -7855367, -3499777, 5681091, 10599060, 6213273, -1845787, -5120356, -2158942, 2177399, 3412006, 833082, -3044457, -4499478, -2173421]
8227b173421K959230j99824k125099N06922L870950K924363j062351l504951l368322
8218b172503k147908L67740L934859M762475L82105m951802n300024j325743J570202
8209d880599J168658m92060j709055j943150k95896K418408K808891L02480l68423
8200b990746L190775N676673K518557j413897N01013M701177K841622l835894
8192A1189280o215751k357851P2423k680379m987791k537932Q30388Q22963o34698
8183f499348n59500k9372p4589J424915M535613M602467o06836n878991n430805
8174h516446r21443J995562J820849J231417J438278J235902M65217L95871R65803
8165A11010O61622p82121j761750j215591k18595m96748j804465j680745J292061
$$ y = [-2173421, 785809, 585985, -1539114, -1032192, 2838758, 5763121, 4700770, 1195819, -2172503, -4320411, -3952671, -17812, 4744663, 5126768, 174966, -5125058, -6450801, -4880599, -3711941, -4204001, -5913056, -7856206, -8152102, -5733694, -2924803, -2622323, -2990746, 200029, 5876702, 8395259, 6981362, 7482375, 12183552, 15025174, 11189280, 4973529, 2615678, 2688101, 7722, -4980069, -7518001, -6687613, -5864650, -6499348, -7058848, -7088220, -7162809, -5737894, -1202281, 3400186, 2793350, -3085641, -8516446, -9437889, -7442327, -5621478, -4390061, -2951783, -1715881, -1250664, -854793, 111010, 772632, -9489, -1771239, -2986830, -3205425, -3702173, -5506638, -7187383, -5895322]
8156e895322M590244M361091J179389j62682J910077K712787j145456n491028
8148B059100m785714q29619R60868Q30978K658440M844395K308446k783892k216372
8139C046630M443714P110223M84740p003299n829858O83450K983636K18921n93314
8130E544843K494583L546975p50275n410783m519192P22673M363921L353911J30707
8121I477363j384687m13926M81734p32547k624839k358666K680J438215L43932
8112D229259j541270k314179k336111k145332o69531K262507L792259J268723
8104B546325l428247n493901l024263Q34046J987781J94499j229846j2951K109068
8095e517489K040242Q0772l54785J773531K954934M69355k905857k804015K00631
$$ y = [-5895322, -1305078, 3056013, 4235402, 4072720, 5982797, 8695584, 7550128, 2059100, -2726614, -3556233, -2595365, -1764387, 894053, 5738448, 8046894, 5263002, 3046630, 7490344, 14600567, 15085307, 8082008, 2252150, 2935600, 5919236, 6138157, 5544843, 8039426, 11586401, 10836126, 5425343, 906151, 1628824, 5992745, 9346656, 9477363, 8092676, 7678750, 8160484, 7427937, 4803098, 2444432, 2447112, 3885327, 4229259, 2687989, 373810, -1962301, -4107633, -4777164, -2514657, 1277602, 2546325, -881922, -6375823, -9400086, -8566040, -6578259, -6383760, -7613606, -7626557, -5517489, -3477247, -3396475, -3751260, -1977729, 977205, 1446560, -1459297, -4263312, -4062681]
8086d062681J916031J060755K26190R34555J919241K163718J792169K80291k269140
8077C961129k846308O78017M164075J507002n436796p836339k400685L705287
8069d504618L345661j309170l876474k736692k52174K525645N143576M978044
8061C313798N08623m479711m628626m8200L937280L407677m52042l487175k451154
8052d379530K225897O213294N276619L23697l580380l647691j890913q35930n86106
8043h81043j006398k425921k968433j23312L547532K085096m219461p335762l036577
8034a6364279K844394M128084L110585L752828L302403j275263m724118j024238
8026f249604N019516M171505k173519m251651J17429L104601Q46648j247209N47421
$$ y = [-4062681, -2146650, -1085895, -859705, 74850, 1994091, 4157809, 5949978, 6230269, 3961129, 1114821, 1792838, 5956913, 7463915, 2027119, -5809220, -8209905, -4504618, -1158957, -2468127, -6344601, -9081293, -9333467, -6807822, -1664246, 3313798, 3822421, -657290, -5285916, -5334116, -1396836, 2010841, 1558799, -1928376, -4379530, -2153633, 4059661, 9336280, 9659977, 6079597, 2431906, 540993, -294937, -881043, -1887441, -4313362, -7281795, -7405107, -3857575, -1772479, -5991940, -13327702, -16364279, -13519885, -9391801, -6281216, -2528388, 774015, -501248, -5225366, -6249604, -1230088, 2941417, 767898, -3483753, -3366324, -261723, 584925, -662284, -114863]
8017a14863K263593Q26954n15244L15662k43479l380632l461065K241624O581439
8008D513989K724844m486872n602974p66872K023143M37198K08482L854729N819387
7999H725054J661965m676038o819281m443260j505582N80230L101786N157400
7991A782274L874065j18476k044854K17710K389588M6077m129600l937889O61107
7982a259998L021994l7137l214481j144546K926519K171068k960019n179970j217973
7973f894543L652426L423906q21475l375003j414442K327883L175448n13012n391306
7964e830118o246245j973751K723575L421766J962642L060256O353738O539269
7956A0011132J515493m384569o580565n443930l512347j377831J177883K956614
$$ y = [-114863, 2148730, 2975684, 2460440, 2776102, 2532623, -848009, -4309074, -2067450, 4513989, 7238833, 2751961, -2851013, -3617885, -1594742, -1157544, -949062, 2905667, 8725054, 10387019, 5710981, -1108300, -5551560, -7057142, -6476912, -3375126, 1782274, 5656339, 5537863, 3493009, 3710719, 6100307, 6146384, 2016784, -1921105, -1259998, 1761996, 1724859, -1489622, -2634168, 292351, 2463419, -496600, -5676570, -6894543, -3242117, 181789, -639686, -4014689, -5429131, -3101248, 74200, -438812, -5830118, -12076363, -14050114, -11326539, -7904773, -5942131, -2881875, 3471863, 10011132, 11526625, 7142056, 561491, -4882439, -8394786, -9772617, -8594734, -5638120]
7948e638120K843765J560790K66061n51297Q7549K873180N137806K484262m266602
7939D797394p767930l318429L917296N231877j87771m831458l094061K463373
7931b789709N582541L669505n26019k687614j388364O35301j78364l399818m720005
7922e802546j930273J409750O23237l475341n708205l440480Q75789L998432N491850
7913g957787O116062N420149K913182J37415o55958J97820l70544l920089p136712
7904e256462m997416K057726O773113L633512l030368l861231K745157P948122
7896F012153M621138k862616n310349j534925J364528p35576l594989j876737
7888c917373K904009M766547J347744l410152m443225j534715R25932j71862k497199
$$ y = [-5638120, -2794355, -1233565, -967504, -1518801, -1431252, 1441928, 6579734, 9063996, 4797394, -2970536, -6288965, -2371669, 2860208, 2672437, -2159021, -5253082, -2789709, 2792832, 6462337, 5936318, 3248704, 1860340, 2495641, 2317277, -1082541, -5802546, -7732819, -6323069, -5699832, -9175173, -14883378, -18323858, -17448069, -13449637, -7957787, -1841725, 3578424, 6491606, 6629021, 5973063, 6170883, 5800339, 1880250, -5256462, -10253878, -8196152, -1423039, 2210473, -819895, -4681126, -1935969, 6012153, 10633291, 7770675, 2460326, 925401, 2289929, 1554353, -2040636, -3917373, -1013364, 3753183, 5100927, 1690775, -2752450, -4287165, -3361233, -3533095, -6030294]
$$ [...]
##END NTUPLES=NMR SPECTRUM
##END=
