##TITLE=31Pdec_SR81 ASP2
 CDCl3, 124 sc
 31.08.2021
##JCAMPDX= 6.0         $$ Bruker NMR JCAMP-DX V2.0
##DATA TYPE= NMR SPECTRUM
##DATA CLASS= NTUPLES
##ORIGIN= UXNMR, Bruker Analytische Messtechnik GmbH
##OWNER= root
$$ XWIN-NMR		Version 3.5
$$ Tue Aug 31 11:35:18 2021 Russian Standard Time (UT+4h)  she@DPX200
##.OBSERVE FREQUENCY= 81.013821
##.OBSERVE NUCLEUS= ^31P
##.ACQUISITION MODE= SIMULTANEOUS
##.ACQUISITION SCHEME= undefined
##.AVERAGES= 124
##.DIGITISER RES= 16
##SPECTROMETER/DATA SYSTEM= spect
##.PULSE SEQUENCE= zgpg30
##.SOLVENT NAME= CDCl3
##.SHIFT REFERENCE= (INTERNAL, CDCl3, 0, 248.564)
##AUDIT TRAIL= $$ (NUMBER, WHEN, WHO, WHERE, WHAT)
$$ ##TITLE= Audit trail, XWIN-NMR		Version 3.5
$$ ##JCAMPDX= 5.01
$$ ##ORIGIN= Bruker BioSpin GmbH
$$ ##OWNER= she
$$ F:/spectra/data/she/nmr/P31/1/pdata/1/auditp.txt
$$ ##AUDIT TRAIL=  $$ (NUMBER, WHEN, WHO, WHERE, WHAT)
(   1,<2021-08-31 11:15:45.76 +0400>,<she>,<DPX200>,
      <continue with go, POWCHK disabled, PULCHK disabled
       configuration hash MD5:
       00 E9 B6 7A A2 85 ED C7 34 08 36 98 17 FE 4E 26
       data hash MD5: 32K
       83 7C 9D BF 0E 38 8B 7B 52 67 EB B9 A6 93 61 D4>)
(   2,<2021-08-31 11:34:20.26 +0400>,<she>,<DPX200>,
      <Start of raw data processing
       efp BC_mod = 2 LB = 1 FT_mod = 6 PKNL = 1 PHC0 = -7770.664 PHC1 = 153.4734 SI = 64K 
       data hash MD5: 64K
       46 11 3D E6 9B 8A 92 7A 71 BC BE 6A DB 5C 06 1B>)
(   3,<2021-08-31 11:34:47.03 +0400>,<she>,<DPX200>,
      <pk PHC0 = 12.7078 PHC1 = -31.6 
       data hash MD5: 64K
       9C 45 8D FA EB 40 D6 F4 9E 5E 22 38 68 5C F1 6C>)
(   4,<2021-08-31 11:34:50.50 +0400>,<she>,<DPX200>,
      <abs ABSG = 5 
       data hash MD5: 64K
       2C BF 92 E8 D4 10 61 24 75 6F 36 E7 B2 70 8C 7D>)
$$ ##END=
$$ 
$$ hash MD5
$$ 79 E7 4D AD E1 A8 AA 33 E6 86 F1 CB D3 90 00 9E
##$RELAX= 
##$RELAX= 
##$RELAX= 
##$RELAX= 
##$RELAX= 
##$RELAX= 
##$RELAX= 
##$RELAX= 
$$ Bruker specific parameters
$$ --------------------------
##$DU= <F:/spectra>
##$EXPNO= 1
##$NAME= <P31>
##$PROCNO= 1
##$TYPE= <nmr>
##$USER= <she>
##$AMP= (0..31)
100 100 100 100 100 100 100 100 100 100 100 100 100 100 100 100 100 100 
100 100 100 100 100 100 100 100 100 100 100 100 100 100 
##$AQSEQ= 0
##$AQ_mod= 1
##$AUNM= <au_zg>
##$AUTOPOS= <>
##$BF1= 81.014009
##$BF2= 200.13
##$BF3= 200.13
##$BF4= 200.13
##$BF5= 200.13
##$BF6= 200.13
##$BF7= 200.13
##$BF8= 200.13
##$BYTORDA= 1
##$CFDGTYP= 0
##$CFRGTYP= 5
##$CHEMSTR= <none>
##$CNST= (0..31)
1 1 145 1 1 1 1 1 1 1 1 1 1 1 1 1 1 1 1 1 1 1 1 1 1 1 1 1 1 1 1 1 
##$CPDPRG= <waltz16>
##$CPDPRG1= <>
##$CPDPRG2= <waltz16>
##$CPDPRG3= <>
##$CPDPRG4= <mlev>
##$CPDPRG5= <mlev>
##$CPDPRG6= <mlev>
##$CPDPRG7= <mlev>
##$CPDPRG8= <mlev>
##$CPDPRGB= <>
##$CPDPRGT= <>
##$D= (0..31)
0 1 0 0 0 0 0 0 0 0 0 0.03 2e-05 3e-06 0 0 0 0 0 0 0 0 0 0 0 0 0 0 0 0 
0 0 
##$DATE= 1630393982
##$DBL= (0..7)
120 120 120 11 120 120 24 19 
##$DBP= (0..7)
150 150 150 150 150 150 150 150 
##$DBP07= 0
##$DBPNAM0= <>
##$DBPNAM1= <>
$$ [...]
##$SUBNAM3= <"">
##$SUBNAM4= <"">
##$SUBNAM5= <"">
##$SUBNAM6= <"">
##$SUBNAM7= <"">
##$SUBNAM8= <"">
##$SUBNAM9= <"">
##$SW= 501.771253377433
##$SWIBOX= (0..15)
0 1 3 0 0 0 0 0 0 0 0 0 0 0 0 0 
##$SW_h= 40650.406504065
##$TD= 32768
##$TD0= 1
##$TE= 0
##$TE2= 300
##$TE3= 300
##$TEG= 300
##$TL= (0..7)
0 120 53 12 22 120 120 120 
##$TP= (0..7)
150 150 150 150 150 150 150 150 
##$TP07= 0
##$TPNAME0= <>
##$TPNAME1= <>
##$TPNAME2= <>
##$TPNAME3= <>
##$TPNAME4= <>
##$TPNAME5= <>
##$TPNAME6= <>
##$TPNAME7= <>
##$TPOAL= (0..7)
0.5 0.5 0.5 0.5 0.5 0.5 0.5 0.5 
##$TPOFFS= (0..7)
0 0 0 0 0 0 0 0 
##$TUNHIN= 0
##$TUNHOUT= 0
##$TUNXOUT= 0
##$USERA1= <user>
##$USERA2= <user>
##$USERA3= <user>
##$USERA4= <user>
##$USERA5= <user>
##$V9= 5
##$VALIST= <valist>
##$VCLIST= <CCCCCCCCCCCCCCC>
##$VD= 0
##$VDLIST= <DDDDDDDDDDDDDDD>
##$VPLIST= <PPPPPPPPPPPPPPP>
##$VTLIST= <TTTTTTTTTTTTTTT>
##$WBST= 1024
##$WBSW= 4
##$XGAIN= (0..3)
0 0 0 0 
##$XL= 0
##$YL= 0
##$YMAX_a= 6133
##$YMIN_a= -5213
##$ZGOPTNS= <>
##$ZL1= 120
##$ZL2= 120
##$ZL3= 120
##$ZL4= 120
##$ABSF1= 248.5645
##$ABSF2= -253.2056
##$ABSG= 5
##$ABSL= 3
##$ALPHA= 0
##$AQORDER= 0
##$ASSFAC= 0
##$ASSFACI= 0
##$ASSFACX= 0
##$ASSWID= 0
##$AUNMP= <proc_1d>
##$AZFE= 0.1
##$AZFW= 0.5
##$BCFW= 0
##$BC_mod= 2
##$BYTORDP= 0
##$COROFFS= 0
##$CY= -3
##$DATMOD= 1
##$DC= 0
##$DFILT= <>
##$DTYPP= 0
##$F1P= 0
##$F2P= 0
##$FCOR= 1
##$FTSIZE= 65536
##$FT_mod= 6
##$GAMMA= 0
##$GB= 0
##$INTBC= 1
##$INTSCL= 5.30512e-09
##$ISEN= 30
##$LB= 1
##$LEV0= 0
##$LPBIN= 0
##$MAXI= 10000
##$MC2= 0
##$MEAN= 0
##$ME_mod= 0
##$MI= 50
##$NCOEF= 0
##$NC_proc= -8
##$NLEV= 6
##$NOISF1= 182.463
##$NOISF2= 159.3651
##$NSP= 0
##$NTH_PI= 0
##$NZP= 0
##$OFFSET= 248.5645
##$PC= 4
##$PHC0= -7757.956
##$PHC1= 121.8734
##$PH_mod= 1
##$PKNL= yes
##$PPARMOD= 0
##$PSCAL= 0
##$PSIGN= 0
##$REVERSE= no
##$SF= 81.014009
##$SI= 65536
##$SIGF1= 159.3651
##$SIGF2= -187.1042
##$SINO= 113.3802
##$SIOLD= 16384
##$SREGLST= <1H.CDCl3>
##$SSB= 0
##$STSI= 65536
##$STSR= 0
##$SW_p= 40650.406504065
##$SYMM= 0
##$S_DEV= 0
##$TDeff= 32768
##$TDoff= 0
##$TI= <>
##$TILT= no
##$TM1= 0
##$TM2= 0
##$TOPLEV= 0
##$USERP1= <user>
##$USERP2= <user>
##$USERP3= <user>
##$USERP4= <user>
##$USERP5= <user>
##$WDW= 1
##$XDIM= 65536
##$YMAX_p= 457312951
##$YMIN_p= -46967744
$$ End of Bruker specific parameters
$$ ---------------------------------
##NTUPLES= NMR SPECTRUM
##VAR_NAME=  FREQUENCY,     SPECTRUM/REAL,   SPECTRUM/IMAG
##SYMBOL=    X,             R,               I
##VAR_TYPE=  INDEPENDENT,   DEPENDENT,       DEPENDENT
##VAR_FORM=  AFFN,          ASDF,            ASDF
##VAR_DIM=   65536,         65536,           65536
##UNITS=     HZ,            ARBITRARY UNITS, ARBITRARY UNITS
##FACTOR=    0.620285442955139, 1,           1
##FIRST=     20137.2065510759, 0,            0
##LAST=      -20513.1999529892, 0,           0
##MIN=       -20513.1999529892, -46967744,   0
##MAX=       20137.2065510759, 457312951,    0
$$ Real data points
##PAGE= N=1
##DATA TABLE= (X++(R..R)), XYDATA
$$ [...]
40107a1149723J1551234Q150205P20288m232120o17145P596621Q229293k220806
40099A8027847j1829348r535265N01278P658618Q954338O491460j32269r161719
40091A0974940j1939693l328307Q293540J0763653L648434l786327n532804k526653
40083F566783J862117L461958l65804m572341J17220J1688016J4530764J292660
40075C4581373j3332862j2441822j191173L108593k355422n793340k961312j699091
40067b085056m709607m404598K174551P144512M731230m66278k054657J20620
40059D50717L222017M991020K865145k958911n896776p14572O460040N581736
40051A4000416j584736m583859j559370j7058r34600K235258P170972K782480
$$ y = [-11149723, 401511, 8551716, 9272004, 5039884, 4422739, 12019360, 20248653, 18027847, 6198499, -3336766, -2835488, 4823130, 13777468, 20268928, 20136659, 10974940, -964753, -4293060, 4000480, 14764133, 18412567, 14626240, 9093436, 6566783, 8428900, 11890858, 11525054, 6952713, 7069933, 18757949, 33288713, 34581373, 21248511, 8806689, 7615516, 10724109, 8368687, 2575347, -385965, -2085056, -6794663, -11199261, -9024710, -1880198, 2851032, 2384754, 330097, 450717, 3672734, 8663754, 11528899, 8569988, 2673212, 1958640, 8418680, 14000416, 12415680, 7831821, 6272451, 6255393, 5320793, 7556051, 14727023, 17509503]
40043A7509503r400414j1971769J392699J2666679N519744r950699j3476510m071214
40035a1781981L293053K337579j91155k75788q12465k017192j292560r86514l739438
40026a5466461k734257R195328K2230807J7609438m617534k1353672j5774135
40019a0910486K011255J0952940N175324m364197o658837o79605O792581P257232
40011I576207j750219j1272548q829292M656661J3112427O032238o670346q687833
40003c832705M2735N383466Q18580m319718l46518Q265556R354466j65758r623993
39994E576111p362555M435608J1084621L236347j0190183j2725919k270798O672486
39986a544282M195928k383097k799476O9815j505778m425478o04179O894490Q017895
$$ y = [17509503, 8109089, -3862680, -2469981, 10196698, 15716442, 5765743, -7710767, -11781981, -8488928, -6151349, -6342504, -6618292, -7430757, -9447949, -10740509, -11727023, -15466461, -18200718, -9005390, 13225417, 30834855, 26217321, 4863649, -10910486, -8899231, 2053709, 7229033, 2864836, -3794001, -4473606, 2318975, 9576207, 7825988, -3446560, -12275852, -7619191, 5493236, 11525474, 4855128, -3832705, -3789970, 1593496, 2412076, -1907642, -2254160, 6011396, 15365862, 15200104, 5576111, -1786444, 2649164, 13733785, 16970132, 6779949, -5945970, -8216768, -1544282, 2651646, 268549, -2530927, -2461112, -3966890, -8392368, -8996547, -2102057, 5915838]
39977E915838L303298K291499N083329J610594q501984j1946274l231342N322841
39969a52201L187830k901840k890881K92134k6311o37055K724783L634661l188713
39960D2407p952867l82429R953333O751320n716657r394564l031867k565819j0278955
39951b2576098q731890P694068J9097428J0310564n245515p544730N21882L280593
39943c193698o52356q12287L399701K651046l775197o145331o94833N703681P554504
39934D035230O022622K377325l249419o744581l779462J240987m39389q367877
39926h904564j2797981q535981l04747N943803Q646635P402812K698171n26880
39918f378732K790841R191599J0065572M036204j785760l087841k768443l575268
$$ y = [5915838, 9219136, 11510635, 16593964, 18204558, 9702574, -2243700, -5475042, -152201, 3035629, 133789, -2757092, -2464958, -2491269, -3128324, -403541, 3231120, 42407, -7910460, -8292889, 1660444, 8411764, 2695107, -6699457, -9731324, -12297143, -22576098, -31307988, -23613920, -4516492, 5794072, 548557, -6996173, -6474291, -3193698, -3846054, -4658341, -1258640, 1392406, -2382791, -8528122, -9222955, -3519274, 4035230, 10057852, 12435177, 9185758, 2441177, -1338285, -97298, -536687, -8904564, -21702545, -30238526, -30543273, -24599470, -15952835, -8550023, -5851852, -6378732, -3587891, 5603708, 15669280, 19705484, 17919724, 14831883, 12063440, 8488172]
39910H488172m328900m187263l403398k11820N454047O933043r94277j0766472
39902c016868j0249423j146108L741851J302868J088529N935391O589406N26937
39894D772583j245722N723275R250566J373836o532334k969848L802578J091627
39886A5266561n657621m007455J988770l1840o372280l342339O140304N575804
39878I559904n184870p144801N563080J3974746N056287o949255m814252L565475
39870A3626314M92617j0172573q892300O997716J7674826R635261o989329j5035859
39862G336673j0864569j860923N734694Q703419M804330k751996m696624K322927
39854H727931Q210897K710326q108390r585283p01117M212799k110494q817997
$$ y = [8488172, 4159272, -27991, -3431389, -3643209, 1810838, 8743881, 7749604, -3016868, -13266291, -14412399, -10670548, -9367680, -8279151, -2343760, 4245646, 4772583, 3526861, 9250136, 18500702, 19874538, 13342204, 10372356, 14174934, 15266561, 9608940, 5601485, 7590255, 7558415, 1186135, -2156204, 3984100, 9559904, 4375034, -2769767, 2793313, 16768059, 21824346, 14875091, 10060839, 13626314, 14118931, 3946358, -4945942, 2051774, 19726600, 29361861, 22372532, 7336673, -3527896, -5388819, 345875, 9049294, 13853624, 11101628, 6405004, 8727931, 16938828, 19649154, 11540764, 1955481, 1254364, 5467163, 3356669, -5461328]
39846e461328m564441N196785Q239785M145806R43313p49790o300636j2306650
39838a0857156q189998N566867J4289428R093043j217027m384800j190985k14928
39830B894444l600720o084993l631857L019992R576933R466291j55806j0634452
39822H49832q745291L918237R371454r26558j0589353j831015J5398983J5887063
39814B3333352l580194j9124672j3772259J703093Q631832N731772L643199M848916
39806A1415039K455699n014102r626158o019216O89261K387228j195721l469541
39798h377511j223386J158979l00381j554239L409771J1314066J2556780N817890
39790B2801969L52609Q79912O02167n011030q497555l699375J441916k183516
$$ y = [-5461328, -10025769, -4828984, 3410801, 7556607, 8499920, 7750130, 1449494, -10857156, -19047154, -13480287, 809141, 9902184, 8685157, 4300357, 3109372, 2894444, -706276, -6791269, -10423126, -7403134, 2173799, 11640090, 11484284, 849832, -7895459, -3977222, 5394232, 4467674, -6121679, -7952694, 7446289, 23333352, 19753158, 628486, -13143773, -11440680, -2808848, 2922924, 6566123, 11415039, 13870738, 8856636, -769522, -6788738, -6099477, -3712249, -4907970, -8377511, -9600897, -8441918, -8742299, -10296538, -6886767, 4427299, 16984079, 22801969, 23154578, 24034490, 24636657, 19625627, 11128072, 7428697, 8870613, 6687097]
39782F687097p712675l339243N728171M098528p523397j1718295j728025Q482924
39774g024915O677757r56311k879315J132320M442051M315877J182030l968361
39766B921133o300089p44205P138982N353392n044500q292561J593267R675800
39758F301219L631050o141280l902554O066965Q056503K45600n971828o526043
39750A759632p093200p632519j717109Q113420J0057230J347483o245745l570482
39742d981290M031092O763101L357666j112164l556125m020312l058069j694173
39734d270274j157120r51668K67960J889095K326197J788669Q20154j785325n592229
39725f664541o147326j436769K511312o20226o674553n980213K286262Q860550
$$ y = [6687097, -1025578, -4364821, 1363350, 5461878, -2061519, -13779814, -15507839, -7024915, -347158, -1303469, -4182784, -3050464, 1391587, 5707464, 6889494, 2921133, -3378956, -4123161, 3015821, 8369213, 3324713, -4967848, -3374581, 6301219, 9932269, 3790989, -111565, 5955400, 14011903, 14257503, 8285675, 1759632, -5333568, -12966087, -14683196, -6569776, 3487454, 4834937, -1410808, -4981290, -950198, 5812903, 9170569, 8058405, 4502280, 481968, -2576101, -4270274, -5427394, -6379062, -6111102, -4222007, -1895810, -107141, 713013, -1072312, -6664541, -12811867, -14248636, -11737324, -12357550, -19032103, -25012316, -22726054, -13865504]
39717a3865504P286648N55558n007966n310442J396415J2040997J6909250R134974
39709B3139930l884731q126885k645721m81883p228764j1240670k164444J1607978
39701a025190J4368463N012633l649691l925562m96758R12020J677893L958675
39693A6832483M305699o36221o551163o130648q0570K852836j765290p492798
39685A334328o695193j776475n4118q06570L061968J0748932J2159965M343654
39677B2316491j880049J281156N466299j03238j0322674j2174976m972551J114365
39669G24823K841637N474090Q398329M778130l519623o108615k094388k483292
39661H011091r664530j0350983K401321J4502295J0224138m469030j1341901n335169
$$ y = [-13865504, -6578856, -6023298, -11031264, -16341706, -14945291, -2904294, 14004956, 23139930, 19255199, 11128314, 8482593, 8000710, 771946, -10468724, -12633168, -1025190, 13343273, 18355906, 14706215, 10780653, 10283895, 11195915, 12873808, 16832483, 21138182, 20501961, 13950798, 7820150, 7739580, 10592416, 8827126, 1334328, -5360865, -7137340, -7191458, -7998028, -4936060, 5812872, 17972837, 22316491, 20436442, 21717598, 27183897, 27080659, 16757985, 4583009, -389542, 724823, 3566460, 9040550, 17438879, 22217009, 18697386, 12588771, 10494383, 8011091, -1653439, -12004422, -9603101, 4899194, 15123332, 10654302, -687599, -6022768]
39653f022768K900864N636818N920216P432143P881276M968407J308195K19391
39645C0244542P21931q49171n591113r345717o380473K486877P837732K809293
39637B1933901n840931n958860J668763M272905k065324n893433j25237N529478
39629A3521262J414614n253549l189058L431181L154374k392591k535063K540909
39621A0692079K603054l451716n481948j40466M017155K064104n30740k70062
39613I501460j525501n223514m252532L291205P556593J623984o572479n755044
39605a355828K369496P024156L655117k538616n076050j993794M072345P103038
39597A3259864K420569o165072q587933j762900N129542L517541k715607m911642
$$ y = [-6022768, -3121904, 2514914, 8435130, 15867273, 23748549, 28716956, 30025151, 30244542, 30966473, 30117302, 24526189, 15180472, 8799999, 11286876, 19124608, 21933901, 16092970, 10134110, 11802873, 16075778, 14010454, 8117021, 7991784, 13521262, 14935876, 9682327, 6493269, 9924450, 13078824, 10686233, 8151170, 10692079, 13295133, 9843417, 4361469, 4221003, 8238158, 10302262, 9771522, 9501460, 7975959, 2752445, -1500087, 1791118, 9347711, 10971695, 4399216, -1355828, 1013668, 8037824, 11692941, 9154325, 4078275, 2084481, 6156826, 13259864, 15680433, 9515361, 927428, -835472, 4294070, 7811611, 5096004, 184362]
39589A84362l039467k543344k433626K530326R305891P783038l187554j1014455
39581b414829n783582N859245R846200L082309m653238n362734j773537j36471
39573a336637o84880n2744P65791k264056p442779p195853M48818O734211L987828
39564g040301k597798k683335L063774M251839k254771p227149l804491K567583
39556a5724649M357198L503755N380234Q176766P162467M450628M732109M641621
39548B6680129k701796j3377554j4374108k334459R442978Q193146j583939n447970
39540D496427J544836J0032805R513337K58141q676801r545111k712408M695202
39532I606428N941229J040312l975475m170054r45065N80627j774965m744284
$$ y = [184362, -2855105, -5398449, -7832075, -5301749, 4004142, 11787180, 8599626, -2414829, -8198411, -2339166, 7507034, 10589343, 5936105, 573371, -1200166, -1336637, -2021517, -2074261, -1308470, -3572526, -11015305, -18211158, -17762340, -11028129, -7040301, -9638099, -12321434, -9257660, -5005821, -7260592, -14487741, -18292232, -15724649, -11367451, -7863696, -2483462, 5693304, 12855771, 17306399, 22038508, 26680129, 23978333, 10600779, -3773329, -6107788, 3335190, 11528336, 9944397, 4496427, 6041263, 16074068, 25587405, 25845546, 17168745, 7623634, 4911226, 9606428, 15547657, 16587969, 12612494, 8442440, 7497375, 8078002, 6303037, 1558753]
39524A558753l623605K206024Q321842R971885P303107M575468L924374K431520
39516C6669368k523854p647286p716552l924955k734238n804872p090317k654485
39508c427191K411935J771840k014158j728373K702898M206257J36806l654933
39500D05081k308874J117752J751745M36240M70037J041773n09073k504224q19049
39491i18592M054610P038719N384448J161865k843671n279001m694260j003234
39483B900884J468098j782034p268829o164456K598929Q812105M843431l292742
39475B115386m603922K185845R271695J1017162P316565p83854j0418642j4150422
39467A949813p242720K873276L884088m064750q225238k274576N331490O146003
$$ y = [1558753, -2064852, 141172, 8463014, 18434899, 25738006, 30313474, 34237848, 36669368, 34145514, 26498228, 18781676, 14856721, 12122483, 6317611, -772706, -3427191, -1015256, 756584, -1257574, -2985947, -283049, 3923208, 4060014, 405081, -1903793, -786041, 965704, 1401944, 1871981, 2913754, 2404681, -99543, -918592, 3136018, 10174737, 15559185, 16721050, 13877379, 8598378, 3904118, 2900884, 4368982, 2586948, -4681881, -10846337, -8247408, 564697, 5408128, 2115386, -2488536, -302691, 8969004, 19986166, 27302731, 26518877, 16100235, 1949813, -5292907, -2419631, 1464457, -2600293, -10825531, -13100107, -7768617, -1622614]
39459a622614L722434L639015J824100o563681j4092093r667608L338059J0224294
39451i198094N670359n27162j0240L109227K013114j583410k374404r18727j125869
39442d945206k446131j264517K057245L433597J665303j48911j97929q01513l900892
39433f548954o448663l467309M326330R157741N416429j492494r89383P080506
39425G034203R953092O900j1838636j0150907K320609Q516727K462469l690755
39417D613702j142412K162733k219771p118365k347578O687344P767616K454332
39409A0857601J841324N647688L029327n992116p963531J204250P879995K532581
39401A9037119n364001m279540J068988R75014j208778K401264O208299o32565
$$ y = [-1622614, 2099820, 5738835, 7562935, 999254, -13092839, -22760447, -19422388, -9198094, -3527735, -4054897, -4065137, -955910, 1057204, -526206, -2900610, -3819337, -4945206, -7391337, -8655854, -6598609, -3165012, -1499709, -1648620, -1846549, -2648062, -6548954, -12997617, -16464926, -12138596, -2980855, 2435574, 943080, -46303, 7034203, 16987295, 16994195, 5155559, -4995348, -2674739, 5841988, 8304457, 4613702, 3471290, 5634023, 3414252, -3704113, -6051691, 635653, 8403269, 10857601, 12698925, 18346613, 21375940, 15383824, 7420293, 8624543, 16504538, 19037119, 13673118, 9393578, 10462566, 11437580, 10228802, 12630066, 18838365, 18205800]
39393A8205800j2361525j1836177K021107J0338992K726545p064709l023293Q997145
39385H003885J1503925J268091q306360p207538N30311N968389N672821J324668
39377A8758192m233357q050260q165568n262356j158334L606284Q015344Q426530
39369A1936475K659997m850189p009796l173705L79174m91430k882838k124880
39361e557192K194926O963426Q817066N624984j523144o679970l877310M172263
39353A0135049O728296j878834j3258341j3874607j403614J2416808J5243919
39346A4108676O588865m183907r149556q426271o321397m150923J71715N883448
39338e479350P259543J259723n758942m720129L652328R574345Q193644N201473
$$ y = [18205800, 5844275, -5991902, -3970795, 6368197, 9094742, 2030033, -993260, 8003885, 19507810, 20775901, 12469541, 5262003, 5792314, 11760703, 17433524, 18758192, 14524835, 6474575, -1690993, -6953349, -8111683, -4505399, 3509945, 11936475, 14596472, 9746283, 2736487, -437218, -58044, -549474, -3432312, -5557192, -3362266, 3601160, 12418226, 18043210, 16520066, 9840096, 5962786, 10135049, 16863345, 14984511, 1726170, -12148437, -13552051, -1135243, 14108676, 20697541, 16513634, 7364078, -1062193, -7383590, -11534513, -11362798, -5479350, 1780193, 3039916, -2719026, -7439155, -3786827, 5787518, 13981162, 19182635]
39330A9182635N414292M160760l113098r556286n352041N818089R762898J473863
39322B7791112q425555r472168m199697n75847P2020P47711O10973k587839n251993
39313a291283j536102O499313R762810M334392l168248m669493o25947J911020
39305A1216462j497342q009953j0858918o042707L407928R563566P406853M06789
39297E592678l675046k156886N91983J003318J780415O500310J1933797J0718944
39289C2289513J558509p524853q054778q49799N393310M108060l082840j0250549
39281A3586573j3990578j4050351r334579J550656J4076677J7245631N272494
39274A4356523j1780111j6418023m798324P578967O147651l209992l755082O691348
$$ y = [19182635, 24596927, 28757687, 25644589, 16088303, 10736262, 16554351, 26317249, 27791112, 19365557, 9893389, 5693692, 5117845, 5189865, 5937576, 6548549, 3960710, -1291283, -2827385, 3671928, 13434738, 17769130, 14600882, 9931389, 9305442, 11216462, 9719120, 1709167, -9149751, -15192458, -11784530, -2220964, 5185889, 5592678, 1917632, -239254, 352729, 1356047, 3136462, 9636772, 21570569, 32289513, 33848022, 26323169, 18268391, 17418592, 22811902, 26919962, 23837122, 13586573, -404005, -14454356, -23788935, -22238279, -8161602, 9084029, 14356523, 2576412, -13841611, -18639935, -11060968, -4913317, -8123309, -11878391, -5187043]
39266e187043J2341349L582345q064270p310027K097922M396927l129153o790777
39258h062727P88657Q796809N459913l977486o116163R06290P147336O461966
39250A1404595K156241j418641l442094k912029Q66664L534528J01129m938262
39242E352131j686297Q351450J0487934j972599j4856842j1236847M542588J2830900
39234A1812418N666517m463007m088600L770900O636505J55475p744723p892305
39226C853180l42786O490824N402653j654108n906457k264446M781674P576803
39218A7937337M818660J046598j178157l510317o680235q084138n622581n86806
39210a859639M037117N691161L161881j678565m051785j699013J262650J35116
$$ y = [-5187043, 7154306, 10736651, 2672381, -4637646, -2539724, 1857203, -1271950, -8062727, -7274070, 1522739, 6982652, 3005166, -3110997, -2204707, 4942629, 11404595, 13560836, 12142195, 8700101, 5788072, 6654736, 10189264, 10290393, 5352131, 3665834, 12017284, 22505218, 20532619, 5675777, -5561070, -1018482, 11812418, 17478935, 13015928, 8927328, 12698228, 19334733, 19490208, 11745485, 3853180, 3510394, 10001218, 15403871, 13749763, 7843306, 5578860, 10360534, 17937337, 22755997, 23802595, 22624438, 19114121, 12433886, 4349748, -1272833, -1859639, 2177478, 7868639, 11030520, 9351955, 5300170, 3601157, 4863807, 4998923]
39202D998923k552502p27976N062551Q020472N253230L08538m265093q395998
39194G702145q256857O23403J1404943R503269n683951j5060757n755812Q649968
39186C126351P623566n538507r965240J28483Q529624M130838l767502l576182
39178F91431J186569K145019Q89193K279981K761409k545176q199288n961986
39170f752848J234417M476058L545248M221599M787543p79571p933171n289144
39162b489869N509737R345255J166442n697148j940849K521848l019453j0395415
39154d999452o678545K498384K095433n909006n210721O763518J3488774O013297
39146H061682l172092r79184O678842O881655o3977m161658j941846J657174K479587
$$ y = [4998923, 2446421, 1718445, 6780996, 14801468, 20054698, 20363236, 16098143, 7702145, -554712, 68691, 11473634, 20976903, 15292952, 232195, -5523617, 3126351, 10749917, 5211410, -4753830, -4625347, 3904277, 8035115, 4267613, 691431, 1878000, 4023019, 4912212, 7192193, 9953602, 7408426, -790862, -6752848, -5518431, -1042373, 2502875, 6724474, 11512017, 10732446, 2799275, -2489869, 3019868, 12365123, 13531565, 7834417, 5893568, 8415416, 5395963, -4999452, -11677997, -9179613, -7084180, -12993186, -18203907, -11440389, 2048385, 8061682, 4889590, 3910406, 10589248, 17470903, 17406926, 13245268, 11303422, 12960596, 15440183]
39137A5440183n60445p450443j3725244j1029765R55370R692258O028515j649746
39129b299317n49279N950208M858146l698753o531884L14875N554326K031918
39121E630240k749398j296175J603176o78515m065464j119956N672976P113609
39113A0110493O20243o792817p946593l580792r03298n023682j1474475r827779
39105c4818700K306655J3530784J3295086P080833O800863J0511162O099316n925039
39097A8880960j0263203j117411P740087M421000m129141n916135j903719L61258
39089H073696M47789J431813J423057j169093k043609L11331o09153o836895q667681
39080g638745n22997O835056K648662n635209m995572J646022K579274j779362
$$ y = [15440183, 14879738, 7429295, -6295949, -17325714, -16370344, -6678086, -649571, -2299317, -2848596, 3101612, 7959758, 4261005, -2270879, -1956004, 3598322, 5630240, 2880842, 1584667, 3187843, 2509328, -1556136, -2676092, 2996884, 10110493, 10730736, 3937919, -4008674, -7589466, -8492764, -13516446, -24990921, -34818700, -32512045, -18981261, -5686175, 1394658, 8195521, 18706683, 24805999, 18880960, 8617757, 7500346, 15240433, 19661433, 15532292, 9616157, 7712438, 8073696, 8521485, 9953298, 11376355, 10207262, 8163653, 8474984, 7865831, 1028936, -7638745, -8161742, -1326686, 1321976, -4313233, -9308805, -7662783, -5083509, -6862871]
39072f862871k185784J131531P21284k053732l31874K654023j352873p932176
39064a6212472n120932N567037J0907819P554083M146002K871310k346815r134557
39056a768525p564053N71420K554768k900731l644307K707836M308895j658516
39048g393213k793527M696040P521826m28290o422922k144707K056767j308987
39040f217013j500025R053659J6827935Q327096o855540j2131087q871701p201503
39032h568179n409116K025373P710017K896863m057495p83603O454801L632858
39024C901519n543860o538343n2075J099687l096497q64813P263968Q094829K56370
39015D520785k878731K258529K914837o528320j3683651q322340K595002P943675
$$ y = [-6862871, -9048655, -7917124, -7195840, -9249572, -9581446, -6927423, -8280296, -16212472, -21333404, -15766367, -4858548, 2695535, 6841537, 9712847, 7366032, -1768525, -9332578, -8761158, -6206390, -9107121, -12751428, -10043592, -5734697, -7393213, -10186740, -5490700, 2031126, 1602836, -4820086, -6964793, -4908026, -6217013, -7717038, 1336621, 18164556, 26491652, 19636112, 7505025, -1366676, -8568179, -13977295, -11951922, -4241905, -1345042, -5402537, -6186140, 268661, 3901519, -1642341, -8180684, -8232759, -7133072, -10229569, -11094382, -3830414, 4264415, 4520785, 1642054, 3900583, 6815420, 287100, -13396551, -21718891, -19123889, -11180214]
39007a1180214O979014L575329j875008p529035p491776p72412N821107Q305650
38999d167345J0050253J2131069R352510N07250o980407p695046n120923l675837
38991D401524k210849M01532J230718r60861k881777k619207j641082M61357N218848
38982A400203Q475292L957857m909148p266615j143686L465208Q19083k780386
38974B017808j500904J315928K191680L975058P120124N361428k807960q380616
38966I292546n119083O75816J296946o06608L09380J337838k037274o252654n211164
38957f314257M598M908257R113822J2363129R561321j427784j2365792j3675599
38949B167695o664520N64227M415152N688716L742624r38885l107832K17928L597334
$$ y = [-11180214, -4201200, -625871, -2500879, -10029914, -17521690, -18294102, -12472995, -4167345, 5882908, 18013977, 27366487, 27873737, 20893330, 13198284, 8077361, 4401524, 2190675, 2592207, 3822925, 2862064, -19713, -2638920, -4280002, -3818645, 1400203, 9875495, 13833352, 8924204, 1657589, 513903, 3979111, 4798194, 2017808, 516904, 1832832, 4024512, 7999570, 15119694, 20481122, 17673162, 9292546, 4173463, 4849279, 6146225, 5539617, 5848997, 7186835, 5149561, -1103093, -6314257, -6309659, -1401402, 7712420, 20075549, 29636870, 28209086, 15843294, 2167695, -4496825, -3932598, 482554, 6171270, 9913894, 8975009, 5867177, 6085105, 9682439]
38940I682439J594739k049962j929990j472915n719535r113918k804977Q955245
38932b858874J2549161M655002l747994m244941r37015p27580l076956l717600
38924b106797j826975O72762K619632L592468L345615K397538Q76089k319311
38916G251021o299072o578557j168154M420833M032656L53137O69791M778092
38908G459747N042905j303402p604636p333056j985573K795318M087344K572111
38900C730758L03928p63061m60835p31613k155028j896897J734067N277897M870455
38891I909671K034892j60391k823070o582097n714383L699105J2950993R651139
38883B2965859l224336r685218l704417L092251Q45320m365251l100808J998320
$$ y = [9682439, 11277178, 9227216, 7297226, 5824311, 104776, -9009142, -11814119, -2858874, 9690287, 14345289, 10597295, 6352354, 5415339, 4687759, 1610803, -2106797, -3933772, -3261010, -641378, 2951090, 6296705, 8694243, 9570332, 7251021, 951949, -5626608, -6794762, -2373929, 1658727, 2011864, 2681655, 7459747, 12502652, 11199250, 3594614, -3738442, -5724015, -2928697, 1158647, 3730758, 4034686, 3271625, 2810790, 2079177, -75851, -1972748, -238681, 5039216, 9909671, 11944563, 11784172, 8961102, 2379005, -3335378, 363727, 13314720, 22965859, 19741523, 10056305, 6351888, 9444139, 10289459, 5924208, 2823400, 4821720]
38875D821720L068657N23369q72913k436540o752820p932259O86578J2073583
38867C179375J1937576m04503j0069008p617821k48571K121181P71362J328262
38859I97853K231025q37479m944853l763151J766530N057341M147458K540370
38851G195094J482766l23170l26599N159833J1212961P529094n354943j3153494
38843A3421542p043617L238067L723631l838213o824757j594937L435587K988059
38835G505362J331456K038088J862849j565627m470117l680885j839548j670045
38827d88467j100078J704856L915037K883446N80426o12158j684362l119790k737332
38818f58422j102694k622911o453539l800555Q277915J7261530R773400q151910
$$ y = [4821720, 7890377, 8413746, 7540833, 5104293, -1648527, -9580786, -8894208, 3179375, 15116951, 14712448, 4643440, -2974381, -3222952, -1101771, -330409, 997853, 3228878, 2391399, -2553454, -6316605, -4550075, 507266, 4654724, 7195094, 8677860, 8354690, 8028091, 13187924, 24400885, 31929979, 26575036, 13421542, 6377925, 9615992, 13339623, 9501410, 2676653, 1081716, 4517303, 7505362, 8836818, 10874906, 12737755, 11172128, 6702011, 3021126, 1181578, -488467, -1588545, 116311, 4031348, 6914794, 7495220, 6883062, 5198700, 2078910, -658422, -1761116, -4384027, -10837566, -14638121, -6360206, 10901324, 20674724, 12522814]
38810A2522814j6888782q587304M288281P604685K563210n97991J964925N266747
38802H136585M436189n0376m797141o775861m372448J719214P967070J0065323
38794A6328555O511617k4988m924189n098407q11768M741701O990855K721089
38786B6434465n840429j0115821l280240Q783782J0887085j788952j3845358q936788
38778B297744N951445R088543m146274j4362785p640431M671871N846071p82746
38770I23438j028052N436225O711370J81455m408176k591940j082501m467668
38762c25849q362128q116131m202352K418174J0650723J4602075Q994262l33961
38754A5324813k549024J013961j389027j1208979j5207338o597815L833412N391715
$$ y = [12522814, -4365968, -12953272, -8664991, -1060306, 1502904, 904913, 2869838, 8136585, 12572774, 12522398, 7725257, 949396, -3423052, -1703838, 6263232, 16328555, 22840172, 22815184, 17890995, 12792588, 11980820, 16722521, 23713376, 26434465, 20594036, 10478215, 7197975, 15981757, 26868842, 25079890, 11234532, 2297744, 8249189, 17337732, 13191458, -1171327, -8811758, -4139887, 1706184, 923438, -104614, 5331611, 12042981, 12224436, 7816260, 5224320, 4141819, -325849, -8687977, -16804108, -21006460, -18588286, -7937563, 6664512, 15658774, 15324813, 12775789, 13789750, 12400723, 1191744, -14015594, -20613409, -16779997, -11388282]
38746a1388282K949942M854253P245022K800703l949363l529109K194224L550188
38738D727578r85552m447605m244351l765570k939987J374355O264695N171166
38730A154729l06545j839708J472693J614038l406285m889787J391424O432942
38722A623501K106669m865671k867501O381663J0208808L580068m470173m103238
38714G594126L080557P777179M289208m511079j0935497r691945k970212J546822
38706c820841n82286m952908m259610J634862N944860M641597N97323k405286
38698c202289l862049l002897K355251R605137J0309330J308749q125827p472592
38690b087187M68711M490035J871528M59334L974896N782934N12705o911931q578494
$$ y = [-11388282, -8438340, -3584087, 3660935, 6461638, 2512275, -1016834, 1177390, 4727578, 3742026, -705579, -4949930, -8715500, -11655487, -10281132, -4016437, 1154729, 848184, -991524, 481169, 2095207, -1311078, -6200865, -4809441, 1623501, 3730170, -1135501, -4003002, 2378661, 12587469, 16167537, 11697364, 7594126, 10674683, 18451862, 22741070, 18229991, 7294494, -2397451, -5367663, -3820841, -4403127, -9356035, -13615645, -11980783, -6035923, -1394326, -797003, -3202289, -7064338, -10067235, -7711984, 1893153, 12202483, 13511232, 5385405, -2087187, -1618476, 2871559, 4743087, 5202421, 9177317, 14960251, 15472956, 8561025, -17469]
38681a7469l375684M433507J0101005Q651875j891828j3149086j1291478L839467
38673b699691J3686111M785228j0612990j0751304M418840J3956424O768062m597883
38665A4952797m971907K950901P106103M551969J606013J531479J527938k89671
38657B8965622k191418k858394l525703n847850r610966j1873816q245999J936736
38649a3251788J1296824J0201000q04317r298714n652661M746701R003315L536368
38641I776728k822080k161513K123536J124432o651767j2388813p713796M314096
38633a4399177J1922056Q140974j756051p855580p095157l707914j098055J377769
38625a4471135M173093N288721L357668l85385l832020n169475l037962J356135
$$ y = [-17469, -3393153, 1040354, 11141359, 19793234, 17901406, 4752320, -6539158, -2699691, 10986420, 15771648, 5158658, -5592646, -1173806, 12782618, 19550680, 14952797, 9980890, 12931791, 20037894, 24589863, 26195876, 27727355, 29255293, 28965622, 26774204, 23915810, 20390107, 14542257, 4931291, -6942525, -15188524, -13251788, -1954964, 8246036, 7441719, -1856995, -7509656, -2762955, 6240360, 9776728, 6954648, 4793135, 6916671, 8041103, 1389336, -10999477, -18713273, -14399177, -2477121, 5663853, 3907802, -3947778, -11042935, -14750849, -15848904, -14471135, -10298042, -5009321, -1651653, -2037038, -5869058, -11038533, -14076495, -12720360]
38617a2720360L652121J823647M25271M088219Q648767N974956k899010p956106
38609A037505m980804j254441k735128m141132J637390J0660472J2678935N677677
38601A8580474j934518l062728K60962J738511q43196m155135m412403k029558
38593D142409n11131j172998j362359M75301J237385j270748k475701K388236
38585A450394P712826K954647j0087736j5718851n126746J0135213J3143553L622694
38577H085994m236263k304334L080287L259221q42877k260379J686435O654263
38569A3122347P213209K799772k436098m477721k988110o3398K521340L291780
38561A8983121O42358m368889o633943k726218L060115L256380k637062p488684
$$ y = [-12720360, -9068239, -7244592, -6819321, -2731102, 5917665, 11892621, 8993611, 1037505, -3943299, -5197740, -7932868, -12074000, -10436610, 223862, 12902797, 18580474, 16645956, 13583228, 13844190, 15582701, 14739505, 10584370, 6171967, 4142409, 3631278, 2458280, 1095921, 1571222, 2808607, 1537859, -937842, 1450394, 9163220, 12117867, 2030131, -13688720, -18815466, -8680253, 4463300, 8085994, 3849731, 1545397, 4625684, 7884905, 7042028, 4781649, 6468084, 13122347, 20335556, 23135328, 20699230, 16221509, 13233399, 13170001, 15691341, 18983121, 19625479, 15256590, 8622647, 5896429, 8956544, 12212924, 9575862, 2087178]
38553B087178n747929J559982J0103819J4726651J0165505k952872j3499719j0402550
38545F040065J555158O510688k67468o429595k665787L564357J819549m601736
38537E525231n667320o39906L137399K541690Q57624J027890L358172O513540
38529A6654320O465252r0048p892782p190227J75187M22443r391192j2364145
38521a3211192K241398J7577697J1453495r729431j9740719r985481K981816O034925
38513a2377492M298340M525003L357328j184318k651647J466467L194404k594171
38505a966086r036869q130327j432617N184096Q369089N335890m343225j1505329
38497a7525378m277980J2962139K0720559J0913716j681127k995954K20236l659393
$$ y = [2087178, -3660751, -2100769, 8003050, 22729701, 32895206, 29942334, 16442615, 6040065, 7595223, 14105911, 13838443, 7408848, 4743061, 8307418, 10126967, 5525231, -142089, -781995, 2355404, 4897094, 5754718, 6782608, 10140780, 16654320, 23119572, 23029524, 15136742, 7946515, 8121702, 8544145, -847047, -13211192, -10969794, 6607903, 18061398, 8331967, -11408752, -21394233, -18412417, -12377492, -8079152, -3554149, -196821, -1381139, -4032786, -2566319, 628085, -1966086, -11002955, -19133282, -20565899, -15381803, -7012714, -1676824, -6020049, -17525378, -21803358, -8841219, 11879340, 22793056, 21111929, 18115975, 18336211, 14676818]
38489A4676818q977030l742990O752671O606080m693260j1568346p019724m44156
38481h409937J312230L821785J0348165J2351831L933135n718633n202570J775334
38473A4211340L357125j580877l703207q3745J783794j819374m382461j409863
38465F372732J153163k148853n489929j362974N503341N215545n15458j663696
38457G063871K043396J142942m597511l747474N390866Q149370k299726j0525117
38449B620617k523261J0434411R253067k745507p161837o50829L636531O61555
38441A3524747j952050k304737n692721p907719O80545J3011272J1021192l024680
38433A7355849o463673N697002J0199162m785277j7132694o754403J0547442R328016
$$ y = [14676818, 5699788, 1956798, 8709469, 15315549, 10622289, -946057, -7965781, -8409937, -7097707, -3275922, 7072243, 19424074, 23357209, 17638576, 12436006, 14211340, 17568465, 15987588, 12284381, 12200636, 13984430, 12165056, 7782595, 6372732, 7525895, 5377042, -112887, -1475861, 4027480, 9243025, 8727567, 7063871, 9107267, 10250209, 5652698, 1905224, 7296090, 15445460, 13145734, 2620617, 97356, 10531767, 19784834, 17039327, 9877490, 9226661, 12863192, 13524747, 11572697, 9267960, 3575239, -4332480, -3651935, 9359337, 20380529, 17355849, 10892176, 16589178, 26788340, 22003063, 4870369, -1884034, 8663408, 17991424]
38425A7991424m841927p915745L108171J0474244O841868P19449l490742p676263
38417A5210479p360571J112777O428820k145133j1677003l454034J2037230P928923
38409A8081488j3197870j9439036J20442J8625278J5333715M178988K603722J905212
38401B8211939r259865j7257899o413937R155395N790645r693229r833591R117197
38393a83345K1195382J0426527q170006j3586628n565707K443431L316881j01033
38385I775502l081731l130883k57874K668758K557437K35719r98123l82301L07679
38376G694183M79558P19190Q38091J403414M446092Q869126Q741052P56712r897021
38367B4050397j5256243j2472264l087805R209588J6129189Q920696p795987j5296920
$$ y = [17991424, 13149497, 5233752, 8341923, 18816167, 25658035, 26377484, 22886742, 15210479, 7849908, 8962685, 15391505, 13246372, 1569369, -1884665, 10152565, 18081488, 4883618, -14555418, -14434976, 4190302, 19524017, 23703005, 26306727, 28211939, 18952074, 1694175, -4719762, 4435633, 10226278, 533049, -9300542, -183345, 21012037, 31438564, 23268558, 9681930, 4116223, 6559654, 9876535, 9775502, 6693771, 3562888, 3305014, 5973772, 8531209, 8766928, 7768805, 7386504, 7694183, 8173741, 8892931, 9731022, 11134436, 15580528, 24449654, 33190706, 33947418, 24050397, 8794154, -3678110, -6765915, 2443673, 18572862, 27493558, 19697571, 4400651]
38359D400651l820636J1721328J1201358k640142j0191546m303805K929098J833135
38351A1129441k639522l077086l03501K197072L732498L081190o72034k318126
38343A1129932M116259J2940777J1401080j088477j0580026q817393l228861j945082
38335A3928209j598253K867151P459277O626930K722820L46684j173142l219717
38327B7959959l530307k188574l721061p695190o493109J542520P019869M592933
38319A7487040J986821N175815O266683k312337j2246978j1713301m532802k080431
38311a969490l321972P77393P968187P151920j836139p405851n239457k629376
38303f504785k676528L90145P027926Q253610R41496n525328l998849K62676P14238
$$ y = [4400651, 580015, 12301343, 23502701, 20862559, 10671013, 6367208, 9296306, 11129441, 8489919, 5412833, 5109332, 7306404, 11038902, 14120092, 13448058, 11129932, 15246191, 28186968, 39588048, 38499571, 27919545, 19102152, 15873291, 13928209, 12329956, 15197107, 22656384, 29283314, 32006134, 32352818, 31179676, 27959959, 24429652, 22241078, 18520017, 10824827, 4331718, 5874238, 12894107, 17487040, 19473861, 24649676, 30916359, 28604022, 16357044, 4643743, 110941, -1969490, -5291462, -4514069, 3454118, 10606038, 8769899, 1364048, -3875409, -6504785, -9181313, -8791168, -1763242, 6490368, 7431864, 1906536, -2092313, -1829637, -1115399]
38294a115399M42025M055147P194880L303285m377990o170801P09032Q338385
38286A2378564P357876k851162j2962680j2586475j858022P821609P812335L047822
38278H159867K561809M046913j170708j0167002r836195J393749Q071328Q57079
38270C916840q034662l225815J0009482J3687103L524799o387153m826324K667850
38262A1332120M590501m21804m229303k016984J647872K82750m908653o529108
38254b52609j381452N086064O577755L816887J086750p03473k331551j759881
38246A0138490K078390M505862J456363k902042k988803j866415m364605n173161
38238H84079K607793J0990446O382179n901893o435192O545622J2203575J079116
$$ y = [-1115399, -673374, 3381773, 10576653, 13879938, 9501948, 3331147, 4040179, 12378564, 19736440, 16885278, 3922598, -8663877, -10521899, -2700290, 5112045, 8159867, 10721676, 14768589, 13597881, 3430879, -6405316, -5011567, 3059761, 3916840, -4117822, -7343637, 2665845, 16352948, 19877747, 13490594, 8664270, 11332120, 15922621, 15500817, 11271514, 9254530, 10902402, 11185152, 6276499, -252609, -1634061, 3452003, 10029758, 13846645, 14933395, 14229922, 11898371, 10138490, 12216880, 16722742, 18179105, 15277063, 12288260, 10421845, 6057240, 884079, 3491872, 14482318, 20864497, 14962604, 8527412, 15073034, 27276609, 28355725]
38230B8355725q903808l080216N296816n39048j0665003n974140P816216R650148
38222B1956690j330246o217139N96666M660281n80905l454423K548333O828183
38214B5007440J920059l080753j12874K775442l557115j2008587j0567457j886434
38206a510279K129867m96133j207817L038905N154682M13955n546887m631687
38198b655394K951659R318156Q310790J783187l536729l970400k023356j724683
38190H453230l396761m335022k296108K921740Q389956Q040441q08287r713154
38182G256035o388703O453215J0454206k178144j3804830o317851R605574R544042
38174A4623544o513835j4266691l515120P849373N090567r33105M570641J4842048
$$ y = [28355725, 19451917, 16371701, 21668517, 21129469, 10464466, 4490326, 12306542, 21956690, 20626444, 14409305, 15005971, 19666252, 19085347, 15630924, 18179257, 25007440, 26927499, 23846746, 23733872, 26509314, 22952199, 10943612, 376155, -1510279, 619588, 123455, -1084362, 1954543, 7109225, 7523180, 1976293, -2655394, 296265, 9614421, 17925211, 19708398, 16171669, 12201269, 10177913, 8453230, 5056469, 721447, -1574661, 1347079, 9737035, 17777476, 16969189, 7256035, 867332, 7320547, 17774753, 15596609, 1791779, -4526072, 5079502, 14623544, 8109709, -6156982, -9672102, -1822729, 3267838, 2334733, 6905374, 21747422]
38166B1747422J4383350M142123l332963m881854o173780o545454j137869N115750
38158B3316725J738162r215575j3620228n839130L471659L766305j495205k775268
38150f52555J049992K731114j661227o340074k465441R806009J8570406J3046961
38142C4085185j940274j0755816p076165o79120p31018k657955P24959M864599
38134A5834395J744328m770399n205842j189829j514385m655664j162499P079402
38126F159507P121709k648960p535748j82498P197418L682735k438311M48955
38118A1804807O236421K072995q387313j0432913k477679K877713R03422N88726
38110C186179O167517R054167L778195k084790j466627N75669k434742o125406
$$ y = [21747422, 36130772, 40272895, 36939932, 32058078, 25884298, 19338844, 18200975, 23316725, 25054887, 15839312, 2219084, -3620046, -148387, 3617918, 2122713, -652555, 397437, 3128551, 1467324, -4872750, -7338191, 2467818, 21038224, 34085185, 32144911, 21389095, 14312930, 13633810, 12902792, 10244837, 10969796, 15834395, 17578723, 12808324, 7602482, 6412653, 4898268, 242604, -919895, 6159507, 13281216, 10632256, 3096508, 2914010, 10111428, 13794163, 11355852, 11804807, 18041228, 20114223, 11726910, 1293997, -1183682, 1694031, 2597453, 3186179, 9353696, 18407863, 22186058, 20101268, 18634641, 19210310, 16775568, 10650162]
38102A0650162l591093K035940L601497K084831K408079K709655j190383n264776
38094A3443912l146565R20770k016840q628190o410449N453932J2844341P834092
38086B0295003o63369k957782k180891l967574m559750L82759M652881Q74816
38078A1876093n899040n707967L07158L094038J111114N34128K129069K57283
38070G701876m661112m437538L130139Q516118L363816p431241j1559731l768057
38062i145730Q996094J5282485J0389379N56832m365939k243783M49517n81772
38054A9337083j804576P2281J450024j140720l919525k776657j211780l416587
38046F589543n495326k621387J141137M62550m5790N614475J0968496O146046
$$ y = [10650162, 7059069, 9095009, 12696506, 14781337, 17189416, 19899071, 18708688, 13443912, 10297347, 11218117, 9201277, 573087, -5837362, -383430, 12460911, 20295003, 19631634, 16673852, 14492961, 10525387, 5965637, 6348396, 11001277, 11876093, 5977053, 269086, 576244, 3670282, 4781396, 5315524, 7444593, 7701876, 3040764, -1396774, 1733365, 10249483, 13613299, 6182058, -5377673, -9145730, -149636, 15132849, 25522228, 26079060, 21713121, 19469338, 19918855, 19337083, 17532507, 17604788, 19054812, 17914092, 13994567, 11217910, 10006130, 6589543, 1094217, -1527170, -386033, 76517, 30727, 5645202, 16613698, 22759744]
38038B2759744l777915n701784p48938j731157r283072r903427P0192Q100284
38030b16073P608202P010848R980009O622657n719093j2060660l350844O647539
38022A6522585L279300n481579m640558K033446J394808m118743k041911N882309
38014A2829657O326784j208590k974451N093073J0515506M973505l992369o957550
38006B4605565m833427j634240L129764Q515226Q507352J182698o019797o426433
37998B7026708l342898l362290n875816n535671j544196J736577J925709J065956
37990A2094079P89697o13708m214854o163576j355453Q216029J3065580P497649
37982B9315443k085434n198970p27876M412057P308526J0035885R859347J181289
$$ y = [22759744, 18981829, 13280045, 12531107, 10799950, 1516878, -8386549, -8316357, -216073, 7392129, 14402977, 24382986, 31005643, 25286550, 13225890, 9875046, 16522585, 19801885, 14320306, 9679748, 11713194, 13108002, 8989259, 6947348, 12829657, 19156441, 17947851, 14973400, 20066473, 30581979, 35555484, 31563115, 24605565, 19772138, 18137898, 21267662, 29782888, 38290240, 39472938, 33453141, 27026708, 23683810, 20321520, 14445704, 8910033, 7365837, 9102414, 11028123, 12094079, 12883776, 12270068, 8055214, 1891638, 536185, 8752214, 21817794, 29315443, 27230009, 22031039, 21303163, 25715220, 33023746, 43059631, 52918978, 54100267]
37974E4100267j0669208j1764225j279446L723843n752354j4582996o808131Q011400
37966A4979150R399837k160504q003973j431177N422052M661380K953774N158683
37958C0979222N065307j083458n882129k786680M093841Q193927Q622917N369476
37950E2572423l101208j2293230j2592618l970644R87048l886693p349124J171073
37942A1537027J2440669R905272m516516j2015055l652473P978508P660840k278006
37934B7060266p681088k510080N189547O284951K131670j52776Q61869N22839
37926C1707198k143806j984968K454403M118747j809951q506829o911433k8846
37918A6894515K054298j170391n32649O066425R147342L500851l033556l123754
$$ y = [54100267, 43431059, 31666834, 30387388, 34111231, 28358877, 13775881, 6967750, 14979150, 24378987, 22218483, 14214510, 12783333, 18205385, 22866765, 25820539, 30979222, 36044529, 34961071, 29078942, 26292262, 30386103, 38580030, 47202947, 52572423, 49471215, 37177985, 24585367, 20614723, 21601771, 17715078, 10365954, 11537027, 23977696, 33882968, 29366452, 17351397, 13698924, 21677432, 29338272, 27060266, 19379178, 16869098, 22058645, 28343596, 30475266, 30322490, 31184359, 31707198, 29563392, 27578424, 30032827, 34151574, 32341623, 23834794, 16923361, 16894515, 18948813, 17778422, 17245773, 23312198, 32459540, 35960391, 32926835, 29803081]
37910B9803081k122050p382152j3082469p717102O287793J2753520L636411q970861
37902A3206171q278101N526725J6090430J1830071q14927p521528m365394j35257
37894B5538190j939918n808125m508306J038153L740110Q72487l088023l400095
37886A2444473l19034K443271J367820l931222q878577p252701N76407O069713
37878B520150L673182l88270K865323J0622471J1607259K941867n874141p204765
37870B0763076m287585k707314j485545J632166K717790k848847j0580399j0099421
37862f896079J328954J3612396J4654881M259152n621515m992217K529268N513437
37854B4388277P31422k940955J416436Q025572P549256J159042k912550l289875
$$ y = [29803081, 27681031, 20298879, 7216410, -500692, 5787101, 18540621, 22177032, 13206171, 4928070, 10454795, 26545225, 38375296, 37560369, 30038841, 25673447, 25538190, 23598272, 17790147, 13281841, 14319994, 18060104, 18932591, 15844568, 12444473, 12125439, 14568710, 15936530, 12005308, 3126731, -4125970, -3549563, 2520150, 6193332, 5805062, 8670385, 19292856, 30900115, 33841982, 27967841, 20763076, 16475491, 13768177, 12282632, 13914798, 16632588, 13783741, 3203342, -6896079, -5567125, 8045271, 22700152, 26959304, 21337789, 16345572, 18874840, 24388277, 25119699, 22178744, 23595180, 31620752, 39170008, 40329050, 37416500, 34126625]
37846C4126625n999274j1800574j3026514n460633M653884Q912899O024988j17682
37838A7313719n943388q459159n089635K603106Q290335P462215K559502p97400
37830A7939295o75111K00721j011382l525783l712532M76322O159430Q260314
37822B4111274N749849K228968k37554l217902o176881m919511K28829J249527
37814A9016599o206674j3839101j0847571R58980J0061567J0062662M123217k260558
37806A1069121n381804l333660R21496L36909n359946n594654N113507J4241634
37798A2012603P149180r508563j5431842n175363O632339Q255744L645149N38970
37790H118217l1332O60798J962943L39086o194462j0406250m695959M293901M576725
$$ y = [34126625, 28127351, 16326777, 3300263, -2160370, 2493514, 11406413, 17431401, 17313719, 11370331, 2911172, -2178463, 424643, 8714978, 16177193, 18736695, 17939295, 17264184, 17464905, 16453523, 12927740, 9215208, 9691530, 15850960, 24111274, 29861123, 32090091, 31852537, 28634635, 22457754, 17538243, 17767072, 19016599, 12809925, -1029176, -11876747, -10917767, -856200, 9206462, 13329679, 11069121, 5687317, 2353657, 3275153, 3612062, -1747884, -7342538, -2229031, 12012603, 19161783, 9653220, -5778622, -10953985, -4321646, 3934098, 7579247, 8118217, 8086885, 8747683, 10710626, 11049712, 4855250, -5551000, -10246959, -5953058, -1376333]
37781a376333l9333M029734J3966397J2349581k073597r241759p63613N833851
37773B2684928k371852j1569023n767597N951913N839097l895233q451046n165976
37765b744789k187341j105166J889070M485073L015721J852905M685934M894981
37757A4786388j785344n086527L556577J2615933O571856p916404j1817425l650775
37749G274279J213308k279666l651178J263299L363976j851681o667322n417428
37741f752413k107233m07475J349822K941314K089799K652593J0190629J8253887
37733B8210923J3082901m983076j8206075j4284757j042731O710264N001343R264
37725A4498056k533553k047081j745737m626094p858849m121052O248277J0636527
$$ y = [-1376333, -1415666, 2614068, 16580465, 28930046, 26856449, 17614690, 16851077, 22684928, 20313076, 8744053, 2976456, 8928369, 14767466, 10872233, 2421187, -2744789, -4932130, -6037296, -4148226, 336847, 3352568, 5205473, 9891407, 14786388, 13001044, 7914517, 11471094, 24087027, 30658883, 22742479, 10925054, 7274279, 8487587, 6207921, 2556743, 3820042, 7184018, 5332337, -1334985, -6752413, -8859646, -9267121, -7917299, -4975985, -2886186, -233593, 9957036, 28210923, 41293824, 36310748, 18104673, 3819916, 2777185, 9487449, 14488792, 14498056, 11964503, 9917422, 8171685, 3545591, -4313258, -8434310, -2186033, 8450494]
37717H450494J243731r763499n665750R202276J5376256P015853l001409o061369
37709A6796583o725127o807024p78609P813888N559850p008596j0488277L253248
37701A615936J4782744O026705j0775778j1690878L042789J1988135M937256o922968
37693A3003941j1124968p370208m56461O133815P935968K392002m251874k774333
37685C487882N273330R108851M768762l39662n16134R58042Q69444K265885O263527
37676C2139927O705523L21154n082947j533019N268603L629167m946831o174984
37668C0326593N539522J7539746J6948700Q978214P988730J6746368K6114348
37661A30182221L2054300L9536497M8848302N1886735M6709124M2317514M0465046
$$ y = [8450494, 9694225, -69274, -5735024, 3467252, 18843508, 25859361, 22857952, 16796583, 10071456, 3264432, 2485823, 10299711, 15859561, 8850965, -1637312, 1615936, 16398680, 22425385, 11649607, -41271, 3001518, 14989653, 19926909, 13003941, 1878973, -5491235, -5947696, 186119, 8122087, 10514089, 6262215, 3487882, 8761212, 17870063, 22638825, 22299163, 21783029, 22741071, 23610515, 25876400, 32139927, 38845450, 39166604, 34083657, 32550638, 37819241, 41448408, 36501577, 30326593, 35866115, 53405861, 70354561, 79332775, 87321505, 104067873, 130182221, 162236521, 201773018, 250621320, 302508055, 349217179, 391534693, 431999739]
37654D31999739K5313212j4876654o3436613q8685176p9797825n5596104l7878757
37647A17041822k9975244k4441967j8282721j2943648p940447k359907J854956
37640B2952844L141938K848434J422731k748548p511810o200526K288842Q267506
37632B4461411K899237q368156j1510834k299025Q072232P594504j865977q676899
37624A0306493p059762k571877j614444k059702R50819M707565K448274m423927
37616F83439o823630j847120L173462L316243K740052L873788Q57426q162557
37608b188897j2508822l839359Q721497J0850759L830535l25034J053933R97687
37600F592299j199821K32942L601593J678432k832287k67052O759062M676831
$$ y = [431999739, 457312951, 442436297, 378999684, 290314508, 210516683, 154920579, 117041822, 87066578, 62624611, 44341890, 31398242, 23457795, 21097888, 22952844, 26094782, 28943216, 30365947, 27617399, 20105589, 13905063, 16193905, 24461411, 27360648, 18992492, 7481658, 5182633, 13254865, 20849369, 18983392, 10306493, 3246731, 674854, -939590, -2999292, -2048473, 2659092, 5107366, 683439, -6140191, -7987311, -4813849, -1497606, 1242446, 5116234, 5973660, -2188897, -14697719, -18537078, -9815581, 1035178, 4865713, 4540679, 5594612, 6592299, 5392478, 5625420, 9227013, 10905445, 8073158, 7806106, 14565168, 19241999]
37592A9241999p349675j3033612m235395O508357O944224K631147L276332N882738
37584A9866115L554184p27845j531977k230087o631844q328736j008485Q147197
37576A1108522Q079502P11170m009797m219440m717806m405060J231539P844496
37568A1623126N977574l316724q769024n626229j032575q26142j304060J983633
37560a290421N503548L300586l289691o526215j867015N930696P455398j08682
37552I108204q289137p655981j218879j62573n830231o395712M005261J3964385
37544b474663J1392327J806977j783692J93213k405775q854673p029863N298926
37536c857223J3472652N813179j0082729j7438488r789555M957324J4688044J2802273
$$ y = [19241999, 11892324, -1141288, -5376683, 1131674, 8075898, 10707045, 13983377, 19866115, 23420299, 22692454, 21160477, 18930390, 12298546, 3969810, 2961325, 11108522, 19188024, 19899194, 15889397, 11669957, 6952151, 2547091, 3778630, 11623126, 17600700, 14283976, 5514952, -111277, -1143852, -1969994, -3274054, -1290421, 4213127, 7513713, 4224022, -2302193, -4169208, 1761488, 9216886, 9108204, 819067, -6836914, -8055793, -8218366, -14048597, -20444309, -16439048, -2474663, 8917664, 10724641, 8940949, 9134162, 6728387, -2126286, -9156149, -3857223, 9615429, 15428608, 5345879, -12092609, -21882164, -16924840, -2236796, 10565477]
37528A0565477J952975p934602q094169J36663P057361O112496L94086l070656
37520G119631j690488J495465K047385j582654o030627n814782n53737K724964
37512b284843j176616o485119l386058O706476J1275421M166961n377929n984647
37504b546354L78485L151446r12173m755342k903874J379006K809359K030616
37496a368831K825937M808514L807237j119985n425511n084862j702384M87031
37488b772854L45244j79466j31884l22669p51784n52845k94635j112492j646168
37479g419553N63879M313308N247751K068129j584491k728010k672110l309438
37471e520535l561951j931705M74049J816232J957360J380574L07299K591J738927
$$ y = [10565477, 12518452, 4583850, -3510319, -3373656, 3683705, 9796201, 10190287, 7119631, 5429143, 6924608, 8971993, 7389339, 1358712, -4456070, -5009807, -2284843, -3461459, -9946578, -13332636, -6626160, 4649261, 8816222, 3438293, -2546354, -2167869, 983577, 71404, -4683938, -7587812, -6208806, -3399447, -1368831, 1457106, 6265620, 10072857, 8952872, 3527361, -1557501, -3259885, -2772854, -2427610, -2607076, -2738960, -3061629, -3813413, -4366258, -4660893, -5773385, -7419553, -6855674, -2542366, 2705385, 4773514, 3189023, 461013, -2211097, -5520535, -9082486, -11014191, -10540142, -8723910, -6766550, -5385976, -5078677, -5076086, -3337159]
37462c337159L552340K078804j251761q13244M423255P959679M588892k785696
37454A4415110q288218r883884p602407q68876P426647R788857L400479l848669
37446D539039l353004J867073K119616m394604r867099q631032l047484K639274
37438a8128221P447969J0984247J0993605O150490j517937q258874j0928053q157412
37430a1414186j554061M672565P181243N949548K532960j583071l689800r41350
37422A153848M573562O067813J093121l790023j916647L864875N871670K505379
37414A9423598j457584k961441l049756k791624k151507j638535j055806J035965
37406E353310L191709Q93176n011846n903718J627679P175265Q67685r617998
$$ y = [-3337159, 215181, 2293985, 1042224, 228980, 4652235, 12611914, 17200806, 14415110, 6126892, -3756992, -11359399, -12228275, -4801628, 4987229, 8387708, 4539039, 1186035, 3053108, 5172724, 778120, -9088979, -17720011, -20767495, -18128221, -10680252, 303995, 11297600, 17448090, 15930153, 7671279, -3256774, -11414186, -12968247, -8295682, -1114439, 4835109, 7368069, 5784998, 2095198, 1153848, 5727410, 11795223, 12888344, 9098321, 7181674, 11046549, 16918219, 19423598, 17966014, 15004573, 11954817, 9163193, 7011686, 5373151, 4317345, 5353310, 8545019, 9438195, 4426349, -1477369, 150310, 7325575, 8193260, -1424738]
37398a424738r336788M64276M560942j145359l755877L460151Q883394K439165
37390D145166o620353m642451L885534L900101n202875p878226L412745J5879018
37382F878659J3926686K16964q715684m361910M077602L347001o183105j2010720
37374b824507p282382K98294J050738j878179J190170Q819272Q814121k091168
37366F096359j0667773n646409N827599R413763M267055J119213L430255L293181
37358A7133243l172770q363587n567718O35246K566223Q32166L82251Q67073o33592
37349D678535j105686M303774J0792006P188766o708986j5940626r431571M261601
37341a962187Q145560j129117j1186597j1536920m140131L709508Q292347Q800621
$$ y = [-1424738, -10761526, -10297250, -5736308, -6881667, -10637544, -7177393, 1706001, 4145166, -2475187, -7117638, -3232104, 667997, -4534878, -12413104, -9000359, 6878659, 20805345, 21022309, 12306625, 7944715, 12022317, 15369318, 9186213, -2824507, -10106889, -9808595, -8757857, -10636036, -9445866, -626594, 8187527, 6096359, -4571414, -10217823, -4390224, 5023539, 9290594, 10409807, 13840062, 17133243, 13960473, 5596886, 29168, 664414, 3230637, 4062803, 4445054, 5312127, 4678535, 3572849, 7876623, 18668629, 25857395, 19148409, 3207783, -6223788, -1962187, 6183373, 5054256, -6132341, -17669261, -21809392, -18099884, -9807537, -1006916]
37333a006916N166139N74009O65445N938626R176012M698305l378604o662247
37325A5170769l502142M09103Q85523m24145q40980j326143l895477o525749m216586
37316d265827L626029R505966N650774m712532r514979l681620L553181K375766
37308B536758l093103k570418L402627N680649K672013J051966J219398l145331
37300G754559r514406o904622L562804N930351m404082r537686K912831J7163968
37292F963717J2372300m825854j1955264n699460j832881m704835j817121R501170
37284a998228J3921688L946102o178047k824292O781586Q541861K982545j45949
37276B5027266L06710k274916q349582j0721252n826722J496806M622308J975494
$$ y = [-1006916, 4159223, 4733232, 5398677, 11337303, 20513315, 25211620, 21833016, 15170769, 11668627, 12077730, 12963253, 12539108, 11698128, 10371985, 6476508, -49241, -4265827, -639798, 8866168, 14516942, 9804410, 289431, -3392189, 160992, 2536758, -556345, -3126763, 275864, 5956513, 8628526, 9680492, 10899890, 7754559, -1759847, -8664469, -5101665, 828686, -3575396, -13113082, -10200251, 6963717, 19336017, 14510163, 2554899, -3144561, -4977442, -9682277, -11499398, -1998228, 11923460, 15869562, 9691515, 6867223, 13648809, 22190670, 25173215, 25027266, 25333976, 23059060, 14709478, 3988226, -1838496, -341690, 4280618, 6256112]
37268F256112k278606k330383K853595P079752M534383j086261j392748L191451
37260A6827295L611129k552741o295343k164039K097895j767296q687634q535650
37252g466384k440000m91411n687795r759162n465650M124325J0610149J0253371
37244f322557O864713N983994P268559M464930m834241j2313166q276386L263496
37236c900658Q130949K345427j976358L615065R567233L603696q734340j1923084
37228G27930l547444M519824N789951N270359M985867j249821j2975136j6680632
37220a3159102m240649J1883994J3712412K181316o014779l279419Q40673j859603
37212F4843n191124j070626N316248L736171l505117m613553K436570O309558
$$ y = [6256112, 3977506, 1647123, 4500718, 11580470, 16114853, 15028592, 13635844, 16827295, 20438424, 17885683, 11590340, 9426301, 11524196, 9756900, 1069266, -7466384, -9906384, -10397795, -16085590, -25844752, -31310402, -27186077, -16575928, -6322557, 542156, 6526150, 13794709, 18259639, 13425398, 1112232, -7164154, -3900658, 4230291, 6575718, 4599360, 8214425, 17781658, 21385354, 12651014, 727930, -2819514, 1700310, 7490261, 12760620, 17746487, 16496666, 3521530, -13159102, -17399751, -5515757, 8196655, 10377971, 4363192, 1083773, 1924446, 64843, -5126281, -6196907, -880659, 2855512, -649605, -5263158, -2826588, 3482970]
37204C482970P17312n404035k851154K537455k19124q432067r342157n38373O062706
37195a3986467K883049k349129j45292N643842N126014j074695l019802K268075
37187d654405N880194J009053o247524n799232J659445O154130L227621o08790
37179F20492P50640L396563P14784m689292m406845K092222N830357J745077m213866
37170A840132m879700j882905r34872k658706l889284l882641l287364l84817
37162a9960157N413190R047687N476253j654143l564673J737374P075602O268564
37154I839697J494841j131080L14761K028215k07150n345262p508420l277128
37146c791526K879415M100389R99231K06865L046121L370471j347064n231015
$$ y = [3482970, 4200282, -1203753, -4054907, -1517452, -1736576, -10168643, -19510800, -20049173, -13986467, -11103418, -13452547, -13597839, -7953997, -2827983, -3902678, -6922480, -4654405, 1225789, 2234842, -4012682, -9811914, -8152469, -1998339, 1229282, 620492, 1371132, 4767695, 5482479, 793187, -3613658, -1521436, 4308921, 6053998, 1840132, -3039568, -4922473, -5857345, -8516051, -12405335, -16287976, -19575340, -19960157, -14546967, -5499280, -23027, -1677170, -5241843, -3504469, 3571133, 9839697, 11334538, 10203458, 10518219, 12546434, 12339284, 6994022, -514398, -3791526, -912111, 3188278, 4187509, 4394374, 7440495, 10810966, 9463902, 4232887]
37138D232887l986305j255582n25864N08532K384179M43260m847116n011710J390403
37129f667316L109756m447476p750624L224980J5042207J0126177m997306j0995454
37121c355056o352979m367495o292828k172171N080886K573914n756477j998650
37113b2640856J2934696J6517323J604417j0263009l371456Q852856Q820075J144529
37105A3598575j802130j711668m720956n771453O67770P355316O741799M140408
37097A8497661M856048K033262p981854j2490558j672894J1654893R676657l416205
37089B1157010j0034082n926449o67915J066646J781338R86233k104682k180161
37081D077938K596980L421464l482923n884455L861182J0896713P00797j3407955
$$ y = [4232887, 246582, -1009000, -1534864, -1026332, 1357847, 1801107, -3046009, -8057719, -6667316, -3557560, -8005036, -15755660, -12530680, 2511527, 12637704, 7640398, -3355056, -9708035, -14075530, -20368358, -22540529, -17459643, -14885729, -20642206, -22640856, -9706160, 6811163, 8415580, -1847429, -5218885, 3633971, 12454046, 13598575, 11796445, 10084777, 5363821, -407632, 260138, 7615454, 14357253, 18497661, 23353709, 25386971, 17405117, 4914559, 3241665, 14896558, 24573215, 21157010, 11122928, 5196479, 4528564, 5595210, 7376548, 8362781, 6258099, 4077938, 6674918, 10096382, 6613459, 729004, 4590186, 15486899, 16187696, 2779741]
37073B779741j0070700L904207N354319m937972n223295O741363R549964k239548
37065E858079p384881L896853J1937792K265263r095267l832169P599938N068700
37057A6314308p489133j0264274M60851R652620P942480J056871l272119l941629
37049A0459975k486308n11298m00337j840822n31789M075077N150559o72393n193895
37040H048769o1698R192094J0480931K735485m256557n632793o534917j0773427
37032C197887j3841347j0508240k962088K514801L373008K147262J918587K892457
37024a1267673L122310J350081j422966l203972l109883j428795J439922M521940
37016i999036N721775M061456J836354J878655L007869J177086m465340r199482
$$ y = [2779741, -7290959, -3386752, 1967567, -2970405, -8193700, -1452337, 8097627, 5858079, -1526802, 2370051, 14307843, 16573106, 7477839, 3645670, 11245608, 16314308, 8825175, -1439099, -978248, 8674372, 16616852, 17673723, 14401604, 10459975, 7973667, 7462369, 7062032, 5221210, 4689421, 8764498, 13915057, 13242664, 8048769, 7987071, 17179165, 27660096, 30395581, 26139024, 20506231, 13971314, 3197887, -10643460, -21151700, -24113788, -21598987, -18225979, -16078717, -14160130, -11267673, -8145363, -6795282, -8218248, -11422220, -14532103, -15960898, -14520976, -9999036, -4277261, -215805, 1620549, 3499204, 6507073, 7684159, 3218819, -5980663]
37008e980663p396828J441720J1281319J3988171O839927l869910r325165q590864
37000a612293q055853r650834o942368K925898J1266752R413417K105900M3823
36992e05558L551023M054489q02622m425713l045007j34725J323175J854921N04319
36983B374302m073143p326180l302221L927242L751434m394110q866481l462959
36975b1372116L692569L968490Q01029J605579N454330O671119M725133L014283
36967H560416K006614J58543j588461j853868k530965n443642p744968n274055
36959a3710386J267270P230416R504039Q130917M387268L02453j370411M15416
36951A6156982L111114K855939j589451p623241j0733340p899697n53271N961310
$$ y = [-5980663, -13377491, -11935771, -654452, 13333719, 20173646, 16303736, 6978571, -1612293, -9668146, -19318980, -26261348, -23335450, -12068698, -2655281, -549381, -505558, 3045465, 7099954, 6297332, 1871619, -1173388, -1308113, 15062, 1869983, 2374302, -1698841, -9025021, -12327242, -8400000, -4648566, -9042676, -17909157, -21372116, -17679547, -13711057, -12910028, -11304449, -5850119, 821000, 5546133, 8560416, 10567030, 10725573, 9137112, 7283244, 4752279, -691363, -8436331, -13710386, -12443116, -5212700, 4291339, 12422256, 16809524, 17111977, 15741566, 16156982, 19268096, 22124035, 20534584, 12911343, 2178003, -5721694, -6274965, -313655]
36943c13655P191145L593583r68120l574153m308305n540541r392010j3608168
36935b6920224j1085371J409824J4854240J6322482O765279M42874L640155O187499
36927A1616758L50577n672818l723613j477883p105308j0054907L101563K1420825
36919H455194K0639700o54859j7596708j3695316N91868P940747N182414j356920
36911I506120o400672n719026J899673Q584261N017015m170295n859440J95672
36903C053308J417358m863631p000403j003124K226805k344748m929589n44220
36895a3988244J290073l819229m251873O909625J7005982J2838949J57699q355393
36887G787589j0753990r606931k525046Q435765J1998019N079130O99351N869464
$$ y = [-313655, 6877490, 10471073, 9502953, 5928800, 1620495, -3920046, -13312056, -26920224, -38005595, -36595771, -21741531, -5419049, 1346230, 1789104, 5429259, 11616758, 11967335, 6294517, 2570904, 1093021, -6012287, -16067194, -12965631, 8455194, 29094894, 28440035, 10843327, -2851989, -2260121, 5680626, 10863040, 9506120, 3105448, -2613578, -713905, 7870356, 12887371, 8717076, 2857636, 3053308, 4470666, -392965, -7393368, -8396492, -6169687, -8514435, -13444024, -13988244, -12698171, -16517400, -20769273, -13859648, 3146334, 15985283, 16142982, 7787589, -2966401, -12573332, -15098378, -6662613, 5335406, 10414536, 11113887, 16983351]
36879A6983351P805377k982438j3088323q038695K363268J540810n278065l119822
36871c814537M296904L290501k074770K486501J2471256J0170971l571028r861052
36863A3394746m073034j549503p975614r395016J327743J0697209O946973k241285
36855G132219m673737j441083L275j324559k629972l627401l903061j840396N14002
36846a1790713k90915j132237L382583Q836019N671631l537552n676079J789757
36838b747506O111176L6952p115833n512324Q97578L504851J691035q71278l335974
36829g341323m519425q37021O622388J0141357N516131k015929n254822k473284
36821a61928L786138Q479472N304025n163931j0640343j921046R939106O457316
$$ y = [16983351, 24788728, 21806290, 8717967, 679272, 3042540, 4583350, -694715, -3814537, 482367, 3772868, 1698098, 4184599, 16655855, 26826826, 23255798, 13394746, 9321712, 7772209, -203405, -9598421, -8270678, 2426531, 9373504, 7132219, 2458482, 1017399, 1020674, -303885, -2933857, -6561258, -10464319, -12304715, -11790713, -12081628, -13213865, -9831282, -995263, 4676368, 1138816, -4537263, -2747506, 3363670, 3400622, -3715211, -9227535, -8329957, -4825106, -3134071, -4005349, -7341323, -11860748, -12697769, -6075381, 4065976, 9582107, 7566178, 2311356, -161928, 3624210, 12103682, 17407707, 12243776, 1603433, -317613, 9621493, 16078809]
36813A6078809r012235j3447084J312089J6103143J3872417K227041m385891p024426
36805A5723863j2174960j4376917o134121N248673P523736K843071J891486M831128
36797E375959L269286l070273o202273m011731j647694n78121J931459L914815
36789a018573P16519m769327m568027J549725N368903K908403r30163j351003
36781b093543M15205J590720K032961K524736L154056L705915L013915j64460
36773A4179505l378676k057606J992921L99820q140776j2107952l436316Q251279
36765d297801Q878303Q48808k688030L37712N66638l264605j729545O203429Q313859
36756A3168768p33945r111389n821564L485860P932007P620854P747460N860080
$$ y = [16078809, 7066574, -6380510, -5068421, 11034722, 24907139, 27134180, 22748289, 15723863, 3548903, -10828014, -16962135, -11713462, -4189726, -1346655, 544831, 5375959, 8645245, 5574972, -627301, -4639032, -6286726, -6864847, -4933388, -1018573, -302054, -5071381, -9639408, -8089683, -2720780, 187623, -742540, -2093543, -1678338, -87618, 1945343, 4470079, 7624135, 11330050, 14343965, 14179505, 10800829, 8743223, 10736144, 11135964, 2995188, -9112764, -12549080, -4297801, 4580502, 5429310, 2741280, 3078992, 3645630, 381025, -1348520, 4854909, 13168768, 12434823, 3323434, -2498130, 987730, 8919737, 16540591, 24288051, 30148131]
36748C0148131k491916j1694344j2354404o051022k211058k974517k764625r41275
36740a1335030k120707l926764J817789J2670335J4140558J355748j0181840n508214
36732c088125P834891J1268792K187743m958658k526584L64295n117534j3231971
36724g267151j3414551n666964J779858M846880N831225O131784M174052L37162
36716c247705j837148p76322L67834j920394n949910n775122J310004R400505
36708h428258R429278J113994n157741k217399L328470J616437m025729k123805
36700f464753P358364J1856307O274055O0165n03098k421606j0121845j3644611
36692g607022m815079O588110P037312R9778k154852k14835k413169n715366n83856
$$ y = [30148131, 27656215, 15961871, 3607467, -2443555, -4654613, -7629130, -10393755, -11335030, -13455737, -17382501, -15564712, -2894377, 11246181, 12601929, 2420089, -3088125, 4746766, 16015558, 18203301, 13244643, 10718059, 11082354, 5964820, -7267151, -20681702, -26348666, -24568808, -19721928, -13890703, -7758919, -3584867, -3247705, -5084853, -5861175, -5493341, -7413735, -13363645, -19138767, -17828763, -8428258, 1001020, 2115014, -3042727, -5260126, -1931656, -315219, -4340948, -6464753, 893611, 12749918, 19023973, 19084138, 18581040, 16159434, 6037589, -7607022, -12422101, -5833991, 1203321, 1303099, -851753, -1066588, -3479757, -9195123, -9778979]
36683i778979Q415338P302097k297768l720109O131979R848435j573760j2644275
36675A682958p808803M420097O432204j163645l350322M439620J0647735O116511
36667B1416355l297385n668293J392909P852242L818690o785829r811501o50091
36659H267097P112727R89447j0257356r726046n9186R58116q659769j0729204
36651b2104174J739503J1452078N690758k550501K462850J2598117J0637891j531806
36643A8394716q974128q546219q514621r842792o323064N51616L511179L304175
36635a6439138N526086P305715K585547k861971J607533J1525951J1483369o28954
36627B0104138j0226823q589707k961654j162149j099280J59969M19442K8566
$$ y = [-9778979, -1363641, 5938456, 3640688, -79421, 6052558, 15900993, 14327233, 1682958, -6125845, -1705748, 4726456, 3562811, 212489, 4652109, 15299844, 21416355, 18118970, 12450677, 13843586, 21695828, 25514518, 18728689, 8917188, 8267097, 15379824, 16369271, 6111915, -3614131, -3673317, -2715201, -11374970, -22104174, -20364671, -8912593, -3221835, -5772336, -3309486, 9288631, 19926522, 18394716, 9420588, 874369, -7640252, -17483044, -23806108, -23254492, -19743313, -16439138, -10913052, -3607337, -1021790, -3883761, -2276228, 9249723, 20733092, 20104138, 9877315, 1287608, -1674046, -2836195, -3935475, -3775506, -3356064, -3327498]
36619c327498L194291P546392M792852l991561o752233M53202N895836Q53821
36611H665102o741019o336539j096116M88957k28013K541776N469380J126285
36603C889813p148696q193722l41747N432493J616514n730459o669327m87014
36595a7632145N649846P079455N574073M283994L404970J924679L69704o62820
36587I991756k590367o049617p455655l170442L227199M093669n67571j984509
36579d505537L434977P343033K737438m158014m070574M20412J026520j208267
36571A019988J37654K490990j132294n752945K08802J2595388J3062314k270145
36563B0359752j3984882p964686L972553M332814l652399n439119j81691J300424
$$ y = [-3327498, -133207, 7413185, 12206037, 8214476, 1462243, 1915445, 7811281, 8665102, 1924083, -4412456, -5508572, -5019615, -5247628, -2705852, 2763528, 3889813, -3258883, -11452605, -11794352, -6361859, -4745345, -10475804, -17145131, -17632145, -11982299, -4902844, 671229, 4955223, 8360193, 10284872, 10654576, 9991756, 7401389, 1351772, -6103883, -9274325, -6047126, -1953457, -2521028, -4505537, -1070560, 6272473, 9009911, 4851897, 781323, 1201735, 2228255, 1019988, 1157642, 3648632, 2516338, -3236607, -3027805, 9567583, 22629897, 20359752, 6374870, -1589816, 2382737, 6715551, 3063152, -2375967, -2557658, -1257234]
36555a257234k473661k209331M197439P718349L495402k430964l867304j821094
36547A351602P08207K397788Q39770n236072j0005327n792350M380552Q763562
36539b592268L396200k952455l203722j031348q51871O89555N785711P338906
36531F578708k46390q929475p068834K455904O165757O71368k985346K237554
36523a120754Q267941N088189l765103o976028j762545L919694L891269J097549
36515H640212J101876L300606K008171m820143j0642483o615690O280085J4722209
36507A3974843P493949q997116j6781840q935325K378929M308937K39441K63981
36499f054201L238306Q01390n429127n250248J987624N178635K90676k567892
$$ y = [-1257234, -3730895, -5940226, -1742787, 5975562, 9470964, 7040000, 3172696, 1351602, 2059809, 4457597, 5297367, 61295, -9944032, -15736382, -11355830, -2592268, 803932, -2148523, -5352245, -6383593, -7235464, -6545909, -760198, 6578708, 6332318, -2597157, -9665991, -7210087, -1044330, -372962, -3358308, -1120754, 7147187, 12235376, 8470273, 1494245, -268300, 3651394, 7542663, 8640212, 9742088, 13042694, 15050865, 10230722, -411761, -7027451, -747366, 13974843, 21468792, 12471676, -4310164, -13245489, -10866560, -6557623, -6318182, -6054201, -2815895, -2014505, -7443632, -12693880, -10706256, -5527621, -5236945, -7804837]
36491g804837L151990Q458200L445692o376910q903822l027611L203682O064414
36483a789202O970519M631121k130791o800329k003495P593272J0405644N075898
36475B1952637P09771j22877n046156j5014870j7595470n413125R419147J0469092
36467f41851j23183o030020p93440N375670L890158K16687J748684L330068m040713
36458B932060j4928679j3436072K964598J6308992J1689990k234715o617210J096968
36450b224068P262829M688140J22155j078195k587948n815081n124472J1205J443740
36441c301695k352063j220071P866031J1567257J656783q472908m310468N340619
36433F773485L398600n925126m802408O452625R134764k493130j2469847r799674
$$ y = [-7804837, -4652847, 3805353, 7251045, 874135, -8029687, -11057298, -7853616, -1789202, 5181317, 9812438, 7681647, 881318, -1122177, 6471095, 16876739, 21952637, 22662408, 22539531, 17493375, 2478505, -15116965, -20530090, -11110943, -641851, -765034, -6795054, -7588494, -2212824, 1677334, 1894021, 3642705, 6972773, 2932060, -11996619, -25432691, -22468093, -6159101, 5530889, 3296174, -3321036, -2224068, 5038761, 9726901, 9849056, 8770861, 6182913, 367832, -4756640, -4745435, -3301695, -5653758, -6873829, 992202, 12559459, 14216242, 5743334, 1432866, 6773485, 10172085, 4246959, -555449, 5897176, 15031940, 12538810, 68963, -9730711]
36425i730711l133012j983571j789279L088189P077723M636212J402686L774612
36417C342849P204002M444635k558432p383019q783403q501470n894767j043417
36409a9173022K580200L451448M230848N481212M290386J758785L015053O562697
36401A2197607L751209o354972j1891894m562781P737061J1657876M635565n537734
36393A1631937j0844798p958600N37309O308518L198456l546408m113215K84861
36385d501940K80928l613056j265670P152397R472149L880334L074515R250087
36377B3729744O897665q521389j7532564p811441L761218p4009p125100P37791
36369e938085J2614935O453065j1193720j4844988k009071O179192K981641L304135
$$ y = [-9730711, -12863723, -14847294, -16636573, -13548384, -6470661, -1834449, -431763, 3342849, 10546851, 14991486, 12433054, 5050035, -3733368, -12234838, -18129605, -19173022, -16592822, -13141374, -8910526, -3429314, 861072, 2619857, 5634910, 12197607, 15948816, 9593844, -2298050, -6860831, 876230, 12534106, 17169671, 11631937, 787139, -7171461, -6634152, -325634, 2872822, -673586, -4786801, -4501940, -4221012, -7834068, -9099738, -1947341, 7524808, 11405142, 14479657, 23729744, 30627409, 22106020, 4573456, -3237985, 523233, 449224, -6675876, -5938085, 6676850, 13129915, 1936195, -12908793, -14917864, -8738672, -5757031, -2452896]
36361b452896J1759438J3617717L097740o097393n521766l192410l494672J51407
36353G867165N453111p79819j5264388j4739426O528437K0779230O688149j6738187
36345b05728j8518499n05200J1144317P372626K728523N525646O459276j080948
36337A2920013r002093q232368j245756M054455M100212K19414m024872m560169
36329e771164p45453K680300J471229k506494n206654n827407l996077K579143
36321a7322577J1548922J3579505M765138m793108m698374p31142n110142j4314390
36313a7076168j2222833L740487J5454327R475100l392837m309132O293999J0600310
36305H563253K93179j1288898q284520N253295J0835676P05395j2132626j2158624
$$ y = [-2452896, 9306542, 22924259, 26021999, 19924606, 14402840, 11210430, 7715758, 7867165, 13320276, 12540457, -2723931, -17463357, -10934920, 9844310, 16532459, -205728, -18724227, -19229427, -8085110, -712484, 2016039, 7541685, 14000961, 12920013, 3917920, -4314448, -5560204, -1505749, 2594463, 2813877, -1210995, -5771164, -6516617, -3836317, -2365088, -4871582, -10078236, -15905643, -19901720, -17322577, -5773655, 7805850, 12570988, 7777880, 3079506, 2348364, -2761778, -17076168, -29299001, -25558514, -10104187, -629087, -4021924, -8331056, -2037057, 8563253, 8856432, -2432466, -10716986, -5463691, 5371985, 6077380, -6055246, -18213870]
36297a8213870j873797L421529k541587r995535q453220J29714P385437J0328726
36289a9812603J1050685R591923M412200j667277k440574L549939R418159O405859
36281B0508311o358555j8862800j8408752l114538J3841544J7226835O557811
36274A1389856m695195o386404j737322J304550J257541J185580J468027M99778
36266D286411o76485J91920K249800K602185L66469k831472m613461k814634K162750
36257I23483M997006K58107q639116j1195241l668355N195508O821980M595709
36249g10919O255039J0057459P500026k448362j0399807q357930J386535R721737
36241A3003778R018656j300688j3331061j5827635n247202Q820611J3173907N476195
$$ y = [-18213870, -20087667, -16666138, -19207725, -29203260, -37656480, -37526766, -30141329, -19812603, -8761918, 830005, 5242205, 3574928, 1134354, 4684293, 14102452, 20508311, 14149756, -4713044, -23121796, -26236334, -12394790, 4832045, 11389856, 6694661, 308257, -1429065, -124515, 1133026, 2318606, 3786633, 4286411, 3609926, 3801846, 6051646, 8653831, 9020300, 6188828, 1575367, -1239267, 923483, 5920489, 6178596, -2460520, -13655761, -17324116, -12128608, -5306628, -710919, 5544120, 15601579, 23101605, 20653243, 10253436, 1895506, 3282041, 13003778, 22022434, 20721746, 7390685, -8436950, -13684152, -4863541, 8310366, 13786561]
36233A3786561m271454n992797L73286O858064O449055l26644o346361n666075
36225D863635l24635K696060Q64434j790966k379558l147329n716951p396427
36217a2331737o252611l798714K93292Q539841J6766542J4493721J089370q477022
36209A0322682l960611L757345j30367r384977o689841O181592R179812l542948
36201E732687j2959517m586320R628160J0891668R49894m902779k750754j915766
36193H7273o073672p691903j969113N431461P344748L627433j666208n071719
36185e981700l729997L162330J0328355R371200p41573j0372439j0167111k081565
36177a0212500M553806N314137L795614L385224K086200k190022o159614n604874
$$ y = [13786561, 9515107, 3522310, 3895596, 10753660, 17202715, 16876071, 10529710, 4863635, 4539000, 7235060, 8099494, 6308528, 3928970, 781641, -4935310, -12331737, -18584348, -22383062, -22089770, -13549929, 3216613, 17710334, 18799704, 10322682, 6362071, 10119416, 9989049, 604072, -6085769, 95823, 9275635, 5732687, -7226830, -11813150, -2184990, 8706678, 9656572, 4753793, 2003039, 87273, -5986399, -13678302, -15647415, -10215954, -2871206, 756227, -909981, -5981700, -9711697, -6549367, 3778988, 13150188, 12408615, 2036176, -8130935, -10212500, -5658694, -344557, 3451057, 6836281, 8922481, 6732459, 572845, -5032029]
36169e032029k532668k357584m783192l714341K398802O483091L040766k682528
36161i179683j620511N894571J0347957N951441k414736o187949k802704L042026
36153C030412N074159J572582k678387j443538M361291O146063o46873q186218
36145G229491o208113K411388N068395j853832p943745n154400J111135L039584
36137b300097K891757N448601N704772l465672j4884019j2438122N027489J7974534
36129C959243J1184433n024106q888434K576539J0086620J58261j5177493j4922644
36121a6047581J308848J2190589L688811j2162962j4215407k03523J2721022J2528695
36113a91508N312144J550270R25467j956344n221846l396164R76684K55372m927344
$$ y = [-5032029, -7564697, -9922281, -14705473, -18419814, -16021012, -9537921, -6497155, -9179683, -10800194, -4905623, 5442334, 11393775, 8979039, 2791090, -11614, 3030412, 8104571, 9677153, 6998766, 5555228, 9916519, 16062582, 15415709, 7229491, 1021378, 3432766, 8501161, 6647329, -1296416, -6450816, -5339681, -2300097, 591660, 6040261, 11745033, 8279361, -6604658, -19042780, -14015291, 3959243, 15143676, 10119570, 1231136, 3807675, 13894295, 14052556, -1124937, -16047581, -14738733, -2548144, 1140667, -11022295, -25237702, -25441225, -12720203, -191508, 5120636, 6670906, 7596373, 5640029, 418183, -2977981, -2001297, -1745925, -6673269]
36104f673269n738499L14443N072434K978034j212799k778866n022560r263452
36096b2324534o592287Q446743K2617712J7438355l908931j8257418j3021270
36089a5601630n09523L307847R1602J19937L894371N034667L706394M376756M953127
36080I373548L02514o447000p581862l561898j046995l72558L048974O350328
36072F5051J703401q183928j0812249k896837M418837L245891r10578j579850
36064a4950262j027854j149443K673462J0491053J2398611L701008n228820m330718
36056B577037J104156J621436m03318J307377K319724m351507j2358329r810261
36048a7993685J459714R048627Q803750O258965K898298l733556q745607m735749
$$ y = [-6673269, -12411768, -12097325, -7024891, -4046857, -5259656, -8038522, -13061082, -22324534, -28916821, -20470078, 2147634, 19585989, 15677058, -2580360, -15601630, -16111153, -12803306, -12711704, -12591767, -8697396, -3662729, 43665, 4420421, 9373548, 9676062, 3229062, -4352800, -7914698, -8961693, -9334251, -6285277, 65051, 1768452, -6415476, -17227725, -20124562, -15705725, -12459834, -13370412, -14950262, -15978116, -17127559, -14454097, -3963044, 8435567, 12136575, 6907755, 2577037, 3681193, 5302629, 4899311, 6206688, 8526412, 4174905, -8183424, -17993685, -16533971, -7485344, 1318406, 7577371, 10475669, 6742113, -2003494, -6739243]
36040f739243L180729L190998k913089k340188N186321N493407m650828r650189
36032i242082m04235J0249115Q208689r76402m424655k403377k465736k967124
36024d425807K514962J0267325J0127347J481616n994165o318337k665297N7221
36016E044865K81492j677041l871164k753185K070136N357102L048984j551290
36008E949899l017797j444949J50092J924706M918366O354993L354086j518574
36000A6670822l855420l640862k944847j052480K605985M314926Q95914m310567
35992H683471n897250l791107r66392K371434O250148O543185M02885o655751
35984F940623o429277P66556O847776O397635Q84602n366409q072669m649671
$$ y = [-6739243, -3558514, -367516, -3280605, -5620793, -434472, 5058935, 408107, -9242082, -9646317, 602798, 8811487, 7835085, 3410430, 1007053, -1458683, -4425807, -1910845, 8356480, 18483827, 19965443, 13971278, 7652941, 4987644, 5044865, 5326357, 3649316, -221848, -2975033, -904897, 4452205, 7501189, 5949899, 2932102, 1487153, 1637245, 3561951, 8480317, 14835310, 18189396, 16670822, 12815402, 9174540, 6229693, 5177213, 7783198, 12098124, 12994038, 8683471, 2786221, -1004886, -1971278, 400156, 6650304, 13193489, 13596374, 6940623, 511346, 1277902, 8125678, 14523313, 15407915, 10041506, 1968837, -2680834]
35976b680834J586417K404399m287620q990109l557494N570270O826274J870490
35968a258207K210258R151493J0672960N61712j1422754j3337086n714462K696906
35960f439180O376653N200074J267377j687542k94892L629456M356454J35548
35952A2543948n133553q912774j1825466j1177336j748124J2989808J9663767
35945F400270J1699525m44545l647945J14431J76730m099680l578375L095316
35937I715727N509895j403002p593335k519988Q245556J0378646R83208q243050
35929A5073657p821732j582040J747570M67452j630883l040942m144747k737244
35921c668909K560539O455467K727275m753110n734155O27783L670522j650049
$$ y = [-2680834, -1094417, 1309982, -2977638, -11967747, -15525241, -9954971, -3128697, -1258207, 952051, 10103544, 20776504, 21338216, 9915462, -3421624, -9136086, -6439180, -62527, 5137547, 6404924, 4717382, 4422490, 8051946, 12408400, 12543948, 7410395, -1502379, -13327845, -24505181, -26253305, -13263497, 6400270, 18099795, 17655250, 14007305, 14121736, 14298466, 10198786, 6620411, 9715727, 15225622, 13822620, 6229285, 3709297, 11954853, 22333499, 23316707, 15073657, 7251925, 5669885, 7417455, 7884907, 6254024, 3213082, -931665, -3668909, -1108370, 5347097, 8074372, 3321262, -2412893, -1785110, 1885412, 235363]
35913B35363o145225j676258M721647K114431o119228p411417N54822P649250
35905f076615P115025K292448k268474n566671n352199O90382P293924N608038
35897C735858k808669o449249j215053L761727J831767j318468J14017J411087
35889i36983k285030n064470m59461N614965M012124j850677k030739K610410
35881c89861K678306k335906k939747L278539O708012J305900o188632p502578
35873e385967l905739o25432J789074M489509N143623J924333j920701k615668
35865a106968r88584Q43128L105368M755352K035918m226558n937475Q88165P635573
35856G003919M464391m186765n572411K106919P380189K929533n068866p603043
$$ y = [235363, -5909862, -7586120, -2864473, -750042, -6869270, -14280687, -13725865, -6076615, 1038410, 3330858, 1062384, -4504287, -9856486, -9166104, -1872180, 3735858, 927189, -5522060, -6737113, -2975386, -1143619, -2462087, -2348070, -936983, -3222013, -8286483, -8745944, -3130979, 881145, -969532, -3000271, -389861, 2288445, -47461, -2987208, 291331, 6999343, 8305243, 2116611, -5385967, -9291706, -9917138, -8128064, -3638555, 1505068, 3429401, 1508700, -1106968, -2095552, -1252424, 1852944, 6608296, 8644214, 4417656, -1519819, -631654, 7003919, 11468310, 7281545, 1709134, 3816053, 11196242, 14125775, 9056909, 1453866]
35848A453866l739273K466959P510456P027699k420873j4817141j6498870l729152
35840b2746329R198918Q124582j613107m667189J064041M075474j41625k921451
35832i626686J013829M624854J837501j909276k80825K225177j231529o523670
35824i870625m567499L167119O160239J182331k997197N44536O510586N389362
35816E518852l061428r400059o173716L436223R207797N015896m389549q301802
35808h147786j576112J0010356J6104132J1823501J080938p964708r745293n359389
35800F225639p08562N71266J320565N190470Q659043M694391n522228j1896069
35792H534515q969216l056568j820251l549125k343392J936440N220332N915147
$$ y = [1453866, -2285407, 181552, 7692008, 14719707, 12298834, -2518307, -19017177, -22746329, -13547411, -5422829, -7035936, -11703125, -10639084, -6563610, -6705235, -9626686, -8612857, -3988003, -2150502, -4059778, -4340603, -2115426, -3346955, -9870625, -14438124, -11271005, -5110766, -3928435, -6925632, -6381096, 129490, 5518852, 2457424, -6942635, -13116351, -9680128, -472331, 4543565, 154016, -8147786, -9723898, 286458, 16390590, 28214091, 29295029, 21330321, 11585028, 6225639, 5517077, 6088343, 7408908, 12599378, 21258421, 25952812, 20430584, 8534515, -434701, -3491269, -5311520, -8860645, -11204037, -9267597, -4047265, 1867882]
35784A867882M084429j131691p324377p796499j631300J637044m130927j0013607
35776b4439046n046163N400647P740455K077540K73419M136711K993312n322732
35768a2185857q751734j687644M936468K359796j687557K456608R751151R837887
35760E029118L465520j698147l627080l733736J6623O812927P476660k766256
35752A0975629j2846997r995039Q57040N616917L219435L250261N426376L4948
35744F538570j1134251j3292081k256680P752916O483795J791778K835944M359909
35736C079900o46794n700051k287694L624973J921771k648457J285167R445884
35728H074699O582689p248016j4056381n572296M138782J727662n348297l543166
$$ y = [1867882, 5952311, 4820620, -2503757, -10300256, -11931556, -10294512, -14425439, -24439046, -29485209, -24084562, -16344107, -14266567, -13993148, -9856437, -6863125, -12185857, -20937591, -22625235, -17688767, -15328971, -17016528, -14559920, -4808769, 5029118, 8494638, 6796491, 3169411, -564325, -547702, 6265225, 13741885, 10975629, -1871368, -11866407, -11009367, -5392450, -2173015, 1077246, 6503622, 6538570, -4595681, -17887762, -20144442, -12391526, -5907731, -4115953, -1280009, 3079900, 2433106, -3266945, -5554639, -1929666, -7895, -2656352, -1371185, 8074699, 14657388, 7409372, -6647009, -12219305, -8080523, -6352861, -11701158, -15244324]
35720a5244324M339185O151040J736753J058795M701925K794994n837790r035216
35712i334638o73923Q425472O514904k442557p068382n434045l455877k231972
35704a5701018J580370N464269K801178m561012o144207J695747R141108O636788
35696I13223j893236n790681k522129J537132K631970L987793P601880Q381506
35688A4847458R58650j0663148j5568953q674427K884801Q548131O800257M877970
35680D010739P241588R699443O484465j587103r080671j2437552j1149879n829832
35672a2648802Q29883L982978J937905p48141L30627K834831K571822J718516
35664H09619N068429R971963Q373279o45328q245954p924598l574743k493688
$$ y = [-15244324, -10905139, -4754099, -3017346, -1958551, 2743374, 5538368, -299422, -9334638, -10008561, -1583089, 4931815, 2489258, -4579124, -10013169, -13469046, -15701018, -14120648, -8656379, -5855201, -10416213, -16560420, -14864673, -5723565, 913223, -980013, -6770694, -9292823, -7755691, -5123721, -1135928, 6465952, 14847458, 15806108, 5142960, -10425993, -19100420, -16215619, -7667488, -867231, 4010739, 11252327, 20951770, 27436235, 25849132, 16768461, 4330909, -6818970, -12648802, -11818919, -7835941, -5898036, -6646177, -6315550, -3480719, -908897, 809619, 5878048, 15850011, 24223290, 23577962, 15332008, 7407410, 3832667, 1338979]
35656A338979n640260q186666o239274n46048M304037L910870n36432k579867
35648a4174661M00977J972423l471016r710762o665789L558481R609934Q148944
35640a0331469N437753K598082n013044j2106419n669774J1075604J6433594K698113
35632E122440q628419J824J2303184L924588j6161655j8250830P21419J2740414
35624h227035L392833q117413k961691Q393884O550939n998919j2069604o191993
35616b5228999K609676P388322Q487933O597765K315088k79818J382046L110950
35608F382963R83707j372923p3828P29915k939751m850312J738174R521217N897323
35599A6016485o317380j1323834l668406N074449N331384J212197j491900n033548
$$ y = [1338979, -4301281, -12487947, -18727221, -19273269, -14969232, -11058362, -11594794, -14174661, -13773684, -11801261, -15272277, -24983039, -31648828, -28090347, -18480413, -10331469, -4893716, -2295634, -7308678, -19415097, -25084871, -14009267, 2424327, 5122440, -3505979, -3504155, 8799029, 12723617, -3438038, -21688868, -20967449, -8227035, -4834202, -12951615, -15913306, -7519422, -968483, -6967402, -19037006, -25228999, -22619323, -15231001, -6743068, -145303, 2169785, 1889967, 3272013, 6382963, 7366670, 5993747, 5919919, 6649834, 3710083, -1140229, 597945, 10119162, 16016485, 9699105, -1624729, -5293135, -218686, 5112698, 6324895, 4832995, -200553]
35591b00553r571058o134750Q709652K0786743J4707478l266692j2846435p521132
35583D663253l34553j565714n421931l575952J062025K035870Q72452J721028
35575e43522K111171j027957k371401L545108R702500N142786o107631r027382
35567A423672j259325K856788l325849o597472L454968J3944254O998788j0503456
35559F992368j4802235j57130J3535976J0812809J64688m116332l734574p718542
35551I77028j3314685j0523802p6835P287414P370145N663074M579836K80236
35543B242411n969394n791102K107914O713292Q38601o650558l932678N316294
35535e125220P647365N43713m354607P20809Q721858Q432270j221059j1570947
$$ y = [-200553, -9771611, -15906361, -7196709, 13590034, 28297512, 25030820, 12184385, 4663253, 4328700, 2762986, -2658945, -6234897, -5172872, -3137002, -2264550, -543522, 1567649, 539692, -1831709, 1713399, 11415899, 16558685, 10451054, 1423672, 164347, 3021135, -304714, -6902186, -3447218, 10497036, 17495824, 6992368, -7809867, -7966997, 5568979, 16381788, 16546476, 12430144, 8695570, 977028, -12337657, -22861459, -22938294, -15650880, -8280735, -2617661, 1962175, 2242411, -3726983, -9518085, -7410171, -696879, 141722, -6508836, -10441514, -5125220, 2522145, 3065858, -1288749, -567940, 8153918, 16586188, 15365129, 3794182]
35527C794182j3869134n484060Q556888J7046832J0865045n850075j7098087j2347543
35519a4385952J232771Q758684N729411n37329m301262p085491r659884p452396
35511b7701448J745395J1350784J2505537M299380o236287j2121508j1081793
35504b7239940m380738M604609J0724025R724413K464603m881779o369237j946555
35496a7300599L103504M196133J704343j312379l657429n714616n851319j518413
35488b6350775N143823P457731K722702l299716l867278K93231L938080N053142
35480h909060M671116K290925k395107n548878l479684O85158J127131j302931
35472a2861330q47256L091359N156792K961901n94297l545391n780309m677625
$$ y = [3794182, -10074952, -15559012, -7002124, 10044708, 20909753, 15059678, -2038409, -14385952, -13153181, -4394497, 1334914, 797585, -3503677, -10589168, -20249052, -27701448, -25956053, -14605269, -2099732, 2199648, -4036639, -16158147, -27239940, -31620678, -27016069, -16292044, -6567631, -4103028, -8984807, -15354044, -17300599, -14197095, -10000962, -8296619, -9608998, -13266427, -18981043, -24832362, -26350775, -21206952, -13749221, -11026519, -14326235, -18193513, -17900282, -13962202, -8909060, -4237944, -1947019, -4342126, -9891004, -13370688, -12685530, -11558399, -12861330, -13708586, -10617227, -5460435, -2498534, -3092831, -6638222, -12418531, -17096156]
35464a7096156J327155N768980J370990o050839l599956P392437J0753247N65513
35456D31371q619440m644599M006476M007703j801275k721509J084254K713432
35448e543587K823097N077277M852385k211100p431290j541265O429913J616844
35440D072274j0043234r135018M708912J0963379J925122n439774P83651Q458821
35432F294133M608367k348953Q3955N296896R16446o761211k771439R210093J0914364
35423B5442651j431116j2034845j0899673n913672n267739m517603J193732N913497
35415g514768L747792L48044K806171O209967J984304n990309o372924R13690
35407c868033L919705k344624q382412n834652J19137Q66998j745070n88077L632421
$$ y = [-17096156, -15769001, -10000021, -8629031, -14679870, -18279826, -10887389, -134142, 431371, -8188069, -12832668, -8826192, -4818489, -6619764, -9341273, -8257019, -5543587, -2720490, 2356787, 7209172, 4998072, -2433218, -3974483, 2455430, 4072274, -5970960, -15105978, -10397066, 566313, 2491435, -2948339, -2164688, 6294133, 10902500, 8553547, 8637502, 13934398, 14850844, 8089633, 5318194, 14528287, 25442651, 24011535, 11976690, 1077017, -4836655, -10104394, -14621997, -13428265, -7514768, -3766976, -3418932, -612761, 5597206, 7581510, 1591201, -4781723, -3868033, 51672, -2292952, -10675364, -16510016, -16390879, -15523881, -17268951, -17857028, -14224607]
35398a4224607M461974J604605O37611K163960J212767k385850k898179N98642
35390h829077K015887r50223l425108l407467m603033n614158J277796J4251073
35382i284310J8212413O747533n052996k721195M780809J224458q338498o671417
35374a103203M081921M653553p488453j1960124O69171J2857485R365803R39061
35366A2015214K609321O706964j515302j4196115j1068838O081699J3449654J383424
35358A5466021j1248622o388865P229047R604409r78709q657894n024850J131331
35350A131868L01299l414192o64880P542081J0996311M926138m356509r270821
35342G191295r331602p033701k424224L173640M434852K88370n82966Q049628
$$ y = [-14224607, -9762633, -8158028, -7520417, -5356457, -4143690, -6529540, -9427719, -8829077, -6813190, -7763413, -11188521, -14595988, -19199021, -24813179, -23535383, -9284310, 8928103, 15675636, 10622640, 7901445, 12682254, 13906712, 5568214, -1103203, 2978718, 7632271, 143818, -11816306, -11147135, 1710350, 11076153, 12015214, 14624535, 21331499, 19816197, 5620082, -5448756, 632943, 14082597, 15466021, 4217399, -2171466, 5057581, 14661990, 13683281, 5025387, 537, 1131868, 1433167, -1981025, -2645905, 4896176, 15892487, 20818625, 16462116, 7191295, -2140307, -9174008, -11598232, -8424592, -3989740, -3701370, -4284336, 3765292]
35334C765292J6546640J0480551o293001j3909200m607759N776810J524842j0363016
35326B921159j2084890o67704J0776297J2637146P638256J657760l627651p765157
35318A1485216r006269o880724k862864J761569N215885M268482j289530n189190
35310b497425j621740N376504N814692k542814j0264346q020803K062121R495128
35302b198683P628702M50637k666931J842197P312730N472527k227951o918644
35294H694584n826231n850626j0326818j0808950n5302J3140798J3371140P99966
35286C138561p783433j954357Q794719R504013l28141q469799p030084k57056
35278d385577L571137J837322j947137l315721o33474M028765O160893K470153
$$ y = [3765292, 20311932, 30792483, 24499482, 10590282, 5982523, 11759333, 13284175, 2921159, -9163731, -9831435, 944862, 13582008, 21220264, 22878024, 19250373, 11485216, 2478947, -4401777, -7264641, -5503072, -287187, 3981295, 2691765, -2497425, -4119165, 1257339, 7072031, 4529217, -5735129, -13755932, -11693811, -2198683, 5430019, 5880656, 3213725, 5055922, 12368652, 17841179, 15613228, 8694584, 2868353, -2982273, -13309091, -24118041, -24173343, -11032545, 2338595, 3138561, -4644872, -6599229, 2195490, 11699503, 11371362, 2901563, -4128521, -4385577, -814440, 1022882, -924255, -4239976, -4873450, -844685, 5316208, 7786361]
35270G786361m963909r205072n464756K488114N705814J016996m416833k381732
35262i435017N088870Q463803L898199k190210l188632j122159j497031l746722
35254c728899k688331K202862N111765K526957j315436n84576L527748M437744
35246I489834k07163m881828m073523k60267J51526l047031l613876P87511M324544
35237a330273K023179k668994l858296j720352N59946L616787Q357751R341424
35229A4321172R10154j1263101j4262753n010454M878613M230700m035127p999185
35221a8229981j510566R173296J2165126L061753q431372q536432K403694Q859137
35213a045345K037278o535429l061341O228803N642970l724942o551430P61044
$$ y = [7786361, 2822452, -6382620, -11847376, -9359262, -3653448, -2636452, -7053285, -9435017, -4346147, 4117656, 8015855, 5825645, 2637013, 1514854, 17823, -3728899, -6417230, -4214368, 897397, 3424354, 2108918, 1524342, 5052090, 9489834, 9282671, 4400843, 327320, 67053, 218579, -2828452, -6442328, -5654817, -1330273, 692906, -1976088, -5834384, -7554736, -6994790, -3378003, 4979748, 14321172, 15231326, 3968225, -10294528, -15304982, -10426369, -6195669, -10230796, -18229981, -19740547, -10567251, 1597875, 4659628, -3771744, -12308176, -9904482, -1045345, 991933, -5543496, -8604837, -2376034, 3266936, -458006, -7009436, -6248392]
35205f248392O334003N353219N941970R334951N253948o544630j0952356k814177
$$ y = [-6248392, 85611, 5438830, 11380800, 20715751, 25969699, 19425069, 8472713, 5658536]
$$ [...]
##END NTUPLES=NMR SPECTRUM
##END=
