##TITLE=31Pdec_SR81 ASP
 CDCl3, 124 sc
 31.08.2021
##JCAMPDX= 6.0         $$ Bruker NMR JCAMP-DX V2.0
##DATA TYPE= NMR SPECTRUM
##DATA CLASS= NTUPLES
##ORIGIN= UXNMR, Bruker Analytische Messtechnik GmbH
##OWNER= root
$$ XWIN-NMR		Version 3.5
$$ Tue Aug 31 10:26:42 2021 Russian Standard Time (UT+4h)  she@DPX200
##.OBSERVE FREQUENCY= 81.013821
##.OBSERVE NUCLEUS= ^31P
##.ACQUISITION MODE= SIMULTANEOUS
##.ACQUISITION SCHEME= undefined
##.AVERAGES= 124
##.DIGITISER RES= 16
##SPECTROMETER/DATA SYSTEM= spect
##.PULSE SEQUENCE= zgpg30
##.SOLVENT NAME= CDCl3
##.SHIFT REFERENCE= (INTERNAL, CDCl3, 0, 248.564)
##AUDIT TRAIL= $$ (NUMBER, WHEN, WHO, WHERE, WHAT)
$$ ##TITLE= Audit trail, XWIN-NMR		Version 3.5
$$ ##JCAMPDX= 5.01
$$ ##ORIGIN= Bruker BioSpin GmbH
$$ ##OWNER= she
$$ F:/spectra/data/she/nmr/P31/1/pdata/1/auditp.txt
$$ ##AUDIT TRAIL=  $$ (NUMBER, WHEN, WHO, WHERE, WHAT)
(   1,<2021-08-31 10:25:22.79 +0400>,<she>,<DPX200>,
      <continue with go, POWCHK disabled, PULCHK disabled
       configuration hash MD5:
       00 E9 B6 7A A2 85 ED C7 34 08 36 98 17 FE 4E 26
       data hash MD5: 32K
       EA A4 F5 C8 98 8E 7D 07 FC 25 02 EC CC 7A EB FC>)
(   2,<2021-08-31 10:25:24.62 +0400>,<she>,<DPX200>,
      <Start of raw data processing
       efp BC_mod = 2 LB = 1 FT_mod = 6 PKNL = 1 PHC0 = -7785.295 PHC1 = 189.0733 SI = 64K 
       data hash MD5: 64K
       9D 1F 0A 47 3C A7 8F 6C EE 8F 9E F9 CA 15 B2 4F>)
(   3,<2021-08-31 10:26:11.43 +0400>,<she>,<DPX200>,
      <pk PHC0 = 69.34605 PHC1 = -154.8 
       data hash MD5: 64K
       44 5C 73 40 BB 59 C5 BA 72 EB 60 34 88 B0 39 45>)
(   4,<2021-08-31 10:26:14.53 +0400>,<she>,<DPX200>,
      <abs ABSG = 5 
       data hash MD5: 64K
       71 50 C9 2A 77 BE BB 5B 46 45 86 E1 4B AD FD 86>)
$$ ##END=
$$ 
$$ hash MD5
$$ CA 2C 60 3E CD 09 87 CE D4 41 33 AA 30 AC FF E6
##$RELAX= 
##$RELAX= 
##$RELAX= 
##$RELAX= 
##$RELAX= 
##$RELAX= 
##$RELAX= 
##$RELAX= 
$$ Bruker specific parameters
$$ --------------------------
##$DU= <F:/spectra>
##$EXPNO= 1
##$NAME= <P31>
##$PROCNO= 1
##$TYPE= <nmr>
##$USER= <she>
##$AMP= (0..31)
100 100 100 100 100 100 100 100 100 100 100 100 100 100 100 100 100 100 
100 100 100 100 100 100 100 100 100 100 100 100 100 100 
##$AQSEQ= 0
##$AQ_mod= 1
##$AUNM= <au_zg>
##$AUTOPOS= <>
##$BF1= 81.014009
##$BF2= 200.13
##$BF3= 200.13
##$BF4= 200.13
##$BF5= 200.13
##$BF6= 200.13
##$BF7= 200.13
##$BF8= 200.13
##$BYTORDA= 1
##$CFDGTYP= 0
##$CFRGTYP= 5
##$CHEMSTR= <none>
##$CNST= (0..31)
1 1 145 1 1 1 1 1 1 1 1 1 1 1 1 1 1 1 1 1 1 1 1 1 1 1 1 1 1 1 1 1 
##$CPDPRG= <waltz16>
##$CPDPRG1= <>
##$CPDPRG2= <waltz16>
##$CPDPRG3= <>
##$CPDPRG4= <mlev>
##$CPDPRG5= <mlev>
##$CPDPRG6= <mlev>
##$CPDPRG7= <mlev>
##$CPDPRG8= <mlev>
##$CPDPRGB= <>
##$CPDPRGT= <>
##$D= (0..31)
0 1 0 0 0 0 0 0 0 0 0 0.03 2e-05 3e-06 0 0 0 0 0 0 0 0 0 0 0 0 0 0 0 0 
0 0 
##$DATE= 1630390955
##$DBL= (0..7)
120 120 120 11 120 120 24 19 
##$DBP= (0..7)
150 150 150 150 150 150 150 150 
##$DBP07= 0
##$DBPNAM0= <>
##$DBPNAM1= <>
$$ [...]
##$SUBNAM3= <"">
##$SUBNAM4= <"">
##$SUBNAM5= <"">
##$SUBNAM6= <"">
##$SUBNAM7= <"">
##$SUBNAM8= <"">
##$SUBNAM9= <"">
##$SW= 501.771253377433
##$SWIBOX= (0..15)
0 1 3 0 0 0 0 0 0 0 0 0 0 0 0 0 
##$SW_h= 40650.406504065
##$TD= 32768
##$TD0= 1
##$TE= 0
##$TE2= 300
##$TE3= 300
##$TEG= 300
##$TL= (0..7)
0 120 53 12 22 120 120 120 
##$TP= (0..7)
150 150 150 150 150 150 150 150 
##$TP07= 0
##$TPNAME0= <>
##$TPNAME1= <>
##$TPNAME2= <>
##$TPNAME3= <>
##$TPNAME4= <>
##$TPNAME5= <>
##$TPNAME6= <>
##$TPNAME7= <>
##$TPOAL= (0..7)
0.5 0.5 0.5 0.5 0.5 0.5 0.5 0.5 
##$TPOFFS= (0..7)
0 0 0 0 0 0 0 0 
##$TUNHIN= 0
##$TUNHOUT= 0
##$TUNXOUT= 0
##$USERA1= <user>
##$USERA2= <user>
##$USERA3= <user>
##$USERA4= <user>
##$USERA5= <user>
##$V9= 5
##$VALIST= <valist>
##$VCLIST= <CCCCCCCCCCCCCCC>
##$VD= 0
##$VDLIST= <DDDDDDDDDDDDDDD>
##$VPLIST= <PPPPPPPPPPPPPPP>
##$VTLIST= <TTTTTTTTTTTTTTT>
##$WBST= 1024
##$WBSW= 4
##$XGAIN= (0..3)
0 0 0 0 
##$XL= 0
##$YL= 0
##$YMAX_a= 2676
##$YMIN_a= -3693
##$ZGOPTNS= <>
##$ZL1= 120
##$ZL2= 120
##$ZL3= 120
##$ZL4= 120
##$ABSF1= 248.5645
##$ABSF2= -253.2056
##$ABSG= 5
##$ABSL= 3
##$ALPHA= 0
##$AQORDER= 0
##$ASSFAC= 0
##$ASSFACI= 0
##$ASSFACX= 0
##$ASSWID= 0
##$AUNMP= <proc_1d>
##$AZFE= 0.1
##$AZFW= 0.5
##$BCFW= 0
##$BC_mod= 2
##$BYTORDP= 0
##$COROFFS= 0
##$CY= -3
##$DATMOD= 1
##$DC= 0
##$DFILT= <>
##$DTYPP= 0
##$F1P= 0
##$F2P= 0
##$FCOR= 1
##$FTSIZE= 65536
##$FT_mod= 6
##$GAMMA= 0
##$GB= 0
##$INTBC= 1
##$INTSCL= 5.30512e-09
##$ISEN= 30
##$LB= 1
##$LEV0= 0
##$LPBIN= 0
##$MAXI= 10000
##$MC2= 0
##$MEAN= 0
##$ME_mod= 0
##$MI= 50
##$NCOEF= 0
##$NC_proc= -7
##$NLEV= 6
##$NOISF1= 182.463
##$NOISF2= 159.3651
##$NSP= 0
##$NTH_PI= 0
##$NZP= 0
##$OFFSET= 248.5645
##$PC= 4
##$PHC0= -7715.949
##$PHC1= 34.2733
##$PH_mod= 1
##$PKNL= yes
##$PPARMOD= 0
##$PSCAL= 0
##$PSIGN= 0
##$REVERSE= no
##$SF= 81.014009
##$SI= 65536
##$SIGF1= 159.3651
##$SIGF2= -187.1042
##$SINO= 113.3802
##$SIOLD= 16384
##$SREGLST= <1H.CDCl3>
##$SSB= 0
##$STSI= 65536
##$STSR= 0
##$SW_p= 40650.406504065
##$SYMM= 0
##$S_DEV= 0
##$TDeff= 32768
##$TDoff= 0
##$TI= <>
##$TILT= no
##$TM1= 0
##$TM2= 0
##$TOPLEV= 0
##$USERP1= <user>
##$USERP2= <user>
##$USERP3= <user>
##$USERP4= <user>
##$USERP5= <user>
##$WDW= 1
##$XDIM= 65536
##$YMAX_p= 202379469
##$YMIN_p= -451911325
$$ End of Bruker specific parameters
$$ ---------------------------------
##NTUPLES= NMR SPECTRUM
##VAR_NAME=  FREQUENCY,     SPECTRUM/REAL,   SPECTRUM/IMAG
##SYMBOL=    X,             R,               I
##VAR_TYPE=  INDEPENDENT,   DEPENDENT,       DEPENDENT
##VAR_FORM=  AFFN,          ASDF,            ASDF
##VAR_DIM=   65536,         65536,           65536
##UNITS=     HZ,            ARBITRARY UNITS, ARBITRARY UNITS
##FACTOR=    0.620285442955139, 1,           1
##FIRST=     20137.2065510759, 0,            0
##LAST=      -20513.1999529892, 0,           0
##MIN=       -20513.1999529892, -451911325,  0
##MAX=       20137.2065510759, 202379469,    0
$$ Real data points
##PAGE= N=1
##DATA TABLE= (X++(R..R)), XYDATA
$$ [...]
$$ plain form
13016 7422372 8660897 8589223 7770176 7452897 6387528 3655034 2270808 5463434 10559852
13007 10559852 11332040 6687316 2703058 4563806 9915884 12462506 9788568 4987221
12999 4987221 1688041 91664 -1853291 -5086985 -8240003 -9349206 -8039506 -5787492
12991 -5787492 -4462332 -5176655 -8144019 -12292284 -14783311 -12665525 -6118946 1308447
12983 1308447 6794840 10795013 13923038 13706820 7747132 -1224779 -7314420 -8284418
12975 -8284418 -6897809 -5617775 -4071437 -2352835 -2331907 -3885448 -3883701 -1315174 323192
12966 323192 -1395410 -3483268 -2358620 294317 971098 1010305 4300245 9511676 10546024
12957 10546024 5481293 -75196 -581870 2468250 3844807 1998807 -27055 156083
$$ packed form
13016G422372J238525p1674q19047l17279j065369k732494j384226L192626N096418
13007A0559852P72188m644724l984258J860748N352078K546622k673938m801347
12999D987221l299180j596377j944955l233694l153018j109203J309700K252014
12991e787492J325160p14323k967364m148265k491027K117786O546579P427393
12983A308447N486393M000173L128025k16218n959688q971911o089641r69998
12975h284418J386609J280034J546338J718602K0928j553541J747K568527J638366
12966C23192j718602k087858J124648K652937O76781L9207L289940N211431J034348
12957A0546024n064731n556489n06674L050120J376557j846000k025862J83138
$$ plain form
12949 156083 1193542 636314 -1101335 -870697 3066889 8096007 9708867 6675627 2040220
12940 2040220 -1336484 -3923409 -6950689 -9059273 -7864716 -3423447 2032873 6496754
12932 6496754 8320156 5839933 -276500 -5765955 -6934686 -4968860 -3237566 -2071018
12924 -2071018 -29771 1406006 -343238 -2976265 -947024 5867488 10481245 7869973
12916 7869973 1203831 -3394246 -4185382 -3063909 -1208469 957402 2020398 1151806
12908 1151806 -217611 -725916 -1229582 -2501572 -3079023 -1928809 -1035285 -2440555 -4588208
12899 -4588208 -4686013 -3201612 -2803949 -3831696 -3987548 -2182262 42344 953836 467524
12890 467524 -395353 -431594 892360 2324197 1594661 -1390778 -3680538 -3410742 -2976176
$$ packed form
12949A56083J037459n57228j737649K30638L937586N029118J612860l033240m635407
12940B040220l376704k586925l027280k108584J194557M441269N456320M463881
12932F496754J823402k480223o116433n489455j168731J965826J731294J166548
12924b071018K041247J435777j749244k633027K029241O814512M613757k611272
12916G869973o666142m598077p91136J121473J855440K165871J062996q68592
12908A151806j369417n08305n03666j271990n77451J150214Q93524j405270k147653
12899d588208r7805J484401L97663j027747j55852J805286K224606R11492m86312
12890D67524q62877l6241J323954J431837p29536k985439k289760K69796M34566
$$ plain form
12881 -2976176 -5310693 -8361697 -6871893 274504 7692869 9587813 6112587 2350403
12873 2350403 2100669 3970372 3728640 66803 -3008545 -788262 5652453 9979858
12865 9979858 8211629 3149744 -208974 -867817 -942800 -1012068 138195 2294093 3749419
12856 3749419 4177471 4863776 6300153 7817727 9022501 9177633 6028725 -1553756 -9920761
12847 -9920761 -12998609 -9120110 -2925202 442997 793048 1470028 4301432 7341803
12839 7341803 7078856 2487280 -2864146 -3561203 1822630 8698629 11538043 9481074
12831 9481074 5194586 416225 -4144191 -6275377 -4064811 213013 2258714 1782942
12823 1782942 2032482 3167343 1401467 -3776291 -6868055 -3788938 2353518 6211453
$$ packed form
12881b976176k334517l051004J489804P146397P418365J894944l475226l762184
12873B350403k49734J869703k41732l661837l075348K220283O440715M327405
12865I979858j768229n061885l358718o58843p4983o9268J150263K155898J455326
12856C749419M28052O86305J436377J517574J204774J55132l148908p582481q367005
12847i920761l077848L878499O194908L368199L50051O76980K831404L040371
12839G341803k62947m591576n351426o97057N383833O875999K839414k056969
12831I481074m286488m778361m560416k131186K210566M277824K045701m75772
12823A782942K49540J134861j765876n177758l091764L079117O142456L857935
$$ plain form
12815 6211453 6912867 6018530 2738866 -3564869 -8712855 -7439791 -1065592 3677559
12807 3677559 3439062 1305049 945861 2471048 5038634 8906180 12851944 13435230 9456774
12798 9456774 4350458 1791145 1461678 1403897 1746401 3112952 3785714 2143797 257511
12789 257511 1058527 2937339 1592911 -2722740 -4458200 -700860 4178647 4323908 -188129
12780 -188129 -4709861 -6676994 -7504795 -8701902 -9291027 -7596916 -3741208 244080 2095634
12771 2095634 1325704 -2280 627967 2883579 3982453 3120964 3009193 5185184 6592452
12762 6592452 4025033 -258802 -1519944 292820 1129139 8035 213324 2608728
12754 2608728 3263509 -37692 -3692331 -3769773 -1712383 -1085988 -1806953 -1322575 845655
$$ packed form
12815F211453P01414q94337l279664o303735n147986J273064O374199M743151
12807C677559k38497k134013l59188J525187K567586L867546L945764N83286l978456
12798I456774n106316k559313l29467n7781L42504J366551O72762j641917j886286
12789B57511Q01016J878812j344428m315651j735460L757340M879507J45261m512037
12780a88129m521732j967133q27801j197107n89125J694111L855708L985288J851554
12771B095634p69930j327984O30247K255612J098874q61489j11771K175991J407268
12762F592452k567419m283835j261142J812764Q36319j121104K05289K395404
12754B608728O54781l301201l654639p7442K057390O26395p20965M84378K168230
$$ plain form
12745 845655 3287859 5452682 6922411 5974753 2364991 -355335 885786 3655366
12737 3655366 3288444 -69689 -2023879 -807430 889919 884155 -127738 -1584055 -4120600
12728 -4120600 -6610106 -6207624 -2847998 -32789 533717 1425173 4397597 6377575 3815208
12719 3815208 -1450529 -4290237 -2876104 170435 2383270 3644691 3547287 71248
12711 71248 -7090834 -13697149 -13927677 -6398749 3928382 10175127 9406535 4338712 395750
12702 395750 1373153 6505020 10612191 8456461 800307 -4989001 -2929552 3929576
12694 3929576 7407581 5220469 2997620 4176872 4197804 -1052068 -6450115 -4110651
12686 -4110651 4202513 8670029 5031934 -435820 -847716 2652494 4824326 3826466
$$ packed form
12745H45655K442204K164823J469729r47658l609762k720326J241121K769580
12737C655366l66922l358133j954190J216449J697349n764j011893j456317k536545
12728d120600k489506M02482L359626K815209N66506Q91456K972424J979978k562367
12719C815208n265737k839708J414133L046539K212835J261421r7404l476039
12711G1248p162082o606315k30528P528928J0327131O246745p68592n067823l942962
12702C95750R77403N131867M107171k155730p656154n789308K059449O859128
12694C929576L478005k187112k222849J179252K0932n249872n398047K339464
12686d110651Q313164M467516l638095n467754m11896L500210K171832r97860
$$ plain form
12678 3826466 1248583 -1756858 -4523248 -4951739 -879413 6925900 14628675 17900262
12670 17900262 14736280 7291339 866581 -878363 446535 1118172 943678 2253263
12662 2253263 4189636 3058556 -1105632 -3719521 -3044619 -2940733 -5528194 -6608467
12654 -6608467 -2646091 2347349 2277276 -1948002 -4434261 -3249861 -1606780 -1150987 173921
12645 173921 3093781 4606390 2061720 -3361365 -8106954 -9018934 -4935000 1845621
12637 1845621 6058407 4419378 -6912 -1166205 2620797 7752564 11244918 13417543
12629 13417543 14323190 12083360 6751251 2174735 1398962 2779542 2995575 1536854
12621 1536854 -262417 -2277855 -4541653 -4963757 -1915157 1610604 374944 -5978838
$$ packed form
12678C826466k577883l005441k766390m28491M072326P805313P702775L271587
12670A7900262l163982p444941o424758j744944J324898O71637j74494J309585
12662B253263J936373j131080m164188k613889O74902J03886k587461j080273
12654f608467L962376M993440p0073m225278k486259J184400J643081M55793J324908
12645A73921K919860J512609k544670n423085m745589r11980M083934O780621
12637A845621M212786j639029m426290j159293L787002N131767L492354K172625
12629A3417543R05647k239830n332109m576516p75773J380580K16033j458721
12621A536854j799271k015438k263798m22104L048600L525761j235660o353782
$$ plain form
12613 -5978838 -11578390 -11436071 -7007680 -2752640 136753 3420024 6780759 7102312
12605 7102312 3243405 -1662498 -4085850 -3947337 -3030425 -1774069 34824 967807 -722287
12596 -722287 -3923754 -5400107 -3835133 -1037334 1014250 2154106 2653975 2049115 315451
12587 315451 -1388801 -2128212 -2159252 -1874097 -1046926 179769 703145 -366137 -2568853
12578 -2568853 -4376243 -4117809 -1237674 2312825 3016864 65637 -2411952 -266225
12570 -266225 4232666 4634277 -734005 -6107282 -5894958 -1108467 3860266 7288381 10052385
12561 10052385 12296356 13435878 13770807 13400560 11084503 6590567 2529880 1339563
12553 1339563 1903203 1597285 229972 -583024 -620580 -977956 -1721867 -1947784 -1372753
$$ packed form
12613e978838n599552J42319M428391M255040K889393L283271L360735L21553
12605G102312l858907m905903k423352J38513R16912J256356J808893R32983j690094
12596g22287l201467j476353J564974K797799K051584J139856M99869o04860j733664
12587C15451j704252p39411l1040K85155Q27171J226695N23376j069282k202716
12578b568853j807390K58434K880135L550499P04039k951227k477589K145727
12570b66225M498891M01611n368282n373277K12324M786491M968733L428115K764004
12561A0052385K243971J139522L34929l70247k316057m493936m060687j190317
12553A339563N63640l05918j367313q12996l7556l57376p43911k25917N75031
$$ plain form
12544 -1372753 -77043 2064904 3946755 3034521 -1177311 -5314784 -6120040 -4459908
12536 -4459908 -2944816 -1869746 -542004 -192515 -1769173 -2996366 -1902113 -1203989
12528 -1203989 -4088640 -7290583 -4632509 2763423 6387977 1921957 -5003187 -7133869
12520 -7133869 -4632413 -2512293 -2994207 -4093957 -3328182 211539 5689667 10290410
12512 10290410 11030758 8451519 6331616 6426257 6380760 4466372 2774105 3046638 2935093
12503 2935093 172085 -2536452 -1443667 1436874 677790 -4111669 -7364275 -5641966
12495 -5641966 -2032561 -1086422 -3229490 -5900340 -6824096 -4371736 1795496 8021556
12487 8021556 8177706 1439655 -4440450 -2142862 5124352 7994716 4239613 977457
$$ packed form
12544a372753J295710K141947J881851r12234m211832m137473q05256J660132
12536d459908J515092J075070J327742L49489j576658j227193J094253O98124
12528a203989k884651l201943K658074P395932L624554m466020o925144k130682
12520g133869K501456K120120m81914j099750P65775L539721N478128M600743
12512A0290410P40348k579239k119903R4641m5497j914388j692267K72533j11545
12503B935093k763008k708537J092785K880541p59084m789459l252606J722309
12495e641966L609405R46139k143068k670850r23756K452360O167232O226060
12487H021556J56150o738051n880105K297588P267214K870364l755103l262156
$$ plain form
12479 977457 2686283 4344431 442714 -5339158 -5691223 -1019903 1818072 313558
12471 313558 -1206641 438800 3634851 6997785 11224608 14102875 10581748 1303234
12463 1303234 -5025826 -2393928 4306768 6706397 4077381 1423585 404168 -1093644
12455 -1093644 -2682664 -1692683 1132227 2248693 1378834 1457066 2765335 2738835 1731409
12446 1731409 3104083 6625921 7478247 3628745 -800772 -1599358 550167 3151292
12438 3151292 5501720 6802931 4908110 -11833 -4011237 -4522125 -3832963 -4538513 -4753152
12429 -4753152 -1482025 3742940 6568426 5683084 3307558 762951 -2731089 -6708920
12421 -6708920 -8165092 -5025028 612776 4004996 2381778 -2266849 -5022179 -2677139
$$ packed form
12479I77457J708826J658148l901717n781872l52065M671320K837975j504514
12471C13558j520199J645441L196051L362934M226823K878267l521127r278514
12463A303234o329060K631898O700696K399629k629016k653796j019417j497812
12455a093644j589020R89981K824910J116466q69859P8232J308269k6500j007426
12446A731409J372674L521838Q52326l849502m429517p98586K149525K601125
12438C151292K350428J301211j894821m919943l999404n10888O89162p05550k14639
12429d753152L271127N224965K825486q85342k375526k544607l494040l977831
12421f708920j456172L140064N637804L392220j623218m648627k755330K345040
$$ plain form
12413 -2677139 3548390 9717909 12580675 11014792 6026900 872224 -666943 1481920
12405 1481920 2717386 -158567 -3689725 -2559553 1763128 2557529 -1773020 -4665520
12397 -4665520 -894224 5791294 7880573 3561095 -2547853 -5940145 -6207870 -5448458
12389 -5448458 -5163218 -4830017 -2951567 181868 1698058 -153795 -2737475 -2371458 143102
12380 143102 1027718 -440910 -1955246 -3332751 -5834292 -6507640 -309553 10540178
12372 10540178 16464113 12776104 5596028 2266319 2487453 2980039 3991189 5669114
12364 5669114 4304788 -1255011 -4722994 -738163 6421619 9269539 7777888 6443987
12356 6443987 5230965 1732213 -1331174 301409 4081909 4765356 4214466 7477095
$$ packed form
12413b677139O225529O169519K862766j565883m987892n154676j539167K148863
12405A481920J235466k875953l531158J130172M322681P94401m330549k892500
12397d665520L771296O685518K089279m319478o108948l392292k67725P59412
12389e448458K85240L33201J878450L133435J516190j851853k583680L66017K514560
12380A43102Q84616j468628j514336j377505k501541o73348O198087J0849731
12372A0540178N923935l688009p180076l329709K21134M92586J011150J677925
12364E669114j364326n559799l467983L984831P159782K847920j491651j333901
12356F443987j213022l498752l063387J632583L780500O83447n50890L262629
$$ plain form
12348 7477095 11459713 8655090 1263363 -476223 4991577 7906620 4066368 1578207
12340 1578207 5459832 7834203 1780242 -5418711 -3301186 5091855 8847365 6535756
12332 6535756 6394697 11441311 15467998 14208075 10882117 8594899 5224194 -812639
12324 -812639 -5801415 -5675300 -1786803 1599729 2729128 2311389 277663 -4081408 -9180115
12315 -9180115 -10898564 -6482294 1653116 6913383 4446552 -3588120 -9707481 -8742972
12307 -8742972 -2919159 1154743 -744098 -7284369 -13404543 -14120370 -8196283 369982
12299 369982 5583124 5199161 2019439 -822032 -3138975 -5100584 -4880755 -1790238 945808
12290 945808 95383 -2694113 -3330424 -967188 2266270 5484445 8711394 9606312 5585620
$$ packed form
12348G477095L982618k804623p391727j739586N467800K915043l840252k488161
12340A578207L881625K374371o053961p198953K117525Q393041L755510k311609
12332F535756j41059N046614M026687j259923l325958k287218l370705o036833
12324h12639m988776J26115L888497L386532J129399m17739k033726m359071n098707
12315i180115j718449M416270Q135410N260267k466831q034672o119361R64509
12307h742972N823813M073902j898841o540271o120174p15827N924087Q566265
12299C69982N213142l83963l179722k841471k316943j961609K19829L090517K736046
12290I45808q50425k789496o36311K363236L233458L218175L226949Q94918m020692
$$ plain form
12281 5585620 -913090 -4337603 -3834795 -4112641 -7159180 -8513748 -4772525 -53888
12273 -53888 -436715 -4934458 -6945806 -3427533 1883507 4254750 3000839 -27921 -3697598
12264 -3697598 -7543711 -10313135 -10425043 -7577707 -3178584 712619 2919391 4013802
12256 4013802 5380905 7078503 7492500 5970041 4587391 5513893 7453501 7190998 4571211
12247 4571211 3061534 4545016 6541058 6498468 6074666 7952083 10290005 8650347 3173189
12238 3173189 -773341 -489763 -142630 -4045745 -9299749 -9790811 -5682460 -3381740 -5761116
12229 -5761116 -7896646 -4924110 388700 1923157 -819349 -2815317 -1503686 191301
12221 191301 -522276 -1907572 -1035907 1334976 1862560 -800000 -4751460 -7525664 -8344713
$$ packed form
12281E585620o498710l424513N02808k77846l046539j354568L741223M718637
12273e3888l82827m497743k011348L518273N311040K371243j253911l028760l669677
12264c697598l846113k769424j11908K847336M399123L891203K206772J094411
12256D013802J367103J697598M13997j522459j382650R26502J939608k62503k619787
12247D571211j509677J483482J996042m2590m23802J877417K337922j639658n477158
12238C173189l946530K83578L47133l903115n254004m91062M108351K300720k379376
12229e761116k135530K972536N312810J534457k742506j995968J311631J694987
12221A91301p13577j385296Q71665K370883N27584k662560l951460k774204q19049
$$ plain form
12212 -8344713 -8019634 -7826173 -8312397 -8600020 -7362150 -4792535 -2508010 -1117313 332287
12203 332287 1584366 313870 -3688868 -5657780 -896154 7980226 12747234 9220731
12195 9220731 1983648 -1712221 28481 3384750 4148316 1559878 -1598845 -1339538
12187 -1339538 3698502 9938812 12299361 10479728 8930474 9580235 8665729 3404249
12179 3404249 -2386349 -3735255 -2295894 -3127106 -5865660 -5593860 -1902073 -169711
12171 -169711 -2565519 -4266168 -1463514 2329289 1827654 -2196750 -4633691 -2768618
12163 -2768618 2062753 6959923 8571278 4628385 -2166091 -4575092 874899 8397091
12155 8397091 9908402 5207323 422045 -1674209 -3862680 -7680623 -10786702 -12139619
$$ packed form
12212h344713L25079J93461m86224k87623J237870K569615K284525J390697J449600
12203C32287J252079j270496m002738j968912M761626Q876380M767008l526503
12195I220731p237083l695869J740702L356269P63566k588438l158723K59307
12187a339538N038040O240310K360549j819633j549254O49761r14506n261480
12179C404249n790598j348906J439361q31212k738554K71800L691787J732362
12171a69711k395808j700649K802654L792803n01635m024404k436941J865073
12163b768618M831371M897170J611355l942893o794476k409001N449991P522192
12155H397091J511311m701079m785278k096254k188471l817943l106079j352917
$$ plain form
12147 -12139619 -13986564 -16520059 -15717847 -9687813 -2977556 -770669 -1979823 -2183294
12139 -2183294 -864339 -856380 -1837984 137213 5636869 9051746 5600754 -1705060 -5425547
12130 -5425547 -2661417 2744348 6671525 9462767 12487327 13408905 8952420 1406798
12122 1406798 -2167284 1274219 6063138 4504375 -3735040 -11788988 -14063730 -11444152
12114 -11444152 -7998334 -5492155 -2796577 769658 3630273 3945200 2434903 1848335
12106 1848335 3112756 3429512 130156 -4333549 -4320685 1451483 7531774 8701190 6295155
12097 6295155 4820440 4959797 3899510 1096499 -771526 -566700 -377618 -1620446 -2782562
12088 -2782562 -2271969 -808190 311074 987053 1082450 -316025 -2692764 -3006273 1046725
$$ packed form
12147a2139619j846945k533495Q02212O030034O710257K206887j209154k03471
12139b183294J318955P959r81604J975197N499656L414877l450992p305814l720487
12130e425547K764130N405765L927177K791242L024560R21578m456485p545622
12122A406798l574082L441503M788919j558763q239415q053948k274742K619578
12114a1444152L445818K506179K695578L566235K860615L14927j510297n86568
12106A848335J264421L16756l299356m463705J2864N772168O080291J169416k406035
12097F295155j474715J39357j060287k803011j868025K04826J89082j242828j162116
12088b782562N10593J463779J119264O75979R5397j398475k376739l13509M052998
$$ plain form
12079 1046725 7493618 11638614 11008959 7536193 4816238 4318632 4930445 5552511 6575138
12070 6575138 7992683 7606437 3508461 -2069740 -4468056 -2825696 -1308220 -2593115
12062 -2593115 -3740605 -1378711 2267064 2478873 -1083496 -4737445 -6215989 -5573391
12054 -5573391 -2516387 2213656 4176213 -350601 -7665560 -10099994 -6337318 -2313600
12046 -2313600 -1235186 435001 4856622 7625464 4942030 525001 312384 4133621
12038 4133621 7597599 9204015 10447010 10863455 8120459 2544839 -2356212 -3914071
12030 -3914071 -2305389 823111 3497918 4139884 3290573 3587382 6133511 8285953 7029366
12021 7029366 2961310 -1213852 -4404823 -6789870 -7259504 -4142535 2006186 8319854
$$ packed form
12079A046725O446893M144996o29655l472766k719955m97606O11813O22066J022627
12070F575138J417545l86246m097976n578201k398316J642360J517476j284895
12062b593115j147490K361894L645775K11809l562369l653949j478544O42598
12054e573391L057004M730043J962557m526814p314959k434434L762676M023718
12046b313600J078414J670187M421621K768842k683434m417029k12617L821237
12038D133621L463978J606416J242995M16445k742996n575620m901051j557859
12030c914071J608682L128500K674807O41966q49311K96809K546129K152442j256587
12021G029366m068056m175162l190971k385047m69634L116969O148721O313668
$$ plain form
12013 8319854 11732830 10184733 3660412 -4241626 -7985665 -5787801 -1897201 -964005
12005 -964005 -2244291 -2130758 -216122 855847 295042 137253 1635021 3761795 5260296
11996 5260296 5761126 5122484 3810395 3567440 5799210 9704354 13324816 15384650 14957025
11987 14957025 11374352 6313633 3630729 4632191 5714038 3369898 -871701 -3545338
11979 -3545338 -4515677 -5244071 -4444459 -415122 4089122 4698433 2287809 1745063 4229697
11970 4229697 5896368 4527442 2278430 1034093 -131690 -1645007 -1903182 -379695
11962 -379695 1481153 3282188 5667972 6796169 3524952 -2619641 -5401221 -1774234
11954 -1774234 4284093 7642053 7526798 5364047 1803040 -1453018 -1329873 1816601
$$ packed form
12013H319854L412976j548097o524321p902038l744039K197864L890600R33196
12005i64005j280286J13533J914636J071969n60805j57789J497768K126774J498501
11996E260296N00830o38642j312089k42955K231770L905144L620462K059834m27625
11987A4957025l582673n060719k682904J001462J081847k344140m241599k673637
11979c545338r70339p28394P99612M029337M504244O09311k410624n42746K484634
11970D229697J666671j368926k249012j244337j165783j513317k58175J523487
11962c79695J860848J801035K385784J128197l271217o144593k781580L626987
11954a774234O058327L357960j15255k162751l561007l256058J23145L146474
$$ plain form
11946 1816601 3067974 93125 -2474805 101330 4974105 5746473 1625643 -2527241
11938 -2527241 -3650572 -3002018 -2122050 -1111483 -822153 -2340119 -3898812 -2429261 966548
11929 966548 1089358 -4105736 -9770430 -10257955 -6547136 -4369195 -5890439 -6679681 -1993059
11920 -1993059 6228943 10968814 8314184 1843221 -1947973 -859117 1894989 2497876
11912 2497876 301166 -2781141 -4517794 -3831066 -1613178 -129235 -425246 -1045070 -872538
11903 -872538 -1757503 -5471298 -9305606 -8689468 -3907613 76324 821128 814293 1761049
11894 1761049 1603793 -624490 -1924290 -479623 594066 -1708563 -5222133 -6465100
11886 -6465100 -6196831 -7047368 -8650549 -9364281 -9977199 -11343259 -11222983 -8213759 -5862689
$$ packed form
11946A816601J251373k974849k567930K576135M872775P72368m120830m152884
11938b527241j123331O48554Q79968J010567K89330j517966j558693J469551L395809
11929I66548J22810n195094n664694m87525L710819K177941j521244p89242M686622
11920a993059Q222002M739871k654630o470963l791194J088856K754106O02887
11912B497876k196710l082307j736653O86728K217888J483943k96011o19824J72532
11903h72538q84965l713795l834308O16138M781855L983937P44804o835R46756
11894A761049j57256k228283j299800J444667J073689k302629l513570j242967
11886f465100K68269q50537j603181p13732o12918j366060J20276L009224K351070
$$ plain form
11877 -5862689 -7431587 -9354762 -6226630 -59508 2595708 1372586 2042265 5983503
11869 5983503 8136230 6794295 6909956 10495821 11633624 5859722 -1908111 -4377437
11861 -4377437 -1858152 270696 -99287 -1608410 -4003123 -6925874 -6771415 -869514
11853 -869514 6748652 9469473 7012718 4935324 6057883 7840329 7964741 6905083
11845 6905083 4548702 -84488 -4491710 -3556636 2848190 7761837 5586960 -1032566
11837 -1032566 -5679501 -6133657 -4599926 -2848719 -961558 739649 1899692 3221394
11829 3221394 4793591 4874431 3052448 2612400 5998552 9466839 7003593 -709799 -6261475
11820 -6261475 -5441660 -2335738 -2188789 -3627281 -1867204 3295609 7298967 7437036 5497382
$$ packed form
11877e862689j568898j923175L128132O167122K655216j223122O69679L941238
11869E983503K152727j341935J15661L585865J137803n773902p767833k469326
11861d377437K519285K128848l69983j509123k394713k922751J54459N901901
11853h69514P618166K720821k456755k077394J122559J782446J24412j059658
11845F905083k356381m633190m407222R35074O404826M913647k174877o619526
11837a032566m646935m54156J533731J751207J887161J701207J160043J321702
11829C221394J572197Q0840j821983m40048L386152L468287k463246p713392n551676
11820f261475Q19815L105922J46949j438492J760077N162813M003358J38069j939654
$$ plain form
11811 5497382 3944529 3163994 2994026 3640171 3914188 1468249 -3454375 -6728009 -4949058
11802 -4949058 24311 3201373 2356120 -163139 -1263273 -789147 -660352 -1553336 -1940415
11793 -1940415 -763256 139725 -1903960 -5788844 -6603633 -2088734 3157166 3350310 -111985
11784 -111985 -811652 2332235 3022886 -1840017 -5832811 -2282883 4912377 6485213 1048727
11775 1048727 -4232544 -5097191 -4436217 -4401448 -2332033 2491423 5182892 2924303 509514
11766 509514 2783481 6274526 4664864 -891547 -3904793 -2959346 -2653725 -4586024 -4753255
11757 -4753255 -1288762 1867583 1795266 1505383 4282091 7474182 6366090 1362471 -3128383
11748 -3128383 -5216157 -6656188 -8350294 -8951482 -8233371 -8129719 -9118251 -8406446 -3735874
$$ packed form
11811E497382j552853p80535j69968O46145K74017k445939m922624l273634J778951
11802d949058M973369L177062q45253k519259j100134M74126J28795q92984l87079
11793a940415J177159R02981k043685l884884q14789M514899N245900J93144l462295
11784a11985o99667L143887O90651m862903l992794L549928P195260J572836n436486
11775A048727n281271q64647O60974L4769K069415M823456K691469k258589k414789
11766E09514K273967L491045j609662n556411l013246R45447L05621j932299j67231
11757d753255L464493L156345p2317k89883K776708L192091j108092n003619m490854
11748c128383k087774j440031j694106o01188P18111J03652r88532P11805M670572
$$ plain form
11739 -3735874 2644644 5966849 4409753 799982 -1326605 -1828320 -3144536 -6297553
11731 -6297553 -9299671 -9701381 -7364451 -4048303 -1371981 -31647 131056 446514 2576912
11722 2576912 5807765 6535155 2760965 -2020587 -2582866 750715 2294082 -811911
11714 -811911 -4429190 -3447906 1240076 4699102 4647353 2939361 1627984 899976 812944
11705 812944 2256956 5356153 8461452 9458134 7526704 3674330 -51334 -2342822
11697 -2342822 -3924111 -6168768 -8285940 -7623009 -3540735 972833 2835785 2091669
11689 2091669 140132 -2912677 -6804770 -9062397 -7404482 -3028336 1180954 4500239
11681 4500239 7616933 9350956 7629290 3274938 -335011 -1192798 345663 3559816
$$ packed form
11739c735874O380518L322205j557096l609771k126587n01715j316216l153017
11731f297553l002118m01710K336930L316148K676322J340334J62703L15458K130398
11722B576912L230853P27390l774190m781552n62279L333581J543367l105993
11714h11911l617279R81284M687982L459026n1749j707992j311377p28008q7032
11705H12944J444012L099197L105299R96682j931430l852374l725664k291488
11697b342822j581289k244657k117172O62931M082274M513568J862952p44116
11689B091669j951537l052809l892093k257627J657915M376146M209290L319285
11681D500239L116694J734023j721666m354352l609949q57787J538461L214153
$$ plain form
11673 3559816 7204690 8418937 5693003 2261228 2286968 4221974 2999656 -1214200
11665 -1214200 -2547542 907840 3329658 263226 -4135551 -3387847 2173392 7351343
11657 7351343 9509615 8895631 4778607 -2494478 -7341011 -3579879 6396289 12827211
11649 12827211 10438706 4377980 2228557 4178281 4464493 337625 -4184944 -3852740
11641 -3852740 724769 3313828 -310435 -6445126 -7471979 -1727063 3937727 3233118
11633 3233118 -1170393 -1827400 3085769 8086633 8505889 5788877 3935363 4441428 6312626
11624 6312626 8265775 9167788 8170375 5796693 3631450 2332379 1346848 674396 882629
11615 882629 1105550 -571305 -3875212 -5643672 -3547984 988364 4410945 4284601 729451
$$ packed form
11673C559816L644874J214247k725934l431775K5740J935006j222318m213856
11665a214200j333342L455382K421818l066432m398777P47704N561239N177951
11657G351343K158272o13984m117024p273085m846533L761132R976168O430922
11649A2827211k388505o060726k149423J949724K86212m126868m522569L32204
11641c852740M577509K589059l624263o134691j026853N744916N664790p04609
11633C233118m403511o57007M913169N000864M19256k717012j853514N06065J871198
11624F312626J953149R02013r97413k373682k165243j299071r85531o72452K08233
11615H82629K22921j676855l303907j768460K095688M536348L422581j26344l555150
$$ plain form
11606 729451 -3645645 -5163179 -2570150 794162 819914 -1426736 -1012309 3084949 5833674
11597 5833674 3691960 -111058 -1142557 -692703 -2519756 -5552501 -5460072 -2247804 -561541
11588 -561541 -2328352 -4524260 -5244549 -6571907 -9223800 -9537517 -5493366 -1504211 -2242484
11579 -2242484 -4531189 -1335871 6940546 11228426 5397663 -5674030 -12348334 -11154888
11571 -11154888 -6370037 -3208269 -3254837 -5627582 -8772126 -10422745 -8653837 -4579898
11563 -4579898 -2553447 -5991470 -13071470 -17466504 -14120606 -4755655 2939730 3035202
11555 3035202 -1813618 -3476108 1164254 6095440 4728194 -970779 -4162626 -3356059
11547 -3356059 -2998732 -4668805 -4507548 -926244 1570144 -456404 -3618887 -3040962 904812
$$ packed form
11606G29451m375096j517534K593029L364312K5752k246650M14427M097258K748725
11597E833674k141714l803018j031499M49854j827053l032745R2429L212268J686263
11588e61541j766811k195908p20289j327358k651893l13717M044151L989155p38273
11579b242484k288705L195318Q276417M287880n830763j1071693o674304J193446
11571a1154888M784851L161768m6568k372745l144544j650619J768908M073939
11563d579898K026451l438023p080000m395034L345898R364951P695385R5472
11555C035202m848820j662490M640362M931186j367246n698973l191847Q06567
11547c356059L57327j670073J61257L581304K496388k026548l162483N77925L945774
$$ plain form
11538 904812 5252188 9547758 13571056 14104572 9811800 5905728 7333482 10056520
11530 10056520 6666221 -1117860 -4151536 115906 4356374 3635474 1818453 2294240
11522 2294240 1291189 -3725348 -6671678 -1723671 5728433 5622443 -2208072 -8387799
11514 -8387799 -7725800 -4582523 -4043566 -4956461 -3855538 -344709 3823032 6946816 6882593
11505 6882593 2289996 -3816810 -5646117 -1995064 1467895 -179083 -4457928 -5575744
11497 -5575744 -2554672 399465 274250 -1453596 -1558314 1464390 6519898 10580123
11489 10580123 10595712 6522528 1974161 177315 68934 -1460065 -4266952 -4978528 -2565181
11480 -2565181 -639239 -2446944 -5789076 -5364167 582424 7925081 11031800 8307753
$$ packed form
11538I04812M347376M295570M023298N33516m292772l906072J427754K723038
11530A0056520l390299p784081l033676M267442M240468p20900j817021M75787
11522B294240j003051n016537k946330M948007P452104j05990p830515o179727
11514h387799O61999L143277N38957r12895J100923L510829M167741L123784o4223
11505F882593m592597o106806j829307L651053L462959j646978m278845j117816
11497e575744L021072K954137j25215j727846j04718L022704N055508M060225
11489A0580123J5589m073184m548367j796846j08381j528999k806887p11576K413347
11480b565181J925942j807705l342132M24909N946591P342657L106719k724047
$$ plain form
11472 8307753 3218245 512133 1736698 4426477 5581980 5152320 5111783 5817473 5362297
11463 5362297 2790115 -333464 -2501112 -4058161 -4914171 -3149797 1350128 4198383
11455 4198383 1460390 -3812439 -4550381 715568 5829301 5845746 3359352 3443665 6076851
11446 6076851 7234271 5115670 1623299 -978039 -1715434 -348606 1873490 1887932 -1755593
11437 -1755593 -5941176 -6541147 -4343317 -4091055 -7611393 -11210508 -10617917 -5805514 -108428
11428 -108428 3026008 1681367 -3583932 -9135494 -10567567 -7006160 -1846341 1560533
11420 1560533 3349260 5311710 7335930 7482281 5136443 2616207 2961731 6143880
11412 6143880 8094518 4826675 -2147834 -6395246 -4012968 1247894 2613138 -1300305
$$ packed form
11472H307753n089508k706112J224565K689779J155503m29660m0537P05690m55176
11463E362297k572182l123579k167648j557049q56010J764374M499925K848255
11455D198383k737993n272829p37942N265949N113733J6445k486394Q4313K633186
11446F076851J157420k118601l492371k601338p37395J366828K222096J4442l643525
11437a755593m185583n99971K197830K52262l520338l599115N92591M812403N697086
11428a08428L134436j344641n265299n551562j432073L561407N159819L406874
11420A560533J788727J962450K024220J46351k345838k520236L45524L182149
11412F143880J950638l267843o974509m247412K382278N260862J365244l913443
$$ plain form
11404 -1300305 -5573739 -5737531 -2284128 1457174 2878953 1180624 -2265951 -4039400
11396 -4039400 -1659701 3040098 5867209 5700315 5183520 5887448 6277609 5413580 5110229
11387 5110229 6611561 7958859 6643398 2776029 -1741391 -4974042 -4935999 -774447
11379 -774447 4583021 6124387 3105668 658533 2642453 5925731 4933434 -623289
11371 -623289 -6194630 -8781084 -9035976 -7987256 -5648796 -3127154 -2692463 -4389531 -4597155
11362 -4597155 348437 9436726 16831233 17203363 11529452 6487965 6759167 9262941
11354 9262941 7766111 2187297 -1038984 1617379 5983640 7152534 6670947 8821064
11346 8821064 12963798 14274463 10678612 5105303 1462425 1276060 3458258 4839364
$$ packed form
11404a300305m273434j63792L453403L741302J421779j698329l446575j773449
11396d039400K379699M699799K827111j66894n16795P03928L90161q64029l03351
11387E110229J501332J347298j315461l867369m517420l232651L8043M161552
11379g74447N357468J541366l018719k447135J983920L283278r92297n556723
11371f23289n571341k586454k54892J048720K338460K521642M34691j697068k07624
11362d597155M945592R088289P394507L72130n673911n041487K71202K503774
11354I262941j496830n578814l226281K656363M366261J168894m81587K150117
11346H821064M142734J310665l595851n573309l642878j86365K182198J381106
$$ plain form
11338 4839364 2066395 -4445148 -9634110 -9368959 -5562663 -3190117 -3820921 -5080236
11330 -5080236 -5024539 -3676821 -1251060 1796648 3628104 2985328 1577671 1590417 1731890
11321 1731890 -1026851 -6449818 -10969723 -12164832 -10446700 -7070852 -3523087 -2046260
11313 -2046260 -3527055 -5612084 -6072349 -6781269 -10505613 -14998666 -15076988 -10202266 -5118635
11304 -5118635 -2814984 -1846640 -1220538 -2555110 -5689069 -7082886 -5076567 -2713609
11296 -2713609 -2878516 -4264081 -4607232 -4358329 -4301637 -2696283 2007897 7874534 11668220
11287 11668220 12456093 10925307 7444754 3138516 557132 679511 1215951 209645
11279 209645 -960867 -765861 -1133409 -4320573 -8078483 -8036962 -4101961 -574617 -7486
$$ packed form
11338D839364k772969o511543n188962K65151L806296K372546o30804j259315
11330e080236N5697J347718K425761L047708J831456o42776j407657J2746J41473
11321A731890k758741n422967m519905j195109J718132L375848L547765J476827
11313b046260j480795k085029m60265p08920l724344m493053p8322M874722N083631
11304e118635K303651R68344O26102j334572l133959j393817K006319K362958
11296b713609j64907j385565l43151K48903N6692J605354M704180N866637L793686
11287A1668220P87873j530786l480553m306238k581384J22379N36440j006306
11279B09645j170512J95006l67548l187164l757910M1521L935001L527344N67131
$$ plain form
11270 -7486 -636919 -480620 -457898 -1803549 -3016690 -1809257 1012485 1904844 -925269
11261 -925269 -4909542 -6083812 -4040345 -2252550 -3017981 -4122104 -2474564 630907
11253 630907 1317657 -293068 403587 5179023 9410081 8588893 4828339 2996434 3075839
11244 3075839 1365825 -1921625 -1896311 3216520 8335110 8042770 3492908 -144936 -870429
11235 -870429 -1173978 -3187076 -5827433 -7247019 -7690400 -8599520 -10061577 -10450208 -8378224
11226 -8378224 -4311510 -279821 1717718 1252140 -147589 -215444 1996814 5141537 6913722
11217 6913722 6485200 5334492 5454112 7002157 8151135 7251906 4665590 2064015 186992
11208 186992 -1863759 -4649891 -6563320 -5395767 -1803766 415918 -1548759 -6313216
$$ packed form
11270g486o29433J56299K2722j345651j213141J207433K821742Q92359k830113
11261i25269l984273j174270K043467J787795p65431j104123J647540L105471
11253F30907O86750j610725O96655M775436M231058q21188l760554j831905P9405
11244C075839j710014l287450K5314N112831N118590k92340m549862l637844p25493
11235h70429l03549k013098k640357j419586m43381r09120j462057l88631K071984
11226h378224M066714M031689J997539m65578j399729o7855K212258L144723J772185
11217F913722m28522j150708J19620J548045J148978q99229k586316k601575j877023
11208A86992k050751k786132j913429J167553L592001K219684j964677m764457
$$ plain form
11200 -6313216 -10238283 -11231755 -9250106 -4873481 -14140 1452326 -2347576 -6993783
11192 -6993783 -5845864 705164 4652695 1195648 -4316420 -3789080 3004626 9810042
11184 9810042 13151741 14725304 15715812 14430371 10303427 5691242 2233526 -1134634
11176 -1134634 -5121308 -7877010 -7365824 -3924353 551066 4307381 6245961 6580825
11168 6580825 7143843 9114799 10594287 8615560 3241520 -2769143 -7657963 -10843933
11160 -10843933 -10255953 -4116828 4109166 7517097 4496546 1398047 3825413 9022573
11152 9022573 10289168 6063437 847891 -1077205 754480 4694607 8880548 11265080
11144 11265080 10045653 4987189 -1835366 -6303543 -4206592 4507045 13298387 14280748
$$ packed form
11200f313216l925067r93472J981649M376625M859341J466466l799902m646207
11192f993783J147919O551028L947531l457047n512068N27340O793706O805416
11184I810042L341699J573563R90508j285441m126944m612185l457716l368160
11176a134634l986674k755702N11186L441471M475419L756315J938580L34864
11168F580825N63018J970956J479488j978727n374040o010663m888820l185970
11160a0843933N87980O139125Q225994L407931l020551l098499K427366N197160
11152I022573J266595m225731n215546j925096J831685L940127M185941K384532
11144A1265080j219427n058464o822555m468177K096951Q713637Q791342R82361
$$ plain form
11136 14280748 7304662 553010 228495 3374043 3978611 2387221 3543614 7903471
11128 7903471 9982868 6396226 599223 -1997564 -329676 2642927 4033780 2889462
11120 2889462 -314674 -3975980 -5799020 -4507584 -1279954 1159107 1004148 -1185311
11112 -1185311 -3319562 -3814424 -2741074 -1164253 124867 951652 1486653 2217536 3417960
11103 3417960 3829655 1104767 -4804655 -9898040 -10216740 -6937972 -4536576 -4415211 -3894651
11094 -3894651 -1496899 984040 2557255 4706373 7198659 6723555 2435842 -1401984
11086 -1401984 -1756772 -1699306 -4631424 -7510490 -5480723 -540847 825200 -2598772 -5835601
11077 -5835601 -6345104 -7001161 -9234230 -9428632 -4926691 1259301 5018491 6681811 8689527
$$ packed form
11136A4280748o976086o751652l24515L145548O04568j591390J156393M359857
11128G903471K079397l586642n797003k596787J667888K972603J390853j144318
11120B889462l204136l661306j823040J291436L227630K439061j54959k189459
11112a185311k134251m94862J073350J576821J289120Q26785N35001P30883J200424
11103C417960M11695k724888n909422n093385l18700L278768K401396J21365N20560
11094c894651K397752K480939J573215K149118K492286m75104m287713l837826
11086a401984l54788N7466k932118k879066K029767M939876J366047l423972l236829
11077e835601n09503o56057k233069j94402M501941O185992L759190J663320K007716
$$ plain form
11068 8689527 10795209 11131853 9882396 8488250 6739294 3874242 1497407 2172311
11060 2172311 5479117 8345302 9340816 9967446 11147221 10965593 7365330 1501152 -3321726
11051 -3321726 -5423202 -5936485 -6287588 -5981223 -3772018 -248000 2207001 2469330 2682023
11042 2682023 5945710 11926373 15945404 13568100 5907271 -889369 -2047387 1011821
11034 1011821 3452916 3508073 3629521 5261090 6017497 3953487 1417291 1283388 1795375
11025 1795375 -364156 -3416702 -2496457 1735980 2691438 -2075256 -6291712 -3963599
11017 -3963599 2057662 5068773 4052695 2823056 2485606 764118 -2342686 -3862528
11009 -3862528 -2791614 -1084522 395515 2579391 4612343 3903539 506971 -2452448
$$ packed form
11068H689527K105682L36644j249457j394146j748956k865052k376835O74904
11060B172311L306806K866185R95514O26630J179775j81628l600263n864178m822878
11051c321726k101476n13283l51103L06365K209205L524018K455001K62329K12693
11042B682023L263687N980663M019031k377304p660829o796640j158018L059208
11034A011821K441095N5157J21448J631569P56407k064010k536196j33903N11987
11025A795375k159531l052546R20245M232437R55458m766694m216456K328113
11017c963599O021261L011111j016078j229639l37450j721488l106804j519842
11009c862528J070914J707092J480037K183876K032952p08804l396568k959419
$$ plain form
11001 -2452448 -3596544 -4812973 -7004778 -8170608 -7277745 -6505346 -7489958 -8172775 -5798373
10992 -5798373 -1142267 2468064 3319945 2938519 3927149 6680168 8094071 4614768 -2328755
10983 -2328755 -5958486 -1970291 5042855 6901711 2438755 -1875762 -1462482 1490579
10975 1490579 3184390 2763199 371352 -3844568 -6738529 -3715522 3793970 7686104
10967 7686104 3634309 -2709164 -4022493 -998148 1141939 1279469 1596612 1604982 -594513
10958 -594513 -3324201 -3748886 -3591499 -6395339 -10387711 -10239082 -5277954 -63848 2713484
10949 2713484 3960887 3333006 -668543 -5385463 -5661424 -2099332 -940761 -3826565
10941 -3826565 -4724125 -243151 3897597 1651527 -3733087 -4954523 -1722703 -121970
$$ packed form
11001b452448j144096j216429k191805j165830Q92863P72399r84612o82817K374402
10992e798373M656106L610331Q51881l81426R88630K753019J413903l479303o943523
10983b328755l629731L988195P013146J858856m462956m314517M13280K953061
10975A490579J693811m21191k391847m215920k893961L023007P509492L892134
10967G686104m051795o343473j313329L024345K140087J37530L17143Q370k199495
10958e94513k729688m24685J57387k803840l992372J48629M961128N214106K777332
10949B713484J247403o27881m001549m716920k75961L562092J158571k885804
10941c826565q97560M480974M140748k246070n384614j221436L231820J600733
$$ plain form
10933 -121970 -2698103 -5181664 -3252225 1901282 5890627 6321069 4466415 2800732
10925 2800732 1710381 -582081 -4231019 -5811234 -3042664 107860 -2075810 -7677053
10917 -7677053 -8184353 -303808 9355717 13913806 14236394 13681292 11509827 7220625 5596476
10908 5596476 9998154 14601662 11191970 1368105 -5518351 -5116813 -1553324 827309
10900 827309 1783291 1260145 -1633827 -4557313 -2957340 3270598 8955319 10333791 8187322
10891 8187322 4378502 163807 -2225420 -1472100 -373270 -2035166 -3949973 -1900107
10883 -1900107 1761430 1290195 -2195050 -2678744 -993905 -3761921 -9327660 -7183978
10875 -7183978 4116855 10827564 3436488 -8389304 -10015173 -2501167 1953485 -972047
$$ packed form
10933a21970k576133k483561J929439N153507L989345M30442j854654j665683
10925B800732j090351k292462l648938j580215K768570L150524k183670n601243
10917g677053n07300P880545R659525M558089L22588n55102k171465m289202j624149
10908E596476M401678M603508l409692r823865o886456M01538L563489K380633
10900H27309R55982n23146k893972k923486J599973O227938N684721J378472k146469
10891H187322l808820m214695k389227P53320J098830j661896j914807K049866
10883a900107L661537m71235l485245m83694J684839k768016n565739K143682
10875g183978J1300833O710709p391076j1825792j625869P514006M454652k925532
$$ plain form
10867 -972047 -5029797 -6269032 -7119271 -8339526 -6694723 -1748858 2215473 2169479 -741606
10858 -741606 -4006467 -5379942 -3413302 -498834 -2441288 -10130978 -15455946 -11654990
10850 -11654990 -3752180 -1114768 -3202170 -1847295 4427884 8406383 6456638 3351373
10842 3351373 3295786 4349255 3902810 2660041 1028381 -2282646 -6258477 -7764878 -6929034
10833 -6929034 -6865437 -7481844 -5525216 -1225480 1585872 2507946 4706343 7301336 5614589
10824 5614589 969445 1867588 11439676 20823943 20035665 10279773 931082 -1664850
10816 -1664850 1503861 5605572 6393815 3393768 341048 372511 1336729 -402633 -3067077
10807 -3067077 -2257308 558233 -83982 -3456818 -2973085 2194147 4990212 2303777 -432045
$$ packed form
10867i72047m057750j239235q50239j220255J644803M945865L964331m5994k911085
10858g41606l264861j373475J966640K914468j942454p689690n324968L800956
10850a1654990P902810K637412k087402J354875O275179L978499j949745l105265
10842C351373n5587J053469m46445j242769j631660l311027l975831j506401Q35844
10833f929034O3597o16407J956628M299736K811352R22074K198397K594993j686747
10824E614589m645144Q98143R572088R384267p88278r755892r348691k595932
10816a664850L168711M101711P88243l000047l052720L1463R64218j739362k664444
10807c067077Q09769K815541o42215l372836M83733N167232K796065k686435k735822
$$ plain form
10798 -432045 238406 355197 -1779136 -322314 7338967 13641570 12377229 9139347 11628173
10789 11628173 16538336 15688207 9633784 5048521 2592956 -2178090 -8059540 -8584057
10781 -8584057 -3093629 1258151 -324434 -4854732 -7372015 -6650705 -4160903 -1734532
10773 -1734532 -884667 -1249937 -254681 2831806 4352279 1389637 -2802535 -3015843 83225
10764 83225 1371706 -473108 -1264552 1885180 6311914 7553478 4748763 1052931 -447056
10755 -447056 -553234 -2708669 -7092322 -8579482 -4200282 250382 -2411296 -8720629
10747 -8720629 -8979255 -3401183 -2310213 -7619409 -7326595 4676585 16009765 13682850
10739 13682850 4043424 1626948 5975781 4810110 -3922760 -8915750 -4281935 2313619
$$ packed form
10798d32045O70451J16791k134333J456822P661281O302603j264341l237882K488826
10789A1628173M910163q50129o054423m585263k455565m771046n881450n24517
10781h584057N490428M351780j582585m530298k517283P21310K489802K426371
10773a734532Q49865l65270R95256L086487J520473k962642m192172k13308L099068
10764H3225J288481j844814p91444L149732M426734J241564k804715l695832j499987
10755d47056j06178k155435m383653j487160M379200M450664k661678o309333
10747h720629k58626N578072J090970n309196K92814J2003180J1333180k326915
10739A3682850r639426k416476M348833j165671q732870m992990M633815O595554
$$ plain form
10731 2313619 2596417 -2238406 -7095887 -9561290 -8410259 -3262372 2258604 3687922
10723 3687922 2942914 5641197 11026201 12237110 7467711 3088465 3927247 7401358
10715 7401358 9109662 7899930 3857957 -2515017 -7537231 -6595255 -671266 4508567
10707 4508567 6443701 7585034 9067304 8870157 6644924 4322781 1695958 -2449149
10699 -2449149 -5149120 -2387644 2701723 2896700 -1090264 -468795 7549914 14287906
10691 14287906 12039198 4390243 -452291 -354331 1424271 2486702 2402180 1405157 1315409
10682 1315409 4188969 7901420 7409288 2444044 -962294 916370 4337092 4378215 1609191
10673 1609191 -737420 -1829929 -1905950 303064 4959842 8650330 8033232 4371877 2040994
$$ packed form
10731B313619K82798m834823m857481k465403J151031N147887N520976J429318
10723C687922p45008K698283N385004J210909m769399m379246Q38782L474111
10715G401358J708304j209732m041973o372974n022214R41976N923989N179833
10707D508567J935134J141333J482270j97147k225233k322143k626823m145107
10699b449149k699971K761476N089367J94977l986964O21469Q018709O737992
10691A4287906k248708p648955m842534R7960J778602J062431q4522r97023q9748
10682A315409K873560L712451m92132m965244l406338J878664L420722M1123k769024
10673A609191k346611j092509p6021K209014M656778L690488o17098l661355k330883
$$ plain form
10664 2040994 3678759 8018068 11245502 10190737 5641620 2000935 2002680 3360944 2956071
10655 2956071 1698332 1707469 1763984 293073 -390720 1380423 1362379 -4034165 -9211063
10646 -9211063 -6461329 681975 1598163 -4629106 -7819260 -3171820 2381833 3223100
10638 3223100 3135172 5517144 5941436 1122608 -3232268 -893429 5163418 8555383 9618298
10629 9618298 12775899 17746946 19831702 16734009 10497310 4540324 1649048 2407380
10621 2407380 3623871 1303240 -3672887 -6480642 -5259722 -2319019 1342430 6380504
10613 6380504 9886475 7589243 2397371 2314393 7862928 10601691 6974751 3785680
10605 3785680 5580233 6901601 3564321 1858702 7785938 14893594 12746406 2474822
$$ packed form
10664B040994J637765M339309L227434j054765m549117l640685J745J358264m04873
10655B956071j257739R137N6515j470911o83793J771143j8044n396544n176898
10646i211063K749734P143304R16188o227269l190154M647440N553653Q41267
10638C223100q7928K381972M24292m818828m354876K338839O056847L391965J062915
10629I618298L157601M971047K084756l097693o236699n956986k891276P58332
10621B407380J216491k320631m976127k807755J220920K940703L661449N038074
10613F380504L505971k297232n191872q2978N548535K738763l626940l189071
10605C785680J794553J321368l337280j705619N927236P107656k147188j0271584
$$ plain form
10597 2474822 -5367619 -5132279 -251768 4233485 6119893 5017194 2991390 4448380
10589 4448380 10538937 16154727 16766185 14724746 14069093 13280320 9210014 4635210 4959535
10580 4959535 9325967 11495608 8757666 4429988 1880380 976158 702812 1297724 2990168
10571 2990168 5163901 7294521 9266483 10757314 11153391 9989608 7614517 5774722
10563 5774722 6130696 7092330 4784068 -506068 -2514965 2294442 8302988 8882590 6897757
10554 6897757 9220351 14166125 14168192 9221513 6973192 9422997 10290310 6959871 4607289
10545 4607289 6097524 7567899 6836749 7009526 8897707 8692993 5986708 5640563 9152443
10536 9152443 12327618 13425929 15248890 17635659 16511241 11743211 7710808 5779173
$$ packed form
10597B474822p842441K35340M880511M485253J886408j102699k025804J456990
10589D448380O090557N615790O11458k041439o55653p88773m070306m574804L24325
10580D959535M366432K169641k737942m327678k549608r04222k73346N94912J692444
10571B990168K173733K130620J971962J490831L96077j163783k375091j839795
10563E774722L55974R61634k308262n290136k008897M809407O008546N79602j984833
10554F897757K322594M945774K067m946679k248321K449805Q67313l330439k352582
10545D607289J490235J470375p31150J72777J888181k04714k706285l46145L511880
10536I152443L175175J098311J822961K386769j124418m768030m032403j931635
$$ plain form
10528 5779173 4459842 5598421 11021313 15794478 15534139 16165217 23666365 29862464
10520 29862464 24430781 15027362 16143598 23445145 21645387 13237849 13638439 20824834
10512 20824834 18533620 8593626 8969550 19041072 20464159 14483669 21213095 37806282
10504 37806282 38456393 22924995 20229991 34452799 36733876 24152141 29659573 54498906
10496 54498906 55705255 28979136 30485106 75128006 96592640 70154617 81303811
10489 81303811 171734323 202379469 18071445 -290253983 -451911325 -355934543 -172678066
10482 -172678066 -97030523 -116988401 -115106465 -72453812 -54152843 -69534793 -68421270
10475 -68421270 -43298892 -34376423 -47120065 -47141854 -30318919 -27575884 -42349454 -44773441
$$ packed form
10528E779173j319331J138579N422892M773165k60339O31078P501148O196099
10520B9862464n431683r403419J116236P301547j799758q407538M00590P186395
10512B0824834k291214r939994L75924J0071522J423087n980490O729426J6593187
10504C7806282O50111j5531398k695004J4222808K281077j2581735N507432K4839333
10496E4498906J206349k6726119J505970M4642900K1464634k6438023J1149194
10489H1303811R0430512L0645146j84308024l08325428j61657342R5976782J83256477
10482a72678066P5647543j9957878J881936M2652653J8300969j5381950J113523
10475f8421270K5122378Q922469j2743642k1789J6822935K743035j4773570k423987
$$ plain form
10467 -44773441 -28507284 -19320934 -25502790 -28065544 -22126752 -23416778 -31321585 -27236642
10459 -27236642 -12668880 -9667878 -19972841 -21497189 -9714311 -5758922 -17058843
10452 -17058843 -24795161 -18857687 -13132997 -16492738 -18023687 -11494768 -7955605 -13399550
10444 -13399550 -17515233 -14437368 -13134251 -18412062 -21778978 -19071283 -18060461 -21608274
10436 -21608274 -21704453 -16341775 -14245469 -17547625 -17840767 -13945960 -14735551 -19768049 -16957436
10427 -16957436 -5138606 1007060 -4680682 -10058095 -6916427 -4027164 -9170823 -15845174
10419 -15845174 -17214853 -17116343 -18407127 -16020370 -9903485 -9165628 -15231690 -16963036
10411 -16963036 -10837156 -8996263 -17593856 -24375809 -19299928 -11049023 -10135187 -11145801
$$ packed form
10467d4773441J6266157R186350o181856k562754N938792j290026p904807M084943
10459b7236642J4567762L001002j0304963j524348J1782878L955389j1299921
10452a7058843p736318N937474N724690l359741j530949O528919L539163n443945
10444a3399550m115683L077865J303117n277811l366916K707695J010822l547813
10436b1608274r6179N362678K096306l302156k93142L894807p89591n032498K810613
10427a6957436J1818830O145666n687742n377413L141668K889263n143659o674351
10419a5845174j369679R8510j290784K386757O116885P37857o066062j731346
10411a6963036O125880J840893q597593o781953N075881Q250905R13836j010614
$$ plain form
10403 -11145801 -6189468 -1785880 -6497849 -13712364 -12982668 -8441415 -9642496 -12757520
10395 -12757520 -7818700 1702669 3426204 -3561025 -8326896 -6082368 -2596912 -1571045
10387 -1571045 -384539 1243278 -390944 -4650414 -5810531 -2126590 1647986 1733599
10379 1733599 -712384 -3312632 -4860245 -4265017 -1736524 -325062 -2409989 -6069044
10371 -6069044 -8252829 -9014345 -9049382 -6482519 -632744 4131527 3155282 -2249778 -7356851
10362 -7356851 -10122984 -11036641 -10144284 -8144477 -7146686 -6752806 -3385515 2732418 4898646
10353 4898646 -830768 -8565175 -10458987 -7097163 -3725216 -740312 4320150 8800673
10345 8800673 7643341 2532330 79272 1318052 857968 -3026508 -5192068 -2520851
$$ packed form
10403a1145801M956333M403588m711969p214515P29696M541253j201081l115024
10395a2757520M938820R521369J723535o987229m765871K244528L485456J025867
10387a571045J186506J627817j634222m259470j160117L683941L774576Q5613
10379A733599k445983k600248j547613N95228K528493J411462k084927l659055
10371f069044k183785p61516l5037K566863N849775M764271r76245n405060n107073
10362g356851k766133r13657Q92357J999807R97791L93880L367291O117933K166228
10353D898646n729414p734407j893812L361824L371947K984904N060462M480523
10345H800673j157332n111011k453058J238780m60084l884476k165560K671217
$$ plain form
10337 -2520851 678488 -504490 -4213867 -5046774 -1795014 1296564 -101779 -5618740
10329 -5618740 -10314548 -9196301 -2318718 4892810 7274055 4976065 1720085 -413425
10321 -413425 -2184066 -4301764 -6188867 -7591554 -9139606 -10915136 -11990587 -11642754
10313 -11642754 -10034370 -7810051 -5789587 -4650091 -4286248 -4148222 -4560210 -6338813
10305 -6338813 -8463430 -8134067 -4829894 -2590755 -5634975 -12263778 -15826786 -12448426
10297 -12448426 -5814733 -2803421 -5387675 -8873414 -8363818 -4788115 -2702191 -3575776
10289 -3575776 -4386830 -2892280 -843962 -560384 -1281053 -1090222 -206260 -192763 -1742696
10280 -1742696 -4867006 -8998101 -11530932 -9513196 -4679952 -2931241 -6292172 -9767583
$$ packed form
10337b520851L199339j182978l709377q32907L251760L091578j398343n516961
10329e618740m695808J118247O877583P211528K381245k297990l255980k133510
10321d13425j770641k117698j887103j402687j548052j775530j075451L47833
10313a1642754J608384K224319K020464J139496L63843J38026m11988j778603
10305f338813k124617L29363L304173K239139l044220o628803l563008L378360
10297a2448426O633693L011312k584254l485739N09596L575703K085924q73585
10289c575776q11054J494550K048318K83578p20669J90831Q83962J3497j549933
10280a742696l124310m131095k532831K017736M833244J748711l360931l475411
$$ plain form
10272 -9767583 -9215523 -7066375 -6107457 -3803229 1120437 2779319 -2913174 -8918425
10264 -8918425 -6697910 -710838 -1650916 -8190415 -8780711 -1115522 4220589 1655956
10256 1655956 -1497270 558319 2640083 -162760 -3054342 -823699 2995089 3804082
10248 3804082 4060631 6150309 5814522 1154572 -109266 7736207 16431662 14068278
10240 14068278 2162200 -8088948 -12188740 -14003170 -14392315 -10122813 -3432905 -1585044
10232 -1585044 -5514234 -8116336 -5735259 -3296571 -5552230 -10130578 -12305351 -11350988
10224 -11350988 -9309906 -7427504 -6160154 -5900623 -6166670 -5878029 -4575277 -1970392
10216 -1970392 2062103 4999343 2301253 -5765451 -11319064 -8128849 -793709 1637832
$$ packed form
10272i767583N52060K149148R58918K304228M923666J658882n692493o005251
10264h918425K220515N987072r40078o539499n90296P665189N336111k564633
10256A655956l153226K055589K081764k802843k891582K230643L818788Q08993
10248C804082K56549K089678l35787m659950j263838P845473Q695455k363384
10240A4068278j1906078j0251148m099792j814430l89145M269502O689908J847861
10232a585044l929190k602102K381077K438688k255659m578348k174773R54363
10224a1350988K041082J882402J267350K59531k66047K88641J302752K604885
10216a970392M032495K937240k698090q066704n553613L190215P335140K431541
$$ plain form
10208 1637832 -1223654 -2121559 808514 992638 -4896716 -10489142 -9027659 -3144041
10200 -3144041 -602811 -4058318 -9225534 -10940406 -7881962 -2836222 -316140 -2446054
10192 -2446054 -6069725 -5861181 -1126320 2868499 1363905 -4428456 -9353190 -9610140
10184 -9610140 -5243650 236765 1829697 -2815792 -10013588 -13039218 -9603474 -4068419
10176 -4068419 -1254309 -919224 -298246 586531 -572438 -3491315 -4088982 827393 9002320
10167 9002320 14096317 11857585 4533015 -1542931 -2665819 -847717 72008 -719088
10159 -719088 -1647065 -2259029 -3272386 -4119652 -3585633 -2757836 -4266536 -7991537 -10228553
10150 -10228553 -8269091 -3853735 -1006849 -1875601 -5354309 -8413924 -8396530 -5497310
$$ packed form
10208A637832k861486q97905K930073J84124n889354n592426J461483N883618
10200c144041K541230l455507n167216j714872L058444N045740K520082k129914
10192b446054l623671K08544M734861L994819j504594n792361m924734k56950
10184i610140M366490N480415J592932m645489p197796l025630L435744N535055
10176d068419K814110L35085O20978Q84777j158969k918877n97667M916375Q174927
10167I002320N093997k238732p324570o075946j122888J818102R19725p91096
10159g19088r27977o11964j013357q47266N34019Q27797j508700l725001k237016
10150a0228553J959462M415356K846886q68752l478708l059615J7394K899220
$$ plain form
10142 -5497310 -3129348 -4015644 -5996528 -4481416 314089 2128258 -2958797 -9852015
10134 -9852015 -10165407 -3428358 2043999 393397 -3975641 -3006734 3273387 6409537
10126 6409537 1077308 -7437171 -9773568 -3673854 4691434 8997379 8509679 5759362
10118 5759362 2470011 -644823 -2735338 -3451212 -3314899 -2380435 -114361 2551635 3108720
10109 3108720 677428 -2575327 -4474215 -5230596 -5513212 -4746076 -3394493 -4269273 -8525961
10100 -8525961 -12455844 -11811753 -7885716 -5446224 -5567715 -4892682 -2114958 -557799 -2620154
10091 -2620154 -5422968 -4618812 -69975 4904393 8097155 9345693 8093317 3509445
10083 3509445 -2465695 -5072322 -1551747 5242851 9629486 8805366 4399184 -854004
$$ packed form
10142e497310K367962q86296j980884J515112M795505J814169n087055o893218
10134i852015l13392O737049N472357j650602m369038R68907O280121L136150
10126F409537n332229q514479k336397O099714Q365288M305945m87700k750317
10118E759362l289351l114834k090515p15874J36313R34464K266074K665996N57085
10109C108720k431292l252755j898888p56381k82616P67136J351583q74780m256688
10100h525961l929883O44091L926037K439492j21491O75033K777724J557159k062355
10091b620154k802814Q04156M548837M974368L192762J248538j252376m583872
10083C509445n975140k606627L520575O794598M386635q24120m406182n253188
$$ plain form
10075 -854004 -5637930 -8937536 -9015170 -5510977 -1284272 10115 -2166411 -5293893 -7119081
10066 -7119081 -7087612 -5167091 -1877343 378394 -1141051 -5393248 -7169640 -2761300
10058 -2761300 4977179 8892582 4848209 -3882299 -9567272 -7414200 -226884 4723159
10050 4723159 3629097 -207873 -1180715 2144427 6794702 9369565 7856033 1771395
10042 1771395 -6074600 -9862409 -6959860 -2406507 -2659096 -6333505 -6860504 -3376682
10034 -3376682 -1759794 -4035826 -4502962 651463 6791238 8063177 5409647 2802576
10026 2802576 605781 -2344519 -4463262 -4337644 -4178765 -5626245 -5974297 -3358058 -1393839
10017 -1393839 -3100537 -4547867 -1170903 3447745 2701277 -2020886 -3558229 -366867
$$ packed form
10075h54004m783926l299606p7634L504193M226705J294387k176526l127482j825188
10066g119081L1469J920521L289748K255737j519445m252197j776392M408340
10058b761300P738479L915403m044373q730508n684973K153072P187316M950043
10050D723159j094062l836970r72842L325142M650275K574863j513532o084638
10042A771395p845995l787809K902549M553353k52589l674409n26999L483822
10034c376682J616888k276032m67136N154425O139775J271939k653530k607071
10026B802576k196795k950300k118743J25618J58879j447480l48052K616239J964219
10017a393839j706698j447330L376964M618648p46468m722163j537343L191362
$$ plain form
10009 -366867 2670530 3810410 6113224 9407697 9381441 6136404 5280308 8114210 8754284
10000 8754284 4325219 316994 1302695 3331929 1305824 -1870737 -306797 4648016
9992 4648016 6346520 3200479 495636 1834053 4213655 3199460 -566882 -2303845
9984 -2303845 716128 5675030 7571032 5631255 4444264 7246933 10408306 8233501
9976 8233501 1771214 -2364800 -1909903 -1653417 -4679170 -7273767 -6045950 -4322064 -6408284
9967 -6408284 -10106447 -10865840 -9895593 -11503971 -14467149 -13085184 -6497568 -463713 1023456
9958 1023456 280175 599216 1399260 932600 -229376 -964952 -1769374 -2770295 -2094139
9949 -2094139 1454390 5911371 8252559 7511008 4545409 532728 -2926453 -4042328
$$ packed form
10009c66867L037397J139880K302814L294473k6256l245037q56096K833902O40074
10000H754284m429065m008225R85701K029234k026105l176561J563940M954813
9992D648016J698504l146041k704843J338417K379602j014195l766342j736963
9984b303845L019973M958902J896002j939777j186991K802669L161373k174805
9976H233501o462287m136014M54897K56486l025753k594597J227817J723886k086220
9967f408284l698163p59393R70247j608378k963178J381965O587616O033855J487169
9958A023456p43281L19041Q00044m66660j161976p35576q04422j000921O76156
9949b094139L548529M456981K341188p41551k965599m012681l459181j115875
$$ plain form
9941 -4042328 -2788351 -1214806 -634746 -167485 742335 442585 -2429513 -6205350 -7930143
9932 -7930143 -6655145 -3342440 1005203 5022896 6124145 2680671 -3141043 -6821018
9924 -6821018 -5985298 -2294526 804885 1024345 -1507353 -4480002 -5032904 -2149738 2564710
9915 2564710 6568691 8088057 6535042 3159893 1154493 2307336 3446479 182229
9907 182229 -5121580 -4771255 2263099 6372887 691824 -7696065 -7856453 -1591015 128301
9898 128301 -5089078 -8172720 -4032877 1160351 1251269 -919936 -244275 2671588 4532960
9889 4532960 3875242 -434437 -8329241 -14260541 -12261393 -6925220 -8576723 -15396171
9881 -15396171 -14417892 -4750100 -2423970 -13424718 -21949616 -20729683 -31630093 -70495349
$$ packed form
9941d042328J253977J573545N80060M67261R09820k99750k872098l775837j724793
9932g930143J274998L312705M347643M017693J101249l443474n821714l679975
9924f821018Q35720L690772L099411K19460k531698k972649n52902K883166M714448
9915B564710M003981J519366j553015l375149k005400J152843J139143l264250
9907A82229n303809L50325P034354M109788n681063q387889j60388O265438J719316
9898A28301n217379l083642M139843N193228R0918k171205O75661K915863J861372
9889D532960o57718m309679p894804n931300J999148N336173j651503o819448
9881a5396171R78279R667792K326130j1000748q524898J219933j0900410l8865256
$$ plain form
9873 -70495349 -107806948 -98734461 -47200026 -4435527 -218117 -10542486 -4984916 8133220
9865 8133220 5976485 -6478638 -7583612 3204535 7652999 1382466 -1918840 3445837
9857 3445837 7873956 6363461 5965051 9883181 10671271 4042555 -3813230 -7172889 -7873347
9848 -7873347 -7906523 -5399270 -1429755 -1010804 -3832098 -3343944 1615155 3714190 -422702
9839 -422702 -3934669 -887459 4638437 6281397 4922302 4473037 4439492 2926483 1878298
9830 1878298 3197691 3929944 1138444 -2196648 -1876225 285673 -191506 -2671639 -3187472
9821 -3187472 -2139400 -3665717 -7691337 -8875140 -4816519 -223139 -494058 -4771135
9813 -4771135 -8227001 -8878520 -8824896 -9533537 -9266431 -6348646 -2668785 -1409447 -2026267
$$ packed form
9873g0495349l7311599R072487N1534435M2764499M217410j0324369N557570J3118136
9865H133220k156735j2455123j104974J0788147M448464o270533l301306N364677
9857C445837M428119j510495l98410L918130P88090o628716p855785l359659p00458
9848g873347l3176K507253L969515M18951k821294M88154M959099K099035m136892
9839d22702l511967L047210N525896J642960j359095m49265l3545j513009j048185
9830A878298J319393P32253k791500l335092L20423K161898m77179k480133n15833
9821c187472J048072j526317m025620j183803M058621M593380k70919m277077
9813d771135l455866o51519N3624p08641K67106K917785L679861J259338o16820
$$ plain form
9804 -2026267 -543675 4238143 7810254 5800097 719684 -875022 2499983 5095242
9796 5095242 2208953 -2928628 -3567797 1167766 5081412 3298636 -1560432 -3664767
9788 -3664767 -2126974 -1347711 -3674720 -5915007 -4903015 -2778796 -3197800 -4928391 -3839227
9779 -3839227 -7382 2073186 268749 -2822670 -4564653 -4846515 -3655439 -976950
9771 -976950 404382 -2492224 -6582135 -5347598 633499 2879047 -2273227 -7509064
9763 -7509064 -5727756 -393690 1405632 198736 1162133 4387684 5575032 3507688
9755 3507688 317618 -3051465 -5833065 -5093123 -407849 2585013 -224508 -3906885
9747 -3906885 -1798834 3176897 2829112 -3165069 -7288399 -6110345 -3564734 -2652946 -2030170
$$ packed form
9804b026267J482592M781818L572111k010157n080413j594706L375005K595259
9796E095242k886289n137581o39169M735563L913646j782776m859068k104335
9788c664767J537793P79263k327009k240287J011992K124219m19004j730591J089164
9779c839227L831845K080568j804437l091419j741983k81862J191076K678489
9771i76950J381332k896606m089911J234537N981097K245548n152274n235837
9763g509064J781308N334066J799322j206896R63397L225551J187348k067344
9755C507688l190070l369083k781600P39942M685274K992862k809521l682377
9747c906885K108051M975731l47785n994181m123330J178054K545611R11788O22776
$$ plain form
9738 -2030170 -1154697 -1385330 -1552091 653081 2779769 40693 -6331656 -10131444 -9670208
9729 -9670208 -9159951 -10392845 -10227527 -7079471 -3265998 -346144 1696062 1011462 -3600338
9720 -3600338 -7505581 -5096778 895984 3079286 1520485 2902387 7780716 8995079
9712 8995079 4053359 -966109 -1829948 -825995 712819 4386853 7280883 3549169
9704 3549169 -3825693 -4482395 2547180 5936189 801435 -2906010 2137799 7907355
9696 7907355 5346220 -433326 -577692 2123287 791588 -1182394 3165023 9887052
9688 9887052 10149585 6005167 6376075 10471739 9111051 1399185 -3277218 -620019 3238636
9679 3238636 3414897 2238559 1071058 -3412416 -10833222 -13929010 -8822290 -1921845
$$ packed form
9738b030170Q75473k30633j66761K205172K126688k739076o372349l799788M61236
9729i670208N10257j232894J65318L148056L813473K919854K042206o84600m611800
9720c600338l905243K408803N992762K183302j558801J381902M878329J214363
9712H995079m941720n019468q63839J003953J538814L674034K894030l731714
9704C549169p374862o56702P029575L389009n134754l707445N043809N769556
9696G907355k561135n779546j44366K700979j331699j973982M347417O722029
9688I887052K62533m144418L70908M095664j360688p711866m676403K657199L858655
9679C238636J76261j176338j167501m483474p420806l095788N106720O900445
$$ plain form
9671 -1921845 -1757574 -8566173 -15759671 -17967878 -14621216 -8751257 -4717144 -4748436 -6401330
9662 -6401330 -5649934 -2561144 -755696 -1348475 -1467376 499431 2148913 1010514 -1877899
9653 -1877899 -3842271 -3648648 -1542338 1813858 5397924 8081181 9317900 8996577 7284047
9644 7284047 5395556 4991285 5474988 3798450 -1219244 -6398701 -8137689 -6722805 -4453799
9635 -4453799 -1985345 558860 1288234 -1084698 -4368156 -5717853 -5634623 -5959758 -5873413
9626 -5873413 -3537654 -97964 1630163 1218996 176572 -1029964 -2406763 -2771555 -1885400
9617 -1885400 -2073255 -4297834 -5281238 -2662736 -113906 -1987053 -5203977 -2896392 4717557
9608 4717557 9600944 6680689 -326916 -5308686 -7089494 -8216269 -10067796 -11701904
$$ packed form
9671a921845J64271o808599p193498k208207L346662N869959M034113l1292j652894
9662f401330P51396L088790J805448n92779j18901J966807J649482j138399k888413
9653a877899j964372J93623K106310L356196L584066K683257J236719l21323j712530
9644G284047j888491m04271M83703j676538n017694n179457j738988J414884K269006
9635d453799K468454K544205P29374k372932l283458j349697Q3230l25135Q6345
9626e873413K335759L439690J728127m11167j042424j206536j376799l64792Q86155
9617a885400j87855k224579r83404K618502K548830j873147l216924K307585P613949
9608D717557M883387k920255p007605m981770j780808j126775j851527j634108
$$ plain form
9600 -11701904 -11735019 -9754304 -6592250 -3454922 -458628 2781006 4685049 2655662
9592 2655662 -1960978 -3558341 41510 3361690 1057101 -3608690 -3764588 202559
9584 202559 1541637 -2044498 -5272184 -3657002 830035 4000090 4633385 3745626 2392043
9575 2392043 1719722 2415508 3255767 2486472 535490 -1024093 -2216649 -3316624 -2205385
9566 -2205385 2762986 8128063 8180812 2447435 -3834330 -6685450 -6713195 -5560212 -3518259
9557 -3518259 -1269930 -21462 710280 1932172 1885427 -1952282 -7527265 -9516150 -6686486
9548 -6686486 -3396262 -2676379 -2521935 -964705 -387830 -3708871 -9202450 -12218128 -10615202
9539 -10615202 -6415553 -2986425 -1906196 -2135601 -1891869 -1553498 -3704029 -9287874 -15273008
$$ packed form
9600a1701904l3115J980715L162054L137328K996294L239634J904043k029387
9592B655662m616640j597363L599851L320180k304589m665791j55898L967147
9584B02559J339078l586135l227686J615182M487037L170055O33295q87759j353583
9575B392043o72321O95786Q40259p69295j950982j559583j192556j099975J111239
9566b205385M968371N365077N2749n733377o281765k851120k7745J152983K041953
9557c518259K248329J248468P31742J221892m6745l837709n574983j988885K829664
9548f686486L290224P19883J54444J557230N76875l321041n493579l015678J602926
9539a0615202M199649L429128J080229k29405K43732L38371k150531n583845n985134
$$ plain form
9530 -15273008 -17846235 -16301725 -11951726 -5615199 1062291 4475362 3118139 689003
9522 689003 1086818 2497131 1200967 -856020 1732583 8858240 14032161 12697428 6358111
9513 6358111 -1462524 -8094396 -10552782 -7242950 -1768830 -32024 -2771469 -5739903
9505 -5739903 -7316343 -9976521 -13376050 -12595175 -5788135 1983755 5492084 5316567 4547312
9496 4547312 4131713 4337445 6427752 9441730 8866044 2086570 -7222698 -12913775 -12640739
9487 -12640739 -8544973 -3970608 -1194765 -404685 287377 2104189 2941739 139349 -4526808
9478 -4526808 -6430429 -4694539 -2957468 -3243194 -3779055 -3713429 -4992105 -8028022 -10226776
9469 -10226776 -10495450 -10605906 -10484559 -7213926 -872397 3740117 3925200 2821028 3413244
$$ packed form
9530a5273008k573227J544510M349999O336527O677490L413071j357223k429136
9522F89003L97815J410313j296164k056987K588603P125657N173921j334733o339317
9513F358111p820635o631872k458386L309832N474120J736806k739445k968434
9505e739903j576440k660178l399529P80875O807040P771890L508329j75517p69255
9496D547312m15599K05732K090307L013978n75686o779474r309268n691077K73036
9487a2640739M095766M574365K775843P90080O92062J816812Q37550k802390m666157
9478d526808j903621J735890J737071k85726n35861O5626j278676l035917k198754
9469a0226776k68674j10456J21347L270633O341529M612514J85083j104172N92216
$$ plain form
9460 3413244 3693540 1335907 -1372365 -1527291 -908056 -3002437 -7451491 -11154587 -12520507
9451 -12520507 -11553642 -8360535 -4545462 -3301534 -5035893 -5608369 -1976562 3100144
9443 3100144 5093694 3826864 2423815 2615382 4179548 6670572 8645308 7509908
9435 7509908 3203065 -222869 314997 2544421 2466611 -127993 -3016785 -5871401 -9315704
9426 -9315704 -11535100 -9991498 -5715878 -2415003 -1725701 -2089881 -1776824 -588858 886788
9417 886788 1675592 717804 -1563904 -2951291 -2200216 -898246 -976796 -1671182 -729901
9408 -729901 2211722 4860152 4402740 157894 -4842738 -5419870 345061 7609537 9646511
9399 9646511 6022322 2254307 1419880 994478 -942051 -1843118 318990 3008017 3480500
$$ packed form
9460C413244K80296k357633k708272j54926O19235k094381m449054l703096j365920
9451a2520507R66865L193107L815073J243928j734359n72476L631807N076706
9443C100144J993550j266830j403049J91567J564166K491024J974736j135400
9435G509908m306843l425934N37866K229424p7810k594604k888792k854616l444303
9426i315704k219396J543602M275620L300875O89302l64180L13057J187966J475646
9417H86788P88804r57788k281708j387387P51075J301970p8550o94386R41281
9408g29901K941623K648430m57412m244846n000632n77132N764931P264476K036974
9399I646511l624189l768015q34427m25402j936529r01067K162108K689027M72483
$$ plain form
9390 3480500 3233281 4545080 6020444 5243022 3000615 1435334 535613 -485891 -951347
9381 -951347 -739232 -1770759 -4614996 -6498464 -5565556 -4041520 -4162181 -4269130 -2311981
9372 -2311981 87119 786832 1193134 3232568 5194167 4651710 2781184 1677525 184373
9363 184373 -3113260 -5298525 -2502655 3729683 7985062 7795399 5183106 2724180 1477171
9354 1477171 1433572 1126744 -1454032 -5328099 -6829708 -5718604 -6548299 -10470695 -11040438
9345 -11040438 -3657451 5742829 8361494 4882675 2337541 1896806 -1087049 -6334833
9337 -6334833 -7582902 -3146792 928896 260498 -2553568 -4183643 -5470820 -7415906
9329 -7415906 -8199973 -7199472 -6949884 -8301130 -8171913 -4776906 -766726 1437995 3144402
$$ packed form
9390C480500k47219J311799J475364p77422k242407j565281q99721j021504m65456
9381i51347K12115j031527k844237j883468R32908J524036j20661j06949J957149
9372b311981K399100O99713M06302K039434J961599n42457j870526j103659j493152
9363A84373l297633k185265K795870O232338M255379j89663k612293k458926j247009
9354A477171m3599l06828k580776l874067j501609J111104q29695l922396n69743
9345a1040438P382987R400280K618665l478819k545134m40735k983855n247784
9337f334833j248069M436110M075688o68398k814066j630075j287177j945086
9329g415906p84067J000501K49588j351246J29217L395007M010180K204721J706407
$$ plain form
9320 3144402 5335436 5318391 1120804 -3943436 -5006507 -2036141 747299 513845 -1762774
9311 -1762774 -3487936 -2741788 956274 6236636 10253150 10536559 6740147 710423 -4709045
9302 -4709045 -7367742 -7171369 -5506000 -3031451 665630 4683008 6401052 5090484
9294 5090484 3494088 3626108 3752381 2499128 2765831 7012477 11173290 9045980 1778433
9285 1778433 -2824866 -661559 4198638 5897999 2638540 -4575847 -13769476 -20799468
9277 -20799468 -20942081 -14169390 -5806544 -542491 1150052 132435 -3390865 -7282912
9269 -7282912 -7209463 -1789206 4875095 8069244 7347399 4861070 1812564 -1177944 -2739353
9260 -2739353 -2349427 -1653407 -2223993 -3285539 -3027361 -886370 2452392 5977835 8551738
$$ packed form
9320C144402K191034j7045m197587n064240j063071K970366K783440k33454k276619
9311a762774j725162P46148L698062N280362M016514K83409l796412o029724n419468
9302d709045k658697J96373J665369K474549L697081M017378J718044j310568
9294E090484j596396J32020J26273j253253K66703M246646M160813k127310p267547
9285A778433m603299K163307M860197J699361l259459p214387r193629p029992
9277b0799468j42613O772691Q362846N264053J692543j017617l523300l892047
9269g282912P3449N420257O664301L194149p21845k486329l048506k990508j561409
9260b739353L89926O96020n70586j061546K58178K140991L338762L525443K573903
$$ plain form
9251 8551738 9440435 8981173 7686411 5362161 2720848 2348640 5151199 7304414 4824747
9242 4824747 257234 -217511 3604181 4849576 -461562 -7703517 -10444055 -8274820
9234 -8274820 -4676588 -1160263 2517325 5158084 5169028 3303737 1344512 -642221 -3249341
9225 -3249341 -5312686 -5102626 -3178514 -2096398 -3673376 -7534350 -11543243 -13088376
9217 -13088376 -11193260 -7853198 -5957695 -5861102 -5840739 -5688168 -7049493 -9778540 -10908930
9208 -10908930 -8408108 -3758294 -32777 662758 -2120336 -6453921 -8239837 -5335458
9200 -5335458 -1261220 -1024881 -3494711 -2800459 2105279 4961782 1403433 -4627629 -6909133
9191 -6909133 -5035298 -2820319 -2034760 -1477600 27480 2614832 5352300 5469314 493989
$$ packed form
9251H551738Q88697m59262j294762k324250k641313l72208K802559K153215k479667
9242D824747m567513m74745L821692J245395n311138p241955k740538K169235
9234h274820L598232L516325L677588K640759J0944j865291j959225j986733k607120
9225c249341k063345K10060J924112J082116j576978l860974m008893j545133
9217a3088376J895116L340062J895503R6593K0363J52571j361325k729047j130390
9208a0908930K500822M649814L725517O95535k783094m333585j785916K904379
9200e335458M074238K36339k469830O94252M905738K856503l558349o031062k281504
9191f909133J873835K214979P85559N57160J505080K587352K737468J17014m975325
$$ plain form
9182 493989 -7114290 -10961402 -8371651 -3360533 -75767 2093732 4231490 4090081 770738
9173 770738 -1658834 -357942 698187 -2893953 -7668609 -7105514 -2288523 -526596 -4110571
9164 -4110571 -7317058 -5342071 -414305 2623373 2385111 690996 -688751 -1332105 -1817006
9155 -1817006 -2726317 -3262166 -1820216 1059204 2455712 1495562 1154174 3056506 3819825
9146 3819825 378849 -4231452 -5288165 -4005072 -5159290 -8860446 -10697454 -9276424
9138 -9276424 -7587468 -6907206 -5252189 -2613200 -2140201 -4658547 -6760254 -5895175 -3275540
9129 -3275540 -594110 1996482 3506981 1975359 -1790473 -4176252 -3890235 -3496095 -4637448
9120 -4637448 -5593165 -5013208 -4273026 -4430023 -4315396 -3193445 -1980479 -652603 1829225
$$ packed form
9182D93989p608279l847112K589751N011118L284766K169499K137758j41409l319343
9173G70738k429572J300892J056129l592140m774656N63095M816991J761927l583975
9164d110571l206487J974987M927766L037678k38262j694115j379747o43354m84901
9155a817006r09311n35849J441950K879420J396508r60150l41388J902332P63319
9146C819825l440976m610301j056713J283093j154218l701156j837008J421030
9138i276424J688956O80262J655017K638989M72999k518346k101707Q65079K619635
9129c275540K681430K590592J510499j531622l765832k385779K86017L94140j141353
9120d637448r55717N79957P40182j56997J14627J121951J212966J327876K481828
$$ plain form
9111 1829225 3909700 2179821 -2561834 -4732616 -2024635 661103 -1093005 -3868285
9103 -3868285 -1543485 5013991 8600015 5217119 -1229735 -4195655 -1850857 1580618
9095 1580618 982531 -3349779 -5312940 -395360 7689986 11023324 7532017 2620928
9087 2620928 660191 450060 650437 3382218 8841970 11969931 9371792 5124538 4586605
9078 4586605 6456959 6594756 6005687 8399642 12393042 13169163 10529838 8444287 7232595
9069 7232595 3180237 -3577023 -7435688 -5280062 -666664 1699852 1021478 -1592744
9061 -1592744 -5635525 -9773459 -11653363 -10824422 -8867627 -6128624 -2011585 1356192
9053 1356192 527908 -3323981 -4754306 -1640440 2313334 3821929 3467834 1564008 -3128409
$$ packed form
9111A829225K080475j729879m741655k170782K707981K685738j754108k775280
9103c868285K324800O557476L586024l382896o446854k965920K344798L431475
9095A580618n98087m332310j963161M917580Q085346L333338l491307m911089
9087B620928j960737k10131K00377K731781N459752L127961k598139m247254n37933
9078D586605J870354J37797n89069K393955L993400P76121k639325k085551j211692
9069G232595m052358o757260l858665K155626M613398K366516o78374k614222
9061a592744m042781m137934j879904Q28941J956795K739003M117039L367777
9053A356192q28284l851889j430325L113866L953774J508595l54095j903826m692417
$$ plain form
9044 -3128409 -8026443 -6721901 1618330 8845602 8471887 3999034 1468568 -156445
9036 -156445 -4238331 -7523876 -4664787 1680651 4188830 2371087 1924371 3788807 3246748
9027 3246748 142289 267206 4435550 5383402 -651687 -7320708 -7818213 -4084855 -1114911
9018 -1114911 1345132 4952614 6120981 913325 -6777822 -9532045 -7056302 -5420591
9010 -5420591 -6665181 -6581249 -3448752 -1703795 -4086275 -5988037 -2103719 4861455 7231935
9001 7231935 3039964 -1016233 1472844 8045694 10682676 6389983 718862 -220568
8993 -220568 2432735 3530757 2090193 1313793 1719523 291247 -2803637 -2893599 1378522
8984 1378522 4846832 4133041 3472068 7054143 10630307 7564218 -277684 -5154480 -4809519
$$ packed form
9044c128409m898034J304542Q340231P227272l73715m472853k530466j625013
9036a56445m081886l285545K859089O345438K508179j817743m46716J864436n42059
9027C246748l104459J24917M168344R47852o035089o669021m97505L733358K969944
9018a114911K460043L607482J168367n207656p691147k754223K475743J635711
9010e420591j244590Q3932L132497J744957k382480j901762L884318O965174K370480
9001G231935m191971m056197K489077O572850K636982m292693n671121r39430
8993b20568K653303J098022j440564p76400M05730j428276l094884q9962M272121
8984A378522L468310p13791o60973L582075L576164l066089p841902m876796L44961
$$ plain form
8975 -4809519 -3549945 -3231708 -1413603 1294629 460148 -3752870 -5229705 -1888169 359684
8966 359684 -2393695 -4966224 -1322839 5716355 9027806 7200101 3955725 1025962
8958 1025962 -2056515 -3519765 -1169657 2615034 3511107 1963011 1794097 3127936 2729320
8949 2729320 946823 1649167 4514566 4233784 -476706 -3641769 -1300461 1924012 387181
8940 387181 -3320414 -2841438 1353511 2694749 -1144539 -5197138 -5315497 -3631165 -3758301
8931 -3758301 -5123010 -5110687 -3601878 -2082549 -499658 1665546 2719614 581784 -3447909
8922 -3447909 -6021858 -6610918 -7718300 -9905650 -10145261 -6562593 -1749278 827674 1265431
8913 1265431 1489239 1170226 -1245998 -4486570 -5012135 -1689546 3115699 7341068 10985903
$$ packed form
8975d809519J259574L18237J818105K708232q34481m213018j476835L341536K247853
8966C59684k753379k572529L643385P039194L311451j827705l244376k929763
8958A025962l082477j463250K350108L784691Q96073j548096j68914J333839l98616
8949B729320j782497P02344K865399k80782m710490l165063K341308L224473j536831
8940C87181l707595M78976M194949J341238l839288m052599j18359J684332j27136
8931c758301j364709J2323J508809J519329J582891K165204J054068k137830m029693
8922c447909k573949n89060j107382k187350k39611L582668M813315K576952M37757
8913A265431K23808l19013k416224l240572n25565L322589M805245M225369L644835
$$ plain form
8904 10985903 13422136 12439854 7839173 3120739 1141072 320280 -2049696 -4660081
8896 -4660081 -3948066 -125329 2444478 1285417 -1231385 -2073461 -1554259 -1358305 -1349385
8887 -1349385 -946353 -1495201 -3882013 -5036222 -874874 7036663 11746481 9437171 4376181
8878 4376181 2951136 5602610 8070291 8559241 9139433 10457388 9787518 5668475 649397
8869 649397 -2617061 -4845192 -7247531 -8060680 -5159187 -204365 3194853 4245994 4670272
8860 4670272 4665009 2768608 -585224 -3005262 -3980077 -5505445 -8294111 -10503358 -10994658
8851 -10994658 -10617231 -9216476 -4995091 1200509 4515768 2154362 -1788326 -1268473
8843 -1268473 3456499 6367545 3927472 -995653 -3910508 -3957207 -2867327 -1353750 982028
$$ packed form
8904A0985903K436233r82282m600681m718434j979667q20792k369976k610385
8896d660081P12015L822737K569807j159061k516802q42076N19202J95954Q920
8887a349385M03032n48848k386812j154209M161348P911537M709818k309310n060990
8878D376181j425045K651474K467681M88950N80192J317955o69870m119043n019078
8869F49397l266458k228131k402339q13149K901493M954822L399218J051141M24278
8860D670272n263j896401l353832k420038r74815j525368k788666k209247m91300
8851a0994658L77427J400755M221385O195600L315259k361406l942688N19853
8843a268473M724972K911046k440073m923125k914855m6699J089880J513577K335778
$$ plain form
8834 982028 3265980 3315698 322398 -3838883 -6690127 -7830784 -8716846 -10064178 -10658041
8825 -10658041 -9358721 -7320577 -6718707 -7307803 -5905141 -292627 7357245 12343052
8817 12343052 12547915 10448566 9605535 10158992 9009332 4388705 -1180743 -3629971 -2298543
8808 -2298543 -374599 -247771 -445861 1584332 5230606 7177470 5443234 1207294 -3084515
8799 -3084515 -5836777 -6564026 -5404798 -2689928 1393645 6117886 8998807 7277429
8791 7277429 2104855 -972097 1612563 6415955 7771886 5987671 6095271 9061735
8783 9061735 10002376 6460380 2810625 3323766 5571352 5019585 2630592 2745015 5439597
8774 5439597 6443281 4267597 2334650 2986996 3665291 1246253 -2763743 -4075528 -1176568
$$ packed form
8834I82028K283952M9718k993300m161281k851244j140657q86062j347332n93863
8825a0658041J299320K038144O01870n89096J402662N612514P649872M985807
8817A2343052K04863k099349q43031N53457j149660m620627n569448k449228J331428
8808b298543J923944J26828j98090K030193L646274J946864j734236m235940m291809
8799c084515k752262p27249J159228K714870M083573M724241K880921j721378
8791G277429n172574l076952K584660M803392J355931j784215J07600K966464
8783I061735R40641l541996l649755N13141K247586n51767k388993J14423K694582
8774E439597J003684k175684j932947O52346O78295k419038m009996j311785K898960
$$ plain form
8765 -1176568 3351548 6421410 7161032 6024575 3385777 256681 -1052751 859765
8757 859765 3786233 3565795 -779837 -5371916 -6120916 -3402988 -660645 -118935 -1832581
8748 -1832581 -5105435 -8128581 -7785896 -3142506 1938448 3095045 1313638 654194 1495987
8739 1495987 1220054 885249 4575056 10939789 12336504 5564695 -2615042 -4917362 -3190512
8730 -3190512 -3527201 -6211969 -6766067 -4235012 -2059701 -1737688 -1211558 386658 941151
8721 941151 -932879 -3430132 -3533072 -89165 4505193 5108711 -1213852 -9813658 -11673435
8712 -11673435 -4387683 4060534 5684414 2203525 82325 631331 1095866 1651541 4065135
8703 4065135 6064557 4647291 3152356 7026971 13538676 14176180 7559433 1573848
$$ packed form
8765a176568M528116L069862P39622j136457k638798l129096j309432J912516
8757H59765K926468k20438m345632m592079p49000K717928K742343N41710j713646
8748a832581l272854l023146L42685M643390N080954J156597j781407o59444Q41793
8739A495987k75933l34805L689807O364733J396715o771809q179737k302320J726850
8730c190512l36689k684768n54098K531055K175311L22013N26130J598216N54493
8721I41151j874030k497253j02940L443907M594358O03518o322563q599806j859777
8712a1673435P285752Q448217J623880l480889k121200N49006M64535N55675K413594
8703D065135J999422j417266j494935L874615O511705O37504o616747n985585
$$ plain form
8695 1573848 1356888 3307402 3244495 2598617 3099254 2348118 -1149649 -4233546 -4282447
8686 -4282447 -3289662 -3526692 -4044274 -4345656 -6129280 -8285464 -6060725 920035 5660447
8677 5660447 3387862 -1435219 -2743024 -1976931 -3560984 -6240615 -5931421 -3615541 -3416768
8668 -3416768 -5393894 -6730573 -7696919 -9934544 -11069043 -7960191 -3647987 -3868586 -7602875
8659 -7602875 -8377619 -4690717 -1708034 -2057778 -2521407 -1547260 -2574925 -6734516 -8901508
8650 -8901508 -5487707 -1035832 -2048225 -7772772 -11996309 -11646125 -8941302 -6295873
8642 -6295873 -3591755 -681914 943013 246406 -1490586 -2056125 -722483 1439576 3139066
8633 3139066 3939004 3730755 2121978 -700883 -3096117 -3416630 -2044303 -236258 2464318
$$ packed form
8695A573848k16960J950514o2907o45878N00637p51136l497767l083897m8901
8686d282447R92785k37030n17582l01382j783624k156184K224739O980760M740412
8677E660447k272585m823081j307805P66093j584053k679631L09194K315880J98773
8668c416768j977126j336679r66346k237625j134499L108852M312204k20599l734289
8659g602875p74744L686902K982683l49744m63629R74147j027665m159591k166992
8650h901508L413801M451875j012393n724547m223537L50184K704823K645429
8642f295873K704118K909841J624927o96607j736992n65539J333642K162059J699490
8633C139066P99938k08249j608777k822861k395234l20513J372327J808045K700576
$$ plain form
8624 2464318 6736864 9688592 7076656 623465 -2044593 2228959 6939107 5510995
8616 5510995 1032395 272563 2423151 1761741 -1411703 -1647561 997786 801378 -2600577
8607 -2600577 -2792496 1683404 3826682 93728 -3471691 -2067556 -136751 -1901388
8599 -1901388 -2329770 3643713 9641587 6143341 -3690058 -7257066 -223713 8812937
8591 8812937 11544726 8942052 5633670 3207030 1677271 1435700 1139007 -1459965 -4775033
8582 -4775033 -4246413 514585 4338506 4004766 2241875 2162270 2658828 2207711 2787665
8573 2787665 6334810 10443703 11077864 7507872 2085147 -2813538 -5573971 -5318614 -3160430
8564 -3160430 -1687254 -1819213 -2129214 -1948567 -2302002 -3005737 -2365570 -893925 -1333737
$$ packed form
8624B464318M272546K951728k611936o453191k668058M273552M710148j428112
8616E510995m478600p59832K150588o61410l173444k35858K645347j96408l401955
8607b600577j91919M475900K143278l732954l565419J404135J930805j764637
8599a901388m28382N973483N997874l498246r833399l567008P033353R036650
8591H812937K731789k602674l308382k426640j529759k41571k96693k598972l315068
8582d775033N28620M760998L823921l33740j762891p9605M96558m51117N79954
8573B787665L547145M108893O34161l569992n422725m898685k760433K55357K158184
8564c160430J473176j31959l10001J80647l53435p03735O40167J471645m39812
$$ plain form
8555 -1333737 -3416570 -3113305 495853 2280977 -1666681 -8136980 -12005844 -13140074
8547 -13140074 -13632687 -12261888 -7328829 -1885150 -66572 -405351 1201562 3723910
8539 3723910 2676027 -1522087 -3579187 -1644578 811409 1798427 3127580 5064894
8531 5064894 5066942 3365761 3537865 5591543 5031311 1468684 1155688 6654042 10646476
8522 10646476 6172336 -2218433 -4784315 -523854 3005757 2022936 586898 1922882
8514 1922882 3238213 1838011 527649 2863874 6637920 6414162 1163806 -4113810
8506 -4113810 -4429976 -268291 3640479 3927687 1943507 1159872 1880257 331178 -5901805
8497 -5901805 -13134696 -14728922 -8778676 -405007 4063807 3208325 52524 -2447555
$$ packed form
8555a333737k082833L03265L609158J785124l947658o470299l868864j134230
8547a3140074m92613J370799M933059N443679J818578l38779J606913K522348
8539C723910j047883m198114k057100J934609K455987R87018J329153J937314
8531E064894K048j701181J72104K053678n60232l562627l12996N498354L992434
8522A0646476m474140q390769k565882M260461L529611r82821j436038J335984
8514A922882J315331j400202j310362K336225L774046k23758n250356n277616
8506d113810l16166M161685L908770K87208j984180p83635P20385j549079o232983
8497e901805p232891j594226N950246Q373669M468814q55482l155801k500079
$$ plain form
8489 -2447555 -3696998 -4421447 -5434739 -7357282 -9887095 -11035278 -8660630 -3605050
8481 -3605050 169563 156138 -1036168 1104222 6446663 9773212 7610269 2497924 -1255897
8472 -1255897 -3065482 -4570558 -5483333 -4921834 -4839773 -7236336 -9031544 -5280959 2454464
8463 2454464 6899144 5481702 3884380 6622068 10071301 9065845 5330083 3934271
8455 3934271 4959933 4403755 1101114 -2547391 -5081273 -6361381 -5177781 -1512888
8447 -1512888 475299 -2639243 -6824946 -4991682 2120715 5992693 2276518 -3595543
8439 -3595543 -4873349 -1847646 1267908 2850808 3355938 1932024 -2156810 -6567159
8431 -6567159 -7725462 -4890407 -606043 1817450 454011 -3712824 -6740186 -5569510
$$ packed form
8489b447555j249443p24449j013292j922543k529813j148183K374648N055580
8481c605050L774613j3425j192306K140390N342441L326549k162943n112345l753821
8472a255897j809585j505076r12775N61499Q2061k396563j795208L750585P735423
8463B454464M444680j417442j597322K737688L449233j005456l735762j395812
8455C934271J025662n56178l302641l648505k533882j280108J183600L664893
8447a512888J988187l114542m185703J833264P112397L871978l716175n872061
8439c595543j277806L025703L115554J582900N05130j423914m088834m410349
8431f567159j158303K835055M284364K423493j363439m166835l027362J170676
$$ plain form
8423 -5569510 -2424757 -2348506 -5824191 -7854900 -5657228 -2616859 -2129114 -2249558 -265665
8414 -265665 1594443 -58567 -3276551 -3330815 71324 3165371 4426395 5404175 5944667
8405 5944667 3831779 -296909 -2223902 490816 5814669 10579994 13252010 12890683
8397 12890683 8954728 3315563 -462738 -985167 68858 1043604 1455313 173965 -3718624
8388 -3718624 -7763676 -8041763 -5343796 -4889826 -8146258 -9980190 -7027283 -3797598 -5606826
8379 -5606826 -9518631 -8579653 -2776945 962642 -738665 -3629622 -3241048 -647881 1317729
8370 1317729 2826180 5106491 7340804 8531231 9772533 11878845 13049688 11573488
8362 11573488 8753804 6482315 4011133 170422 -3122904 -3169676 -1057159 -166948 -773843
$$ packed form
8423e569510L144753P6251l475685k030709K197672L040369M87745j20444J983893
8414b65665J860108j653010l217984n4264L402139L094047J261024R77780N40492
8405E944667k112888m128688j926993K714718N323853M765325K672016l61327
8397A2890683l935955n639165l778301n22429J054025R74746M11709j281348l892589
8388c718624m045052k78087K697967M53970l256432j833932K952907L229685j809228
8379e606826l911805R38978N802708L739587j701307k890957L88574K593167J965610
8370A317729J508451K280311K234313J190427J241302K106312J170843j476200
8362A1573488k819684k271489k471182l840711l293326m6772K112517Q90211o06895
$$ plain form
8353 -773843 -40768 2525677 3527210 637711 -4067417 -7146543 -7670572 -6805800 -5774583
8344 -5774583 -5508658 -6329032 -6785513 -4707590 -459020 2816265 3158190 1823609 449762
8335 449762 -1006647 -1992228 -281151 4077894 6544904 3552703 -1621418 -2635208 982324
8326 982324 2977575 -987533 -7671530 -10910148 -9158659 -6076285 -5037394 -5518953 -5189820
8317 -5189820 -4030964 -4765826 -8665377 -12318291 -10922051 -4856819 -103590 -724792 -3716989
8308 -3716989 -3746122 -481817 2179147 2362941 1607524 876678 -542592 -2140857 -2267462
8299 -2267462 -1640018 -2770901 -4913862 -3712362 2269131 8459686 10301506 9152894
8291 9152894 9083366 10381771 10083726 7688766 6476535 8788197 12705484 14423218 12550099
$$ packed form
8353g73843P33075K566445J001533k889499m705128l079126n24029Q64772J031217
8344e774583K65925q20374m56481K077923M248570L275285L41925j334581j373847
8335D49762j456409r85581J711077M359045K467010k992201n174121j013790L617532
8326I82324J995251l965108o683997l238618J751489L082374J038891m81559L29133
8317e189820J158856p34862l899551l652914J396240O065232M753229o21202k992197
8308c716989k9133L264305K660964J83794p55417p30846j419270j598265j26605
8299b267462O27444j130883k142961J201500N981493O190555J841820j148612
8291I152894o9528J298405k98045k394960j212231K311662L917287J717734j873119
$$ plain form
8282 12550099 9217352 7370657 7421118 6915309 3792136 -807257 -4134307 -5420201 -5830664
8273 -5830664 -5387718 -2924212 538825 1753331 -20151 -1395946 -15118 1659264
8265 1659264 407393 -2466529 -3227706 -1175503 1491696 3787783 6062763 6941208 4419906
8256 4419906 175778 -1324549 910693 2625265 530602 -2759577 -2439114 1892762
8248 1892762 6008422 6498027 4056539 1350844 -501948 -2334349 -4418080 -4936887 -2315274
8239 -2315274 1102502 203858 -6056174 -11027885 -7448208 2257370 7420204 2453957
8231 2453957 -5696391 -6740443 -82751 6134202 6894074 5291586 5522704 6721193 6199345
8222 6199345 4494036 3737416 3657673 2549201 610240 -549872 -516559 205718 1679204
$$ packed form
8282A2550099l332747j846695N0461n05809l123173m599393l327050j285894m10463
8273e830664M42946K463506L463037J214506j773482j375795J380828J674382
8265A659264j251871k873922p61177K052203K667199K296087K274980Q78445k521302
8256D419906m244128j500327K235242J714572k094663l290179L20463M331876
8248A892762M115660M89605k441488k705695j852792j832401k083731n18807K621613
8239b315274L417776q98644o260032m971711L579677R705578N162834m966247
8231B453957q150348j044052O657692O216953P59872j602488K31118J198489n21848
8222F199345j705309p56620p9743j108472j938961j160112L3313P22277J473486
$$ plain form
8213 1679204 3362544 3103342 48796 -3115611 -3896485 -4006019 -5816370 -6931886 -3612264
8204 -3612264 1635667 2244474 -2547941 -6699425 -7242927 -7845037 -10127024 -9352648 -3349398
8195 -3349398 1618601 287792 -2461195 540652 6748078 8325569 5006166 3366911
8187 3366911 5332348 6676746 6127216 6693094 7782885 5270832 515767 48848 4254167
8178 4254167 5666957 1571682 -1157204 1778618 4349973 754389 -4534938 -4749771
8170 -4749771 -2022047 -2363255 -4822874 -4247318 -969153 630182 355097 998207 1310519
8161 1310519 -1790569 -5773491 -5427491 -2222553 -2466869 -6226608 -6410615 -122531 6755345
8152 6755345 8516136 6557884 4910816 4713684 5726650 8021682 9510042 6686191
$$ packed form
8213A679204J683340k59202l054546l164407p80874j09534j810351j115516L319622
8204c612264N247931O08807m792415m151484n43502o02110k281987P74376O003250
8195c349398M967999j330809k748987L001847O207426J577491l319403j639255
8187C366911J965437J344398n49530N65878J089791k512053m755065m66919M205319
8178D254167J412790m095275k728886K935822K571355l595584n289327k14833
8170d749771K727724l41208k459619N75556L278165J599335k75085O43110L12312
8161A310519l101088l982922L46000L204938k44316l759739j84007O288084O877876
8152F755345J760791j958252j647068j97132J012966K295032J488360k823851
$$ plain form
8144 6686191 541697 -2806470 -94907 4723865 6596263 5424899 3349517 747377
8136 747377 -1590806 -943300 2330798 2438601 -3946669 -10794436 -9821216 -2455433 1813710
8127 1813710 -1458921 -6769048 -8017715 -6552398 -6645935 -7736674 -6033964 -1573634 1332888
8118 1332888 646388 -542053 918595 3376185 2945675 -786888 -4284814 -4740013 -2878991
8109 -2878991 -1066581 -730823 -2012973 -3972930 -4658958 -3040900 -1383825 -3105047 -7257652
8100 -7257652 -8294721 -3496936 2374224 3147161 -321548 -1848686 1221925 5317716
8092 5317716 6645764 5503339 3568565 783560 -2909728 -5332059 -4073304 292307
8084 292307 4665445 6676562 6537668 5778306 4660246 1571368 -4006442 -8589288 -7647896
$$ packed form
8144F686191o144494l348167K711563M818772J872398j171364k075382k602140
8136G47377k338183O47506L274098J07803o385270o847767R73220P365783M269143
8127A813710l272631n310127j248667J465317r3537j090739J702710M460330K906522
8118A332888o86500j188441J460648K457590m30510l732563l497926m55199J861022
8109b878991J812410L35758j282150j959957o86028J618058J657075j721222m152605
8100g257652j037069M797785N871160P72937l468709j527138L070611M095791
8092E317716J328048j142425j934774k785005l693288k422331J258755M365611
8084B92307M373138K011117j38894p59362j118060l088878n577810m582846R41392
$$ plain form
8075 -7647896 -2377906 137583 -3763387 -8385381 -6334483 814466 5235455 4440989
8067 4440989 3266223 4353781 4136840 493952 -2396335 -759222 2551663 3054968 1650123
8058 1650123 1749351 2711426 1477143 -1256211 -1781624 490820 2419896 2665381 3499160
8049 3499160 6116699 7693462 5059623 -641248 -4870283 -4767384 -2141464 -1005627
8041 -1005627 -2525225 -3734207 -2295980 -834203 -3500173 -8957681 -11143177 -7892790
8033 -7892790 -4024416 -3415851 -2889855 1734196 7503638 7996746 2800094 -2679245 -5589855
8024 -5589855 -7478841 -8092173 -4454098 2137724 4928725 1103807 -3087305 -1114049
8016 -1114049 4416971 6607923 5103618 5332630 8323354 8615493 3674724 -964319 626387
$$ packed form
8075g647896N269990K515489l900970m621994K050898P148949M420989p94466
8067D440989j174766J087558k16941l642888k890287J637113L310885N03305j404845
8058A650123R9228R62075j234283k733354n25413K272444J929076K45485Q33779
8049C499160K617539J576763k633839n700871m229035J02899K625920J135837
8041a005627j519598j208982J438227J461777k665970n457508k185496L250387
8033g892790L868374O08565N25996M624051N769442M93108n196652n479339k910610
8024e589855j888986o13332L638075O591822K791001l824918m191112J973256
8016a114049N531020K190952j504305K29012K990724K92139m940769m639043J590706
$$ plain form
8007 626387 6296199 9029802 5947571 276291 -3833162 -4655366 -2199694 2017229 4915669
7998 4915669 5014586 5245430 8858693 12889974 10661538 1850367 -5233298 -4147260 1617836
7989 1617836 4789908 4102306 2837919 1345731 -2122767 -4860597 -1594047 6376935
7981 6376935 10737840 7020017 235159 -2904900 -2029208 -77485 2537688 5946484
7973 5946484 6939815 2693736 -3762977 -6954224 -6448567 -6077641 -6767961 -5546972 -1771430
7964 -1771430 978185 558499 -712015 -524265 23007 -132448 1013896 4856347 8510167
7955 8510167 8677875 6970389 7080408 8196836 6357268 2087295 905146 4518562 7101317
7946 7101317 3966126 -835110 -961158 1686140 15006 -5940344 -7850107 -1828649
$$ packed form
8007F26387N669812K733603l082231n671280m109453q22204K455672M216923K898440
7998D915669R8917K30844L613263M031281k228436q811171p083665J086038N765096
7989A617836L172072o87602j264387j492188l468498k737830L266550P970982
7981F376935M360905l717823o784858l140059Q75692J951723K615173L408796
7973E946484R93331m246079o456713l191247N05657L70926o90320J220989L775542
7964a771430K749615m19686j270514J87750N47272j55455J146344L842451L653820
7955H510167J67708j707486J10019J116428j839568m269973j182149L613416K582755
7946G101317l135191m801236j26048K647298j671134n955350j909763O021458
$$ plain form
7938 -1828649 5295172 6346149 3858521 4070437 6160159 4931480 1156574 997274 5667900
7929 5667900 9325573 8309747 5691884 4721936 4094251 2616696 2781997 5697896 7190769
7920 7190769 3582702 -2145708 -4547944 -3223275 -1419128 469306 4451697 8916457
7912 8916457 8777300 2778157 -3734495 -5383395 -3099201 -1635300 -2840813 -4146248
7904 -4146248 -3104244 -767747 434121 463893 1282987 3121412 3645148 1790420 41883
7895 41883 812959 2442761 1613989 -1515721 -3757221 -3631012 -2356306 -796628 894972
$$ packed form
7938a828649P123821J050977k487628K11916K089722j228679l774906j59300M670626
7929E667900L657673j015826k617863r69948o27685j477555J65301K915899J492873
7920G190769l608067n728410k402236J324669J804147J888434L982391M464760
7912H916457j39157n999143o512652j648900K284194J463901j205513j305435
7904d146248J042004K336497J201868K9772Q19094J838425N23736j854728j748537
7895D1883P71076J629802q28772l129710k241500J26209J274706J559678J691600
$$ [...]
##END NTUPLES=NMR SPECTRUM
##END=
