##TITLE=31Pdec_SR80 Gly4
 CDCl3, 24 sc
 1.09.2021
##JCAMPDX= 6.0         $$ Bruker NMR JCAMP-DX V2.0
##DATA TYPE= NMR SPECTRUM
##DATA CLASS= NTUPLES
##ORIGIN= UXNMR, Bruker Analytische Messtechnik GmbH
##OWNER= root
$$ XWIN-NMR		Version 3.5
$$ Wed Sep  1 09:43:35 2021 Russian Standard Time (UT+4h)  she@DPX200
##.OBSERVE FREQUENCY= 81.013821
##.OBSERVE NUCLEUS= ^31P
##.ACQUISITION MODE= SIMULTANEOUS
##.ACQUISITION SCHEME= undefined
##.AVERAGES= 24
##.DIGITISER RES= 16
##SPECTROMETER/DATA SYSTEM= spect
##.PULSE SEQUENCE= zgpg30
##.SOLVENT NAME= CD2Cl2
##.SHIFT REFERENCE= (INTERNAL, CD2Cl2, 0, 248.564)
##AUDIT TRAIL= $$ (NUMBER, WHEN, WHO, WHERE, WHAT)
$$ ##TITLE= Audit trail, XWIN-NMR		Version 3.5
$$ ##JCAMPDX= 5.01
$$ ##ORIGIN= Bruker BioSpin GmbH
$$ ##OWNER= she
$$ F:/spectra/data/she/nmr/P31/1/pdata/1/auditp.txt
$$ ##AUDIT TRAIL=  $$ (NUMBER, WHEN, WHO, WHERE, WHAT)
(   1,<2021-09-01 09:41:25.03 +0400>,<she>,<DPX200>,
      <created by zg, POWCHK disabled, PULCHK disabled
       configuration hash MD5:
       00 E9 B6 7A A2 85 ED C7 34 08 36 98 17 FE 4E 26
       data hash MD5: 32K
       EF F1 29 A0 D7 41 69 93 28 4D 46 32 04 1E 05 6B>)
(   2,<2021-09-01 09:41:29.29 +0400>,<she>,<DPX200>,
      <Start of raw data processing
       efp BC_mod = 2 LB = 1 FT_mod = 6 PKNL = 1 PHC0 = -7753.97 PHC1 = 116.6731 SI = 64K 
       data hash MD5: 64K
       5C 64 E4 67 67 CD 52 B0 DF 16 94 44 55 3A D6 28>)
(   3,<2021-09-01 09:41:57.60 +0400>,<she>,<DPX200>,
      <pk PHC0 = 107.572 PHC1 = -259.6 
       data hash MD5: 64K
       1D B7 02 DE 04 6E 50 B1 20 46 F7 72 1D 6E BF 26>)
(   4,<2021-09-01 09:42:01.12 +0400>,<she>,<DPX200>,
      <abs ABSG = 5 
       data hash MD5: 64K
       5A B6 3C 96 4A 78 2E 69 E8 BB D7 AD 8B 75 41 01>)
$$ ##END=
$$ 
$$ hash MD5
$$ 8D FA F1 4A FB FE 3D 93 9B C3 5A AC 5C 3E 9F FA
##$RELAX= 
##$RELAX= 
##$RELAX= 
##$RELAX= 
##$RELAX= 
##$RELAX= 
##$RELAX= 
##$RELAX= 
$$ Bruker specific parameters
$$ --------------------------
##$DU= <F:/spectra>
##$EXPNO= 1
##$NAME= <P31>
##$PROCNO= 1
##$TYPE= <nmr>
##$USER= <she>
##$AMP= (0..31)
100 100 100 100 100 100 100 100 100 100 100 100 100 100 100 100 100 100 
100 100 100 100 100 100 100 100 100 100 100 100 100 100 
##$AQSEQ= 0
##$AQ_mod= 1
##$AUNM= <au_zg>
##$AUTOPOS= <>
##$BF1= 81.014009
##$BF2= 200.13
##$BF3= 200.13
##$BF4= 200.13
##$BF5= 200.13
##$BF6= 200.13
##$BF7= 200.13
##$BF8= 200.13
##$BYTORDA= 1
##$CFDGTYP= 0
##$CFRGTYP= 5
##$CHEMSTR= <none>
##$CNST= (0..31)
1 1 145 1 1 1 1 1 1 1 1 1 1 1 1 1 1 1 1 1 1 1 1 1 1 1 1 1 1 1 1 1 
##$CPDPRG= <waltz16>
##$CPDPRG1= <>
##$CPDPRG2= <waltz16>
##$CPDPRG3= <>
##$CPDPRG4= <mlev>
##$CPDPRG5= <mlev>
##$CPDPRG6= <mlev>
##$CPDPRG7= <mlev>
##$CPDPRG8= <mlev>
##$CPDPRGB= <>
##$CPDPRGT= <>
##$D= (0..31)
0 1 0 0 0 0 0 0 0 0 0 0.03 2e-05 3e-06 0 0 0 0 0 0 0 0 0 0 0 0 0 0 0 0 
0 0 
##$DATE= 1630474884
##$DBL= (0..7)
120 120 120 11 120 120 24 19 
##$DBP= (0..7)
150 150 150 150 150 150 150 150 
##$DBP07= 0
##$DBPNAM0= <>
##$DBPNAM1= <>
##$DBPNAM2= <>
$$ [...]
##$SUBNAM3= <"">
##$SUBNAM4= <"">
##$SUBNAM5= <"">
##$SUBNAM6= <"">
##$SUBNAM7= <"">
##$SUBNAM8= <"">
##$SUBNAM9= <"">
##$SW= 501.771253377433
##$SWIBOX= (0..15)
0 1 3 0 0 0 0 0 0 0 0 0 0 0 0 0 
##$SW_h= 40650.406504065
##$TD= 32768
##$TD0= 1
##$TE= 0
##$TE2= 300
##$TE3= 300
##$TEG= 300
##$TL= (0..7)
0 120 53 12 22 120 120 120 
##$TP= (0..7)
150 150 150 150 150 150 150 150 
##$TP07= 0
##$TPNAME0= <>
##$TPNAME1= <>
##$TPNAME2= <>
##$TPNAME3= <>
##$TPNAME4= <>
##$TPNAME5= <>
##$TPNAME6= <>
##$TPNAME7= <>
##$TPOAL= (0..7)
0.5 0.5 0.5 0.5 0.5 0.5 0.5 0.5 
##$TPOFFS= (0..7)
0 0 0 0 0 0 0 0 
##$TUNHIN= 0
##$TUNHOUT= 0
##$TUNXOUT= 0
##$USERA1= <user>
##$USERA2= <user>
##$USERA3= <user>
##$USERA4= <user>
##$USERA5= <user>
##$V9= 5
##$VALIST= <valist>
##$VCLIST= <CCCCCCCCCCCCCCC>
##$VD= 0
##$VDLIST= <DDDDDDDDDDDDDDD>
##$VPLIST= <PPPPPPPPPPPPPPP>
##$VTLIST= <TTTTTTTTTTTTTTT>
##$WBST= 1024
##$WBSW= 4
##$XGAIN= (0..3)
0 0 0 0 
##$XL= 0
##$YL= 0
##$YMAX_a= 4244
##$YMIN_a= -3782
##$ZGOPTNS= <>
##$ZL1= 120
##$ZL2= 120
##$ZL3= 120
##$ZL4= 120
##$ABSF1= 248.5645
##$ABSF2= -253.2056
##$ABSG= 5
##$ABSL= 3
##$ALPHA= 0
##$AQORDER= 0
##$ASSFAC= 0
##$ASSFACI= 0
##$ASSFACX= 0
##$ASSWID= 0
##$AUNMP= <proc_1d>
##$AZFE= 0.1
##$AZFW= 0.5
##$BCFW= 0
##$BC_mod= 2
##$BYTORDP= 0
##$COROFFS= 0
##$CY= -3
##$DATMOD= 1
##$DC= 0
##$DFILT= <>
##$DTYPP= 0
##$F1P= 0
##$F2P= 0
##$FCOR= 1
##$FTSIZE= 65536
##$FT_mod= 6
##$GAMMA= 0
##$GB= 0
##$INTBC= 1
##$INTSCL= 5.30512e-09
##$ISEN= 30
##$LB= 1
##$LEV0= 0
##$LPBIN= 0
##$MAXI= 10000
##$MC2= 0
##$MEAN= 0
##$ME_mod= 0
##$MI= 50
##$NCOEF= 0
##$NC_proc= -8
##$NLEV= 6
##$NOISF1= 182.463
##$NOISF2= 159.3651
##$NSP= 0
##$NTH_PI= 0
##$NZP= 0
##$OFFSET= 248.5645
##$PC= 4
##$PHC0= -7646.398
##$PHC1= -142.9269
##$PH_mod= 1
##$PKNL= yes
##$PPARMOD= 0
##$PSCAL= 0
##$PSIGN= 0
##$REVERSE= no
##$SF= 81.014009
##$SI= 65536
##$SIGF1= 159.3651
##$SIGF2= -187.1042
##$SINO= 113.3802
##$SIOLD= 16384
##$SREGLST= <1H.CDCl3>
##$SSB= 0
##$STSI= 65536
##$STSR= 0
##$SW_p= 40650.406504065
##$SYMM= 0
##$S_DEV= 0
##$TDeff= 32768
##$TDoff= 0
##$TI= <>
##$TILT= no
##$TM1= 0
##$TM2= 0
##$TOPLEV= 0
##$USERP1= <user>
##$USERP2= <user>
##$USERP3= <user>
##$USERP4= <user>
##$USERP5= <user>
##$WDW= 1
##$XDIM= 65536
##$YMAX_p= 474625984
##$YMIN_p= -135180985
$$ End of Bruker specific parameters
$$ ---------------------------------
##NTUPLES= NMR SPECTRUM
##VAR_NAME=  FREQUENCY,     SPECTRUM/REAL,   SPECTRUM/IMAG
##SYMBOL=    X,             R,               I
##VAR_TYPE=  INDEPENDENT,   DEPENDENT,       DEPENDENT
##VAR_FORM=  AFFN,          ASDF,            ASDF
##VAR_DIM=   65536,         65536,           65536
##UNITS=     HZ,            ARBITRARY UNITS, ARBITRARY UNITS
##FACTOR=    0.620285442955139, 1,           1
##FIRST=     20137.2065510759, 0,            0
##LAST=      -20513.1999529892, 0,           0
##MIN=       -20513.1999529892, -135180985,  0
##MAX=       20137.2065510759, 474625984,    0
$$ Real data points
##PAGE= N=1
##DATA TABLE= (X++(R..R)), XYDATA
$$ [...]
40886a3506945J026771N500096M901341q87069n319075l034761K590663M618111
40878d110868K428498N42156O8238j476817k967447j62116N783780P648423K389869
40869A0143716l980229m792943j060853J832724J672915Q1776j284237j672895
40861I39974l73828K061616L082132J030763k246945l551173k108402K95785J875182
40852A005104K039674R86711m13730r14877k10050N55897L75549k79427n30639
40843B614212n80714r51083j004937J33754J380480L63664k856600m471198j325572
40834f697994M163741O217846L182218k68011j1020J708442O06779k312090k730547
40825C859364q21023r66160l481146l282821J115466L920225J272774j882091
$$ plain form
40886 -13506945 -12480174 -6980078 -2078737 -2965806 -8284881 -11319642 -8728979 -4110868
40878 -4110868 -1682370 -1140214 -1071976 -2548793 -5516240 -5678356 105424 7753847 10143716
40869 10143716 6163487 1370544 309691 2142415 3815330 3897106 2612869 939974
40861 939974 566146 2627762 5709894 6740657 4493712 942539 -1165863 -870078 1005104
40852 1005104 3044778 4031489 3617759 2702882 2492832 3048729 3424278 3144851 2614212
40843 2614212 2033498 1082415 77478 211232 1591712 1955376 -901224 -5372422 -6697994
40834 -6697994 -2534253 3683593 6865811 6597800 6586780 8295222 8902001 6589911 3859364
40825 3859364 3038341 2072181 -1408965 -4691786 -3576320 343905 1616679 -265412
40817b65412K94193M674561M156434p44488k968566k53523K172175N97499k291171
40808E371702l006006j930385n33676J008599J485143j229785n526510o160216
40800a0521134j585291L157952L752960K450682L007761L902938J412024l379573
40792B198319n857256m749305k859033j546279P71334M164918N574958L311813
40784A009469J48988j21384K470910M350098K672225j705667n070088m256952
40776e02401K94022M769758N660456K918809q94654l534164m048444k237242O28451
40767C054591J337786k057361o420477o105978m98034M189446K887221j348181
40759d960987j790727K303212M976530K502159j505383j766915J422877L619780
$$ plain form
40817 -265412 28781 4703342 8859776 8115288 5146722 4893199 7065374 7662873 5371702
40808 5371702 2365696 435311 -98365 910234 2395377 1165592 -4360918 -10521134
40800 -10521134 -12106425 -8948473 -5195513 -2744831 262930 4165868 5577892 2198319
40792 2198319 -3658937 -8408242 -11267275 -12813554 -12042220 -7877302 -2302344 1009469
40784 1009469 1158457 1037073 3507983 7858081 10530306 8824639 3754551 -502401
40776 -502401 -208379 4561379 10221835 13140644 12245990 8711826 4663382 2426140 3054591
40767 3054591 4392377 2335016 -4085461 -10191439 -10689473 -6500027 -3612806 -4960987
40759 -4960987 -6751714 -4448502 528028 3030187 1524804 -242111 1180766 4800546
40751D800546K686341M74656r48334j514067j596945r85333L3356O02036P51308
40742D303564J098428R48586r83985l485327l259850J60527K566459M57182l690321
40733a884737m440204o32485L455831M031566J962051L22400J91150L51951k64888
40724C092635j436464k445550k901221k764740k051345n66736J929987M849262
40716b294172O236677M178465o61565m667783m536415r68849J779544O08144k683782
40707c009736l329921O30844N615433O384374J967722l503843n594319l790262
40699d629708q02512R09230J191240J632858L483700N585592M626011j084118
40691A0912293q016550r782655m282361L206040N693381K066848k524370k835690
$$ plain form
40751 4800546 7486887 7961543 7013209 5499142 3902197 2916864 2950220 3552256 4303564
40742 4303564 5401992 6350578 5366593 1881266 -1378584 -1218057 1348402 1805584 -1884737
40733 -1884737 -6324941 -6957426 -3501595 529971 2492022 2814422 3005572 3357523 3092635
40724 3092635 1656171 -789379 -3690600 -6455340 -8506685 -9073421 -7143434 -2294172
40716 -2294172 3942505 8120970 7459405 2791622 -1744793 -2713642 -934098 -325954 -3009736
40707 -3009736 -6339657 -5708813 -93380 6290994 8258716 4754873 -839446 -4629708
40699 -4629708 -5432220 -4522990 -3331750 -1698892 1784808 7370400 11996411 10912293
40691 10912293 2895743 -6886912 -11169273 -7963233 -2269852 -203004 -2727374 -5563064
40683e563064J522497O459533P180018K323685m268603o774341l638533O69791
40675b089017J540639j91948r51132l81005o25631j107872Q29447L965887L346936
40666D336304j865435n662152l291493J997716L946218J680474r52487j757824
40658a568679j394476j12617K015655K805518N46523k006681j084524J394381
40650E95100K52886l819515m262486N90992L825268P93159k897162j62826N825335
40641G40751O217205O4971m637324l008111J158955L047509L110210L049591J475814
40632A1219571k452543n453716m538875j863660r36079o43478K083357N332270
40624B746847L607521l350884q243013n187864K241091N201894M67506n919305
$$ plain form
40683 -5563064 -4040567 2418966 9598984 11922669 7654066 879725 -2758808 -2089017
40675 -2089017 -548378 -740326 -1691458 -2072463 -2698094 -3805966 -2976519 989368 4336304
40666 4336304 2470869 -3191283 -6482776 -4485060 -538842 1141632 189145 -1568679
40658 -1568679 -2963155 -3075772 -1060117 1745401 2291924 285243 -799281 595100
40650 595100 847986 -2971529 -7234015 -6643023 -2817755 -2024596 -4921758 -5084584 740751
40641 740751 6957956 7022927 2385603 -622508 536447 3583956 6694166 9743757 11219571
40632 11219571 8767028 3313312 -1225563 -3089223 -4025302 -4668780 -2585423 2746847
40624 2746847 6354368 3003484 -5239529 -10427393 -8186302 -2984408 -2516902 -8436207
40616h436207o114244O02361P594538Q507706L579859j704153k881799m73324
40608F74737J779295J456452l02215r27829r0466l582j577796k213370J74751
40599a030023K463134l6918n292178n569423J066760O342077L449443k491250
40591a098378k548582J944983K536176j529595k287096K609817N375548J313018
40583F315891l291593j945813J722814J194624k074750k502338j27343R68885
40575B60377M34166Q47152J781603R61975p92608j233932j014076j507598j235046
40566a497987O99304J187445j595730l579664j404020R07253j111298l426615
40558i821312J1403N860548O073254J074774j862890j296118j973672l791198
$$ plain form
40616 -8436207 -14550451 -13948090 -6353552 2154154 5734013 4029860 1148061 674737
40608 674737 2454032 3910484 3608269 2680440 2589974 2586392 1008596 -1204774 -1030023
40599 -1030023 1433111 1396193 -3895985 -9465408 -8398648 -2056571 1392872 -1098378
40591 -1098378 -3646960 -1701977 834199 -695396 -2982492 -372675 5002873 6315891
40583 6315891 3024298 1078485 2801299 3995923 1921173 -581165 -708508 260377
40575 260377 694543 1541695 3323298 4285273 3492665 2258733 1244657 -262941 -1497987
40566 -1497987 -798683 388762 -1206968 -4786632 -6190652 -5283399 -6394697 -9821312
40558 -9821312 -9809909 -3949361 2123893 3198667 1335777 39659 -1934013 -5725211
40550e725211j700314L285890M303011Q58451l08018J956829J186596l513959
40542C43275m399906Q59542M110615J053454j107463K781749N807057J184179
40534A0632502n203232m339983J404891L279054m5589k992981k961334j415758
40526a642430R75271L160896J873133k619410m009715L52321L426170m00643m966484
40517c850891k379747K997031J824713l775710l604651L198355O769323K617023
40509C795446k454794k315622N03072J458806N14312p76875k194942k669949n74069
40500d714615K543254L367896K172118J839075K201925Q22666j548143k181880
40492D502296j873173l009961l711652q96294K458750J154540k399725j207749
$$ plain form
40550 -5725211 -7425525 -4139635 163376 1021827 713809 2670638 3857234 343275
40542 343275 -4056631 -3197089 913526 1966980 859517 3641266 9448323 10632502
40534 10632502 5429270 1089287 2494178 5773232 5727643 2734662 -226672 -1642430
40526 -1642430 -667159 2493737 4366870 1747460 -2262255 -1909934 1516236 1115593 -3850891
40517 -3850891 -6230638 -3233607 -1408894 -5184604 -8789255 -5590900 1178423 3795446
40509 3795446 1340652 -974970 -471898 986908 1501220 724345 -1470597 -4140546 -4714615
40500 -4714615 -2171361 1196535 3368653 5207728 7409653 8232319 6684176 4502296
40492 4502296 2629123 -380838 -4092490 -4988784 -2530034 -1375494 -3775219 -4982968
40484d982968L906494M750404m87882m048777j540234J675797O97580j242329
40476a271915P1479K667682L141749K089842P06723j781891l819675j465626L855538
40467D193906N021415O14739j618748K102565L929913k682801j0573215r126952
40459h139178q47533L157541M25080j417200R95275K186971j024004l637270j224591
40450i524909K940052L839475K318390K161269L324656K690835l41807k979896
40442D428065l199870j850152m85121N97323J414386J159799m58237j634493k88709
40433c17009K472797L049028L79707k311207k526903k192917l236450k683376
40425g366330K603266Q254040O266872l035935r602726o474315J638816N695625
$$ plain form
40484 -4982968 -1076474 3673930 3186048 -862729 -2402963 -727166 -29586 -1271915
40476 -1271915 -1200436 1467246 4608995 6698837 7405560 5623669 1803994 338368 4193906
40467 4193906 9215321 9830060 8211312 10313877 14243790 11560989 987774 -8139178
40459 -8139178 -8986711 -5829170 -5404090 -6821290 -5826015 -3639044 -4663048 -8300318 -9524909
40450 -9524909 -6584857 -2745382 -426992 1734277 5058933 7749768 7407961 4428065
40442 4428065 1228195 -621957 -1107078 -509755 904631 2064430 1606193 -28300 -317009
40433 -317009 2155788 5204816 5584523 3273316 746413 -1446504 -4682954 -7366330
40425 -7366330 -4763064 3490976 9757848 6721913 -2880813 -9355128 -7716312 -2020687
40417b020687L430935n83190k177664q83429J586237K883034J661277n12609r44810
40408B439094k21115j309702l465830k051040L462190O742911L342406k698634
40400F240280m994833l051082j49462K337358L706639J673179l044442m340078
40392a622441P68465N573896K939199k948223k912095K176392L094227k003317
40384E066103m760921j158667K022739o04425l991689j872761K642156K844258
40376A86793p04566k390653r63804J91463q0291J62983J221895J473775R80707
40367G8302R44217O66520q15201j623580j5233J357560o46278l201836j269729
40358d525258L155918K958116k372981m873276m51856M615811L772544k59633
$$ plain form
40417 -2020687 1410248 827058 -1350606 -2234035 -647798 2235236 3896513 3383904 2439094
40408 2439094 2217979 908277 -2557553 -4608593 -1146403 5596508 8938914 6240280
40400 6240280 1245447 -1805635 -1955097 382261 4088900 5762079 2717637 -1622441
40392 -1622441 -853976 4719920 7659119 4710896 1798801 3975193 7069420 5066103
40384 5066103 305182 -853485 1169254 564829 -3426860 -5299621 -2657465 186793
40376 186793 -517773 -2908426 -3872230 -3680767 -3761058 -3598075 -2376180 -902405 78302
40367 78302 1022519 1689039 873838 -749742 -764975 592585 -53693 -3255529 -4525258
40358 -4525258 -1369340 1588776 -784205 -5657481 -6109337 -1493526 2279018 2019385
40350B019385j673902j162037k229529k924537M03186M421072K933267k046255
40342b59350k721589J328532K306858k104735m430359m58907L098319p6187n240278
40333h557696m683589J05794K564364K191314K816691L548225P24908l257625
40325d547614k341768K653731M677937J877174j73661J163788J498544j731755
40317C076376m137825k018449J356677J574447j7909J35243J446341J024283j019170
40308A420014k233998j856559r34266k809R45140J655229K350177L454961L682119
40299H480008J080496k954157l975394m59292L573545L747686L96717l143126
40291F746483m486340l012738L07145K539947J284552j406231j108251K059390
$$ plain form
40350 2019385 345483 -816554 -3046083 -5970620 -5567434 -1146362 1786905 -259350
40342 -259350 -2980939 -1652407 654451 -1450284 -5880643 -6339550 -3241231 -3317418 -8557696
40333 -8557696 -13241285 -13135491 -10571127 -8379813 -5563122 -2014897 -1289989 -4547614
40325 -4547614 -6889382 -4235651 442286 2319460 2145799 3309587 4808131 3076376
40317 3076376 -1061449 -3079898 -1723221 -148774 -166683 -31440 1414901 2439184 1420014
40308 1420014 -813984 -2670543 -3604809 -3607618 -2662478 -1007249 1342928 4797889 8480008
40299 8480008 9560504 6606347 2630953 2171661 5745206 9492892 9889609 6746483
40291 6746483 2260143 -752595 -445450 2094497 3379049 1972818 864567 2923957
40283B923957K973303n68706m327002m320678k177553q48656K57837K245460L145774
40274f96264J361551r30522j479273j488892k129810j661252L40141M95053k356603
40265h545871l508669J47258L956045K903000L98823K274650O035311M713828
40257H374375j102423m136324k187557j21005j97887O66416K898348K174949k282250
40248D086642n024903k937023L80843J689907K720068M334347L089395j839170
40240F500106m697130j570185K739780K196725j012426j186501Q56957J50032
40232C977358k701825k448094J006194J926972j278886l132732m65353K257590
40224h58776P18051k115675j553596Q00277M63759j652598q75747K736139M102824
$$ plain form
40283 2923957 5897260 5328554 1001552 -3319126 -5496679 -6345335 -6087498 -3842038 -696264
40274 -696264 665287 -265235 -1744508 -3233400 -5363210 -7024462 -6684321 -6189268 -8545871
40265 -8545871 -12054540 -11907282 -7951237 -5048237 -4649414 -2374764 3660547 8374375
40257 8374375 7271952 3135628 948071 827066 629179 1295595 4193943 6368892 4086642
40248 4086642 -938261 -3875284 -3494441 -1804534 915534 5249881 8339276 6500106
40240 6500106 1802976 232791 2972571 5169296 4156870 2970369 3827326 3977358
40232 3977358 1275533 -1172561 -166367 1760605 481719 -2651013 -3116366 -858776
40224 -858776 -140725 -2256400 -3809996 -3009719 -2545960 -4198558 -5074305 -2338166 1764658
40215A764658J601520l99089P81325J659021r78217l955550k614507J403532K521327
40206A784020k06300k221211j120517p6324j901318l783668j207381M773332P703236
40197C743869L695237l042980m762849Q2208M474895K163031l348931l709207
40189g04727J568793M033983m21034m674008j619413M302021M226548j230378
40181E481785m040738j922445J18484L27550K288230N653370M636167j602281
40173A0940122n899372l883691J38912J594976J907902K371736J30476m583044
40165B718017n344032J34496M293265J399580k588239j98546M428568K633507
40157G476616l813575n891209k294201j11244j800873k210855Q41137K739012
$$ plain form
40215 1764658 3366178 2967089 3748414 5407435 4429218 473668 -2140839 -737307 1784020
40206 1784020 1577720 -643491 -1764008 -1840332 -3741650 -7525318 -8732699 -3959367 3743869
40197 3743869 7439106 4396126 -366723 -284515 4190380 6353411 3004480 -704727
40189 -704727 864066 4898049 4477015 -196993 -1816406 2485615 6712163 5481785
40181 5481785 1441047 -481398 -362914 -35364 2252866 7906236 12542403 10940122
40173 10940122 5040750 1157059 1295971 2890947 4798849 7170585 7301061 2718017
40165 2718017 -2626015 -2491519 1801746 3201326 613087 414541 4843109 7476616
40157 7476616 3663041 -2228168 -4522369 -4633613 -6434486 -8645341 -7804204 -5065192
40149e065192Q43002j011254N08556L096816L262939J159520q87620j117823Q61650
40140A650594K931775J391373l347600m828004M74239N780321K964895m209640
40132B807953n161168Q73437M063234L26195k958676n94417K009582n35544l918158
40123c087562k092908K292676K976050L52297o49020P43489J396622P63924J028590
40114C724158K197916K091394L12544j607033k917675l422928k180310N94383
40106a207551K191952R94680n14080O01359K977732L134831P74783j494875k517365
40097D941466l271704l834798k799136J51627L258460M469502L065395O4849k054109
40088C991552j202322J564009K475603l47534m069549m583176j663556J198065
$$ plain form
40149 -5065192 -4222190 -5233444 -4724888 -1628072 1634867 2794387 1906767 788944 1650594
40140 1650594 4582369 5973742 2626142 -2201862 -1727623 4052698 7017593 2807953
40132 2807953 -2353215 -1479778 2583456 2909651 -49025 -643442 1366140 830596 -3087562
40123 -3087562 -5180470 -2887794 88256 440553 -208467 535022 1931644 2695568 3724158
40114 3724158 5922074 8013468 8326012 6718979 3801304 378376 -1801934 -1207551
40106 -1207551 984401 1979081 1465001 2066360 5044092 8178923 8953706 7458831 4941466
40097 4941466 1669762 -2165036 -4964172 -4812545 -1554085 2915417 5980812 6045661 3991552
40088 3991552 2789230 4353239 6828842 6481308 2411759 -2171417 -3834973 -2636908
40080b636908J521642N48464R55449K993479L859242J282003k868119m203840
40072A451412j528201J277275N85911k158754l396538k678168j489196O16517
40064g319742M020630N278951J259958m138309m168829O8493P33131l805369n551358
40055a3622444K04454O700435O069571J182960L0496L089133M124301R13097k413470
40046F278533k887600k042273j589294j106742n38223o55299o75702P98138K426954
40037H492J456195j547849k945811j202590J638903L706931M855194M327348J013501
40028A1310314l072605l694442m01622K145118R47913r57546J12763K145611Q04974
40019I340478k922069l584075M21650M297983L871542Q02025j548877l402082
$$ plain form
40080 -2636908 -1115266 -566802 388647 3382126 7241368 8523371 5655252 1451412
40072 1451412 -76789 1200486 1786397 -372357 -3768895 -6447063 -7936259 -7319742
40064 -7319742 -3299112 1979839 3239797 -898512 -5067341 -4998848 -4265717 -8071086 -13622444
40055 -13622444 -13417990 -6717555 -647984 534976 565472 3654605 7778906 8692003 6278533
40046 6278533 3390933 1348660 -240634 -1347376 -1885599 -2540898 -3216600 -2418462 8492
40037 8492 1464687 -83162 -3028973 -4231563 -2592660 1114271 5969465 10296813 11310314
40028 11310314 8237709 4543267 4141645 6286763 7234676 6277130 6389893 8535504 9340478
40019 9340478 6418409 2834334 3255984 7553967 11425509 12227534 10678657 7276575
40011G276575n934939o590914k357893L663357M896575Q72970j726262O18922
40003G18391K873997o8022m855114m937434n68092K503239J997352N85573k81610
39994b031720j697744k695399n68439L379299M216526J064550r97626J091758
39986A761205L502158J734601k295376l171406L88635M162265L738878q39871
39978H981089n321893n464737j561820J839011J753597L28712L08996m1786k947288
39969b126119m791045n78179O346740P007006K27793m686996j526571M150600
39961D023229M336607O3488k134597n67618Q01410p20395l696320n170046l156791
39952f221033J629753M894399K698862k391885l420952J113446M931903L764086
$$ plain form
40011 7276575 1341636 -5249278 -7607171 -3943814 952761 1825731 99469 718391
40003 718391 3592388 3524366 -1330748 -6268182 -6836274 -4333035 -2335683 -1750110 -2031720
39994 -2031720 -3729464 -6424863 -6993302 -3614003 602523 1667073 669447 1761205
39986 1761205 5263363 6997964 4702588 1531182 1919817 6082082 9820960 8981089
39978 8981089 3659196 -1805541 -3367361 -1528350 225247 553959 862955 821169 -2126119
39969 -2126119 -6917164 -7495343 -1148603 5858403 6086196 1399200 -127371 4023229
39961 4023229 8359836 8423324 6288727 5721109 6522519 5802124 2105804 -3064242 -6221033
39952 -6221033 -4591280 303119 3001981 610096 -2810856 -1697410 3234493 6998579
39944F998579J064002M33412o32994m107528n295696m70407M828926L208259k874119
39935C152434n092818k010715N74880J62544k6450J457305K221158J700642J950666
39926D089646K389149K49690l272833l682256o85007J103922j36175j055328L10809
39917f88383J519166R68601O20377J385346R26599j511890k718159o84494J728740
39908A545903J071082j804277l482659k193605J311057M685439M833539O11326
39900F577805m481861n341628j777960J266055P97178o62888P4540K234066L313565
39891A998872K738293J108215j459588m095916m661616k507512J96576J460762
39883e221914J763376K006372J575743J40687q15536j20241J268788K131220K680046
$$ plain form
39944 6998579 8062581 8495993 7862999 3755471 -1540225 -2010632 2818294 6026553 3152434
39935 3152434 -1940384 -3951099 -3376219 -3213675 -3240125 -1782820 438338 2138980 4089646
39926 4089646 6478795 6728485 3455652 -226604 -911611 192311 56136 -999192 -688383
39917 -688383 830783 1799384 2419761 3805107 4731706 3219816 501657 -182837 1545903
39908 1545903 2616985 812708 -2669951 -4863556 -3552499 1132940 5966479 6577805
39900 6577805 2095944 -3245684 -5023644 -3757589 -2960411 -3623299 -3548759 -1314693 1998872
39891 1998872 4737165 5845380 4385792 289876 -4371740 -6879252 -6682676 -5221914
39883 -5221914 -3458538 -1452166 123577 264264 -551272 -671513 597275 2728495 5408541
39874E408541K809371R98935k747262m961666k749284J431312K347780p56759
39866A780968k766222K39494N107182N329017l33391n868154n462702n47587K692643
39857A71248J380201j416376j860157m5098J463651J345237L82713J84172J802375
39848C407966M109084L735818p86140n253579m179410Q50290K465001j469063
39840B879967m299043j143241L446898L337595L41136o39666p76052l568602n881292
39831f302300k070776M840871N775954n72460n615604l892721K74121J539266
39823f023649J118428K051287L320407K710625P76079j241081l339560m388892
39815e016356k254738J713401K931442K37753k402786k504950k105193k360265
$$ plain form
39874 5408541 8217912 9216847 6469585 1507919 -1241365 189947 2537727 1780968
39866 1780968 -985254 -745760 4361422 9690439 9357048 3488894 -1973808 -2521395 171248
39857 171248 1551449 135073 -1725084 -1770182 -306531 1038706 1421419 1605591 3407966
39848 3407966 7517050 11252868 10466728 5213149 1033739 1884029 4349030 2879967
39840 2879967 -1419076 -2562317 884581 4222176 4563312 3923646 3147594 -421008 -6302300
39831 -6302300 -8373076 -3532205 2243749 1671289 -3944315 -7837036 -7562915 -6023649
39823 -6023649 -4905221 -2853934 466473 3177098 3953177 2712096 -627464 -5016356
39815 -5016356 -7271094 -5557693 -2626251 -2388498 -4791284 -7296234 -9401427 -11761692
39807a1761692r91038K284840L703961K012766J228996L313705M117788R40101
39799D849427j875769k09217K423221Q66932k750690k686865J127400L794080
39791E538519K998330K54267k963550n084145l231003K311788N331718J443160
39783F599084m199770l677731J718354L952890J007069j382087n37276m20827
39775C059706k685836k727082J670760M988080K227829k924572l583941M73678
39767D98622L716648L185043Q97837q83532k266405l478403l457555j682107M95523
39758b974329J248643K77690r05662n48815J240035K163490M33253k386302k825621
39749d277618j28979K452135K038631O7749K170K120433L077619J013677j273254
$$ plain form
39807 -11761692 -12752730 -10467890 -6763929 -4751163 -3522167 -208462 3909326 4849427
39799 4849427 2973658 2764441 5187662 6054594 3303904 617039 1744439 5538519
39791 5538519 8536849 8791116 5827566 743421 -2487582 -175794 5155924 6599084
39783 6599084 2399314 -1278417 439937 4392827 5399896 4017809 3480533 3059706
39775 3059706 373870 -2353212 -682452 4305628 6533457 3608885 24944 498622
39767 498622 4215270 7400313 8298150 7414618 5148213 1669810 -1787745 -3469852 -2974329
39758 -2974329 -1725686 -1447996 -2353658 -2902473 -1662438 501052 934305 -1451997 -4277618
39749 -4277618 -4406597 -1954462 84169 151918 154088 2274521 5352140 6365817 5092563
39740E092563k01013K858998K925017r45534l072512P65505N686644L526168m665250
39731A1970586q679326l438856L553451L311615k000126l917447q53162J481323
39723A428058O90333K54828J463798J005439j663307k182530M82793P98509m022811
39714a744890p801228m240980K874646M964107J007095k164387m62280L035661
39706d532256M281387L275881J800481M42692o50119j013480q71003p96424l62338
39697A574821P33096R96059n97591j751664J05670K878211K371051o84066j499918
39688D125669M55157J00987m321797p090221l523913K498028M398817K319559
39680a037714J290347K829711M000899L184106J465148p29814l434618m455827
$$ plain form
39740 5092563 4891550 7750548 10675565 9730031 6657519 7423024 13109668 16635836 11970586
39731 11970586 3291260 -147596 3405855 6717470 4717344 799897 -53265 1428058
39723 1428058 2118391 2373219 3837017 4842456 3179149 996619 1479412 2277921 -1744890
39714 -1744890 -9546118 -13787098 -10912452 -5948345 -4941250 -7105637 -7567917 -4532256
39706 -4532256 -250869 3025012 4825493 5268185 4618066 3604586 2733583 1937159 1574821
39697 1574821 2307917 3303976 2706385 954721 1060391 3938602 6309653 5625587 4125669
39688 4125669 4580826 4681813 360016 -6730205 -10254118 -7756090 -3357273 -1037714
39680 -1037714 252633 3082344 7083243 10267349 11732497 11002683 7568065 3112238
39672C112238j946515R83961l22072m202302m149138J032776M699138K156922
39664A365008k658829l519154k42016K976334L806499K605669L6241k520892k672963
39655h24103l16987J216047R8053r50776L74919J596524J40214j244177R30029
39646A019743L853053K258432k604588m644917k715430j477544k164119k42443
39638f717813N402289Q284511L655399l618539n691374k214142J167841J822742
39630B090914J828588K070902M79624l235387n640258m018350J26147L433583
39622b864237M404017L472462J264893j491352l320343l009081j275704l21700
39614c141045j312999k885874k737693m93404J799158K311511J712686J861604
$$ plain form
39672 3112238 1165723 2149684 1827612 -2374690 -6523828 -5491052 -791914 1365008
39664 1365008 -1293821 -4812975 -5054991 -2078657 1727842 4333511 4369752 1848860 -824103
39655 -824103 -1141090 74957 173010 -777766 -402847 1193677 1333891 89714 1019743
39646 1019743 4872796 7131228 4526640 -118277 -2833707 -4311251 -6475370 -6717813
39638 -6717813 -1315524 6968987 10624386 7005847 1314473 -899669 268172 2090914
39630 2090914 3919502 5990404 6470028 3234641 -2405617 -6423967 -6297820 -2864237
39622 -2864237 1539780 5012242 6277135 4785783 1465440 -1543641 -2819345 -3141045
39614 -3141045 -4454044 -7339918 -10077611 -10571015 -8771857 -6460346 -4747660 -2886056
39606b886056K686917J821658k094333o659955p372371k371175M838752Q191386
39598c845177N213928j39768k010443L37668K059400k57992l842609l960616o38202
39589g083811J933200J598866M48327Q13905K108285K400047Q56476k075604m942677
39580c942986n257896j428335M400313P437080N369722Q74316j961766k140132
39572C350316j476575j266602r55926K61181J771683J794379p33223m341286n586041
39563g182094k402104L183137O675417N553456J369929k354432l357278j860426
39555c74395L56440J699768J838502J144668l43242k287740k938828r03825J946818
39546A38166K368794J092005K202598N524643M761078k869556j0034669q344591
$$ plain form
39606 -2886056 -199139 1622519 -471814 -7131769 -14504140 -16875315 -12036563 -3845177
39598 -3845177 1368751 1228983 -781460 -443792 1615608 1357616 -2484993 -6445609 -7083811
39589 -7083811 -5150611 -3551745 -3103418 -2289513 -181228 2218819 3075295 999691 -3942986
39580 -3942986 -9200882 -10629217 -6228904 1208176 6577898 7452214 5490448 3350316
39572 3350316 1873741 607139 -348787 -87606 1684077 3478456 2745233 -1596053 -7182094
39563 -7182094 -9584198 -6401061 274356 5827812 7197741 4843309 1486031 -374395
39555 -374395 -17955 1681813 3520315 4664983 4321741 2034001 -904827 -1808652 138166
39546 138166 2506960 3598965 5801563 11326206 16087284 13217728 3183059 -5161532
39538e161532n06231L719063J543308q79396P6406P04470j699377l631750j867316
39529g702355J195803K350245K441686K901153K318610J00541r18260Q58597K542670
39520F088690J449797r88363k830277m438459m786996p79441N693850O480149
39512E888950j139960p558912l359683O176175Q244605J091861m675878k593174
39504B073984J927352K098221q29728k211505j313306Q0895J476351K459872J480022
39495G242158j185740k546950j412209n02515j787943l099032j948896M09296
39487d831831J538543J643774J891249J354432j082146l498783k917425L65455
39479e536732L167167L615533K662352J795054J306695P70291l24341k279111
$$ plain form
39538 -5161532 -5667763 -1948700 -405392 -1284788 -1208382 -503912 -2203289 -5835039 -7702355
39529 -7702355 -6506552 -4156307 -1714621 1186532 3505142 3605683 2687423 3546020 6088690
39520 6088690 7538487 6550124 3719847 -718612 -5505608 -6285049 -591199 5888950
39512 5888950 4748990 -2809922 -6169605 6570 8251175 9343036 4667158 2073984
39504 2073984 4001336 6099557 5269829 3058324 1745018 1825913 3302264 5762136 7242158
39495 7242158 6056418 3509468 2097259 1594744 -193199 -3292231 -5241127 -4831831
39487 -4831831 -3293288 -1649514 241735 1596167 514021 -2984762 -5902187 -5536732
39479 -5536732 -2369565 1245968 3908320 5703374 7010069 7780360 7456019 5176908
39471E176908m317303m438552j559871K437406M245265K847885N47941j8010J063460
39462E985129J506246p4993k366592k993933j617795n04643j484545l161657k488438
39453g201221J014024M155936L812163N66688k283313k502364o89650J036489
39445b091248R76644j026702l129318k591427R91837L841630J833545l261181
39437d456220m545434P96996O217018L990837l290402n502165M42129N706259
39429f40982K405634m911144o392420j043460L450254K796314L68990k94844M0622
39420d221036N43125K392626M531207L239178j467667m370199k685705J9948L87546
39411a630977K12081J342671J348347j166677k312932N75519L112376P48107l005433
$$ plain form
39471 5176908 859605 -3578947 -5138818 -2701412 1543853 4391738 4939679 4921669 5985129
39462 5985129 7491375 7416382 5049790 2055857 438062 -66581 -1551126 -4712783 -7201221
39453 -7201221 -6187197 -2031261 1780902 2347590 64277 -2438087 -3127737 -2091248
39445 -2091248 -1114604 -2141306 -5270624 -7862051 -6870214 -3028584 -1195039 -4456220
39437 -4456220 -9001654 -8204658 -1987640 2003197 -1287205 -6789370 -6347241 -640982
39429 -640982 1764652 -3146492 -9538912 -10582372 -7132118 -4335804 -3966814 -4261658 -4221036
39420 -4221036 -3677911 -1285285 3245922 6485100 5017433 647234 -2038471 -2018523 -1630977
39411 -1630977 -1418896 -76225 1272122 105445 -2207487 -1631968 1480408 2228515 -776918
39402g76918k356597O53040M0367k943216j816557L077929M341543K04263k248031
39393a824177O76726K956072m16132m341060j952848L784580M552544n20439m181524
39384a266258k181992J703426K494149L30878j789675k450602j693399N17010
39376d336463L098968L155901o14067m706086m021831J320569N096837K511628
39368A505456l322591n021828k76412N424006N912008J399482l114318m257920
39360a752117k782777q72157M48413J104433R74706o9833j529177k091152o48255
39351g217916J934497K859118O35276k362184k584454n4811K073357K255408J717970
39342g43739J161943J59649q5254K062103M232655K212875k410800l231007K67480
$$ plain form
39402 -776918 -3133515 -2480475 -2440108 -5383324 -7199881 -4121952 219591 423854 -1824177
39393 -1824177 -1147451 1808621 1392489 -2948571 -4901419 -1116839 3435705 2915266 -1266258
39384 -1266258 -3448250 -1744824 749325 1080203 -709472 -3160074 -4853473 -4336463
39376 -4336463 -1237495 1918406 1304339 -3401747 -7423578 -6103009 -1006172 1505456
39368 1505456 -1817135 -6838963 -7115375 -1691369 4220639 5620121 2505803 -1752117
39360 -1752117 -4534894 -5407051 -4958638 -3854205 -2879499 -2949332 -4478509 -6569661 -7217916
39351 -7217916 -5283419 -2424301 -1789025 -4151209 -6735663 -6790474 -4717117 -2461709 -743739
39342 -743739 418204 577853 492599 2554702 6787357 9000232 6589432 3358425 3625905
39333C625905O62693m646137o974106L55615R614040Q995028J29622n288148l226008
39324C248504n25993j448797k182927q5860J543821N92134j97481P07962J171270
39315B822633J073797L127163O028280M580655r06562l391475l66103J870444
39307A4838832q79214l867135k546312m87106j759630k721163R13103M725122
39299H216497J886846n093746p327295k305482L488461L891592o40909n421318
39291c305354o067497j760909L151507L138118p75611j561228K781311N035437
39283F35774M71885m237927j342353M852676M782031p48413k527125J664343M714758
39274H265649L041045J071841J485896R28618j961656l273963j759087j763700
$$ plain form
39333 3625905 4288598 -357539 -7331645 -6976030 2638010 11633038 11762660 6474512 3248504
39324 3248504 2722511 1273714 -909213 -995073 548748 1140882 943401 1651363 2822633
39315 2822633 3896430 7023593 13051873 17632528 16725966 13334491 12968388 14838832
39307 14838832 13959618 10092483 7546171 7059065 5299435 2578272 3491375 8216497
39299 8216497 10103343 5009597 -2317698 -4623180 -1134719 2756873 2115964 -3305354
39291 -3305354 -9372851 -11133760 -7982253 -4844135 -5619746 -7180974 -4399663 635774
39283 635774 1107659 -3130268 -4472621 380055 5162086 4413673 1886548 3550891 8265649
39274 8265649 11306694 12378535 13864431 14793049 12831393 9557430 7798343 6034643
39266F034643m710913n593927k028951Q80946n01854j879639Q70424L917019K379735
39257f32517q85675o79722J310859N40151j159851R69759M570950K897640l108687
39248C822907m792153P61384N767508L431883k616924n067271l403809k159546
39240d256021k483509j431713J759497L929460K876646L61281o65595M68776K221094
39231B779916K814809J594834n70094j918897j480252p5202Q53521R27332O54112
39222E580079K61238k43405l92369J75146Q23974O84532j11640j000446k036032
39213C741077k932873k030436J462580M681053L568608j362173m763777l248668
39205h84609M15167J862619J136592J198614K479584K599947P65483j048732j399970
$$ plain form
39266 6034643 1323730 -4270197 -6299148 -5418202 -5920056 -7799695 -6929271 -3012252 -632517
39257 -632517 -1518192 -2197914 -887055 -346904 -1506755 -536996 4033954 6931594 3822907
39248 3822907 -969246 -207862 5559646 8991529 6374605 1307334 -2096475 -4256021
39240 -4256021 -6739530 -8171243 -6411746 -2482286 394360 755641 90046 558822 2779916
39231 2779916 5594725 7189559 6619465 4700568 3220316 3145114 3998635 4925967 5580079
39222 5580079 5841317 5597912 5205543 5380689 6204663 6889195 6777555 5777109 3741077
39213 3741077 808204 -1222232 240348 4921401 8490009 7127836 2364059 -884609
39205 -884609 -469442 1393177 2529769 3728383 6207967 8807914 9573397 8524665 7124695
39196G124695r85276o99559o29144j111684k207677k128158O82064L600052J806311
39187E451624m402737q204347m817499J804205M407823K086201R9494J311787
39179b263449K763133J402245j203486k009667j096141k78382O71481K930431
39171I16165M715589K445635l344761o796218l827209K020293M091039J441711
39163A662244r25586k48478N45117r33683j862883O66680L806505L099675j36447
39154E673144j072333M75589J41406k972748m525999k196707J123225L106185
39146b48238N110727O988813M857890j848874o567604m223825O64126O04626l499850
39137A837791m505725n86280K723829J871759k73173n61033k9913q9681N26717
$$ plain form
39196 7124695 6139419 5439860 4810716 3699032 1491355 -636803 45261 3645313 5451624
39187 5451624 1048887 -7155460 -11972959 -10168754 -5760931 -3674730 -3575236 -2263449
39179 -2263449 499684 1901929 698443 -1311224 -2407365 -2685747 -2014266 916165
39171 916165 5631754 8077389 4732628 -2063590 -5890799 -3870506 220533 1662244
39163 1662244 736658 488180 1033297 99614 -1763269 -1096589 2709916 5809591 5673144
39154 5673144 4600811 5076400 5217806 2245058 -2280941 -4477648 -3354423 -248238
39146 -248238 4862489 11851302 16709192 14860318 8292714 4068889 4733015 5337641 1837791
39137 1837791 -2667934 -3254214 -530385 1341374 1068201 507168 477255 387574 914291
39128I14291K241621K383591m62783l270181k756694Q123J926186K134884J168900
39119D287938j353070m752878n416707j116362M241634M710847O67018j572120
39111c03700J010949M076909L077449O3827k64156J723735J511628k013982m688323
39102D194336l465884p44812m22695k485273l875642k881146l10756K425700M157550
39093c408622L779771J468451m44823J70999K378731L463416K576128J126119
39085A1110170K4479j202989k618933l279841k588239o83674K081476M368474
39077G210923L624397q44959n516593o372121m120952k285828j190535J491829
39069h003839M723204M441809P99087r70433J082382K447589L31121j248080J019679
$$ plain form
39128 914291 3155912 5539503 5076720 1806539 -950155 -942032 984154 3119038 4287938
39119 4287938 2934868 -1818010 -7234717 -8351079 -4109445 601402 1268420 -303700
39111 -303700 707249 4784158 7861607 7925434 7661278 9385013 10896641 8882659 4194336
39102 4194336 728452 -16360 -439055 -2924328 -6799970 -9681116 -9991872 -7566172 -3408622
39093 -3408622 371149 1839600 1394777 1565776 3944507 7407923 9984051 11110170
39085 11110170 11134649 9931660 7312727 4032886 1444647 760973 2842449 7210923
39077 7210923 10835320 9990361 4473768 -1898353 -6019305 -8305133 -9495668 -8003839
39069 -8003839 -3280635 1161174 1960261 989828 2072210 4519799 4850920 3602840 4622519
39060D622519L001337r1347m946482n183009j683012l33786j641103o74631L136466
39051c793048M204343J79278l781396k725034J478406L974116L143057M45144
39043C124866k415403l775222k328407P82072K456251J569766J98152J41379P81039
39034E34493J048429P95486l25670k424109l461168j199359K403560K632686j046135
39025a041787l467482r42502L685447N282700K618411j702561m654519m312364
39017d534657p32409L047983L612543J853495J677353L186934J950001k961871
39009G099372n737079k392168K450156K425555j036071k038879q3472J84306k260289
39000a388569l148148m38683K405474K153029J14746j015040p67856M00812K642828
$$ plain form
39060 4622519 7623856 7532509 2586027 -2596982 -4279994 -4613780 -6254883 -6929514 -3793048
39051 -3793048 411295 590573 -3190823 -5915857 -4437451 -463335 2679722 3124866
39043 3124866 709463 -3065759 -5394166 -4612094 -2155843 -586077 -387925 -246546 534493
39034 534493 1582922 2378408 2052738 -371371 -3832539 -5031898 -2628338 4348 -1041787
39025 -1041787 -4509269 -5451771 -1766324 3516376 6134787 4432226 -222293 -4534657
39017 -4534657 -5267066 -2219083 1393460 3246955 4924308 8111242 10061243 7099372
39009 7099372 1362293 -1029875 1420281 3845836 2809765 770886 687414 871720 -1388569
39000 -1388569 -4536717 -4975400 -2569926 -416897 -302151 -1317191 -2085047 -1684235 958593
38991I58593M985384M846014J373266k729613m482736m048684l296748k537953
38983d932477o39850K339708M376749L553652K14320l174654m301295l161419
38975e725266j669043j122233q49628K95594K127920L480613L446649J792073
38967A776679o23886j472016J036013M921182N625698J877576k230041k976799
38959G934406j878265j970459k328836n11867J809430P71148l066152m960169
38951d200764k726680J164479M069729N258691L705399j118919n763818n326296
38943d938179n44097K660046J820703N91330J261167R79432j647225k600455N15760
38934a901518L193796J137270k269496j721884R15467J80424l320430m171576
$$ plain form
38991 958593 5943977 10789991 12163257 9433644 4950908 902224 -2394524 -4932477
38983 -4932477 -5572327 -3232619 1144130 4697782 4912102 1737448 -2563847 -5725266
38975 -5725266 -7394309 -8516542 -9366170 -9070576 -6942656 -3462043 -15394 1776679
38967 1776679 1152793 -319223 716790 5637972 11263670 13141246 10911205 7934406
38959 7934406 6056141 4085682 1756846 1244979 3054409 3825557 759405 -4200764
38951 -4200764 -6927444 -5762965 -1693236 3565455 7270854 6151935 388117 -4938179
38943 -4938179 -5482276 -2822230 -1001527 -410197 850970 1830402 183177 -2417278 -1901518
38934 -1901518 1292278 2429548 160052 -1561832 -646365 -465941 -3786371 -7957947
38926g957947j433194N75437K44067N60961K697651L970763L071005J758694N70105
38917D057542j731032l722038k125368J853731K981999M12841n72299K387369
38909C542745M346171J305331l099030l788542k001634j580590j832956m0264
38901c148769K156691J212002j457878j299757J525285K067694j336671m238196
38893d519599k706761J289101L035447J026194j869954j946417J304105M225524
38885a62360K840354j759862l934673q76591L301781L521597Q98861M4215J526513
38876E399835J866202k18900k554605l956419n006042m548532o03416M668117
38868d953760O075335K746006m90535o38753m46945k405142l800969j523218K012978
$$ plain form
38926 -7957947 -9391141 -8815704 -8571637 -8010676 -5313025 -1342262 1728743 3487437 4057542
38917 4057542 2326510 -1395528 -3520896 -1667165 1314834 1727675 1155376 3542745
38909 3542745 7888916 9194247 6095217 2306675 305041 -1275549 -3108505 -3148769
38901 -3148769 -992078 219924 -1237954 -2537711 -1012426 1055268 -281403 -4519599
38893 -4519599 -7226360 -5937259 -2901812 -1875618 -3745572 -5691989 -4387884 -162360
38885 -162360 2677994 918132 -3016541 -3893132 -591351 2930246 3829107 3873322 5399835
38876 5399835 7266037 7047137 4492532 536113 -4469929 -9018461 -9621877 -4953760
38868 -4953760 1121575 3867581 3377046 2738293 2291348 -113794 -3914763 -5437981 -3425003
38859c425003K197114p54999k303815j29303L208546L888308Q09069l764765o026983
38850f301831l779755J023830L875904K870532Q00585Q62945K089757J115457
38842B557424k667302n953880n336570q89375L936085N326351K519846j370372
38834a877793k658342j219414J6270l47150l67101J576120L690092L287006Q69083
38825B968771n75743J62379J013205k06961k517954k850958k18837K590093K637879
38816C001874R98461Q01721J681213K25436l145823l043206J968305M813802m4585
38807G257198o721961n901640N91546K866053o83322j243605M520529P869814
38799H554612K313290n384082n764525n60439K129010P36351k83184J13201q20118
$$ plain form
38859 -3425003 -1227889 -1982888 -4286703 -4416006 -1207460 2680848 3489917 -274848 -6301831
38850 -6301831 -10081586 -9057756 -5181852 -2311320 -1510735 -647790 1441967 2557424
38842 2557424 -109878 -6063758 -11400328 -12289703 -8353618 -3027267 -507421 -1877793
38834 -1877793 -4536135 -5755549 -5739279 -6086429 -6453530 -4877410 -1187318 2099688 2968771
38825 2968771 2393028 2555407 3568612 3361651 843697 -2007261 -2226098 363995 3001874
38816 3001874 4000335 4802056 6483269 6708705 3562882 519676 2487981 7301783 7257198
38807 7257198 535237 -5366403 -4774857 -1908804 -2592126 -3835731 684798 8554612
38799 8554612 10867902 5483820 -280705 -841144 1287866 2024217 1741033 1854234 1034116
38790A034116k634928j936037J221872L293573K901164J593915K31074q90406
38782D814343k05830K263750K652289j236666m930978l372064Q31404J557913
38774B374161j017460j922925o79399j119205k836720j207633L515397N186316
38766B292532J599244j866751q75180J893102K175879J45067j851769l034472
38758D77652l118837j393081J039183J552921j3812j056624o36493l67923l80218
38749c897232J151380L605098L652548O07093k275823k927082k650479k359327
38741e093824j147330M93261O25145j37639P14767K402827J586986j131058j357537
38732c044402J395751K488874K10012j533127o95847m16558k013307j637855K262219
$$ plain form
38790 1034116 -1600812 -3536849 -2314977 978596 3879760 5473675 5704749 4814343
38782 4814343 4608513 6872263 9524552 8287886 3356908 -15156 816248 2374161
38774 2374161 1356701 -566224 -1245623 -2364828 -5201548 -6409181 -2893784 2292532
38766 2292532 3891776 2025025 1149845 3042947 5218826 5363893 3512124 477652
38758 477652 -2641185 -4034266 -2995083 -1442162 -1455974 -2512598 -3149091 -3517014 -3897232
38749 -3897232 -2745852 859246 4511794 5118887 2843064 -84018 -2734497 -5093824
38741 -5093824 -6241154 -5747893 -5122748 -5260387 -4545620 -2142793 -555807 -1686865 -3044402
38732 -3044402 -1648651 840223 1050235 -482892 -1178739 -1595297 -3608604 -5246459 -2984240
38723b984240M747513K224414j436851j499430K55976k26632k369618l180302
38715d469170k214714j56615L147704N626603L389305j901791k530819L462788
38707D353291P121206J744096n948212o181159j207376L4971k696583k342692
38699e122458J582132K422369q81811j845894J594271L560331J022854j303632
38691A028162p8160J096652q84381l013782k264799q88823j264925j160908J364288
38682f066676L362876J912818o95663j154290n51923j106117j293972P55725K308954
38673b528268Q7237l048256j497313M023052O803752L821795m48044j314273M0795
38664E940477K96649m06433k70651k03693j923650l404191j194126K975818L202924
$$ plain form
38723 -2984240 1763273 3987687 2550836 1051406 1307382 1080750 -1288868 -4469170
38715 -4469170 -6683884 -6840499 -3692795 1933808 5323113 3421322 890503 4353291
38707 4353291 11474497 13218593 7270381 1089222 -118154 -83183 -2779766 -5122458
38699 -5122458 -3540326 -1117957 -1999768 -3845662 -2251391 1308940 2331794 1028162
38691 1028162 950002 2046654 1162273 -1851509 -4116308 -5005131 -6270056 -7430964 -6066676
38682 -6066676 -2703800 -790982 -1486645 -2640935 -3192858 -4298975 -5592947 -4837222 -2528268
38673 -2528268 -2441031 -5489287 -6986600 -2963548 3840204 7661999 7213955 5899682 5940477
38664 5940477 6237126 5830693 5560042 5356349 3432699 28508 -1165618 1810200 5013124
38655E013124j601980m958726k109817K622633K422119j790686l645091j431785
38647e480209Q28908J361488K424616L866291K328679j624418k904122o92637
38639A08596m01630l795714n053251j037387K534047J010893r30258J743017M636768
38630a184919K136753j163594J982128P389520M975017m222644q809932m309064
38622c206735J980721M086958M074406L862733J278470k607747k266687K278366
38614I480485L410811j892440o512181m434022O68290L018418L009622K611286
38606I360269K34381l876254m401625M21829L706786L24536m071170k043199L501019
38597C156572M630866J041893j477617j585639k407518l489881j547180K050240
$$ plain form
38655 5013124 3411144 -1547582 -3657399 -1034766 1387353 -403333 -4048424 -5480209
38647 -5480209 -4651301 -3289813 -865197 3001094 5329773 3705355 801233 108596
38639 108596 -293034 -4088748 -9141999 -10179386 -7645339 -6634446 -7564704 -5821687 -1184919
38630 -1184919 951834 -211760 1770368 9159888 14134905 9912261 1102329 -3206735
38622 -3206735 -1226014 2860944 6935350 10798083 12076553 9468806 7202119 9480485
38614 9480485 12891296 10998856 4486675 52653 720943 3739361 6748983 9360269
38606 9360269 9594650 5718396 1316771 1738600 5445386 5769922 1698752 -344447 3156572
38597 3156572 7787438 8829331 7351714 5766075 3358557 -131324 -1678504 371736
38589C71736K642830M07219l31622P62757j1655k629805k956644m93199N92408
38580a645975r61704j597649K48522J803726J780167K274224L241810J475795
38572F618916k613566l544248O34412M071774J621313l257353l959274m06157
38564h34183K044364J184798J84321J625995L633922K960094n94090m050587m533819
38555A620815j998759J105688K624101K588210J943929N50788j993251m314330
38547B127191m197556j514845J560102L172734L076178J845595O14653Q20866
38539G504918K173060K022873p19955k668835n71113K670577J469432l585923
38531H295034o046488l296766J85198R68507J643639M324118N263399J053793
$$ plain form
38589 371736 3014566 3421785 3090163 3852920 3841265 1211460 -1745184 -2238383 -1645975
38580 -1645975 -2607679 -4205328 -3956806 -2153080 -372913 1901311 5143121 6618916
38572 6618916 4005350 461102 1095514 5167288 6788601 3531248 -428026 -834183
38564 -834183 1210181 2394979 2579300 4205295 7839217 10799311 10205221 6154634 1620815
38555 1620815 -377944 727744 3351845 5940055 7883984 8434772 6441521 2127191
38547 2127191 -2070365 -3585210 -2025108 1147626 4223804 6069399 6684052 7504918
38539 7504918 9677978 11700851 10980896 8312061 7740948 10411525 11880957 8295034
38531 8295034 2248546 -1048220 -863022 105485 1749124 6073242 11336641 12390434
38523A2390434m483293n450252k566989p52082o73155P25411K826914J618864
38515C635852k462169l803427m08338K675058J522454l55768K087482P038094
38507I929238Q071514K984362l846825p388480o820053m312745j681801P06749
38499b358041K949020M393647L627991L73343k685873j921692K306037M881703
38491A1566135K267012k220067k640588J069121K899387m14184m518397l685318
38483D323101J199708M324074L032279M93670L19550J809663J845556n87262l448850
38474A3311489m263018k368651J010625L881737M647512K893496m33695l465252
38466A5214243m370171k693153k2675J463444J487074J570414J914491M01140
$$ plain form
38523 12390434 7907141 2456889 -110100 -862182 -1535337 -809926 2016988 3635852
38515 3635852 1173683 -2629744 -3038082 -363024 1159430 803662 2891144 9929238
38507 9929238 18000752 20985114 17138289 9749809 2929756 -1382989 -3064790 -2358041
38499 -2358041 590979 4984626 8612617 8985960 6300087 4378395 6684432 11566135
38491 11566135 13833147 11613080 8972492 10041613 12941000 12526816 8008419 4323101
38483 4323101 5522809 9846883 12879162 13372832 13692382 15502045 17347601 16760339 13311489
38474 13311489 9048471 6679820 7690445 11572182 16219694 19113190 18679495 15214243
38466 15214243 10844072 8150919 8128244 9591688 11078762 12649176 14563667 14964807
38458A4964807l478090n816343k869848K568709L723505p94054m709328l002992
38450E86366J222072K000724r00287k908775j897319J00890J331003K036172K055306
38441C626152Q21542j66299J145893L107335J863919k036981l096857J121216
38433F385920N629168M609715r44401n502369o250305m468349j696656J463902
38425g73375L657049L564709K217018J608463J416867O3375j439351l22036K885141
38416A2877860L839473L85037l999507m776657j998244R17512K172063K558520
38408A1976057K427763P61199k244558l981467k257443J600667L811417K409137
38400A4502772l33656m56081K774442N502687L803441j073044l743562j311394
$$ plain form
38458 14964807 11486717 5670374 2800526 5369235 9092740 8298686 3589358 586366
38450 586366 1808438 3809162 2908875 100 -1897219 -1796329 -465326 1570846 3626152
38441 3626152 4447694 4281395 5427288 8534623 10398542 8361561 5264704 6385920
38433 6385920 12015088 16624803 15680402 10178033 3927728 -540621 -2237277 -773375
38425 -773375 2883674 6448383 8665401 10273864 11690731 11754106 10314755 9992719 12877860
38416 12877860 16717333 17102370 13102863 8326206 6327962 7245474 9417537 11976057
38408 11976057 14403820 15165019 12920461 8938994 6681551 8282218 12093635 14502772
38400 14502772 14169116 13713035 16487477 21990164 25793605 24720561 20976999 19665605
38392A9665605K955953L861274O66614k766475l336297j665596K93533J866873
38384B1541484K768869K052935J2906o25555J879091M655033L255865j584462
38376C3956166l775890L2678N315447N449745N41222l157686j878658J547599
38368C8030623K910215K303229K383115L425582L217507J167913k21835J399539
38360E4615888N133735P883511P799223N883868M259320L553148K778737J737453
38352I3644883K100567M876125P939857Q286017O354664N496473O924014Q298733
38344A43921333Q326983R129446J1672101J2420408Q587870M169037N462185J1386328
38336B15075691J3816131Q491306O12207k487915l8750L512735N006354M389466
$$ plain form
38392 19665605 22621558 26482832 27149446 24382971 21046674 19381078 19674611 21541484
38384 21541484 24310353 26363288 26376194 25750639 27629730 32284763 35540628 33956166
38376 33956166 30180276 30212954 35528401 40978146 41519368 38361682 36483024 38030623
38368 38030623 40940838 43244067 45627182 49052764 52270271 53438184 53216349 54615888
38360 54615888 59749623 67633134 75432357 81316225 85575545 89128693 91907430 93644883
38352 93644883 95745450 100621575 108561432 116847449 123202113 128698586 135622600 143921333
38344 143921333 152248316 161377762 173049863 185470271 194058141 198227178 203689363 215075691
38336 215075691 228891822 237383128 237995335 235507420 235468670 238981405 243987759 248377225
38328B48377225K590187R91100J294537K941598K424880j805123n763942n037267
38320B46013195j700909j406394m454083n331981j741403J694041R96797j209655
38312B32859608j114291o96718m029889r268482j0333395o113387k470078l993608
38304A94839760q308602j0518950r652006q134375p533083p629370q119789q761443
38296A26182142q788707q025666p563366p798598p189580m742921k241171j889190
38288G7942943l199103m527842o013338p990967q200061m632755k01738J38630
38280D3315769l140752m572041k238019l61414j584673k562547o33730P25086
38272B8947679j886129m759682k500712K686115L874411j80538m196746n077933
$$ plain form
38328 248377225 250967412 251958512 253253049 256194647 258619527 256814404 251050462 246013195
38320 246013195 244312286 242905892 238451809 233119828 231378425 233072466 234069263 232859608
38312 232859608 231745317 231048599 227018710 217750228 207416833 201303446 198833368 194839760
38304 194839760 186531158 176012208 166360202 158225827 150692744 143063374 134943585 126182142
38296 126182142 117393435 109367769 101804403 94005805 86816225 82073304 79832133 77942943
38288 77942943 74743840 70215998 64202660 56211693 48011632 43378877 43177139 43315769
38280 43315769 40175017 35602976 33364957 33003543 31418870 28856323 28222593 28947679
38272 28947679 27061550 22301868 19801156 22487271 26361682 26181144 21984398 16906465
38264A6906465m775494m409169k208569J588515L860591M037264M652851N200683
38256B4853137J929690m100024n812243p15353L910399J540917l646168l634097
38248A4326258J126728L438051P43045k346923k172229n58780o81427k737767
38240A1136956m458923l412389P84179M883735M583313L96333k328755j418153
38232A0166296j064391l523469l812961J259230M986353M84176o308677m244118
38224b057561N041984Q785589K602398l919010l274076K14697Q74840P13187J915596
38215A0897644K87513o178352j0351523n970853J754439L874277Q11200n71544
38207e447199J275633K302160J430250J342950K430390K856023L015057L751237
$$ plain form
38264 16906465 12130971 7721802 5513233 7101748 10962339 14999603 19652454 24853137
38256 24853137 26782827 22682803 16870560 16155207 20065606 21606523 17960355 14326258
38248 14326258 15452986 18891037 19634082 17287159 15114930 14556150 13874723 11136956
38240 11136956 6678033 3265644 4049823 8933558 13516871 13913204 11584449 10166296
38232 10166296 9101905 5578436 1765475 3024705 8011058 8495234 2186557 -2057561
38224 -2057561 2984423 11770012 14372410 10453400 7179324 7394021 8268861 8982048 10897644
38215 10897644 11185157 5006805 -5344718 -11315571 -9561132 -5686855 -4875655 -5447199
38207 -5447199 -4171566 -1869406 -439156 903794 3334184 6190207 9205264 12956501
38199A2956501K335043l263346q234365o090235J399263O201845M945460J379803
38191A1629969j031389k288818k244461l87984R61717p33547l027723j920962
38183I56802P01415o0148k940842k102466K432607M347661J594475j098597j365296
38174B465611k043049l211510p83490M194990M561173o14917k560167K765913
38166D774554O540420R80262p336324p432511m55087L911248K670432Q31834O89774
38157E174602j09273j416986p48855L11570j637647m117860j963872K540719K118770
38148A51168k686662l207325K940937P245850L929315j256021j463351L95639
38140F049550j419744m368622k272569L008570L746464j198489m542991j845736
$$ plain form
38199 12956501 15291544 12028198 3793833 -2296402 -897139 5304706 10250166 11629969
38191 11629969 10598580 8309762 6065301 5677317 6639034 5905487 2877764 956802
38183 956802 1658217 1598069 -1342773 -3445239 -1012632 3335029 4929504 3830907 2465611
38174 2465611 422562 -2788948 -3572438 622552 5183725 4568808 2008641 4774554
38166 4774554 11314974 12295236 4958912 -2473599 -2928686 982562 3652994 4484828 5174602
38157 5174602 5065329 3648343 2899488 3211058 1573411 -2544449 -4508321 -1967602 151168
38148 151168 -2535494 -5742819 -2801882 4443968 8373283 7117262 5653911 6049550
38140 6049550 4629806 261184 -2011385 997185 4743649 3545160 -997831 -2843567
38132b843567K672563L655748J902664Q45614L94301j370996l121389j619473
38124E15465K546397M718367K453270j200097k330712j413609j387744k426600
38116A474737k194997o40305l71989j502472m14983M037528P061831M384945q27239
38107A1007056k210103N21475J807375r12464m068830m249106k391629k29898
38099g26124K532574N184685M624435J65915l830893l510467q51995j37915j602491
38090A847724k078885o0198L114543N482104N124740P99077n057216o524134j342487
38081A305268M450432L686027j986576m677956j619144K154140K521211J278771
38073G112173Q86340J98710j747831k686182j212686J67148n24222j020281P98473
$$ plain form
38132 -2843567 -171004 3484744 5387408 6233022 6627323 5256327 2134938 515465
38124 515465 3061862 7780229 10233499 9033402 6702690 5289081 3901337 1474737
38116 1474737 -720260 -1360565 -1732554 -3235026 -3650009 387519 7449350 11834295 11007056
38107 11007056 8796953 9318428 11125803 10213339 6144509 1895403 -496226 -726124
38099 -726124 1806450 6991135 11615570 11781485 7950592 4440125 3588130 3450215 1847724
38090 1847724 -231161 -291359 2823184 8305288 13430028 14229105 9171889 2647755 1305268
38081 1305268 5755700 9441727 7455151 2777195 1158051 3312191 5833402 7112173
38073 7112173 7998513 8197223 6449392 3763210 2550524 2717672 2193450 1173169 1971642
38064A971642K328288L62875l041366l486145j011556O99812M66263K87035P66507
38055f56645N13701j73244N47225K135192K085202N11658J06470J059518M35141
38046F564218k419732m253370l110741q51092J144381M035403O876693N048263
38038A3034023k519348q777899o612447J097549M980049J441216l867006m547696
38030e771559m65618M330806O341799M138254j108916n151874l851440J579310
38022D0762N119523L113076j643883m348909l856674j817683J064492M624790
38014B295494O633857M387694r25135m517459l798887j608537j897732l803898
38006c234603k807829K232767O272038M307904j578961m654693k403242Q40013
$$ plain form
38064 1971642 4299930 4662805 1621439 -1864706 -2876262 -2176450 -1710187 -1423152 -656645
38055 -656645 -142944 -316188 231037 2366229 4451431 4963089 5069559 6129077 6564218
38046 6564218 4144486 -108884 -3219625 -4070717 -2926336 1109067 7985760 13034023
38038 13034023 10514675 1736776 -4875671 -3778122 1201927 2643143 -1223863 -5771559
38030 -5771559 -6237177 -1906371 4435428 8573682 7464766 2312892 -1538548 40762
38022 40762 5160285 8273361 6629478 2280569 -1576105 -3393788 -2329296 2295494
38014 2295494 8929351 13317045 12391910 7874451 4075564 2467027 569295 -3234603
38006 -3234603 -6042432 -3809665 2462373 6770277 5191316 536623 -1866619 -1026606
37998a026606R24709n31038j07325J418327J016975r26737j447139l18383J65079
37989h32138K73958K609983O193982O062001P72711m311911m145393o19660J190610
37980G194143J90395j052813j315560j366767j102894J26103J103545O1959k002397
37971A835714k323545l89326J692797K463050K115349P13864j711645l492930
37963I03328k717161m21362M86488k71655l3658J957329K738292K68407k973930
37954f3922l381542j268869M8738p53598j443399K36863L269988M472217K342566
37945C459042r90437k119378l96789J442830J058561o65884j784118k412353l244097
37936e652623k531889J651389O578690O809374J994029j738402m07594K136891
$$ plain form
37998 -1026606 -101897 -632935 -740260 678067 1695042 768305 -678834 -997217 -832138
37989 -832138 -558180 2051803 8245785 14307786 15080497 10768586 6623193 6003533 7194143
37980 7194143 7384538 6331725 5016165 3649398 2546504 2672607 3776152 3838111 1835714
37971 1835714 -487831 -877157 815640 3278690 5394039 6107903 4396258 903328
37963 903328 -1813833 -2235195 -1748707 -2020362 -2054020 -96691 2641601 2910008 -63922
37954 -63922 -3445464 -4714333 -4665595 -5419193 -6862592 -6625729 -3355741 1116476 3459042
37945 3459042 2468605 349227 -47562 1395268 2453829 1787945 3827 -2408526 -5652623
37936 -5652623 -8184512 -6533123 45567 6854941 8848970 7110568 6702974 8839865
37928H839865O99578k917592l128667K59433K035798K23062j250594L21750K084350
37919G166983J009243q53083j58894J891328J627486j096445l073110k916160
37911C597348k112392j203108J079777M159296M753079J352456l103097m825620
37903C697739l395779q50274J216429J767797q5982k937543k589035K729072P960920
37894G513344O323907j379790p109240o144693k497336j475780j731437Q21021
37886e680004M717577M656878K94168k772401j391990J280384J915662J731215
37878D751489K304468J523095k137862n083023l346768O83108J616478n27569
37870b16584r70306J484656K880213J389624j1037J75945q01158l478135l045361
$$ plain form
37928 8839865 9539443 6621851 3493184 3752617 5788415 6011477 4760883 5082633 7166983
37919 7166983 8176226 7323143 7164249 9055577 10683063 9586618 6513508 3597348
37911 3597348 1484956 281848 1361625 5520921 10274000 11626456 8523359 3697739
37903 3697739 301960 -548314 668115 2435912 2349930 -587613 -3176648 -447576 7513344
37894 7513344 13837251 12457461 5348221 -796472 -3293808 -4769588 -6501025 -5680004
37886 -5680004 -962427 3694451 3988619 1216218 -175772 1104612 3020274 4751489
37878 4751489 7055957 8579052 6441190 1358167 -1988601 -1305493 310985 -216584
37870 -216584 -1186890 297766 3177979 4567603 4556566 4732511 3931353 453218 -2592143
37861b592143K573263O748126K713563n335662p089214o66142N205727M101380
37853E658898k22435j419659J32126J9919k201165k782993r0169L050969L410172
37844E555663J132456j035149r49871P85638J491543m48438l185493l289078j43466
37835h6195L114665L506905J382998r78001k149268j947725p04994N88578O48252
37826C375215n36998j581458j815223k071805k608344j980857P22730L865524
37818b631216M803937K654084j135041l957883l589190j78345K931666K308159
37810A206171j150075l054617j373864J124424J270470m15812j590819j522257
37802e506379p54950N81504K255033L318635L319825K558163P27140k242457l903005
$$ plain form
37861 -2592143 -18880 6729246 9442809 4107147 -2982067 -3648209 1557518 5658898
37853 5658898 5436463 4016804 4148930 4168849 1967684 -815309 -905478 2145491 5555663
37844 5555663 6688119 5652970 4703099 5488737 6980280 6531842 3346349 57271 -86195
37835 -86195 3028470 6535375 7918373 6940372 4791104 2843379 2138385 2726963 3375215
37826 3375215 2838217 1256759 -558464 -2630269 -5238613 -7219470 -6496740 -2631216
37818 -2631216 2172721 4826805 3691764 -266119 -3855309 -4033654 -1101988 1206171
37810 1206171 56096 -2998521 -4372385 -3247961 -1977491 -2393303 -3984122 -5506379
37802 -5506379 -6261329 -5679825 -3424792 -106157 3213668 5771831 6498971 4256514 353509
37793C53509j617657K207516J927278k788653n488992k489629J859250L025536
37785c011842L246998N413239N953896R60040n169187n272654n75701J807434
37777C352223K53901q53080m07438j408689k863095p8163N756721P036344J273868
37768A2062592m511422l979459N99661L581314L061430k7728m139446n838741
37760H08201k098324L711977M235015j070654m365569j616977J368423m08474
37752E63618k365045J109491N938273M433174k260296o172619m532148j939090
37744e224642j539184j219171Q81035K850508K503015O84143j62927J210307L592730
37735C575814L832350K1345m834596m993902M42160N282789M029171j217271m432803
$$ plain form
37793 353509 -1264148 943368 2870646 81993 -5406999 -7896628 -6037378 -3011842
37785 -3011842 235156 5648395 11602291 12562331 7393144 2120490 1544789 3352223
37777 3352223 3606124 2753044 2345606 936917 -1926178 -2004341 3752380 10788724 12062592
37768 12062592 7551170 3571711 4171372 7752686 10814116 10786388 6646942 808201
37760 808201 -1290123 2421854 6656869 5586215 1220646 -396331 972092 563618
37752 563618 -1801427 -691936 5246337 9679511 7419215 1246596 -3285552 -5224642
37744 -5224642 -6763826 -7982997 -7101962 -4251454 -1748439 -1064296 -1227223 -16916 3575814
37735 3575814 7408164 7429509 2594913 -2398989 -1956829 3325960 7355131 6137860 1705057
37726A705057l255870L9786K319491J639582j541448l095132R52376P330259P678530
37717A3772631P68184m150453j064924L064676k95885o838966o465083j71835
37709a381655J812103k827627n124821l948N875079N079636k52007l474993k527350
37700b825583K13352K333854K184001q47232m363526m769926k390959q00086m97574
37691a1763679J422976M371937L580193j227216l154396J749048P505089O540331
37683I024283L97549l622342l063237j416320p74287K56604J714560J127321j679423
37674A964708l097090r51535J974782J815906j079649l032880k133463j19020
37666d658241Q32961J020061J719489K270107Q52375k081663l592455k294947
$$ plain form
37726 1705057 -1550813 -1511027 808464 2448046 906598 -2188534 -1236158 6094101 13772631
37717 13772631 14540815 10390362 9325438 12390114 12094229 5255263 -1209820 -1381655
37709 -1381655 430448 -2397179 -7522000 -7525948 -1650869 3428767 3176760 -298233 -2825583
37700 -2825583 -2612231 -278377 1905624 1058392 -3305134 -8075060 -10466019 -11266105 -11763679
37691 -11763679 -10340703 -5968766 -2388573 -3615789 -6770185 -5021137 2483952 9024283
37683 9024283 9421832 5799490 2736253 1319933 545646 802250 2516810 3644131 1964708
37674 1964708 -1132382 -2083917 -109135 1706771 627122 -2405758 -4539221 -4658241
37666 -4658241 -3825280 -2805219 -1085730 1184377 2036752 -44911 -3637366 -5932313
37658e932313n04683q88355k655790k884777n11872K615584L854977J954961j613519
37649f565787k929693N27278N450331N396687l33485m500261j788445L228705
37641a514670K860754k262741m758052j766512K018427K551814J364066J017549
37633d89365R85065J27722o80211l06957J070083K987390M567391L558839q95049
37624A0924908m838773l379884J733458L430679o63816m727597l463394N37735
37616d46684J553993q75703k415438p67703J790187K312235R25255J0009P33199
37607B819350J382661j23714k523663k239386J086167L094278R21049k250274
37599B166468k133868K08144J063170L73352L19756J62954j717571k855052l26883
$$ plain form
37658 -5932313 -6436996 -7325351 -9981141 -12865918 -13377790 -10762206 -6907229 -4952268 -6565787
37649 -6565787 -9495480 -8968202 -3517871 1878816 1545331 -2954930 -4743375 -1514670
37641 -1514670 1346084 -916657 -5674709 -7441221 -5422794 -2870980 -1506914 -489365
37633 -489365 495700 623422 -56789 -363746 706337 3693727 8261118 11819957 10924908
37624 10924908 6086135 2706251 4439709 7870388 7206572 2478975 -984419 -446684
37616 -446684 1107309 231606 -2183832 -2951535 -1161348 1150887 2076142 2086151 2819350
37607 2819350 4202011 4078297 1554634 -684752 401415 3495693 4416742 2166468
37599 2166468 32600 240744 1303914 1677266 1997022 2159976 442405 -2412647 -2739530
37590b739530K450071o519n242402n364601M41113M547166L197519J269940K212796
37581G65553K088512k027200n383720k775227L194549O087262L654423j716855
37573C887297o315501o194563J00711P408393P985954J976178k301494p59686
37565E787289J228332p46492k863947j304934L37534j598233l221117j06350M149299
37556A661381L876918N72312j046310j131000j698247q35249K482176L169596
37548G051577k041442o716252l890732J906321K001090j639015o15057M248512
37540C05002M389924o33898k180317J653167K434989l250770p258127l833244
37532h373274Q37107k28168l202392q94166M921274O806185L137071r74278j809873
$$ plain form
37590 -2739530 -289459 -295978 -5538380 -10902981 -10461868 -5914702 -2717183 -1447243 765553
37581 765553 2854065 826865 -4556855 -7332082 -4137533 1949729 5604152 3887297
37573 3887297 -2428204 -8622767 -8522056 -1113663 6872291 8848469 6546975 5787289
37565 5787289 7015621 6269129 3405182 2100248 2437782 839549 -2381568 -2487918 1661381
37556 1661381 5538299 6110611 5064301 3933301 2235054 1399805 3881981 7051577
37548 7051577 5010135 -1706117 -5596849 -3690528 -1689438 -3328453 -3943510 305002
37540 305002 4694926 4061028 1880711 3533878 5968867 2718097 -4540030 -8373274
37532 -8373274 -7536167 -7764335 -10966727 -11860893 -6939619 -133434 3003637 2029359 219486
37523B19486k27612J737836K826953K133408O0691j313071r61391l77107p97241
37514C301952j370342j575223k411939l335997j499024L300246O208284L272637
37506E890594k666644n572159l900181j210608l06466l31796M27008J816934K645893
37497c207425K504922J939964J461256Q24999o01945k590675l633645k589318
37489e891867k75541J699013L038620M064995L680251N87366l453772m480059
37481a030994j415747K159829K752365J262310N85026P05240q90656m267651n615945
37472e756223k325541K480776L239808n47823l243135p72073L667054M452232
37464A195075J579581m09844m0314j04064j426024j324971M79447L99514k245691
$$ plain form
37523 219486 -8126 1729710 4556663 6690071 6750762 5437691 4476300 4099193 3301952
37514 3301952 1931610 356387 -2055552 -5391549 -6890573 -3590327 2617957 5890594
37506 5890594 3223950 -2348209 -6248390 -7458998 -7765464 -8097260 -7670252 -5853318 -3207425
37497 -3207425 -702503 1237461 2698717 3523716 2921771 331096 -3302549 -5891867
37489 -5891867 -6167408 -4468395 -1429775 2635220 6315471 6902837 3449065 -1030994
37481 -1030994 -2446741 -286912 2465453 3727763 4312789 5018029 4127373 -140278 -5756223
37472 -5756223 -8081764 -5600988 -2361180 -2909003 -6152138 -6924211 -3257157 1195075
37464 1195075 2774656 2364812 2324498 2220434 794410 -530561 -51114 348400 -1897291
37455a897291k910110M14075K979510J196481r09288J299974M684299L541063
37447H398713p88933k563210q55381Q74492J865179L539391M026271O21700l763611
37438A1354611l929018r42035j26045j814517j832604l3799K5271q16822J414733
37429C299775M671770K787143k769984l621718J047846K027127l957958p219875
37421c735874o39613P863394P097881q00464n008148k065925K001038K629607
37413G341896J410621Q98065J138145J121259k66635l522811o231360m489292
37405b600112Q15561L501390J094609r55202J603387M335894J771837k838817
37397F728547k899967M83925R94146j996031l188170p85297J413806J019514l90208
$$ plain form
37455 -1897291 -4807401 -4393326 -1413816 -217335 -1126623 173351 4857650 8398713
37447 8398713 7609780 5046570 4191189 5065681 6930860 10470251 14496522 15118222 11354611
37438 11354611 7425593 6483558 6357513 4542996 2710392 2676593 2701864 1885042 3299775
37429 3299775 7971545 10758688 7988704 4366986 5414832 7441959 3484001 -3735874
37421 -3735874 -4375487 3487907 10585788 9785324 4777176 2711251 4712289 7341896
37413 7341896 8752517 9650582 10788727 11909986 11643351 8120540 1889180 -2600112
37405 -2600112 -1784551 1716839 2811448 1856246 3459633 7795527 9567364 6728547
37397 6728547 3828580 4312505 5306651 3310620 122450 -662847 750959 1770473 1380265
37388A380265j510264k353422j651383J302602L305499J391249j258882J02031
37380G07695L066052J473912l581378m707546l66738K797283J287488m19362Q78350
37371A135756J572569j005843l066372j499286L10561q95995k134772l99633J030178
37362d952837j000043k399421J344584N966085M570956n62804j672605J173284
37354B467199O40125m167595n182959R44653O417551M287789j183042k238854
37346A984867O68926J880900O58404P98669K610529K398098q29439m060413n357028
37337G53513n088145k696649K272165O162737M280802j249439k824291J629013
37329C239706N050485J734655m209975n373405j566252J574988J609257J200959
$$ plain form
37388 1380265 -129999 -2483421 -4134804 -2832202 473297 1864546 605664 707695
37380 707695 3773747 5247659 1666281 -3041265 -3408003 -610720 676768 257406 1135756
37371 1135756 2708325 1702482 -1363890 -2863176 -2552615 -3448610 -5583382 -5983015 -4952837
37362 -4952837 -5952880 -8352301 -7007717 -1041632 3529324 2966520 1293915 2467199
37354 2467199 3107324 -1060271 -6243230 -5298577 1118974 5406763 4223721 1984867
37346 1984867 2653793 4534693 5193097 5991766 8602295 11000393 10170954 6110541 753513
37337 753513 -4334632 -7031281 -4759116 1403621 5684423 4434984 1610693 3239706
37329 3239706 8290191 10024846 5814871 441466 -1124786 450202 2059459 3260418
37321C260418K162766K775919J400123r66064k408432k044262k06447J551579
37313E525600J293432p85908j930624p08686N48856m31528j810611o62040J859926
37304B898417K257770K71924j322668j585063j918253k270181j107913Q36511
37296a939456Q83354j163367k493898j463376R45641L502979N059947L350870
37288F682694k040565o095520l127612M506252Q042471L792300k543493m714314
37280D502213l369167k026368j049697N56982J610982R94811K31153M30667k00696
37271A680880k529785l419668k82878L949759M394009R06155k380035k798725
37263d80288j228694M70602J276411R74767L46188N77867J312126Q44452p78004
$$ plain form
37321 3260418 5423184 8199103 9599226 8633162 6224730 4180468 3974021 5525600
37313 5525600 6819032 6033124 4102500 3393814 3942670 3511142 1700531 1038491 2898417
37304 2898417 5156187 5428111 4105443 2520380 602127 -1668054 -2775967 -1939456
37296 -1939456 -1056102 -2219469 -4713367 -6176743 -5231102 -1728123 3331824 6682694
37288 6682694 4642129 -1453391 -4581003 -74751 7967720 11760020 9216527 4502213
37280 4502213 1133046 -893322 -1943019 -1386037 224945 1219756 1450909 1881576 1680880
37271 1680880 -848905 -4268573 -4551451 -601692 3792317 4698472 2318437 -480288
37263 -480288 -1708982 -1238380 38031 1012798 1358986 1936853 3248979 4093431 3315427
37254C315427j262906l4017J43203k489364n353380m919843j255989K896830N391832
37245c568207N127127J793657k525699l866456r66976K543108K598936n23286
37237F12204l553513m198772k204860J211989L476647K531515k26615j361154
37229c712559k36418Q25441J282727K655055L680798J061428l637788m460059
37221b541375p04417J138108j619570k916304J081749M292691R68565l850995
37213d151548k668539J982292K883331P69331J277382L260950J218434l095027
37205A476606k784542J528430K316759j553793l150796j71010J571443m53828
37197a220731j196276J542156K504003p39340k359202J338596M632054J976056
$$ plain form
37254 3315427 2052521 2018504 2161707 -327657 -5681037 -10600880 -11856869 -8960039 -3568207
37245 -3568207 1558920 3352577 826878 -3039578 -4006554 -1463446 1135490 612204
37237 612204 -2941309 -7140081 -9344941 -8132952 -4656305 -2124790 -2351405 -3712559
37229 -3712559 -3948977 -3123536 -1840809 814246 4495044 5556472 1918684 -2541375
37221 -2541375 -3245792 -2107684 -3727254 -6643558 -5561809 -1269118 -300553 -4151548
37213 -4151548 -6820087 -4837795 -1954464 -1185133 92249 3353199 4571633 1476606
37205 1476606 -1307936 220494 2537253 983460 -2167336 -2338346 -766903 -1220731
37197 -1220731 -2417007 -874851 1629152 889812 -1469390 -130794 4501260 6477316
37189F477316k507170k357219M60997n7966l186495l084409J102980L987670K251668
37180C087372j351382k587359n32473K506368L554920J649216j008225j714163
37172C604274j191022k144545l842363k489456J891827M178597K148217L31266
37164B486795K194768L799117M44611m754855n281429j354630R79181m44404j588371
37155c519217K79736K538533K028875m94307k447522k760961j653431L95905K150143
37146c482246K142956Q18234M10189J733084K769158J661141l22658n39638R84930
37137F175150J373327o73613k272921l15838L074126K530095k492375n711674
37129A686277k681276K400580K968606M3975k96661K309165J989513k476610m418148
$$ plain form
37189 6477316 3970146 1612927 2073924 2015958 -1170537 -4254946 -3151966 835704 3087372
37180 3087372 1735990 -851369 -1383842 1122526 4677446 6326662 5318437 3604274
37172 3604274 2413252 268707 -3573656 -6063112 -4171285 7312 2155529 2486795
37164 2486795 4681563 8480680 8925291 4170436 -1110993 -2465623 -1486442 -1930846 -3519217
37155 -3519217 -3239481 -700948 1327927 833620 -1613902 -4374863 -6028294 -5632389 -3482246
37146 -3482246 -1339290 -521056 -110867 1622217 4391375 6052516 5729858 5190220 6175150
37137 6175150 7548477 6874864 4601943 4286105 7360231 9890326 7397951 1686277
37129 1686277 -994999 1405581 4374187 4418162 4121501 6430666 8420179 5943569 1525421
37120A525421j66818M179061K211809k495752k431218J530296J747647l628771
37112B471675p461206m227246K350051N102131K708310k46273l42807J001451
37104A356086Q66671p06379j212817J00644P68745j025169l080374k221344N24712
37095d629225J311972k86446o07356J741944L259653J283784j654762j996545
37087a576981l16238P16343O21175K46804o87248k030416j790957M88534J654659
37078b674325k95790k315901j212559O25664n51274k669714j115384K557904K435134
37069e216245j374529j816095L712418Q220864N338325j122669l196698m39402
37061D105969P00906k416567m936952k590495J692409K380699m61048j708375
$$ plain form
37120 1525421 1358603 5537664 7749473 5253721 2822503 4352799 6100446 2471675
37112 2471675 -4989531 -9216777 -6866726 -1764595 943715 697442 354635 1356086
37104 1356086 2222757 1516378 303561 404205 1172950 147781 -2932593 -5153937 -4629225
37095 -4629225 -3317253 -3603699 -4211055 -2469111 790542 2074326 419564 -1576981
37087 -1576981 -1893219 -1176876 -555701 -308897 -996145 -3026561 -4817518 -4328984 -2674325
37078 -2674325 -2970115 -5286016 -6498575 -5872911 -6424185 -9093899 -10209283 -7651379 -5216245
37069 -5216245 -6590774 -8406869 -4694451 3526413 8864738 7742069 4545371 4105969
37061 4105969 4806875 2390308 -2546644 -5137139 -3444730 -1064031 -1525079 -3233454
37053c233454P60380K781093M10436l582302l354928J354385M616580K674017
37045B426207j462488l437096l345864l091419j673480K374254O160260N232750
37037C183124N91489j921772K51767L099941K152434j614946l827405k230915
37029c16283J563728M233624L411210n07874m403917n302878l361610q08526J470156
37020d022370M003539N736959M226153j77739l330510k405034K29567N35836j385386
37011C411015j809648P21149K838817Q65527l734843n537639j993978K820010
37003b419590L100328r49692l187185K9186M681641M752819M94689k603232j799484
36994B099480J72503M50914n9039L90524R47301k5715j837659k492082j587262
$$ plain form
37053 -3233454 -2473074 308019 718455 -2863847 -6218775 -4864390 -247810 2426207
37045 2426207 963719 -2473377 -5819241 -8910660 -10584140 -8209886 -2049626 3183124
37037 3183124 3774613 1852841 2104608 5204549 7356983 5742037 1914632 -316283
37029 -316283 1247445 5481069 8892279 8384405 3980488 -1322390 -4684000 -5492526 -4022370
37020 -4022370 -18831 5718128 9944281 9766542 6436032 4030998 4260565 4796401 3411015
37011 3411015 1601367 2322516 5161333 6026860 2292017 -3245622 -5239600 -2419590
37003 -2419590 680738 -268954 -3456139 -3426953 1254688 6007507 6502196 3898964 2099480
36994 2099480 2271983 2722897 2663858 3054382 4001683 3975968 2138309 -353773 -1941035
36985a941035l56100K58021M5396j049273k422462k445783k08626K703178L670480
36976a746204K306197R10865J276432K252332J545953o85984j661719J25606K365497
36967F688975J855772r47754k579031j613419l77155r00570k010211k009972j508029
36958c401394j320768j78518K533021M139143K424900n9817K15614J437062o95596
36949E093647m695498m366406J055859M618053K125424j480160m77422K507297
36941D380794J644998j924946k199843J345279K879870j22953l093404k070797
36933H38998N56689J059117M39168J408127K535727K74671m452912o354494k968190
36924f663099J805521K814095j42575l016889k874814n03086J789535K992754
$$ plain form
36985 -1941035 -2297135 -2039114 -1993718 -3042991 -5465453 -7911236 -8119862 -5416684 -1746204
36976 -1746204 559993 1470858 2747290 4999622 6545575 5859591 4197872 4323478 6688975
36967 6688975 8544747 7596993 5017962 3404543 3027388 2126818 116607 -1893365 -3401394
36958 -3401394 -4722162 -4900680 -2367659 1771484 4196384 4136567 4352181 5789243 5093647
36949 5093647 398149 -3968257 -2912398 1705655 3831079 2350919 1873497 4380794
36941 4380794 6025792 4100846 1901003 3246282 6126152 6003199 2909795 838998
36933 838998 1395687 2454804 2893972 4302099 6837826 7112497 2659585 -3694909 -6663099
36924 -6663099 -4857578 -2043483 -2186058 -5202947 -8077761 -8580847 -6791312 -3798558
36916c798558L461811L376718K314979M23299p48832M71973L404493M681954J767044
36907A5354881l346440n812669l997851j668556k320725l621223j089805L841519
36899b660869M446039j456062p067595n231877J936335O111562L407653k226218
36891b741032n190296l708553N88476M717031N652914K820041m22219n84936J015640
36882B147066N35675j794801k024271L15477Q91564j806007l157881k8932L398075
36873a524035K082270j546390j378703K606142M261148L68105n274401p317594
36865g723458m591573J31471L125460K284045q49941k026800N41216L345484K713637
36856c050459O00532J020123K742093J365336k250298k490696J369136L214686
$$ plain form
36916 -3798558 -336747 3039971 5354950 5778249 5029417 5501390 8905883 13587837 15354881
36907 15354881 12008441 6195772 2197921 529365 -1791360 -5412583 -6502388 -2660869
36899 -2660869 1785170 329108 -6738487 -11970364 -10034029 -3922467 -514814 -2741032
36891 -2741032 -7931328 -11639881 -11051405 -6334374 -681460 2138581 1716362 1131426 2147066
36882 2147066 2682741 887940 -1136331 -820854 70710 -1735297 -4893178 -4922110 -1524035
36873 -1524035 558235 -988155 -2366858 239284 4500432 4868537 -405864 -7723458
36865 -7723458 -12315031 -12183560 -9058100 -6774055 -7623996 -9650796 -9109580 -5764096 -3050459
36856 -3050459 -2449927 -1429804 1312289 2677625 427327 -2063369 -694233 2520453
36848B520453K05658k124810R51417N155120L842004j582995m182896j757032
36840C026919J392267J547222p79171l399193m237888j639645K999114M516950
36832C426575M47953l804151j862150L401259L661040j547648l798063M30361
36824C55176L781734J05405n295928m051255K229307M918246J304656k887466
36816D59875k839928N0348K399137K980218J882007j76261r99352R32591L146971
36807G835606J734608k507746m523862k261956P21795J248796Q65089J894119
36799E006449K886154J324050j611684k555003j067361p0605j350475l120434
36791e58909k661548M4164K159701J220364j910408l875088k844526o05152M37783
$$ plain form
36848 2520453 2726111 601301 1552718 6707838 10549842 8966847 4783951 3026919
36840 3026919 4419186 5966408 5187237 1788044 -2449844 -4089489 -1090375 3426575
36832 3426575 3874528 70377 -1791773 1609486 5270526 3722878 -75185 355176
36824 355176 4136910 4242315 -1053613 -5104868 -2875561 2042685 3347341 459875
36816 459875 -2380053 -2329705 69432 3049650 4931657 4755396 3756044 4688635 7835606
36807 7835606 9570214 7062468 2538606 276650 998445 2247241 3112330 5006449
36799 5006449 7892603 9216653 7604969 5049966 3982605 3912000 2561525 -558909
36791 -558909 -3220457 -3176293 -1016592 203772 -1706636 -5581724 -8426250 -9031402 -8593619
36782h593619Q87793K645335M572088L334166j088201m225485k842130J047538
36774d262515L538564L546827K200669O0961k474270l815808k889788j089220
36766e184580m11272p70877r99434j051249j140479k43259K076451L735090K769784
36757a219825P69566O91794K143483K152958K06125j114373q01139j024301k867098
36748a062810l873786j999627O43845Q07681p65099m52707K358952L798675J199209
36739F54333k317634j773337K168670L440716n42266m163258j465790M071684
36731G3118L625014l437777p261103j644622O149729N568428j948574n595132
36723d470919j118977M267227L783409J82032m19052K021266K903475M90119k495114
$$ plain form
36782 -8593619 -7705826 -5060491 -488403 2845763 1757562 -2467923 -5310053 -4262515
36774 -4262515 -723951 2822876 5023545 5084506 2610236 -1205572 -4095360 -5184580
36766 -5184580 -5595852 -6366729 -7366163 -8417412 -9557891 -9801150 -7724699 -3989609 -1219825
36757 -1219825 -450259 241535 2385018 4537976 4744101 3629728 2828589 1804288 -1062810
36748 -1062810 -4936596 -6936223 -6292378 -5484697 -6249796 -6702503 -4343551 -544876 654333
36739 654333 -1663301 -3436638 -1267968 2172748 1630482 -2532776 -3998566 73118
36731 73118 3698132 260355 -7000748 -8645370 -2495641 3072787 1124213 -4470919
36723 -4470919 -5589896 -1322669 2460740 2642772 2223720 4244986 7148461 7638580 5143466
36714E143466l208462j334254J652564L547862K636403m76302l166750l788345
36706A006182k816446o89219K575808M687747K002941m422367p712536l915460
36698i283350J625299J538330k788365l856083J04310L216278K323567J643716
36690e476298M164996N335612O60512n385577m804214J971100O390783L774685
36682F631599j270115k721444r28742K29463k98709r51240j376330k105303j921947
36673d712768N88847L441248K938054o68486k622257m1447L937839M338032P23894
36664G922956k853964l273368j421330O5120K44045J94428P09831Q18043p47253
36655A658508k874575k331991K061810O556847O012577K95876n212874o069876
$$ plain form
36714 5143466 1935004 600750 2253314 5801176 8437579 7961277 4794527 1006182
36706 1006182 -1810264 -2499483 76325 4764072 6767013 2344646 -5367890 -9283350
36698 -9283350 -7658051 -6119721 -8908086 -12764169 -12659859 -9443581 -7120014 -5476298
36690 -5476298 -1311302 4024310 4684822 -700755 -5504969 -3533869 2856914 6631599
36682 6631599 5361484 2640040 1711298 1940761 1642052 690812 -685518 -2790821 -4712768
36673 -4712768 -4123921 -682673 2255381 1586895 -1035362 -1076809 2861030 7199062 7922956
36664 7922956 5068992 1795624 374294 439414 683459 877887 1587718 2405761 1658508
36655 1658508 -1216067 -3548058 -1486248 5070599 11083176 11379052 6166178 96302
36647I6302l327722o63246L98750N08201M8235p65342q59878J69133P70854m5311
36637c670024m54931J219489K927722J708811j187885k040206p44215n14141j516245
36628d271625j30016M058324N903556K319540k305512k377756O71270J188115
36620E055896j847533l891504k116106J107242K565700K114154R63427p69945
36612C181331k919133l785360j932411J349727K981368J537777j020265j500019
36604b106985N89678J947779m31533m374459m244289J296360O088697L978716
36596B743964k504626n115956r14879M339872M765252J714272j05499j01670j132778
36587C687952l247372k888767J185439M993831M203992k91990l764599l547805
$$ plain form
36647 96302 -3231420 -3894666 -3495916 -2987715 -2939480 -3704822 -4564700 -4395567 -3624713 -3670024
36637 -3670024 -4124955 -2905466 22256 1731067 543182 -1497024 -2241239 -2755380 -4271625
36628 -4271625 -4401641 -343317 5560239 7879779 5574267 3196511 3867781 5055896
36620 5055896 3208363 -683141 -2799247 -1692005 873695 2987849 3951276 3181331
36612 3181331 262198 -3523162 -5455573 -4105846 -1124478 413299 -606966 -2106985
36604 -2106985 -1517307 430472 -1061 -4375520 -8619809 -7323449 -1234752 2743964
36596 2743964 239338 -4876618 -5791497 -1451625 3313627 5027899 4922400 4820730 3687952
36587 3687952 440580 -2448187 -1262748 3731083 7935075 7643085 3878486 330681
36579C30681j530200q21938j668011j685573N15749L276689L900423J871498r19992
36570C269326k773727l609157l611026k133827Q36858L312788L144921Q37614
36562g26230j083956j363738j040484j188955j533967j750532k116238j920600
36554a2724700O33354N160086P554560M397235j932413n419726l758055p45009
36546f834668m89576j894386j017813K614985M880484K607163j762264k771861
36538d667936J102187N007592L627440j609357l973223m03324M317070M390093
36530G790542P89613j497147j548912k574055m825517m556302j026040J422831
36522f024987O58758M65524L416875N447275K538725j743425j651602J149148
$$ plain form
36579 330681 -1199519 -2021457 -3689468 -5375041 -4859292 -1582603 2317820 4189318 3269326
36570 3269326 495599 -3113558 -6724584 -8858411 -8021553 -4708765 -1563844 -726230
36562 -726230 -1810186 -3173924 -4214408 -5403363 -6937330 -8687862 -10804100 -12724700
36554 -12724700 -12091346 -6931260 623300 5020535 3088122 -2331604 -6089659 -6834668
36546 -6834668 -7324244 -9218630 -10236443 -7621458 -2740974 -133811 -1896075 -4667936
36538 -4667936 -3565749 1441843 5069283 3459926 -513297 -916621 3400449 7790542
36530 7790542 8580155 7083008 5534096 2960041 -1865476 -6421778 -7447818 -6024987
36522 -6024987 -5366229 -4900705 -1483830 3963445 6502170 4758745 3107143 4256291
36514D256291N33541l416270m450526q33156J677789o19076l560586k037163K568424
36505e880732N462292M920487K307934r19408k955028j544118K432016M016516
36497G839959L34482m673252n264206j562450J618418J899672R86154J18640j479638
36488a82221l227672k556582P17469K755847Q68815j956128p46503M121651O603135
36479F397811K891792l121030m790803j551594Q58810r05648l160733j431067
36471d812462K507568L724938J628494l44879q75518j410601j547797M93161K732159
36462B095063R10561l754787m601498M19664M861212L286172j069745k363501
36454b16859p43257M4723o33186j105026j328876j234220J138997N003014M723299
$$ plain form
36514 4256291 4789832 1373562 -3076964 -3910120 -2232331 -2851407 -6411993 -8449156 -5880732
36505 -5880732 -418440 4502047 6809981 5890573 2935545 1391427 3823443 7839959
36497 7839959 8174441 3501189 -1763017 -3325467 -1707049 192623 1178777 1297417 -182221
36488 -182221 -3409893 -5966475 -5249006 -2493159 -1624344 -3580472 -4326975 -205324 6397811
36479 6397811 9289603 6168573 1377770 -173824 684986 -220662 -3381395 -4812462
36471 -4812462 -2304894 1420044 3048538 2703659 1828141 417540 -1130257 -637096 2095063
36462 2095063 3005624 -749163 -5350661 -4930997 -69785 3216387 2146642 -216859
36454 -216859 -960116 -915393 -1548579 -2653605 -3982481 -5216701 -4077704 925310 5648609
36445E648609j757793o985529l885460K526866K414594k872314k977707L800102
36437d088632O952274Q42956n665311k803757N318238P357036R33117n717508
36429C128413n928193j656285J405261Q74382j137986j448899M03269J576888
36421b783150j31188k537216j855457J310486K712092J411954J134020L336626
36413B598167M228149J378881j679965j222661N60080l72769l074518l523662
36405a108298j079170J330603J905655J244543L71816M10839K334753M472617
36397I883358K971082k353209n993153m252951j039451j425088l209955j149439
36389f568806L315520L999040L37166j873670k83639Q70588j169953l270365k373624
$$ plain form
36445 5648609 3890816 -3094713 -6980173 -4453307 -2038713 -4911027 -7888734 -4088632
36437 -4088632 2863642 3706598 -1958713 -4762470 555768 7912804 8845921 3128413
36429 3128413 -2799780 -4456065 -3050804 -2176422 -3314408 -4763307 -4360038 -2783150
36421 -2783150 -2914338 -5451554 -7307011 -5996525 -3284433 -1872479 -738459 2598167
36413 2598167 6826316 8205197 6525232 5302571 5862651 5489882 2415364 -1108298
36405 -1108298 -2187468 -856865 1048790 2293333 2665149 3075988 5410741 9883358
36397 9883358 12854440 10501231 4508078 255127 -784324 -2209412 -5419367 -6568806
36389 -6568806 -3253286 745754 1082920 -790750 -1074389 -203801 -1373754 -4644119 -7017743
36380g017743n8317J451832K672899L725068K766594K32364j85101K338571L435767
36371I361934M96471k930047l339010k866148m083250m029765O27369O212676
36363e49770O516913K295271m47749k08131r84760l785064m294550n55319L198166
36354A185007K961118L98142q90185n91650l27412k51931J62838L12088j77494
36345B780521k49935M77178M16227j315175k788282j685815J619736M765469N764910
36336I784834L929599L04588k295497k011560r81478k606148n608989n144226
36328d628877p46422K180075J042115L29516L370157N741581K588305k602557
36320G273893l557261j471580j719769l398496j299579L196230L093689j892172
$$ plain form
36380 -7017743 -7076060 -5624228 -2951329 773739 3540333 3772697 3587596 5926167 9361934
36371 9361934 9858405 6928358 3589348 723200 -3360050 -7389815 -6762446 -549770
36363 -549770 5967143 8262414 7814665 7606534 6621774 2836710 -1457840 -2013159 1185007
36354 1185007 4146125 4544267 3654082 3062432 2735020 2483089 2645927 2958015 2780521
36345 2780521 2530586 3007764 3423991 2108816 -679466 -2365281 -745545 4019924 9784834
36336 9784834 13714433 14019021 11723524 9711964 8730486 6124338 515349 -4628877
36328 -4628877 -5375299 -3195224 -2153109 -1823593 1546564 7288145 9876450 7273893
36320 7273893 3716632 2245052 525283 -2873213 -4172792 -976562 2117127 224955
36312B24955l813501M98562M204954J894805k256728k555530n28028j08375n58019
36303b996905K6521j89863k351518k829750N53233L390214J992639N33487L705486
36294A833544P200154M013656l362196o088452k216910J923975K368251J173755
36286F845777K4202j781327k952541j261019J081403J98038j940033n14078K458423
36277B158845M92064n211484n928818N73824O095990N017865J715175J082531
36269E995992R21167j220774k200172r1596Q00416k181299m182665j075311L078840
36260a55402L178617J264634R43592J41449l237703m700227m84977M045213K200134
36251C195330k604978k534074J504903K185934j531305l834594k528786p75459
$$ plain form
36312 224955 -3588546 -3089984 1114970 3009775 753047 -1802483 -2330511 -2438886 -2996905
36303 -2996905 -2970384 -3160247 -5511765 -8341515 -7788282 -4398068 -2405429 -1871942 1833544
36294 1833544 9033698 13047354 9685158 3596706 1379796 3303771 5672022 6845777
36286 6845777 6869979 5088652 2136111 875092 1956495 2154533 214500 -299578 2158845
36277 2158845 2650909 -2560575 -8489393 -7915569 -1819579 3198286 4913461 5995992
36269 5995992 6917159 5696385 3496213 3404617 4205033 2023734 -2158931 -3234242 -155402
36260 -155402 3023215 4287849 5231441 5372890 2135187 -2565040 -3050017 995196 3195330
36251 3195330 590352 -1943722 -438819 1747115 215810 -3618784 -6147570 -6923029
36243f923029N16097L142601N282196L364254l93127p69568R77085p15130m804019
36234c22640m559463N52328L849883L059051K701395L450201J20603o673052p925660
36225e747354k98881P147034O271306J092488p92102J08928n37651j873885j054900
36216D314983o3451j684765l071347m96073L277641L148994j90397k567974l366139
36207f98528m086721l373236J25349L128538K317970L44207R06769J607358j015496
36198g43790l217536L27426N569100L905837l245384n519963p3293L882861J17433
36189A002691n092268l739421J803942M000690J563896r82963j143901J69149
36181b418185K211123M082379L228179q88887l784119j427995L142621L683403
$$ plain form
36243 -6923029 -6406932 -3264331 2017865 5382119 4988992 4219424 5196509 4481379 -322640
36234 -322640 -4882103 -4329775 -479892 2579159 5280554 8730755 8851358 2178306 -5747354
36225 -5747354 -6046235 1100799 7372105 8464593 7672491 7781419 7243768 5369883 4314983
36216 4314983 4251532 2566767 -504580 -1000653 2276988 5425982 5235585 2667611 -698528
36207 -698528 -4785249 -8158485 -8033136 -4904598 -2586628 -2242421 -1335652 271706 -743790
36198 -743790 -3961326 -3633900 1935200 5841037 2595653 -2924310 -2997603 885258 1002691
36189 1002691 -4089577 -7828998 -6025056 -2024366 -460470 -1443433 -2587334 -2418185
36181 -2418185 -207062 3875317 7103496 6214609 2430490 1002495 4145116 7828519
36173G828519j90533l119715k540784j410432j737247j072052K153880M477832
36165D389468K334607j850804k672607M96962K760472P81796k789746l268548
36157A81600q5104K792600J748566k446895n366472l330842K529212O675198M618450
36148G316313j847970o187200m473119K38125K027765o97975l952684l606892
36140a1183637j94886K274502J384276p17124J8860L860763N866601K104434l985784
36131e71995n268423r86733J908573n57276l084238P3946N138644M498792r68914
36122A82376l408616n37015J852551M84536q14031O40357J613394N4539l98837
36113c30746K246875L179251j194719n742236l985040J270766K105914k306636
$$ plain form
36173 7828519 7637986 4518271 1977487 567055 -1170192 -2242244 -88364 4389468
36165 4389468 6724075 4873271 2200664 2697626 5458098 6239894 3450148 181600
36157 181600 96496 2889096 4637662 2190767 -3175705 -6506547 -3977335 2697863 7316313
36148 7316313 5468343 -718857 -5191976 -4953851 -2926086 -3624061 -7576745 -11183637
36140 -11183637 -11378523 -9104021 -7719745 -8436869 -8418009 -4557246 1309355 3413789 -571995
36131 -571995 -5840418 -6827151 -4918578 -5475854 -8560092 -8486146 -3347502 1151290 182376
36122 182376 -3226240 -3763255 -1910704 -1426168 -2240199 -1599842 13552 68091 -330746
36113 -330746 1916129 5095380 3900661 -1841575 -5826615 -4555849 -2449935 -4756571
36105d756571n079688k330148K153692L522128J863293K96952O31144K109953
36097a589245K628480J089967o25485L84240L310628L946880J201196r42863m12403
36088H991395p21513l680695m294324Q71519N534602K099255n571088p138700
36080c909549j501156K429797L95167j923587l8115K543809K209543J513329K789414
36071D508652K577528j908868o233746m759048M77369K732188K34248k301827
36063d673504r89263K611452M467163K989609J96491j090633n93166l91463j176302
36054A350384q63475J219035J610005k034798n438190k835776L715234O345717
36046C068136K588721j758164j837942M32240J386678O84438o69422k158372j921372
$$ plain form
36105 -4756571 -9836259 -12166407 -10012715 -6490587 -4627294 -4330342 -3699198 -1589245
36097 -1589245 1039235 2129202 1503717 1887957 5198585 9145465 10346661 9403798 8991395
36088 8991395 8269882 4589187 294863 1166382 6700984 8800239 3229151 -3909549
36080 -3909549 -5410705 -2980908 -2585741 -4509328 -4547443 -2003634 205909 1719238 4508652
36071 4508652 7086180 5177312 -1056434 -5815482 -5338113 -2605925 -2371677 -4673504
36063 -4673504 -5662767 -3051315 1415848 4405457 4601948 3511315 2918149 2526686 1350384
36054 1350384 486909 1705944 3315949 1281151 -4157039 -6992815 -3277581 3068136
36046 3068136 5656857 3898693 2060751 2492991 3879669 4564107 3894685 1736313 -185059
36037a85059J604805M905803K379261m294275o706462k026290K727704K034446
36029D39933m91423m85728o98693l943095n574947j116484M526003M254989N04956
36020b584489M77556L276231J984154l119394l914742K144693P287378M823778
36012A0375165j956631n664845m234323j087219M74939J23607l54200P00157K476356
36003H53006K184721o92490k658612j239981R05510N63310l53712J312151L174683
35994D048586Q05472l737813m144006j16100K194574P05761M33636L674938M863973
35985H729021l31398o847301o757757k00388N495433N390802J182432k746658
35977C914186l639607j309353K150674L579539J636309j549523k727979j089316
$$ plain form
36037 -185059 1419746 6325549 8704810 4410535 -2295927 -4322217 -1594513 439933
36029 439933 -51490 -537218 -1235911 -5179006 -10753953 -11870437 -7344434 -3089445 -2584489
36020 -2584489 -2106933 1169298 3153452 34058 -3880684 -1735991 5551387 10375165
36012 10375165 8418534 2753689 -1480634 -2567853 -2092914 -1969307 -2323507 -1623350 853006
36003 853006 3037727 2345237 -313375 -1553356 -647846 -84536 -438248 873903 4048586
35994 4048586 4854058 1116245 -3027761 -3143861 -949287 -243526 190110 3865048 8729021
35985 8729021 8397623 1550322 -5207435 -5407823 87610 5478412 6660844 3914186
35977 3914186 274579 -1034774 1115900 4695439 6331748 4782225 2054246 964930
35969I64930J298686J894737j07902l164232m506014k757729L25690J714926P17275
35960c619633n60161m28681K97926M2426r91730j071077N71491K291068J862371
35951a606000n2638J45201L711084N942936J860903n183256o435885n77914L316302
35942A120733n48013n283328k335875M320891M520531j389141l310597J913762
35934i91037N957152L231681r36682p65737N22008k074608n772042m860137l51173
35925f040575K218144J638261J384272K874142L798929K406208o33183l876365
35917C769833n543719l695881J016347M403050L613268J240864J283362K804874
35909H891998J644535k553111n337052l807630l60770J084937p183j217684r36407
$$ plain form
35969 964930 2263616 4158353 4050451 886219 -3619795 -6377524 -6051834 -4336908 -3619633
35960 -3619633 -4179794 -4608475 -4310549 -4268123 -5259853 -6330930 -5759439 -3468371 -1606000
35951 -1606000 -1658638 -1513437 2197647 8140583 10001486 4818230 -1617655 -2195569 1120733
35942 1120733 572720 -4710608 -7046483 -2725592 1794939 405798 -2904799 -991037
35934 -991037 4966115 8197796 7261114 6495377 7017385 4942777 -829265 -5689402 -6040575
35925 -6040575 -3822431 -2184170 -799898 2074244 5873173 8279381 7646198 3769833
35917 3769833 -1773886 -5469767 -4453420 -50370 3562898 4803762 6087124 8891998
35909 8891998 10536533 7983422 2646370 -1161260 -1522030 -437093 -444276 -1661960 -2598367
35900b598367K0305K43888j69753j49219K53577k51732j785532k456664j135885
35891h029382O25209J137981J151209J689523J576640J03053l77609J487754K136608
35882A500986j402871m713263j816034L924472L540493k880287n216536O95064
35874f367976O275092M090564j042390j549651P24167J51003j715277k29078K294859
35865B631313M52574l606876l159828J329458K876868k20970k235113q9638K697550
35856F75338L344889L439704L475136Q47601m167545o580851l766709N63594K061764
35847a07079J035333k86793j562306k758757k275933N67150L511774L963279K070493
35838D157161O0185k99316O16506K58662l162200o605957m249934L719076Q656474
$$ plain form
35900 -2598367 -2578062 -2334174 -2503927 -2653146 -2399569 -2651301 -4436833 -6893497 -8029382
35891 -8029382 -7404173 -6266192 -5114983 -3425460 -1848820 -1745767 -2123376 -635622 1500986
35882 1500986 98115 -4615148 -6431182 -2506710 1033783 -1846504 -7063040 -6367976
35874 -6367976 -92884 3997680 2955290 1405639 2129806 2280809 565532 336454 2631313
35865 2631313 3083887 -522989 -3682817 -2353359 523509 302539 -1932574 -2022212 675338
35856 675338 4020227 7459931 10935067 11782668 7615123 1034272 -2732437 -2168843 -107079
35847 -107079 928254 641461 -920845 -3679602 -5955535 -5388385 -1876611 2086668 4157161
35838 4157161 4217346 3918030 4534536 4793198 1630998 -4974959 -9224893 -5505817 3150657
35829C150657M631604k404153l525979o29393j732289n404776k307827P201883
35821a020273J0433860J831220p215256n403239K096046L730761l62595j603635
35813B486889J260486J640472j852772l109988K58210K923090J111884j724114
35805B994157j291495J349913K882036K600061J478701l19227k531303l608527
35797C554316k410769N1644J506022M48565k472453m500263l380080o65343k28369
35788h096730k324992k504444J272697M516803L111830L07419J340765M446191
35780B069539M024804M91747p94874N56232m52851m196891m699925j63327L184006
35771A8460J453134o27129J162499K605124r23941m747943j736431N140521O318581
$$ plain form
35829 3150657 7782261 5378108 1852129 1222736 -509553 -5914329 -8222156 -1020273
35821 -1020273 9413587 11244807 4029551 -1373688 722358 4453119 4090524 2486889
35813 2486889 3747375 5387847 3535075 425087 683297 3606387 4718271 2994157
35805 2994157 1702662 3052575 5934611 8534672 10013373 9694146 7162843 3554316
35797 3554316 1143547 1195191 2701213 3149778 677325 -3822938 -7203018 -7868361 -8096730
35788 -8096730 -10421722 -12926166 -11653469 -7136666 -4024836 -3717417 -2376652 2069539
35780 2069539 6094343 6586090 5791216 6347448 5894597 1697706 -3002219 -3165546 18460
35771 18460 1471594 844465 2006964 4612088 3688147 -1059796 -2796227 2344294 8662875
35762H662875J17272n217665m358967j483895j729270l230592j739817J887554
35754g092505L522934K232283P61790R25611J706083J412532l76467k624818l366172
$$ plain form
35762 8662875 8780147 3562482 -796485 -2280380 -4009650 -7240242 -8980059 -7092505
35754 -7092505 -3569571 -1337288 -575498 350113 2056196 3468728 3092261 467443 -2898729
$$ [...]
##END NTUPLES=NMR SPECTRUM
##END=
