##TITLE=31Pdec_SR80 Gly3
 CDCl3, 24 sc
 31.08.2021
##JCAMPDX= 6.0         $$ Bruker NMR JCAMP-DX V2.0
##DATA TYPE= NMR SPECTRUM
##DATA CLASS= NTUPLES
##ORIGIN= UXNMR, Bruker Analytische Messtechnik GmbH
##OWNER= root
$$ XWIN-NMR		Version 3.5
$$ Tue Aug 31 13:34:29 2021 Russian Standard Time (UT+4h)  she@DPX200
##.OBSERVE FREQUENCY= 81.013821
##.OBSERVE NUCLEUS= ^31P
##.ACQUISITION MODE= SIMULTANEOUS
##.ACQUISITION SCHEME= undefined
##.AVERAGES= 24
##.DIGITISER RES= 16
##SPECTROMETER/DATA SYSTEM= spect
##.PULSE SEQUENCE= zgpg30
##.SOLVENT NAME= CD2Cl2
##.SHIFT REFERENCE= (INTERNAL, CD2Cl2, 0, 248.564)
##AUDIT TRAIL= $$ (NUMBER, WHEN, WHO, WHERE, WHAT)
$$ ##TITLE= Audit trail, XWIN-NMR		Version 3.5
$$ ##JCAMPDX= 5.01
$$ ##ORIGIN= Bruker BioSpin GmbH
$$ ##OWNER= she
$$ F:/spectra/data/she/nmr/P31/1/pdata/1/auditp.txt
$$ ##AUDIT TRAIL=  $$ (NUMBER, WHEN, WHO, WHERE, WHAT)
(   1,<2021-08-31 13:33:09.71 +0400>,<she>,<DPX200>,
      <created by zg, POWCHK disabled, PULCHK disabled
       configuration hash MD5:
       00 E9 B6 7A A2 85 ED C7 34 08 36 98 17 FE 4E 26
       data hash MD5: 32K
       C1 5C 9E C2 5E 93 88 D2 37 38 13 D2 24 D8 90 98>)
(   2,<2021-08-31 13:33:15.56 +0400>,<she>,<DPX200>,
      <Start of raw data processing
       efp BC_mod = 2 LB = 1 FT_mod = 6 PKNL = 1 PHC0 = -7751.712 PHC1 = 130.2732 SI = 64K 
       data hash MD5: 64K
       B3 2D 30 CF 05 13 72 B2 80 6D F9 79 D1 69 42 84>)
(   3,<2021-08-31 13:33:55.78 +0400>,<she>,<DPX200>,
      <pk PHC0 = 72.21741 PHC1 = -194 
       data hash MD5: 64K
       01 2C F0 67 38 A4 EC C6 3B A9 BE 19 56 87 ED 18>)
(   4,<2021-08-31 13:34:05.26 +0400>,<she>,<DPX200>,
      <abs ABSG = 5 
       data hash MD5: 64K
       26 F8 B8 87 EF EF 45 73 7E A1 7F 5C 47 21 63 24>)
$$ ##END=
$$ 
$$ hash MD5
$$ F7 9D 45 58 B0 66 B0 45 A9 62 EC 25 07 3D EE 46
##$RELAX= 
##$RELAX= 
##$RELAX= 
##$RELAX= 
##$RELAX= 
##$RELAX= 
##$RELAX= 
##$RELAX= 
$$ Bruker specific parameters
$$ --------------------------
##$DU= <F:/spectra>
##$EXPNO= 1
##$NAME= <P31>
##$PROCNO= 1
##$TYPE= <nmr>
##$USER= <she>
##$AMP= (0..31)
100 100 100 100 100 100 100 100 100 100 100 100 100 100 100 100 100 100 
100 100 100 100 100 100 100 100 100 100 100 100 100 100 
##$AQSEQ= 0
##$AQ_mod= 1
##$AUNM= <au_zg>
##$AUTOPOS= <>
##$BF1= 81.014009
##$BF2= 200.13
##$BF3= 200.13
##$BF4= 200.13
##$BF5= 200.13
##$BF6= 200.13
##$BF7= 200.13
##$BF8= 200.13
##$BYTORDA= 1
##$CFDGTYP= 0
##$CFRGTYP= 5
##$CHEMSTR= <none>
##$CNST= (0..31)
1 1 145 1 1 1 1 1 1 1 1 1 1 1 1 1 1 1 1 1 1 1 1 1 1 1 1 1 1 1 1 1 
##$CPDPRG= <waltz16>
##$CPDPRG1= <>
##$CPDPRG2= <waltz16>
##$CPDPRG3= <>
##$CPDPRG4= <mlev>
##$CPDPRG5= <mlev>
##$CPDPRG6= <mlev>
##$CPDPRG7= <mlev>
##$CPDPRG8= <mlev>
##$CPDPRGB= <>
##$CPDPRGT= <>
##$D= (0..31)
0 1 0 0 0 0 0 0 0 0 0 0.03 2e-05 3e-06 0 0 0 0 0 0 0 0 0 0 0 0 0 0 0 0 
0 0 
##$DATE= 1630402389
##$DBL= (0..7)
120 120 120 11 120 120 24 19 
##$DBP= (0..7)
150 150 150 150 150 150 150 150 
##$DBP07= 0
##$DBPNAM0= <>
##$DBPNAM1= <>
##$DBPNAM2= <>
$$ [...]
##$SUBNAM3= <"">
##$SUBNAM4= <"">
##$SUBNAM5= <"">
##$SUBNAM6= <"">
##$SUBNAM7= <"">
##$SUBNAM8= <"">
##$SUBNAM9= <"">
##$SW= 501.771253377433
##$SWIBOX= (0..15)
0 1 3 0 0 0 0 0 0 0 0 0 0 0 0 0 
##$SW_h= 40650.406504065
##$TD= 32768
##$TD0= 1
##$TE= 0
##$TE2= 300
##$TE3= 300
##$TEG= 300
##$TL= (0..7)
0 120 53 12 22 120 120 120 
##$TP= (0..7)
150 150 150 150 150 150 150 150 
##$TP07= 0
##$TPNAME0= <>
##$TPNAME1= <>
##$TPNAME2= <>
##$TPNAME3= <>
##$TPNAME4= <>
##$TPNAME5= <>
##$TPNAME6= <>
##$TPNAME7= <>
##$TPOAL= (0..7)
0.5 0.5 0.5 0.5 0.5 0.5 0.5 0.5 
##$TPOFFS= (0..7)
0 0 0 0 0 0 0 0 
##$TUNHIN= 0
##$TUNHOUT= 0
##$TUNXOUT= 0
##$USERA1= <user>
##$USERA2= <user>
##$USERA3= <user>
##$USERA4= <user>
##$USERA5= <user>
##$V9= 5
##$VALIST= <valist>
##$VCLIST= <CCCCCCCCCCCCCCC>
##$VD= 0
##$VDLIST= <DDDDDDDDDDDDDDD>
##$VPLIST= <PPPPPPPPPPPPPPP>
##$VTLIST= <TTTTTTTTTTTTTTT>
##$WBST= 1024
##$WBSW= 4
##$XGAIN= (0..3)
0 0 0 0 
##$XL= 0
##$YL= 0
##$YMAX_a= 5740
##$YMIN_a= -3683
##$ZGOPTNS= <>
##$ZL1= 120
##$ZL2= 120
##$ZL3= 120
##$ZL4= 120
##$ABSF1= 248.5645
##$ABSF2= -253.2056
##$ABSG= 5
##$ABSL= 3
##$ALPHA= 0
##$AQORDER= 0
##$ASSFAC= 0
##$ASSFACI= 0
##$ASSFACX= 0
##$ASSWID= 0
##$AUNMP= <proc_1d>
##$AZFE= 0.1
##$AZFW= 0.5
##$BCFW= 0
##$BC_mod= 2
##$BYTORDP= 0
##$COROFFS= 0
##$CY= -3
##$DATMOD= 1
##$DC= 0
##$DFILT= <>
##$DTYPP= 0
##$F1P= 0
##$F2P= 0
##$FCOR= 1
##$FTSIZE= 65536
##$FT_mod= 6
##$GAMMA= 0
##$GB= 0
##$INTBC= 1
##$INTSCL= 5.30512e-09
##$ISEN= 30
##$LB= 1
##$LEV0= 0
##$LPBIN= 0
##$MAXI= 10000
##$MC2= 0
##$MEAN= 0
##$ME_mod= 0
##$MI= 50
##$NCOEF= 0
##$NC_proc= -8
##$NLEV= 6
##$NOISF1= 182.463
##$NOISF2= 159.3651
##$NSP= 0
##$NTH_PI= 0
##$NZP= 0
##$OFFSET= 248.5645
##$PC= 4
##$PHC0= -7679.495
##$PHC1= -63.72681
##$PH_mod= 1
##$PKNL= yes
##$PPARMOD= 0
##$PSCAL= 0
##$PSIGN= 0
##$REVERSE= no
##$SF= 81.014009
##$SI= 65536
##$SIGF1= 159.3651
##$SIGF2= -187.1042
##$SINO= 113.3802
##$SIOLD= 16384
##$SREGLST= <1H.CDCl3>
##$SSB= 0
##$STSI= 65536
##$STSR= 0
##$SW_p= 40650.406504065
##$SYMM= 0
##$S_DEV= 0
##$TDeff= 32768
##$TDoff= 0
##$TI= <>
##$TILT= no
##$TM1= 0
##$TM2= 0
##$TOPLEV= 0
##$USERP1= <user>
##$USERP2= <user>
##$USERP3= <user>
##$USERP4= <user>
##$USERP5= <user>
##$WDW= 1
##$XDIM= 65536
##$YMAX_p= 425164070
##$YMIN_p= -43013388
$$ End of Bruker specific parameters
$$ ---------------------------------
##NTUPLES= NMR SPECTRUM
##VAR_NAME=  FREQUENCY,     SPECTRUM/REAL,   SPECTRUM/IMAG
##SYMBOL=    X,             R,               I
##VAR_TYPE=  INDEPENDENT,   DEPENDENT,       DEPENDENT
##VAR_FORM=  AFFN,          ASDF,            ASDF
##VAR_DIM=   65536,         65536,           65536
##UNITS=     HZ,            ARBITRARY UNITS, ARBITRARY UNITS
##FACTOR=    0.620285442955139, 1,           1
##FIRST=     20137.2065510759, 0,            0
##LAST=      -20513.1999529892, 0,           0
##MIN=       -20513.1999529892, -43013388,   0
##MAX=       20137.2065510759, 425164070,    0
$$ Real data points
##PAGE= N=1
##DATA TABLE= (X++(R..R)), XYDATA
$$ [...]
13033C563192n158910k912793K007447L827122L118390L199757K520585j925097
$$ 3563192 -1595718 -4508511 -2501064 1326058 4444448 7644205 10164790 8239693
13025H239693o872375o328338j114270K470693K335794J659518J193522j407558
$$ 8239693 1367318 -4961020 -6075290 -3604597 -1268803 390715 1584237 176679
13017A76679m286812j981724M585634O861597J120012n031347l595425K356057
$$ 176679 -4110133 -6091857 -1506223 5355374 6475386 1444039 -2151386 204671
13009B04671M258341P45874k020469n57643J951193J875770J01025o98597l62818
$$ 204671 4463012 5208886 3188417 2630774 4581967 6457737 6558762 5860165 5497347
13000E497347p52841k305526k883378o42436K556723K462967j701051m947939
$$ 5497347 4744506 2438980 -444398 -1086834 1469889 3932856 2231805 -2716134
12992b716134k967703J216846J568118j387756j504030K328434L790526k63074
$$ -2716134 -5683837 -4466991 -2898873 -4286629 -5790659 -3462225 328301 65227
12984F5227m130957k514154J113208J091044j104134r18762N27492n16462k079053
$$ 65227 -4065730 -6579884 -5466676 -4375632 -5479766 -6398528 -5871036 -6387498 -8466551
12975h466551L80636M509206L659778j534217l158291J335121N161657L469749
$$ -8466551 -8085915 -3576709 83069 -1451148 -4609439 -3274318 1887339 5357088
12967E357088M28556Q52991J790190j718873p366409q414193l414950K284384
$$ 5357088 5785644 6638635 8428825 6709952 -656457 -9070650 -12485600 -10201216
12959a0201216L923520K195433P60419J523140K875133J967299j115032k487057
$$ -10201216 -6277696 -4082263 -3321844 -1798704 1076429 3043728 1928696 -558361
12951e58361K22800L220671J294030l610509m276440O50194M033818J276994k696292
$$ -558361 -335561 2885110 4179140 568631 -3707809 -3057615 976203 2253197 -443095
12942d43095j805818J830096K617669P22255J31087J174012J587157K034933L822523
$$ -443095 -2248913 -418817 2198852 2921107 3052194 4226206 5813363 7848296 11670819
12933A1670819L829463r63941o226583n630706j659912j925002n603760m249437
$$ 11670819 15500282 14536341 8309758 2679052 1019140 -905862 -6509622 -10759059
12925a0759059K749911N293071p04467n227611p7934P239998N554300j783457
$$ -10759059 -8009148 -2716077 -3420544 -8648155 -8726089 -1486091 4068209 2284752
12917B284752k821071L357766N930854N06443m439213j936728L068807K583144
$$ 2284752 -536319 2821447 8752301 9258744 4819531 2882803 5951610 8534754
12909H534754k751540o378150n184931j185494K678684M329143K732527n26441
$$ 8534754 5783214 -594936 -5779867 -6965361 -4286677 42466 2774993 2248552
12901B248552j937660l70113J679059K288077K194709J581967q14698l637502
$$ 2248552 310892 -59221 1619838 3907915 6102624 7684591 6869893 3232391
12893C232391k957523R97544K478236r61226l870328j735795J291413l48542l785402
$$ 3232391 274868 1272412 3750648 2789422 -1080906 -2816701 -1525288 -1873830 -5659232
12884e659232k789409J232801J948399o54120q49250K023879K607522k89877j578927
$$ -5659232 -8448641 -7215840 -5267441 -5921561 -6770811 -4746932 -2139410 -2429287 -4008214
12875d008214O53368K217682J346864J494545K943260O37390n613925p782684
$$ -4008214 -3354846 -1137164 209700 1704245 4647505 5284895 -329030 -8111714
12867h111714k055547L740252K048376k610358j898545K709629L930019J483858
$$ -8111714 -10167261 -6427009 -4378633 -6988991 -8887536 -6177907 -2247888 -764030
12859g64030Q39173K154310P48718k614661j969869K849048M752804P80534l349533
$$ -764030 75143 2229453 2978171 363510 -1606359 1242689 5995493 6776027 3426494
12850C426494k820408n20376p17171k150769j659218P4361P02962P02548J715427
$$ 3426494 606086 85710 -631461 -2782230 -4441448 -4367087 -3664125 -2961577 -1246150
12841a246150K809478J894634n78527k109877j566673k04415L59577J13343N33029
$$ -1246150 1563328 3457962 2879435 769558 -797115 -1001530 -641953 -528610 4419
12832D419K380919L743239J930982j954794l169796j39195K137301q60479n696070
$$ 4419 2385338 6128577 8059559 6104765 2934969 2795774 4933075 4072596 -1623474
12823a623474n521131m3983M568470M541873J681395j395601l414659k483188
$$ -1623474 -7144605 -7188588 -2620118 1921755 3603150 2207549 -1207110 -3690298
12815c690298J840406M832288J559007m417663m511234K012050O451566L753698
$$ -3690298 -1849892 2982396 4541403 123740 -4387494 -2375444 4076122 7829820
12807G829820r11746j742273n90996j240674k402244j699986q26385j442957j102084
$$ 7829820 6918074 5175801 4584805 3344131 941887 -758099 -1584484 -3027441 -4129525
12798d129525J597154K796881k55877l364065j740436J971348K201662m72908
$$ -4129525 -2532371 264510 8633 -3355432 -5095868 -3124520 -922858 -1395766
12790a395766j098957J259310K878282J640189r71042k857415k589205L29162
$$ -1395766 -2494723 -1235413 1642869 3283058 2312016 -545399 -3134604 -2805442
12782b805442L422394K516925j884168l626926M6929L517614J615322k059478
$$ -2805442 616952 3133877 1249709 -2377217 -2330288 1187326 2802648 743170
12774G43170j840610L02108n96288k678161q33273L188060L454117N48044K69345
$$ 743170 -1097440 -795332 -1391620 -4069781 -4903054 -1714994 1739123 2287167 2556512
12765B556512K793842K506694j462531l655235j927237p1320K01689J398704K976117
$$ 2556512 5350354 7857048 6394517 2739282 812045 740725 942414 2341118 5317235
12756E317235O17673m907734o515692j595368L528787L328769K40959j355617
$$ 5317235 5934908 1027174 -5488518 -7083886 -3555099 -226330 14629 -1340988
12748a340988j490991j201519O40197L090676K023576k611542m616983r57412
$$ -1340988 -2831979 -4033498 -3393301 -302625 1720951 -890591 -5507574 -6464986
12740f464986L008836K529213J012708K522558L201933j832282p860401o000765
$$ -6464986 -3456150 -926937 85771 2608329 5810262 3977980 -3882421 -9883186
12732i883186K857591Q236551M250887l489225o304128k337298L460703N370260
$$ -9883186 -7025595 1210956 5461843 1972618 -4331510 -6668808 -3208105 2162155
12724B162155J756383l538042m491558K92346N061571L807408j797016m851436
$$ 2162155 3918538 380496 -4111062 -3818716 1242855 5050263 3253247 -1598189
12716a598189k514432J269317K155326M44602j123182j275443l82626J024834
$$ -1598189 -4112621 -2843304 -687978 -243376 -1366558 -2642001 -3024627 -1999793
12708a999793K328671K601591J473296k59643j434369j728259j830743k231367
$$ -1999793 328878 2930469 4403765 4144122 2709753 981494 -849249 -3080616
12700c080616j886243P91351M647721N222280J71057n891200n979644j72008M200914
$$ -3080616 -4966859 -4175508 472213 5694493 5865550 -25650 -6005294 -6177302 -1976388
12691a976388K915218J72601Q01968K379841R8648m185533m074465J396163N829521
$$ -1976388 938830 1111431 1913399 4293240 4391888 206355 -3868110 -2471947 3357574
12682C357574M241707r26132m256243m225673l061791j854806Q67375N319479
$$ 3357574 7599281 6673149 2416906 -1808767 -4870558 -6725364 -5857989 -538510
12674e38510P788995M434343k577242o132524l194730O26726p20320m085504j871754
$$ -538510 7250485 11684828 9107586 2975062 -219668 407058 -313262 -4398766 -6270520
12665f270520N082292P469241J664005m401546l344290J212708J995512m58352
$$ -6270520 -1188228 6281013 7945018 3543472 199182 1411890 3407402 2949050
12657B949050r08300O69599K83866j701251j347467R03554M94829l061860m931285
$$ 2949050 2040750 2710349 2994215 1292964 -54503 849051 1343880 -1717980 -6649265
12648f649265k641257P02417J988099K018437K644126L910264M968511M799111
$$ -6649265 -9290522 -8588105 -6600006 -4581569 -1937443 1972821 6941332 11740443
12640A1740443K168546k170629m469332k785512q75266k653682n055281k580399
$$ 11740443 13908989 11738360 7269028 4483516 3608250 954568 -4100713 -6681112
12632f681112K823369M041848N20206p17704K912007N023528R38803m721428n558931
$$ -6681112 -3857743 184105 704311 -13393 2898614 7922142 8860945 4139517 -1419414
12623a419414k248658Q29659K375799K767224Q35214k789082l468202Q59754M669865
$$ -1419414 -3668072 -2838413 -462614 2304610 3139824 350742 -3117460 -2257706 2412159
12614B412159K145093l672074n116061j046204K512302J786523p18925j700838
$$ 2412159 4557252 885178 -4230883 -5277087 -2764785 -978262 -1697187 -3398025
12606c398025j262516o28789K30367J328033J793408J262790L53520l56683l91768
$$ -3398025 -4660541 -5289330 -5058963 -3730930 -1937522 -674732 -321212 -677895 -1069663
12597a069663P50509K128468J281904k069223m007724j189874L789888N368642
$$ -1069663 -319154 1809314 3091218 1021995 -2985729 -4175603 -385715 4982927
12589D982927K460272p98768j367241n55726o50303j743853k813925l265923k578553
$$ 4982927 7443199 6644431 5277190 4721464 4071161 2327308 -486617 -3752540 -6331093
12580f331093n52682J589435K219994J516415Q60133M27216m44681j007960J37254
$$ -6331093 -6883775 -5294340 -3074346 -1557931 -697798 -270582 -715263 -1723223 -1585969
12571a585969K208218K769942J121286j169581k834145l585382k797372l32630
$$ -1585969 622249 3392191 4513477 3343896 509751 -3075631 -5873003 -6205633
12563f205633J821157J773405R88222J972609L539796K559075j09324m41834J766404
$$ -6205633 -4384476 -2611071 -1622849 349760 3889556 6448631 6339307 5897473 7663877
12554G663877K233495l81688k070475n32500J000817p8147j182425J63787J449882
$$ 7663877 9897372 9515684 7445209 6912709 7913526 7835379 6652954 6816741 8266623
12545H266623k5751j974336j473470l48927j119878j642110M52390J878276j006390
$$ 8266623 8240872 6266536 4793066 4444139 3324261 1682151 2134541 4012817 3006427
12536C006427m365455k104299L369780M119849n77884l428072j500163j98419
$$ 3006427 -1359028 -3463327 -93547 4026302 3448418 20346 -1479817 -1678236
12528a678236k594463l657571O05402N614018N159111M64137k803937k354578
$$ -1678236 -4272699 -7930270 -7324868 -1710850 3448261 3912398 1108461 -1246117
12520a246117L30124L481004M776760J494389m837230p618431l284512L236755
$$ -1246117 -915993 2565011 7341771 8836160 3998930 -3619501 -6904013 -3667258
12512c667258N263152K833836J65077j241669j835783l32829L301092M598785
$$ -3667258 1595894 4429730 4594807 3353138 1517355 1184526 4485618 9084403
12504I084403N83854m116943l768439q71345j277828l000926M32838O773368O230751
$$ 9084403 9668257 5551314 1782875 911530 -366298 -3367224 -2934386 3838982 10069733
12495A0069733k576505q635636m635477K451030K860201j773620l190948K09073
$$ 10069733 7493228 -1142408 -5777885 -3326855 -466654 -2240274 -5431222 -5222149
12487e222149L004744K483852J058750K14857j249592k842406j796583K001924
$$ -5222149 -2217405 266447 1325197 1540054 290462 -2551944 -4348527 -2346603
12479b346603M568592K828378j455837l955504k497648J133559L281070K114492
$$ -2346603 2221989 5050367 3594530 -360974 -2858622 -1725063 1556007 3670499
12471C670499n46167j573512m06295Q69294J005576P35860K63092j290964l002211
$$ 3670499 3124332 1550820 1144525 2013819 3019395 3755255 4018347 2727383 -274828
12462b74828k084129J534031L740087J675661k084042l265818j390776R39348
$$ -274828 -2358957 -824926 2915161 4590822 2506780 -759038 -2149814 -1210466
12454a210466J938755J324803o70165k522352j896304P68454J754213l71508j867943
$$ -1210466 728289 2053092 1382927 -1139425 -3035729 -2267275 -513062 -884570 -2752513
12445b752513K66914K935090J927218p15961O0778L509034L746400q02945m549509
$$ -2752513 -2485599 449491 2376709 1660748 1721526 5230560 8976960 8174015 3624506
12436C624506k846553J726002L504323R54781k656398l968954k886072j698554
$$ 3624506 777953 2503955 6008278 6963059 4306661 337707 -2548365 -4246919
12428d246919j757559j515667J115544M682457N117409J732513j088303l41334
$$ -4246919 -6004478 -7520145 -6404601 -1722144 3395265 5127778 4039475 3698141
12420C698141J124632k25640k817304l595339l574878m371381l088549K366057
$$ 3698141 4822773 4597133 1779829 -1815510 -5390388 -9761769 -12850318 -10484261
12412a0484261O331537K585424l753567k060354O307818Q285505m72009p743650
$$ -10484261 -4152724 -1567300 -5320867 -7381221 -1073403 7212102 6740093 -1003557
12404a003557l424982N142686N616339n69832l101112l12308N73254k209696k713064
$$ -1003557 -4428539 714147 6330486 5760654 2659542 2347234 2920488 710792 -2002272
12395b002272O62534K069678q27521k581908J50415K976833J991424R9899N38828
$$ -2002272 -1339738 729940 -97581 -2679489 -2529074 447759 2439183 2539082 3077910
12386C077910Q43169j412288k826076j72908K832769J396322j847168j357251
$$ 3077910 3921079 2508791 -317285 -490193 2342576 3738898 1891730 534479
12378E34479J499039J048081k311888k856776j00332L27129k504475k248922L301891
$$ 534479 2033518 3081599 769711 -2087065 -2187397 -1860268 -4364743 -6613665 -3311774
12369c311774O900913L115903k689900l327680j178322k361318m714424j640122
$$ -3311774 3589139 6705042 4015142 687462 -490860 -2852178 -7566602 -9206724
12361i206724M844174N858940L96053k568208R97664L640579l44244m624045j277097
$$ -9206724 -4362550 1496390 1892443 -675765 321899 3962478 3618234 -1005811 -2282908
12352b282908N611771N971039p55911n480775l381640O91822J303123n50026j625193
$$ -2282908 3328863 9299902 8543991 3063216 -318424 373398 1676521 1126495 -498698
12343d98698j780960k153193k036133n36553J191003J615726J036262O92215J083793
$$ -498698 -2279658 -4432851 -6468984 -7005537 -5814534 -4198808 -3162546 -2470331 -1386538
12334a386538J922668K357414J103143j901511m091970k777374R06764L015211
$$ -1386538 536130 2893544 3996687 2095176 -1996794 -4774168 -3867404 -852193
12326h52193K021802L79192K61750N76797m18663j863047j565976P31648K972033
$$ -852193 1169609 1548801 1810551 2387348 1968685 105638 -1460338 -728690 2243343
12317B243343L151562J236972r72658j656937q80392k77786n43520n08361L83061
$$ 2243343 5394905 6631877 5659219 4002282 3121890 2844104 2300584 1792223 2175284
12308B175284N29571j061711k384643j453437N1543m58794j607128k37293K347984
$$ 2175284 2704855 1643144 -741499 -2194936 -2143393 -2602187 -4209315 -4446608 -2098624
12299b098624J451403l226558o038351l391070J341294L435774L189189L346390
$$ -2098624 -647221 -3873779 -9912130 -13303200 -11961906 -8526132 -5336943 -1990553
12291a990553L640072K084464m21465j134570k62414o71934k633672k629675J074654
$$ -1990553 1649519 3733983 3312518 2177948 1915534 1243600 -1390072 -4019747 -2945093
12282b945093M608739L132124j968327m159247q80604K203793n23805n038113
$$ -2945093 1663646 4795770 2827443 -1331804 -2212408 -8615 -532420 -5570533
12274e570533k542090O373492J0249216K718997p510727q857663k748072J211399
$$ -5570533 -8112623 -1739131 8510085 11229082 3718355 -5139308 -7887380 -6675981
12266f675981J054725K514204N640612L961156k004842l111594K632082M850056
$$ -6675981 -5621256 -3107052 2533560 6494716 4489874 1378280 4010362 8860418
12258H860418k139334q436283m033255M413590M005628m024230p479443l038543
$$ 8860418 6721084 -1715199 -5748454 -1334864 2670764 -1353466 -8832909 -11871452
12250a1871452O31251r08135j578995K658644O247645L936865m23336p23276K108651
$$ -11871452 -11240201 -12148336 -13727331 -11068687 -4821042 -884177 -1307513 -2030789 77862
12241G7862L345043K373254J874164K089831Q29800k245587m890428n073771k604392
$$ 77862 3422905 5796159 7670323 9760154 10589954 8344367 3453939 -1619832 -4224224
12232d224224Q60935K411526M06743k764131k841551O22904L605238L451197J909944
$$ -4224224 -3363289 -951763 -545020 -3309151 -6150702 -5527798 -1922560 1528637 3438581
12223C438581J010658j60790k243759k856846k96704K803548K880681M57116j322156
$$ 3438581 4449239 4288449 2044690 -812156 -1108860 1694688 4575369 5032485 3710329
12214C710329j340410p05833M3830R04908R19218m45662j675562j550585j519108
$$ 3710329 2369919 1664086 1707916 2612824 3532042 3086380 1410818 -139767 -1658875
12205a658875k904396l602095j122478K646426L840708K660764K390003K981588
$$ -1658875 -4563271 -8165366 -9287844 -6641418 -2800710 -139946 2250057 5231645
12197E231645R91721l487577n460419k693098L56805n16310k786487j787251J710239
$$ 5231645 6223366 2735789 -2724630 -5417728 -5060923 -5577233 -8363720 -10150971 -8440732
12188h440732L390931K526441J940272K051413M87870k228334k094144J627917
$$ -8440732 -5049801 -2523360 -583088 1468325 1956195 -272139 -2366283 -738366
12180g38366L812197M83370n033386o359208k276636K632148M303060K963487
$$ -738366 3073831 3557201 -1476185 -7835393 -10112029 -7479881 -3176821 -213334
12172b13334R89800j35349j81770N63170J463135J749963J015916o73644k817479
$$ -213334 776466 641117 459347 1022517 2485652 4235615 5251531 4577887 1760408
12163A760408m378544m387741l088656j634916l05408J702189M161796N176837
$$ 1760408 -2618136 -7005877 -10094533 -11729449 -12034857 -10332668 -6170872 -994035
12155i94035L695213J092923q58574j835871j658864L52434K827691K086667k433135
$$ -994035 2701178 3794101 2935527 1099656 -559208 -206774 2620917 4707584 2274449
12146B274449n180042j268133N615914P264232K101833l310700m093140k303278
$$ 2274449 -2905593 -4173726 1442188 8706420 10808253 7497553 3404413 1101135
12138A101135r25715J030899M031411M228232p23464n983895n387946o26909J250531
$$ 1101135 175420 1206319 5237730 9465962 8742498 2758603 -2629343 -3256252 -2005721
12129b005721j601389l721860j257273K566643L006944O21721n50665Q43547K200394
$$ -2005721 -3607110 -7328970 -8586243 -6019600 -3012656 -2390935 -2941600 -2098053 102341
12120A02341R33741k449758n018220m054839M25871M985784N434371J192024l754331
$$ 102341 1036082 -1413676 -6431896 -10486735 -10060864 -5075080 359291 1551315 -2203016
12111b203016n171696k894943L16847K829532M701456N010032K101301k579153
$$ -2203016 -7374712 -10269655 -9952808 -7123276 -2421820 2588212 4689513 2110360
12103B110360m351394j410134J764525O07454k211685o52522M456397N313934
$$ 2110360 -2241034 -3651168 -1886643 -1279189 -3490874 -4143396 313001 5626935
12095E626935j209190p928722p062265p15908L262365K307496L47096K51714J025979
$$ 5626935 4417745 -3510977 -10573242 -11289150 -8026785 -5719289 -5372193 -5120479 -4094500
12086d094500J678433K453314K356467K10683k065810j775183l05011o13405r56776
$$ -4094500 -2416067 37247 2393714 2604397 538587 -1236596 -1541607 -2155012 -3111788
12077c111788K386214O592250M468246l487259p621218l088140K747332J901469
$$ -3111788 -725574 5866676 10334922 6847663 -773555 -3861695 -1114363 787106
12069G87106k526834k932638M04929J472928o66691j343106J052843L007195K172491
$$ 787106 -1739728 -4672366 -4267437 -2794509 -3461200 -4804306 -3751463 -744268 1428223
12060A428223O8670j322383j171794J144769M429067M666882K38186l836573k231671
$$ 1428223 1496893 174510 -997284 147485 4576552 9243434 9481620 5645047 3413376
12051C413376K032434J731270k976433m588989k95466L694761K137950j717425
$$ 3413376 5445810 7177080 4200647 -388342 -683808 3010953 5148903 3431478
12043C431478k243453K42666J557290M28972q96894o95492P05732K018193J709132
$$ 3431478 1188025 1430691 2987981 3416953 2520059 1824567 2530299 4548492 6257624
12034F257624q29319l697019m029197j818000K49154J094517K031335K721684
$$ 6257624 5428305 1731286 -2297911 -4115911 -3866757 -2772240 -740905 1980779
12026A980779P61802l104824m096337m58180L115226K702899J268321K680640
$$ 1980779 2742581 -362243 -4458580 -4916760 -1801534 901365 2169686 4850326
12018D850326L853815k89430o517729o219997J109636N572482J032459n614693
$$ 4850326 8704141 8414711 1896982 -4323015 -3213379 2359103 3391562 -2223131
12010b223131m657027K283126N454072J695507j993074j24160L397132K463173
$$ -2223131 -6880158 -4597032 857040 2552547 559473 435313 3832445 6295618
12002F295618j568418k523091J059426M300219L208335q66193m364681n523623
$$ 6295618 4727200 2204109 3263535 7563754 10772089 9905896 5541215 17592
11994A7592m355351j514250J556683L221673L160122J959050l57914l250149m023002
$$ 17592 -4337759 -5852009 -4295326 -1073653 2086469 4045519 3687605 437456 -3585546
11985c585546p86209L211306K564937k246353m610669j406861K137939N16098
$$ -3585546 -4371755 -1160449 1404488 -841865 -5452534 -6859395 -4721456 -4205358
11977d205358l661287m034728n8307L156896K902167J553976J479156J738412
$$ -4205358 -7866645 -11901373 -11959680 -8802784 -5900617 -4346641 -2867485 -1129073
11969a129073O50802j393524k512342j125267K554885N578644M228913j233366
$$ -1129073 -478271 -1871795 -4384137 -5509404 -2954519 2624125 6853038 5619672
11961E619672n556133m531509k08505K461415K050828N90837p66792k061689j968355
$$ 5619672 63539 -4467970 -4676475 -2215060 -164232 426605 -340187 -2401876 -4370231
11952d370231Q36282M344475M992354K441481n03590k021314k323800j726467
$$ -4370231 -3533949 810526 5802880 8244361 7740771 5719457 3395657 1669190
11944A669190q61803j457313l547033l673579K78432M522734M299280J319555
$$ 1669190 807387 -649926 -4196959 -7870538 -7592106 -3069372 1229908 2549463
11936B549463P12047K253040J359515j851312k015694J978699M297917J446469
$$ 2549463 3261510 5514550 6874065 5022753 3007059 4985758 9283675 10730144
11928A0730144k246641j842316R60706J748035K70564p02852m07610l21165j326803
$$ 10730144 8483503 6641187 7601893 9349928 9620492 8917640 8510030 8188865 6862062
11919F862062l167755n050492n374904l018813K45079J361740O42402J365188
$$ 6862062 3694307 -1356185 -6731089 -9749902 -9504823 -8143083 -7500681 -6135493
11911f135493L979575M843655K212930p46427j082692l09659r96468k489259k711259
$$ -6135493 -2155918 2687737 4900667 4154240 3071548 2761889 1765421 -723838 -3435097
11902c435097j513283Q0154J618384K506443J908263N40455J4281j20918j451555
$$ -3435097 -4948380 -4868226 -3249842 -743399 1164864 1705319 1719600 1598682 147127
11893A47127k715982j054127K390627L271483J284067P01849K190901R33087m204184
$$ 147127 -2568855 -3622982 -1232355 2039128 3323195 4025044 6215945 7149032 2944848
11884B944848o797910k773559K361226K047806j139179o33377L120497M172817
$$ 2944848 -3853062 -6626621 -4265395 -2217589 -3356768 -3990145 -869648 3303169
11876C303169R48427k319573k657567r55451J464258L769057M135315J853766
$$ 3303169 4251596 1932023 -725544 -1680995 -216737 3552320 7687635 9541401
11868I541401l55349j92468N815k757716o262757o145790k788747Q0313J694638
$$ 9541401 9186052 8993584 8999399 6241683 -21074 -6166864 -8955611 -8875298 -7180660
11859g180660L576064M411576J834088j834557k014023N75253J214581l30262
$$ -7180660 -3604596 806980 2641068 806511 -1207512 -632259 582322 252060
11851B52060L31389L368231L285351j495873m683046j513558L556647L233794
$$ 252060 583449 3951680 7237031 5741158 1058112 -455446 3101201 6334995
11843F334995k393085o655973n163268r819L803901L459193L57680j507537J41235
$$ 6334995 3941910 -2714063 -7877331 -7887150 -4083249 -624056 -266376 -1773913 -1632678
11834a632678K975492L001757O9177k285262k457139k473623l098668j554660
$$ -1632678 1342814 4344571 4413748 2128486 -328653 -2802276 -5900944 -7455604
11826g455604L198949O560592L750219k714418n316666j152547M425782M858423
$$ -7455604 -4256655 2303937 6054156 3339738 -1976928 -3129475 1296307 6154730
11818F154730L57793l233718k271312N70592N53275k730078n173688l731598J66120
$$ 6154730 6512523 3278805 1007493 1578085 2131360 -598718 -5772406 -9504004 -9337884
11809i337884L233570M142999L486108J870659p8884j135060p91053k66147n87798
$$ -9337884 -6104314 -1961315 1524793 3395452 3316568 2181508 1390455 1124308 536510
11800E36510p67752L67675J736977J514630J26239n40482k07888j08778k28199
$$ 536510 -231242 136433 1873410 3388040 3514279 2973797 2765909 2657131 2428932
11791B428932Q44042L059332M011905J691721k904878o368077n807499j600081
$$ 2428932 3272974 6332306 10344211 12035932 9131054 2762977 -3044522 -4644603
11783d644603K589410L452377J727429O63109R95996M04966j473157j500767J396649
$$ -4644603 -2055193 1397184 3124613 3787722 4783718 5188684 3715527 2214760 3611409
11774C611409L195752P41177k837585l031475j186438j504377l094782j389261
$$ 3611409 6807161 7548338 4710753 1679278 492840 -1011537 -4106319 -5495580
11766e495580L170945M516293L11992l856678k403329K427672M065483M45722
$$ -5495580 -2324635 2191658 2503650 -1353028 -3756357 -1328685 2736798 3182520
11758C182520l977461m305979r00285J619093L56444k068993j076667L089835
$$ 3182520 -794941 -5100920 -6001205 -4382112 -4025668 -6094661 -7171328 -4081493
11750d081493N133358K240013j729191k071146J56994R94518O8301k66566j8579
$$ -4081493 1051865 3291878 1562687 -508459 -351465 643053 711354 444788 426209
11741D26209q13129j547705J22370K843471L070522R64157m9838P80656Q79775
$$ 426209 -386920 -1934625 -1812255 1031216 4101738 5065895 5016057 5796713 6676488
11732F676488n42288j479632j254379j172515j192173k51533O41455Q7568j38077
$$ 6676488 6134200 4654568 3400189 2227674 1035501 783968 1425423 1512991 1374914
11723A374914J732444K506284j335232n733369l728537K667808M293852q27020
$$ 1374914 3107358 5613642 4278410 -1454959 -5183496 -2515688 1778164 951144
11715I51144m563399k177282J055928L53620r77248N53952J946095Q01154R01122
$$ 951144 -3612255 -5789537 -4733609 -4379989 -5357237 -4803285 -2857190 -2056036 -1154914
11706a154914M240436N309655M67920m461459l740505j471067l059987m324071
$$ -1154914 3085522 8395177 8863097 4401638 661133 -809934 -3869921 -8193992
11698h193992L85770N769178L599998j868837l18107N892870M592997m808726
$$ -8193992 -7808222 -2039044 1560954 -307883 -625990 5266880 9859877 5051151
11690E051151q665320j181141N939376K622669l989153k498384M543746O478629
$$ 5051151 -3614169 -4795310 1144066 3766735 -222418 -2720802 1822944 8301573
11682H301573J660807k503586k631975j994753j959626k61010K464076K519996
$$ 8301573 9962380 7458794 4826819 2832066 872440 611430 3075506 5595502
11674E595502K1475j085886m55661j927541n496761n625113j51336N223671M921787
$$ 5595502 5616977 4531091 4075430 2147889 -3348872 -8973985 -9125321 -3901650 1020137
11665A020137R82595j313190r94304j90798R30625K938664L534236O38069k646443
$$ 1020137 2002732 689542 -304762 -495560 435065 3373729 6907965 7546034 4899591
11656D899591j826575J225175N14158m001075n369390n27573M434696L551496
$$ 4899591 3073016 4298191 4812349 811274 -4558116 -5085689 -650993 2900503
11648B900503l14838j172684M14749k19220k760846k502627R11166K265529q38720
$$ 2900503 2585665 1412981 1827730 1608510 -1152336 -3654963 -2743797 -478268 -1316988
11639a316988m266942l822548o56148J916994K994176L107372J926573m81334
$$ -1316988 -5583930 -9406478 -10062626 -8145632 -5151456 -2044084 -117511 -598845
11631e98845k242840j615352R21599L427427M085143K116847j071292k323260
$$ -598845 -2841685 -4457037 -3535438 -108011 3977132 6093979 5022687 2699427
11623B699427o46221O47673j064666k607112J51013M156695K775480k956553m844844
$$ 2699427 2053206 2700879 1636213 -970899 -819886 3336809 6112289 3155736 -1689108
11614a689108n78874K525520L636k502270K10961L488595J319031k724113j839661
$$ -1689108 -2267982 257538 261174 -2241096 -2030135 1458460 2777491 53378 -1786283
11605a786283J909668J451201k694678l497894L60218K819466J147064l72203
$$ -1786283 123385 1574586 -1120092 -4617986 -4257768 -1438302 -291238 -663441
11597f63441J091365K305179K78638k758055l277362j086449J703581K959387
$$ -663441 427924 2733103 3011741 253686 -3023676 -4110125 -2406544 552843
11589E52843J246450k386815l799930o91542L088913K713732Q6921M74568K995250
$$ 552843 1799293 -587522 -4387452 -5078994 -1990081 723651 810572 1285140 4280390
11580D280390J882955l061990n398236k631245J10200o76701j641295N6319J415740
$$ 4280390 6163345 3101355 -2296881 -4928126 -4817926 -5494627 -7135922 -7079603 -5663863
11571e663863k6209r59720J485371L794165J849764j757128j838879J235187K795808
$$ -5663863 -5690072 -6649792 -5164421 -1370256 479508 -1277620 -3116499 -1881312 914496
11562I14496J018106j676775k617320q65617K800021N197492K750564l159233
$$ 914496 1932602 255827 -2361493 -3227110 -427089 4770403 7520967 4361734
11554D361734o124825k953903J628893J922186q99614j969874k73248J585934
$$ 4361734 -1763091 -4716994 -3088101 -1165915 -2065529 -4035403 -4308651 -2722717
11546b722717K286197J928513j46554l293469l903196k64667L505360K926180
$$ -2722717 -436520 1491993 1345439 -1948030 -5851226 -6115893 -2610533 315647
11538C15647k13373j508244j139756j696316j699754J754600N673895M028554
$$ 315647 102274 -1405970 -2545726 -4242042 -5941796 -4187196 1486699 5515253
11530E515253k310240n702118k648189J986655L135086J890422J543175K338976
$$ 5515253 3205013 -2497105 -5145294 -3158639 -23553 1866869 3410044 5749020
11522E749020K653021J577098j327922n365944p047067l311530K769864M294747
$$ 5749020 8402041 9979139 8651217 3285273 -3761794 -7073324 -4303460 -8713
11514h713m4821l688673j446508L602298N219048K183273j617114k448407K86297
$$ -8713 -53534 -3742207 -5188715 -1586417 3632631 5815904 4198790 1750383 2036680
11505B036680M002576M510741K81113m305922l580207J207282L162904J15300
$$ 2036680 6039256 10549997 10831110 6525188 2944981 4152263 7315167 7430467
11497G430467k341673l69209K135649R40771j450212j382711j001310l148175
$$ 7430467 5088794 4719585 6855234 7796005 6345793 4963082 3961772 813597
11489H13597m228329O0528N389376L880476l107675o106947j596517L529078L252389
$$ 813597 -3414732 -3354204 2035172 5915648 2807973 -3298974 -4895491 -1366413 1885976
11480A885976L78536l5436J411821J470324K30349m70331j147554k864210l833697
$$ 1885976 2264512 2229076 3640897 5111221 5341570 4871239 3723685 859475 -2974222
11471b974222j858252J475949K553984O37430j823477k807212k084159J27440
$$ -2974222 -4832474 -3356525 -802541 -165111 -1988588 -4795800 -6879959 -6752519
11463f752519L249103N457125M933623K036201j179178l223056l775464k879741
$$ -6752519 -3503416 1953709 6887332 8923533 7744355 4521299 745835 -2133906
11455b133906j134161l5692m29630j017151l0540J939397K552712J136440l08855
$$ -2133906 -3268067 -3303759 -3733389 -4750540 -4781080 -2841683 -288971 847469 538614
11446E38614O917J347009J957646J732101J937952K628648J916112j374043n250080
$$ 538614 545531 1892540 3850186 5582287 7520239 10148887 12064999 10690956 5440876
11437E440876o194494l295983N76589K175967J116871r63180k704094k977872
$$ 5440876 -753618 -4049601 -3473012 -1297045 -180174 -1143354 -3847448 -6825320
11429f825320m31119M233003O707958L286693l457259o627473l289261K388200
$$ -6825320 -7256439 -3023436 3684522 6971215 3513956 -3113517 -6402778 -4014578
11421d014578N090949L985470J045627k406177m995819m477648q17622K387573
$$ -4014578 1076371 5061841 6107468 3701291 -1294528 -5772176 -6589798 -4202225
11413d202225K562085J711840K256345K332299n52439l909539l560454o54717
$$ -4202225 -1640140 71700 2328045 4660344 4107905 198366 -3362088 -4016805
11405d016805L85597l01031J210528M276873L465453j827739m876208j884766
$$ -4016805 -3631208 -3932239 -2721711 1555162 5020615 3192876 -1683332 -3568098
11397c568098J977456J217346j378864n25164K154276J415411k142167l177503
$$ -3568098 -1590642 -373296 -1752160 -2277324 -123048 1292363 -849804 -4027307
11389d027307o17501J398430J185998J489523L125652K869947m91144l248480
$$ -4027307 -4644808 -3246378 -2060380 -570857 2554795 5424742 4933598 1685118
11381A685118k380457M5193O23617m82138q14696O04282K640839L323143R72330
$$ 1685118 -695339 -650146 -26529 -508667 -1323363 -719081 1921758 5244901 6217231
11372F217231l578080n768068j849978M866951O746964K184378j758688K77875
$$ 6217231 2639151 -3128917 -4978895 -111944 6635020 8819398 7060710 7338585
11364G338585M058689K615379l138755o316372m187877n98029Q28778M88633l54052
$$ 7338585 11397274 14012653 10873898 4557526 369649 -228380 600398 1089031 734979
11355G34979j711559k851341j994285O47952K484803K210789J205515N10704p22897
$$ 734979 -976580 -3827921 -5822206 -5174254 -2689451 -478662 726853 1237557 514660
11346E14660k610684l107819r45201K072988L468116L157669K422787J301188
$$ 514660 -2096024 -5203843 -6149044 -4076056 -607940 2549729 4972516 6273704
11338F273704q13726k739405k120724J034796L331541J939107j356427k068131
$$ 6273704 5459978 2720573 599849 1634645 4966186 6905293 5548866 3480735
11330C480735Q14150K875363J93939m698975n809963j814932K477083L062395
$$ 3480735 4294885 7170248 7364187 2665212 -3144751 -4959683 -2482600 579795
11322E79795J214815k25194j021847j734618j418779q1139j27708k073074k156830
$$ 579795 1794610 1569416 547569 -1187049 -2605828 -2686967 -2814675 -4887749 -7044579
11313g044579J747179N103596K673810k991136m746553j024775L071855M009997
$$ -7044579 -5297400 -193804 2480006 -511130 -5257683 -6282458 -3210603 799394
11305G99394L079285J513221j383568m254492l631431M26257L517780L265380
$$ 799394 3878679 5391900 4008332 -246160 -3877591 -3451334 66446 3331826
11297C331826J893991J219937N6970j756080j813335K44415J314650K08731k68006
$$ 3331826 5225817 6445754 6502724 4746644 2933309 3177724 4492374 4701105 4433099
11288D433099J124697J331732j438404m178195m131674k856432k189653q18957
$$ 4433099 5557796 6889528 5451124 1272929 -2858745 -5715177 -7904830 -8723787
11280h723787J743444K487835Q3685j772223l51065J147679q10979l733710l377853
$$ -8723787 -6980343 -4492508 -4408823 -6181046 -6532111 -5384432 -6195411 -9929121 -13306974
11271a3306974p03316P25155J082166K665067M606838M412082K580112J098401
$$ -13306974 -14010290 -13285135 -12202969 -9537902 -4931064 -518982 2061130 3159531
11263C159531k55076j827676j395556J790220L673277J293536j576284n27826
$$ 3159531 2904455 1076779 -318777 1471443 5144720 6438256 4861972 4334146
11255D334146J515888o15675m624786m216456r4250J221681j238926j521223K564611
$$ 4334146 5850034 5234359 609573 -3606883 -3701133 -2479452 -3718378 -5239601 -2674990
11246b674990N612933L481382r35144l170480k746310j165511P00725J477465
$$ -2674990 2937943 6419325 5484181 2313701 -432609 -1598120 -897395 580070
11238E80070n3902j965819j037294J822482K415954j30395k241024j763903l81906
$$ 580070 526168 -1439651 -2476945 -654463 1761491 1631096 -609928 -2373831 -2755737
11229b755737J39129k73624j812949l959553l681101N87169M504180L150924p71864
$$ -2755737 -2616608 -2890232 -4703181 -8662734 -12343835 -11756666 -7252486 -4101562 -4873426
11220d873426q93447K173971K233222j209586k202113O20532J843705j63314j97540
$$ -4873426 -5766873 -3592902 -1359680 -2569266 -4771379 -4150847 -2307142 -2470456 -2667996
11211b667996L288067M154865o53464m957827l073374J767796L776390K612745
$$ -2667996 620071 4774936 4121472 -836355 -3909729 -2141933 1634457 4247202
11203D247202L30886k956148n640823l574752K630214N797291K524508j395522
$$ 4247202 4578088 1621940 -4018883 -7593635 -4963421 833870 3358378 1962856
11195A962856q07904Q91645n10818j840004Q64114M074708K712733j143225k758325
$$ 1962856 1154952 2046597 1535779 -304225 559889 4634597 7347330 6204105 3445780
11186C445780k698141l191554k104622J796902L155894j814014o549765k998043
$$ 3445780 747639 -2443915 -4548537 -2751635 404259 -1409755 -7959520 -10957563
11178a0957563M866706O512730J001310k795613q68121J371685j49251k042838
$$ -10957563 -6090857 421873 1423183 -1372430 -2240551 -868866 -1018117 -3060955
11170c060955l62137L288115M999601L312651n10414l585961l109689L1906J168368
$$ -3060955 -3423092 -134977 4864624 8177275 7666861 4080900 971211 1003117 2171485
11161B171485j436420l121643l60363K571450M37815l688701l510325m07329o46173
$$ 2171485 735065 -2386578 -2746941 -175491 262324 -3426377 -6936702 -7344031 -7990204
11152g990204l879777l624926J363934N078055M273349K456036K501924K508225
$$ -7990204 -11869981 -15494907 -14130973 -9052918 -4779569 -2323533 178391 2686616
11144B686616Q37621q83761j617747k516472l379376k358534r8254N18239n44858
$$ 2686616 3524237 2640476 1022729 -1493743 -4873119 -7231653 -7329907 -6811668 -7356526
11135g356526j55787K574914M696185L783403N19567k964340m456515k541350
$$ -7356526 -7512313 -4937399 -241214 3542189 4061756 1097416 -3359099 -5900449
11127e900449J083424K369272Q17018R04852M090821M804829p0623l893844m14475
$$ -5900449 -4817025 -2447753 -1630735 -725883 3364938 8169767 8099144 4205300 3790825
11118C790825M515323J608302n901882o925216o89106K631791p58800l319373
$$ 3790825 8306148 9914450 4012568 -2912648 -3601754 -969963 -1728763 -5048136
11110e048136n07377K279345R70901O678L034576N610466K885025k569326n588505
$$ -5048136 -5555513 -3276168 -2305267 -2298589 735987 6346453 9231478 6662152 1073647
11101A073647n182578k779091O02390K635871R97361j619171k04875L527356K628992
$$ 1073647 -4108931 -6888022 -6285632 -3649761 -2652400 -4271571 -4476446 -949090 1679902
11092A679902k809234m066204K087463P088631L747748k731007l547806P57964
$$ 1679902 -1129332 -5195536 -3108073 3980558 7728306 4997299 1449493 2207457
11084B207457L372190K061362p4126j230539k100929k565949j870179o27417K31430
$$ 2207457 5579647 7641009 7566883 6336344 4235415 1669466 -200713 -828130 -596700
11075e96700P02763M50227r52654j817984p9989K426897J974677o73379j364410
$$ -596700 106063 556290 -396364 -2214348 -2294337 132560 2107237 1433858 69448
11066F9448j01929q78917l387146k452229K517611N148665J836312l157205n055835
$$ 69448 -32481 -911398 -4298544 -6750773 -4233162 915503 2751815 -405390 -5461225
11057e461225m234225k035470J963372N716670M809012k61193l575360k801115
$$ -5461225 -9695450 -11730920 -9767548 -4050878 758134 496941 -3078419 -5879534
11049e879534j509508q92856K127332O297578N347763o46877l335275J17027J800919
$$ -5879534 -7389042 -8281898 -6154566 143012 5490775 4843898 1508623 1625650 3426569
11040C426569k805035o141869j327114O028323P037766K394039k011590m689689
$$ 3426569 621534 -5520335 -6847449 -819126 6218640 8612679 6601089 1911400
11032A911400n966220l339312K619357M980801Q84940k204604J442766N640893
$$ 1911400 -4054820 -7394132 -4774775 206026 1090966 -1113638 329128 5970021
11024E970021L117577j622122o52838L339015K675142j444926k174868K98033
$$ 5970021 9087598 7465476 6812638 10151653 12826795 11381869 9207001 9505034
11016I505034L82465j990352k385072j020737j509032l079142k554579j116624
$$ 9505034 9887499 7897147 5512075 4491338 2982306 -96836 -2651415 -3768039
11008c768039j308960j071319J645240L035360J54628k020014J153473M751307
$$ -3768039 -5076999 -6148318 -4503078 -1467718 -1313090 -3333104 -2179631 2571676
11000B571676K795981n80681P45217K379304k452111q346377n452203K837571
$$ 2571676 5367657 4786976 5532193 7911497 5459386 -2886991 -8339194 -5501623
10992e501623M812119j11874k102588R01102J309789k307280k997854J72699M39041
$$ -5501623 -689504 -801378 -2903966 -2002864 -693075 -3000355 -5998209 -5825510 -5386469
10983e386469k391643p42856N320790O223540j49405l991807m53977L035475J538247
$$ -5386469 -7778112 -8520968 -3200178 3023362 2873957 -1117850 -1571827 1463648 3001895
10974C001895P89095M037264M148353k800763q037994l803759L483440L735620
$$ 3001895 3790990 7828254 11976607 9175844 1137850 -2665909 817531 4553151
10966D553151j413453l687646j852734m17995J49399K322330M099744J431157
$$ 4553151 3139698 -547948 -2400682 -2818677 -2669278 -346948 3752796 5183953
10958E183953l820403n535164j987857K590378M200735K688453J47996j211224
$$ 5183953 1363550 -4171614 -6159471 -3569093 631642 3320095 3468091 2256867
10950B256867n56331N89451L74963j77942J041155K595935J170159k136306k697661
$$ 2256867 1700536 2289987 2664950 2487008 3528163 6124098 7294257 5157951 2460290
10941B460290j07212J063439p05610j663173j78996N76605m90733m4019K382021
$$ 2460290 2353078 3416517 2710907 1047734 868738 1445343 954610 910591 3292612
10932C292612K176446j678841l315782J16155K783279J17279k749646K34045M795139
$$ 3292612 5469058 3790217 474435 590590 3373869 3491148 741502 975547 5770686
10923E770686K572241m997942p958038k110500N584375O839379J680526l449178
$$ 5770686 8342927 3344985 -4613053 -6723553 -1139178 5700201 7380727 3931549
10915C931549l620791L15008L661441K913392r26899m084144m419322k740128
$$ 3931549 310758 625766 4287207 7200599 6273700 2189556 -2229766 -4969894
10907d969894m75703J453420J747415k94943k696253k528854J02905K442918L053123
$$ -4969894 -5445597 -3992177 -2244762 -2539705 -5235958 -7764812 -7661907 -5218989 -2165866
10898b165866K454993P21141j880818k797657l4277L707846M247110K227386J175483
$$ -2165866 289127 1010268 -870550 -3668207 -3702484 5362 4252472 6479858 7655341
10889G655341P29960j830781m336509j717962M282924N401945j069868p660514
$$ 7655341 8385301 6554520 2218011 500049 4782973 10184918 9115050 1454536
10881A454536o980215n71144N083821N972851J966730l859681n900302j505928
$$ 1454536 -5525679 -6096823 -1013002 4959849 6926579 3066898 -2833404 -4339332
10873d339332L622029J968503l860475m096522K522510O159936J777614l099173
$$ -4339332 -717303 1251200 -2609275 -6705797 -4183287 1976649 3754263 655090
10865F55090j668966J359892m62454l716841k094823J980875K109041p61080r66831
$$ 655090 -1013876 346016 -116438 -3833279 -5928102 -3947227 -1838186 -2599266 -3566097
10856c566097J453414J764487l64012r43767M05039L7462k543929l524513j135161
$$ -3566097 -2112683 -348196 -712208 -1655975 -1250936 -1213474 -3757403 -7281916 -8417077
10847h417077J949526L037515K281785R26294j54666k33479O11874J182930J130957
$$ -8417077 -6467551 -3430036 -1148251 -221957 -376623 -610102 1772 1184702 2315659
10838B315659J731376L080345K756509n66958m295394m965296k399337Q99535
$$ 2315659 4047035 7127380 9883889 9316931 5021537 56241 -2343096 -1443561
10830a443561K627178J678151j443985l985678l051988O51500L434634L241356
$$ -1443561 1183617 2861768 1417783 -2567895 -5619883 -4968383 -1533749 1707607
10822A707607J037810j843500m144997l416000R34856M165055J514474l651721
$$ 1707607 2745417 901917 -3243080 -6659080 -5724224 -1559169 -44695 -3696416
10814c696416l761120J227426L959683K031219J058902L486901M071015K20157
$$ -3696416 -7457536 -6230110 -2270427 -239208 819694 4306595 8377610 8597767
10806H597767k695503j379929q08633m278898o034477j301833M151387L078573
$$ 8597767 5902264 4522335 3713702 -565196 -6599673 -7901506 -3750119 -671546
10798f71546j143841p63969L000530K619960k637407n460370j616914M849242
$$ -671546 -1815387 -2579356 421174 3041134 403727 -5056643 -6673557 -1824315
10790a824315P556737M087734k881491p323521m733763J938788M482238J53420
$$ -1824315 5732422 9820156 6938665 -384856 -5118619 -3179831 1302407 1455827
10782A455827m452558l456376J85627J101524J3332J10303M43953p11220q71691
$$ 1455827 -2996731 -6453107 -6267480 -5165956 -5152624 -5042321 -4598368 -5309588 -6181279
10773f181279J732401K951483p57442n019605l827642R04091L216488K693349
$$ -6181279 -4448878 -1497395 -2254837 -7274442 -11102084 -10197993 -6981505 -4288156
10765d288156K804052L198467J308357j228362j162996j51481j676846m033138
$$ -4288156 -1484104 1714363 3022720 1794358 631362 479881 -1196965 -5230103
10757e230103l240204k80587J363602K388858M796536N615866J332365m289725
$$ -5230103 -8470307 -8750894 -7387292 -4998434 -201898 5413968 6746333 2456608
10749B456608m971917j920767o90222p63329K278075O162046M051781k939924
$$ 2456608 -2515309 -4436076 -5126298 -5889627 -3611552 2550494 6602275 3662351
10741C662351n843908j810822J876058K85902j999879k42713K070338k72668n081965
$$ 3662351 -2181557 -3992379 -2116321 -1830419 -3830298 -4073011 -2002673 -2275341 -7357306
10732g357306n942394j323681M183487O172496M641216K427638J340190K78080
$$ -7357306 -13299700 -14623381 -10439894 -4267398 373818 2801456 4141646 4419726
10724D419726k564358n882236n876318j768229K241836K699180J455800J705267
$$ 4419726 1855368 -4026868 -9903186 -11671415 -9429579 -6730399 -5274599 -3569332
10716c569332K845407K858062K469321K808297K072342j060475l753576l278828
$$ -3569332 -723925 2134137 4603458 7411755 9484097 8423622 4670046 1391218
10708A391218j775426k064178k288847L1025K423618J927812J262708L669161
$$ 1391218 -384208 -2448386 -4737233 -4706208 -2282590 -354778 907930 4577091
10700D577091N327578J028945n462530n760774q4249L162189Q47463j177543Q19153
$$ 4577091 9904669 10933614 5471084 -289690 -373939 2788250 3635713 2458170 3277323
10691C277323K526872j09755l974105m241519j543355K31354j97369r57485j83265
$$ 3277323 5804195 5694440 1720335 -2521184 -4064539 -3833185 -4030554 -4988039 -5171304
10682e171304K171965M285621L831764P94680j834917j834068n37951J45309Q21985
$$ -5171304 -2999339 1286282 5118046 5912726 4077809 2243741 1705790 1851099 2673084
10673B673084J875697R94435k537909m423165j264794L024075K470410j644405
$$ 2673084 4548781 5543216 3005307 -1417858 -2682652 341423 2811833 1167428
10665A167428k969017o7825K185086P27123k065175l140763k283698m66273J467559
$$ 1167428 -1801589 -1869414 315672 1042795 -1022380 -4163143 -6446841 -6913114 -5445555
10656e445555K436795K255655K185961K226029M27251k610663k614514J335349
$$ -5445555 -3008760 -753105 1432856 3658885 4086136 1475473 -1139041 196308
10648A96308L408423l65706m977186m101862j72051N36928j334110p75957J570991
$$ 196308 3604731 3239025 -1738161 -5840023 -6012074 -5475146 -6809256 -7585213 -6014222
10639f014222J070764j293189l05425L288085L136176j747306m820158k188691
$$ -6014222 -4943458 -6236647 -6542072 -3253987 -117811 -1865117 -6685275 -8873966
10631h873966K292975L724020J902804r35759k922610k313278R88604L624140
$$ -8873966 -6580991 -2856971 -954167 -1889926 -4812536 -7125814 -6137210 -2513070
10623b513070K648390J96355l5951J049402M53643p12837L34179J681095l12102
$$ -2513070 135320 331675 295724 1345126 1798769 1085932 1420111 3101206 2789104
10614B789104l408965k245481K311296M028484J319417q53906L60885J823874
$$ 2789104 -619861 -2865342 -554046 3474438 4793855 3939949 4300834 6124708
10606F124708M81797k134683k996392j324904J415859K669632P31314k367701
$$ 6124708 6606505 4471822 1475430 150526 1566385 4236017 4967331 2599630
10598B599630k331456R38640K444131L07353r04674R30484L77803n612003r850675
$$ 2599630 268174 1206814 3650945 3958298 3053624 3984108 4361911 -1250092 -11100767
10589a1100767n258757L086916N526135K308307P52306K241560K280086L94430
$$ -11100767 -16359524 -13272608 -7746473 -5438166 -4685860 -2444300 -164214 230216
10581B30216L2205Q02549j80688j461029o0257J617102j99499k947696k093478
$$ 230216 262421 1064970 884282 -576747 -637004 980098 780599 -2167097 -4260575
10572d260575N17074P30243J73076J928640L036879J46336k596893m94826K547501
$$ -4260575 -3743501 -3013258 -2840182 -911542 2125337 2271673 -325220 -820046 1727455
10563A727455J290626q36290Q40572J978585k293315o067753k354518L243403
$$ 1727455 3018081 2181791 3022363 5000948 2707633 -3360120 -5714638 -2471235
10555b471235J949218k345882r11457L312846K164808j652947o09744K346328
$$ -2471235 -522017 -2867899 -3779356 -466510 1698298 45351 -564393 1781935
10547A781935O29445j127987L819180Q065376J575154q009932o673253J375128
$$ 1781935 2411380 1283393 5102573 13167949 14743103 6733171 59918 1435046
10539A435046J706872m259266l855646J872237J491531l247441j323190M351444
$$ 1435046 3141918 -1117348 -4972994 -3100757 -1609226 -4856667 -6179857 -1828413
10531a828413K295882l345683K34704P766319L568671p937900q437387P54447
$$ -1828413 467469 -2878214 -2643510 5122809 8691480 753580 -7683807 -6929360
10523f929360J938694m708639k571945P032035O066589m368581m604672N755743
$$ -6929360 -4990666 -9699305 -12271250 -5239215 827374 -3541207 -8145879 -2390136
10515b390136O850566k450852k454098P425330O293108o587719r081476M27588
$$ -2390136 4460430 2009578 -444520 6980810 13273918 6686199 -2395277 -1967689
10507a967689N61032p792607j497002J4446927R643256j1336664j0405636J1858648
$$ -1967689 -1406657 -9199264 -10696266 3750661 13393917 2057253 -8348383 3510265
10499C510265J1749668j4452493j7389813J2180201K0072927p949014j2139612
$$ 3510265 15259933 807440 -16582373 -4402172 15670755 7721741 -4417871
10492d417871K3745893K5529591k7073199k1717669J05655596K09764810J13676919
$$ -4417871 19328022 44857613 17784414 -3933255 101722341 311487151 425164070
10485D25164070j10037923k12731859j11615873J9396207K6692960k8993120k6334677
$$ 425164070 315126147 102394288 -9221585 10174622 36867582 7874462 -18460215
10478a8460215J9462354K3229846j0923535j7090639O972534J0506925r390679
$$ -18460215 1002139 24231985 13308450 -3782189 3190345 13697270 4306591
10471D306591j1150093P704446J0839055n060198q343354M745356O541393o298414
$$ 4306591 -6843502 860944 11699999 6639801 -1703553 3041803 9583196 3284782
10463C284782q208995M847190R095850j544663o962615l17360K646320l245391
$$ 3284782 -4924213 -77023 9018827 7474164 511549 194189 2840509 -404882
10455d04882m845139O91712Q13365n860405o250907J402508M595367J078243J523306
$$ -404882 -5250021 -4558309 -3744944 -9605349 -15856256 -14453748 -9858381 -8780138 -7256832
10446g256832O462363M772609l111424l834317M463536Q246915K273356l077496
$$ -7256832 -794469 3978140 866716 -2967601 1495935 9742850 12016206 8938710
10438H938710j670045j24123k601694l833099j134036J089024J368347K678152
$$ 8938710 7268665 7144542 4542848 709749 -424287 664737 2033084 4711236
10430D711236L262872j049949n971466l759880K028090J157246m974851m989258
$$ 4711236 7974108 6924159 952693 -2807187 -779097 378149 -4596702 -9585960
10422i585960K481590O194118J472285l053426j232899J678326L98739j644230
$$ -9585960 -7104370 -910252 562033 -2491393 -3724292 -2045966 -1647227 -3291457
10414c291457r2188K774481K890121N17420j421205p31243K707847N369844K307634
$$ -3291457 -3383645 -609164 2280957 2798377 1377172 645929 3353776 8723620 11031254
10405A1031254m962879p689735k416820K453838R327l282212Q21392O762505M193185
$$ 11031254 6068375 -1621360 -4038180 -1584342 -1575015 -4857227 -4035835 2726670 6919855
10396F919855l630033m974648Q40639L803247Q26404j413891k67335N6351p91497
$$ 6919855 3289822 -1684826 -844187 2959060 3785464 2371573 2104238 2160589 1369092
10387A369092J116518L629048O12125n307417n000968J353500L689014j127777
$$ 1369092 2485610 6114658 6726783 1419366 -3581602 -2228102 1460912 333135
10379C33135m743309k208698R23118J11311q09668J713722M453455L869486J261333
$$ 333135 -4410174 -6618872 -5695754 -5584443 -6394111 -4680389 -226934 3642552 4903885
10370D903885j465630l899736l663137J143786N482738K451177m657380n502042
$$ 4903885 3438255 -461481 -4124618 -2980832 2501906 4953083 295703 -5206339
10362e206339J082208N116471J841306j657349N7096K137129j87456k847506j067863
$$ -5206339 -4124131 992340 2833646 1176297 1233393 3370522 3183066 335560 -732303
10353g32303K199533K405412Q48376L42831P2050l42504J493717M387929K380979
$$ -732303 1467230 3872642 4721018 5063849 5135899 4793395 6287112 10675041 13056020
10344A3056020m878897q451912l100054L637767K834890k275878k883138Q68599
$$ 13056020 8177123 -274789 -3374843 262924 3097814 821936 -2061202 -1192603
10336a192603J791706j271158k340781N91599K379476k58196l764931l873719
$$ -1192603 599103 -672055 -3012836 -2421237 -41761 -299957 -4064888 -7938607
10328g938607j321972Q18768J582214J679942J318093L65988p32005j299763r08449
$$ -7938607 -9260579 -8441811 -6859597 -5179655 -3861562 -3495574 -4227579 -5527342 -6435791
10319f435791N78307K580933L789940L535471K601195J781229O30553j147036
$$ -6435791 -5857484 -3276551 513389 4048860 6650055 8431284 9061837 7914801
10311G914801k311037j855784j096227j676461k168655L37290M863624O106665
$$ 7914801 5603764 3747980 2651753 975292 -1193363 -856073 4007551 10114216
10303A0114216J414413m464099m986521o59956K065969N54691o84417J703716
$$ 10114216 11528629 7064530 2078009 1418053 3484022 4038713 3354296 5058012
10295E058012L852303J250435l196990l777831j348397q34999j584722J086862
$$ 5058012 8910315 10160750 6963760 3185929 1837532 1002533 -582189 504673
10287E04673N321139L722987l246100n388163J228377O485489J534038o926165
$$ 504673 5825812 9548799 6302699 914536 2142913 8628402 10162440 3236275
10279C236275p045387J56650L931596R09941k070296q14417J013271K66113r52540
$$ 3236275 -3809112 -3652462 279134 1189075 -881221 -1695638 -682367 -416254 -1368794
10270a368794p18307k86393P5609K035090M472003L682889j11716k020851r914
$$ -1368794 -2087101 -2373494 -2297885 -262795 4209208 7892097 7780381 5759530 5749616
10261E749616K021297O45779k398970m047422m056778l061549m72449L095437
$$ 5749616 7770913 8416692 6017722 1970300 -2086478 -5148027 -5620476 -2525039
10253b525039M530020K043026j843368l164121r30682K365343L313568M26017
$$ -2525039 2004981 4048007 2204639 -959482 -1890164 475179 3788747 4214764
10245D214764m000449n282523j632215K850583L150636J92560r06402J278906
$$ 4214764 214315 -5068208 -6700423 -3849840 -699204 -506644 -1413046 -134140
10237a34140K846280J271319q26915m32651J049646L85926k296573l556861j219144
$$ -134140 2712140 3983459 3156544 2723893 3773539 4159465 1862892 -1693969 -2913113
10228b913113K753229M220339J485430k371630k835031K61073K375305O43694
$$ -2913113 -159884 4060455 5545885 3174255 339224 600297 2975602 3619296
10220C619296k151933k174022k69710K85033m07969M01186K633150L108738R03621
$$ 3619296 1467363 -706659 -976369 -691336 -1099305 -698119 1935031 5043769 5947390
10211E947390j014988n06436O01901k96200k407487k531006L97857L389367K960205
$$ 5947390 4932402 4425966 5027867 4731667 2324180 -206826 191031 3580398 6540603
10202F540603L7944r21737J258092J834380k242890n586127j738157M958136M069383
$$ 6540603 6578547 5656810 6914902 8749282 6506392 920265 -817892 4140244 8209627
10193H209627m073083p209684l61067N486941J126207n490624k532968N852506
$$ 8209627 4136544 -3073140 -3434207 2052734 3178941 -2311683 -4844651 1007855
10185A007855O692525k69392l234196J313509L979833l39893m563174k916101
$$ 1007855 7700380 7430988 4196792 5510301 9490134 9150241 4587067 1670966
10177A670966l10891k187168m715832k228966K816793M396831K317896O94470
$$ 1670966 1360075 -827093 -5542925 -7771891 -4955098 -558267 1759629 2454099
10169B454099P23261N39617k86964o84940p10226q96608o15067N41650J509480
$$ 2454099 3177360 3716977 3430013 2745073 2034847 1138239 523172 1064822 2574302
10160B574302J562059J335951R00160p14718k986083l563810j604394R56560K195348
$$ 2574302 4136361 5472312 6372472 5657754 2671671 -892139 -2496533 -1539973 655375
10151F55375J909049L72863j899285l212820k410935j174895j534690k007361
$$ 655375 2564424 2937287 1038002 -2174818 -4585753 -5760648 -7295338 -9302699
10143i302699K9425L216856L920259K080050N38777l61703k089788l093552r99431
$$ -9302699 -9273274 -6056418 -2136159 -56109 482668 120965 -1968823 -5062375 -6061806
10134f061806J454836l9321k771186n53886M372885L286005l637221n415192K054407
$$ -6061806 -4606970 -4646291 -7417477 -7971363 -3598478 -312473 -3949694 -9364886 -7310479
10125g310479Q090807M090585k516180j046275M571902L003080n072858q096943
$$ -7310479 780328 4870913 2354733 1308458 5880360 8883440 3810582 -4286361
10117d286361k326432L186635J489699l135434m026483j547597M27653J034794
$$ -4286361 -6612793 -3426158 -1936459 -5071893 -9098376 -10645973 -10218320 -9183526
10109i183526J301144J133265Q29996J840433L367830K067550k194794m300394
$$ -9183526 -7882382 -6749117 -5919121 -4078688 -710858 1356692 -838102 -5138496
10101e138496r98968L524505L376578n74414k775634j661452p11892j281411l71340
$$ -5138496 -6137464 -2612959 763619 189205 -2586429 -4247881 -4959773 -6241184 -6612524
10092f612524K870384M051569M32433l560652k563052J128612J017486l195771
$$ -6612524 -3742140 309429 741862 -2818790 -5381842 -4253230 -3235744 -6431515
10084f431515n191678k037235K009458L189511L239450L913404K820943j043063
$$ -6431515 -11623193 -13660428 -11650970 -8461459 -5222009 -1308605 1512338 469275
10076D69275l220523m92855L075685K503194r0833k09606N33606j657442l851739
$$ 469275 -2751248 -3244103 -168418 2334776 2243943 2034337 2567943 910501 -2941238
10067b941238n26665N267612M770192k369459o626027l026256K217937K603444
$$ -2941238 -3467903 1799709 6569901 4200442 -2425585 -5451841 -3233904 -630460
10059f30460K98703p3691Q92954R72979J246855K296990J064524l194693m990570
$$ -630460 -331757 -405448 487506 1460485 2707340 5004330 6068854 2874161 -2116409
10050b116409m72138N171365M510769j134868l929231q39919L311855L527153
$$ -2116409 -2588547 2582818 7093587 5958719 2029488 1189569 4501424 8028577
10042H028577L12562k615025k749547n20709J303143K23998k799592m119670k260207
$$ 8028577 8341139 5726114 2976567 2455858 3759001 3982999 1183407 -2936263 -5196470
10033e196470L29185J450967J881651K291271J243279j233347j936490M16149
$$ -5196470 -4867285 -3416318 -1534667 756604 1999883 766536 -1169954 -753805
10025g53805K042755j85570l265049k561810J112956L427833L043380J645261
$$ -753805 1288950 1103380 -2161669 -4723479 -3610523 -182690 2860690 4505951
10017D505951k18199k523276l065402n02503J605489p30626m715401m002565J373133
$$ 4505951 4287752 1764476 -1300926 -1803429 -197940 -928566 -5643967 -9646532 -8273399
10008h273399M660088K620961k76829J34630J507309K46307j789479n27622L167027
$$ -8273399 -3613311 -992350 -1269179 -1134549 372760 619067 -1170412 -1698034 1468993
9999A468993M369203J279064k426634k846738n54791J189636J142607J083283
$$ 1468993 5838196 7117260 4690626 1843888 1289097 2478733 3621340 4704623
9991D704623K294002K896399L69613l841798m864134q28933L536615K486552k823119
$$ 4704623 6998625 9895024 10264637 6422839 1558705 729772 4266387 6752939 3929820
9982C929820n469358j905371L577520M913061J742891j568895k234845j248867
$$ 3929820 -1539538 -3444909 132611 5045672 6788563 5219668 2984823 1735956
9974A735956k74609L96302N85850j64035q55212M54979L001391K852189j469084
$$ 1735956 1461347 1857649 2443499 2279464 1424252 1879231 4880622 7732811 6263727
9965F263727n227765k995829L300414O203192K674526k323772l439340j476895
$$ 6263727 1035962 -1959867 1340547 7543739 10218265 7894493 4455153 2978258
9957B978258K10996J427386L136749L299247l3672l572717k475011J663732K458664
$$ 2978258 3189254 4616640 7753389 11052636 11018964 7446247 4971236 6634968 9093632
9948I093632j221772l031409Q65772N208561L119843l657821o997866l268876
$$ 9093632 7871860 4840451 5706223 10914784 14034627 10376806 3378940 110064
9940A10064K652416M370317J265607k491396l644136k423406n42454R63482J484374
$$ 110064 2762480 7132797 8398404 5907008 2262872 -160534 -702988 260494 1744868
9931A744868M03497j620509k288659o11298Q44093n24388k362488j4504N480518
$$ 1744868 2148365 527856 -1760803 -2372101 -1528008 -2052396 -4414884 -4429388 1051130
9922A051130P186368K289863k860704j759885K738530L358747n91461l595287
$$ 1051130 8237498 10527361 7666657 5906772 8645302 12004049 11412588 7817301
9914G817301l187431j925084r63862J192401L103603P09978m910832o768752k066772
$$ 7817301 4629870 2704786 1740924 2933325 6036928 6746906 1836074 -4932678 -6999450
9905f999450K786606J530379k401619j211695N242302Q899478M828619k141647
$$ -6999450 -4212844 -2682465 -5084084 -6295779 -1053477 7846001 12674620 10532973
9897A0532973m248009q58836J833398N9824k874477k705024r37696j419540l018457
$$ 10532973 6284964 5426128 7259526 7319350 4444873 1739849 802153 -617387 -3635844
9888c635844j609020J959159K937296J599752K820525N719918L689961k469616
$$ -3635844 -5244864 -3285705 -348409 1251343 4071868 9791786 13481747 11012131
9880A1012131l156512L118438M948203j310982j644473J0564587J5281840o194122
$$ 11012131 7855619 10974057 15922260 14611278 12966805 23531392 38813232 32619110
9872C2619110l5107590l5204352n320556J7924391J3372003Q19375K775015J0132257
$$ 32619110 -2488480 -37692832 -43013388 -25088997 -11716994 -10897619 -8122604 2009653
9864B009653M942660o334901o550220J337493K107913l510486k649296M068407
$$ 2009653 6952313 617412 -5932808 -4595315 -2487402 -5997888 -8647184 -4578777
9856d578777L988196l364128n426591J96818K102741l286171n481554N17405N637619
$$ -4578777 -590581 -3954709 -9381300 -9184482 -7081741 -10367912 -15849466 -15332061 -9694442
9847i694442L427318N3103R59906J331522k493948m344539M22159N193976K820493
$$ -9694442 -6267124 -6214021 -5254115 -3922593 -6416541 -10761080 -10338921 -5144945 -2324452
9838b324452k355617k266191J877892L356348J495878O58047J213396k26506l364471
$$ -2324452 -4680069 -6946260 -5068368 -1712020 -216142 441905 1655301 1428795 -1935676
9829a935676m037311r76278K498163L344903J627116j028917k947084l072788
$$ -1935676 -5972987 -6949265 -4451102 -1106199 520917 -508000 -3455084 -6527872
9821f527872k094640j732831j739237J50503L909890N747186K985639k131522
$$ -6527872 -8622512 -10355343 -12094580 -11944077 -8034187 -2287001 698638 -1432884
9813a432884n497127n524102k789576J661623N452696N379566J566450j433877
$$ -1432884 -6930011 -12454113 -15243689 -13582066 -8129370 -2749804 -1183354 -2617231
9805b617231m66179J763342J075066j669908k153519O90526L332319K745442k05130
$$ -2617231 -3083410 -1320068 -245002 -1914910 -4068429 -3377903 -45584 2699858 2494728
9796B494728k693676k915734q15297K263100M086760L024970k54932l071652l072604
$$ 2494728 -198948 -3114682 -3929979 -1666879 2419881 5444851 5189919 2118267 -954337
9787i54337l53171K545732K892886N09764j999434k392898j445091j179851j414497
$$ -954337 -1307508 1238224 4131110 4640874 2641440 248542 -1196549 -2376400 -3790897
9778c790897m78249R80762K09839k684051l395890N44905N065768M366323q85793
$$ -3790897 -4269146 -3288384 -3078545 -5762596 -9158486 -8613581 -3547813 818510 -67283
9769f7283m061433j412106L215845L928434K00331l516262l754744j026041K165301
$$ -67283 -4128716 -5540822 -2324977 1603457 1803788 -1712474 -5467218 -6493259 -4327958
9760d327958L689658K540343l04999j857434l94229J484866J87989k641659j674208
$$ -4327958 -638300 1902043 1597044 -260390 -654619 830247 1018236 -1623423 -3297631
9751c297631L355832N939507K687825r01088M38044K450519j328190p272150o377088
$$ -3297631 58201 5997708 8685533 7784445 8222489 10673008 9344818 2072668 -4304420
9742d304420O52985L932523O50212o76184M295627P262088J071638p480458p707396
$$ -4304420 -3651435 281088 931300 255116 4550743 11812831 12884469 5404011 -2303385
9733b303385j075202K667550Q39242q87210j04072m18918k732449k964796q4974
$$ -2303385 -3378587 -711037 128205 -759005 -863077 -1281995 -4014444 -6979240 -7064214
9724g064214J352386p54344j975662J339242N735496N558277R44249k854727k556588
$$ -7064214 -5711828 -6466172 -8441834 -7102592 -1367096 4191181 5135430 2280703 -275885
9715b75885j48709P39009l25399n05267J839911M201701L086947q44497l689258
$$ -275885 -424594 314415 -10984 -516251 1323660 5525361 8612308 7767811 4078553
9706D078553m049047l993990l841351r80468M139049O167798K473878k214130
$$ 4078553 29506 -3964484 -7805835 -8786303 -4647254 1520544 3994422 1780292
9698A780292k948436j646559k036925k226405J172343N150208M055081q00218
$$ 1780292 -1168144 -2814703 -4851628 -7078033 -5905690 -755482 3299599 2499381
9690B499381k778675l38270J386756m27603k473410j575421J024772L119540M370051
$$ 2499381 -279294 -617564 769192 341589 -2131821 -3707242 -2682470 437070 4807121
9681D807121M285116J746433j962880l384362j522807P68196R66878k49955r60176
$$ 4807121 9092237 10838670 8875790 5491428 3968621 4736817 5703695 5453740 4493564
9672D493564m89788M48265M99957j024086k440945j006974K644579M202882J924102
$$ 4493564 4003776 4452041 4951998 3927912 1486967 479993 3124572 7327454 9251556
9663I251556m74705j67025j13214l209068n881780l352287K115235M466651K651242
$$ 9251556 8776851 8609826 8496612 5287544 -594236 -3946523 -1831288 2635363 5286605
9654E286605Q9094j827870l310990k249668K169310M731718Q78646m449978l256422
$$ 5286605 5375699 3547829 236839 -2012829 156481 4888199 5766845 1316867 -1939555
9645a939555K376875L265859j809154m489736r93052K493519J039882j740045
$$ -1939555 437320 3703179 1894025 -2595711 -3588763 -1095244 -55362 -1795407
9637a795407j291663O79994N59730j468356l068841k507537J327101O761281P761990
$$ -1795407 -3087070 -2407076 -1847346 -3315702 -6384543 -8892080 -7564979 -803698 6958292
9628F958292R02608p161595p064115o02602K130067r72778j799214K653852M921922
$$ 6958292 7860900 699305 -6364810 -6967412 -4837345 -5810123 -7609337 -4955485 -33563
9619c3563Q36813k998292j133094J752659M00330j770691j79470K197559J028833
$$ -33563 803250 -2195042 -3328136 -1575477 -1175147 -2945838 -3125308 -927749 101084
9610A01084j350848j183992l18002j330633j606998J201858L510738J950730l19403
$$ 101084 -1249764 -2433756 -2751758 -4082391 -5689389 -4487531 -976793 973937 654534
9601F54534L73365J429829m86229k493075n91933L055040M103441K791376J230486
$$ 654534 1027899 2457728 1971499 -521576 -1113509 1941531 6044972 8836348 10066834
9592A0066834j173394m253071m327497l73357K483747R33536j054743o7821M12387
$$ 10066834 8893440 4640369 312872 -60485 2423262 3356798 2302055 2234234 2646621
9583B646621k253110l233977J127670N200261L006217j371731j249809J171999
$$ 2646621 393511 -2840466 -1712796 3487465 6493682 5121951 3872142 5044141
9575E044141K83541k070758j319703l509k167640l487658J268148N965113J396600
$$ 5044141 5327682 3256924 1937221 1933712 -233928 -3721586 -2453438 3511675 4908275
9566D908275p792223q448702N09197O757855L814832j673047l152851k160622
$$ 4908275 -2883948 -11332650 -10823453 -4065598 -250766 -1923813 -5076664 -7237286
9558g237286q29002K111192N023673L426816r80820j142893L232963M347460m53011
$$ -7237286 -8066288 -5955096 -931423 2495393 1514573 371680 3604643 7952103 7499092
9549G499092m335910k961027p00117j194495j481547L02912P97693o41552P26915
$$ 7499092 3163182 202155 -497962 -1692457 -3174004 -2871092 -2073399 -2714951 -1988036
9540a988036N047086M875639k168572p349120m239803Q97044J92327k765243n09333
$$ -1988036 3059050 7934689 5766117 -1583003 -5822806 -4925762 -4733435 -7498678 -8008011
9531h008011M453417M120559r77649k957163J28638K026750o34302l382832j584997
$$ -8008011 -3554594 565965 -411684 -3368847 -3240209 -1213459 -1847761 -5230593 -6815590
9522f815590L124201O008660M640010j05514n265743p246514m568831K67408L145236
$$ -6815590 -3691389 2317271 6957281 6851767 1586024 -5660490 -10229321 -9961913 -6816677
9513f816677K358605n61246k809080k174281J270017M339943L683819L75571j085598
$$ -6816677 -4458072 -5019318 -7828398 -10002679 -8732662 -4392719 -708900 -333329 -1418927
9504a418927Q58281K933468K703807J920084K080862J108985k242651m630228
$$ -1418927 -560646 2372822 5076629 6996713 9077575 10186560 7943909 3313681
9496C313681k867805N98690J226456r09476k138719j251505m04697q25921j209652
$$ 3313681 445876 1044566 2271022 1361546 -777173 -2028678 -2433375 -3259296 -4468948
9487d468948k82401J488622K608234J657318j364056l935186l104156L64878K378401
$$ -4468948 -4751349 -3262727 -654493 1002825 -361231 -4296417 -7400573 -7035695 -4657294
9478d657294J161715n36556l95532j9175j078888j649845K50969K530130K145759
$$ -4657294 -3495579 -4032135 -4427667 -4446842 -5525730 -7175575 -6924606 -4394476 -2248717
9469b248717r482r91426n51744m25653n80034K75223J615041J688515L73235r06972
$$ -2248717 -2258199 -3249625 -3801369 -4227022 -4807056 -4531833 -2916792 -1228277 -855042 -1762014
9459a762014j146726q2546J772748K314435k07366l293521k205542K356025L709152
$$ -1762014 -2908740 -2991286 -1218538 1095897 888531 -2404990 -4610532 -2254507 1454645
9450A454645n39285l532727L77371N806792M219956k534045n148793j118565K856148
$$ 1454645 915360 -2617367 -2239996 3566796 7786752 5252707 103914 -1014651 1841497
9441A841497K322409K57975l27549r00852k082423r17559L160535N468963K856416
$$ 1841497 4163906 4421881 4094332 3193480 1111057 193498 3354033 8822996 11679412
9432A1679412j358339k755808k036475k298172l528369l525984j973312m13776
$$ 11679412 10321073 7565265 5528790 3230618 -297751 -3823735 -5797047 -6210823
9424f210823K81774K46073j67916k10766N97520J188152O10673P22665L613558
$$ -6210823 -5929049 -5682976 -5850892 -6061658 -5464138 -4275986 -3665313 -2942648 670910
9415F70910O485691M144815k477309o114979l680431p37269j820572k850775Q75116
$$ 670910 7156601 11301416 8824107 2709128 -971303 -1708572 -3529144 -6379919 -5504803
9406e504803M877952J984722m764451n208675K311552P707488L882712l347353
$$ -5504803 -626851 1357871 -3406580 -8615255 -6303703 1403785 5286497 1939144
9398A939144m684649n67924J355319j377492l151670K28338N001337N078420P91555
$$ 1939144 -2745505 -3313429 -1958110 -3335602 -6487272 -6258934 -1257597 3820823 4612378
9389D612378j859622P8499K493078O21461l494049l807641M48982L194839O73911
$$ 4612378 2752756 2831255 5324333 5945794 2451745 -1355896 -906914 2287925 2961836
9380B961836k593314q05923L791464M070175j133147n436020m536249j519731
$$ 2961836 368522 -437401 3354063 7424238 6291091 855071 -3681178 -5200909
9372e200909n36405n04280J265070L252717K262756n75579j207407Q08877J715803
$$ -5200909 -5737314 -6241594 -4976524 -1723807 538949 -36630 -1244037 -435160 1280643
9363A280643k35583k091836r67484J800314L095047K097243q1555k661078m600561
$$ 1280643 1045060 -1046776 -2014260 -213946 2881101 4978344 4896789 2235711 -2364850
9354b364850l501022J539291O529226N801465l54720m649847j756000M277075
$$ -2364850 -5865872 -4326581 2202645 8004110 7649390 2999543 1243543 5520618
9346E520618N166089l36545m873482k927093J742569K156655j658926l280233
$$ 5520618 10686707 10350162 5476680 2549587 4292156 6448811 4789885 1509652
9338A509652J48022L609217J604945l853015n929195k082669K928945L490771
$$ 1509652 1657674 5266891 6871836 3018821 -2910374 -4993043 -2064098 1426673
9330A426673o0847k697167j435559J442434K188514N80341n55619K20710J340023
$$ 1426673 1365826 -1331341 -2766900 -1324466 864048 1444389 888770 1109480 2449503
9321B449503J101927j77431j664260l317053m359257k849331J113515L931500
$$ 2449503 3551430 3373999 1709739 -1607314 -5966571 -8815902 -7702387 -3770887
9313c770887K965646N28277K02619J064725j71000k555710j811686K099945L994787
$$ -3770887 -805241 -276964 -74345 990380 819380 -1736330 -3548016 -1448071 2546716
9304B546716J506408j311366q75659N87097j912j067629k30010M83122j505970
$$ 2546716 4053124 2741758 1866099 2453196 2451284 1383655 1153645 1636767 130797
9295A30797l608563k073878Q68954M07624j990883m60194M762488O558975K295475
$$ 130797 -3477766 -5551644 -4682690 -4275066 -6265949 -6726143 -1963655 4595320 6890795
9286F890795j710298n90165J278496j624272n776551l884556K927978O242981
$$ 6890795 5180497 4590332 5868828 4244556 -1531995 -5416551 -2488573 3754408
9278C754408K957834r88518q96843k6561k310432m388464r58862N319445O265877
$$ 3754408 6712242 5723724 4826881 4800320 2489888 -1898576 -2857438 2462007 8727884
9269H727884L2405n920335n231660m92645K219911J878320J194743L98605j965096
$$ 8727884 8760289 2839954 -2391706 -2884351 -664440 1213880 2408623 2807228 842132
9260H42132l803583j298739L864791N059029K59942m180635k244808L428777N590381
$$ 842132 -2961451 -4260190 -395399 4663630 4923572 742937 -1501871 1926906 7517287
9251G517287J903832l234424m713573j572828K971777M307407O56483m088137
$$ 7517287 9421119 6186695 1473122 -99706 2872071 7179478 7835961 3747824
9243C747824m013413J014056M466397K037990k570687l827439k145012j141080
$$ 3747824 -265589 748467 5214864 7252854 4682167 854728 -1290284 -2431364
9235b431364r29158L96672J508275J12064j609016p6897K690486J783607j850927
$$ -2431364 -3360522 -2963850 -1455575 -1343511 -2952527 -3029424 -338938 1444669 -406258
9226d06258k492354N42534J633753j369454l453675j026334K483989L036550K154257
$$ -406258 -2898612 -2356078 -722325 -2091779 -5545454 -6571788 -4087799 -1051249 1103008
9217A103008K632773K984939P36154k368638k928203j217391j76063q31191j715980
$$ 1103008 3735781 6720720 7456874 5088236 2160033 942642 766579 -64612 -1780592
9208a780592j441804K43818K483534L173110Q91066k202785k188721J037669L313054
$$ -1780592 -3222396 -2978578 -495044 2678066 3569132 1366347 -822374 215295 3528349
9199C528349K307921L11564l06319k22353j48970P59135J436886j236563o317593
$$ 3528349 5836270 6147834 5841515 5619162 5470192 6229327 7666213 6429650 112057
9190A12057p584925k220200L944787M317700N86427j069340P16340K438372K424515
$$ 112057 -7472868 -9693068 -5748281 -1430581 -844154 -1913494 -1197154 1241218 3665733
9181C665733K063580J746672M50269j422199k622722l407361m051990k876655
$$ 3665733 5729313 7475985 7926254 6504055 3881333 473972 -3578018 -6454673
9173f454673O33091K870430N70480l499108l908300m37207K068070J082746q68077
$$ -6454673 -5821582 -2951152 -2380672 -5879780 -9788080 -10225287 -8157217 -7074471 -7942548
9164g942548q50263J130311L713967N653222N337053J914792k605432m795657
$$ -7942548 -8792811 -7662500 -3948533 1704689 7041742 8956534 6351102 1555445
9156A555445l637457j083837Q76896J808457J896496J262900N7045j669341l389329
$$ 1555445 -2082012 -3165849 -2288953 -480496 1416000 2678900 2735945 1066604 -2322725
9147b322725l231741J00262M004749L797140p73994m348377l173306K72471K082266
$$ -2322725 -5554466 -5454204 -1449455 2347685 1573691 -2774686 -5947992 -5675521 -3593255
9138c593255K065050J277165q31834l096968j418046M410210P465203K942043
$$ -3593255 -1528205 -251040 -1082874 -4179842 -5597888 -1187678 6277525 9219568
9130I219568l847842n111544j967233q31876k140688j245855J793820K402711
$$ 9219568 5371726 260182 -1707051 -2538927 -4679615 -5925470 -4131650 -1728939
9122a728939N84394R74524L607343L123072j636088n060246l624940m41115Q89036
$$ -1728939 -1144545 -170021 3437322 6560394 4924306 -135940 -3760880 -4201995 -3312959
9113c312959P61157L27298m23594k08041K204139L736319M53369m608131m492109
$$ -3312959 -2551802 -2224504 -2648098 -2856139 -652000 3084319 3537688 -1070443 -5562552
9104e562552L22894K144209r93520k133918J828561M069261k72812n138974l365941
$$ -5562552 -5239658 -3095449 -4088969 -6222887 -4394326 -325065 -597877 -5736851 -9102792
9095i102792J930435L381520R91690M7626J743144L091429K879305J511154j740727
$$ -9102792 -7172357 -3790837 -2799147 -2751521 -1008377 2083052 4962357 6473511 4732784
9086D732784n653431n155798J379090O967875M814346j617452m516490l667580
$$ 4732784 -920647 -6076445 -4697355 2270520 7084866 5467414 950924 -2716656
9078b716656l936575m307605J77784O920018P311725Q31295l115373k86502J840837
$$ -2716656 -6653231 -10960836 -10783052 -3863034 3448691 4279986 1164613 878111 2718948
9069B718948k456328o785414l315525L695188M450405q55150l068967R62424M250530
$$ 2718948 262620 -6522794 -9838319 -6143131 -1692726 -2547876 -5616843 -4654419 -403889
9060d03889J746311k042913j226594K230971K628343l20170k126303j277432q55440
$$ -403889 1342422 -700491 -1927085 303886 2932229 2612059 485756 -791676 -1647116
9051a647116k581298l921903k316297J114814L644394M235606L235582R03367
$$ -1647116 -4228414 -8150317 -10466614 -9351800 -5707406 -1471800 1763782 2667149
9043B667149j914435l118557j316364K109443M144003L073817j59614k883923
$$ 2667149 752714 -2365843 -3682207 -1572764 2571239 5645056 5485442 2601519
9035B601519k879595o17427R00887j58703j733319j074371M51702m38943k544175
$$ 2601519 -278076 -895503 5384 -153319 -1886638 -2961009 -2509307 -2948250 -5492425
9026e492425j265507L082212M242229o3163l521041r69385L175079K286221j724738
$$ -5492425 -6757932 -3675720 566509 503346 -3017695 -3987080 -812001 1474220 -250518
9017b50518k408329L24280J587393J227062L137193N960816L871812k692580o133667
$$ -250518 -2658847 -2334567 -747174 479888 3617081 9577897 13449709 10757129 4623462
9008D623462l492021o25508j663589k517629P73425M541839L819788M45131q29767
$$ 4623462 1131441 505933 -1157656 -3675285 -2901860 1639979 5459767 5904898 5075131
8999E075131J40021O98192R51122K095914K199650r12078m623825m516251j126950
$$ 5075131 5215152 5913344 6864466 8960380 11160030 10247952 5624127 1107876 -19074
8990a9074R00265k31863j598066p49868P93352L42061j860637k843399q55229
$$ -19074 881191 649328 -948738 -1698606 -905254 -563193 -2423830 -5267229 -6122458
8981f122458J904131J780044r25841j525730K111468N170333K509151k801230
$$ -6122458 -4218327 -2438283 -3364124 -4889854 -2778386 2391947 4901098 2099868
8973B099868l443553P99336K664864j102315n157274m501252j121944J351520
$$ 2099868 -1343685 -544349 2120515 1018200 -4139074 -8640326 -9762270 -8410750
8965h410750L149273M691071L420358j140892m299383k719847N84529J994458
$$ -8410750 -5261477 -570406 2849952 1709060 -2590323 -5310170 -4725641 -2731183
8957b731183K923624M975808M823575r5715n287949n119445j443766J21324p20414
$$ -2731183 192441 5168249 9991824 9896109 4608160 -511285 -1955051 -1833727 -2554141
8948b554141l58596R63478P6368k087818j578260J152500J653730p04244j600866
$$ -2554141 -2912737 -1949259 -1872891 -3960709 -5538969 -4386469 -2732739 -3436983 -5037849
8939e037849Q96906L457957L050044P13992j290185k153985j508129P55175K962196
$$ -5037849 -4140943 -682986 2367058 3081050 1790865 -363120 -1871249 -1116074 1846122
8930A846122K892192Q16810j117007k016854k278912j690269l84776j83108j733307
$$ 1846122 4738314 5555124 4438117 2421263 142351 -1547918 -1932694 -2115802 -3849109
8921c849109k119745R11470M315229L818971Q49865K41107K318426K949142R06256
$$ -3849109 -5968854 -5057384 -742155 3076816 3926681 4167788 6486214 9435356 10341612
8912A0341612p32200p31915j368439l079693l186624j422574j148440k929392
$$ 10341612 9609412 8877497 7509058 4429365 1242741 -179833 -1328273 -4257665
8904d257665k370062K545034O881109N602753J086206r74304l98194j718247n450508
$$ -4257665 -6627727 -4082693 2798416 8401169 9487375 8513071 8114877 6396630 946122
8895I46122n981933m4651P005137P193410M66449m970042l258920K081426L910726
$$ 946122 -5035811 -5080462 1924675 9118085 9584534 4614492 1355572 3436998 7347724
8886G347724Q77710k741288m251998m430001l145908Q82671N195186M484363j451246
$$ 7347724 8225434 5484146 1232148 -3197853 -6343761 -5461090 -265904 4218459 2767213
8877B767213o122928n336288k312089q68900M04403K964005L555290L60311j731912
$$ 2767213 -3355715 -8692003 -11004092 -11872992 -11468589 -8504584 -4949294 -4588983 -6320895
8868f320895J284128M730881K673505j387846j32915M663464M717851r41398m817125
$$ -6320895 -5036767 -305886 2367619 979773 846858 5510322 10228173 9286775 4469650
8859D469650l441095j206650p73442O72183L410495K798107j640677l299057Q14976
$$ 4469650 1028555 -178095 -951537 -279354 3131141 5929248 4288571 989514 1804490
8850A804490M075141L70968o072677p043943j839925L438384M783694L241893
$$ 1804490 5879631 6250599 177922 -6866021 -8705946 -5267562 -483868 2758025
8842B758025J268222M49315J194348J661679r25544n514223o759796k192187L337323
$$ 2758025 4026247 4475562 5669910 7331589 6406045 891822 -5867974 -8060161 -4722838
8833d722838L945118O88517q83980P92327J854023l53770l282596l056318O6950
$$ -4722838 -777720 -89203 -973183 -180856 1673167 1319397 -1963199 -5019517 -4952567
8824d952567K054522O14810j316817N62708M868956M819392k167073q766365o465680
$$ -4952567 -2898045 -2283235 -3600052 -3037344 1831612 6651004 4483931 -4282434 -10748114
8815a0748114K229179O587076K247240l815878m295313o91840J793059K510167
$$ -10748114 -8518935 -1931859 315381 -3500497 -7795810 -8487650 -6694591 -4184424
8807d184424L617145M212611J660967l124760o135400n224701j728518J839623
$$ -4184424 -567279 3645332 5306299 2181539 -3953861 -9178562 -10907080 -9067457
8799i067457L427797K139331m80940j101811J464373M212042L636896K90861k125446
$$ -9067457 -5639660 -3500329 -3981269 -5083080 -3618707 593335 4230231 4521092 2395646
8790B395646j375275J035487J759444p46086l964530l331370J975260O396158
$$ 2395646 1020371 2055858 3815302 3069216 -895314 -4226684 -2251424 4144734
8782D144734M136963k633177n706062j512684M267757M477090p19721n249651
$$ 4144734 8281697 5648520 -57542 -1570226 2697531 7174621 6454900 1205249
8774A205249m881895j137380J300267l34411l707279l477163K024906P459193
$$ 1205249 -3676646 -4814026 -3513759 -3848170 -7555449 -11032612 -9007706 -1548513
8766a548513O618034O03272m020071m199171k666504j730162n07361J043300J116343
$$ -1548513 5069521 5672793 1652722 -2546449 -5212953 -6943115 -7450476 -6407176 -5290833
8757e290833M08720J876411M638817L987500o37056l884868l113079k148874l274739
$$ -5290833 -4882113 -3005702 1633115 5620615 4983559 1098691 -2014388 -4163262 -7438001
8748g438001k577438K033808N020208J644946l465781l195401J087391K767402
$$ -7438001 -10015439 -7981631 -2961423 -1316477 -4782258 -7977659 -6890268 -4122866
8740d122866Q09573k67515Q51707J049093m02012n18952J541158K814433J415987
$$ -4122866 -3313293 -3580808 -2729101 -1680008 -2082020 -2600972 -1059814 1754619 3170606
8731C170606j106637k631982k327875o6000K895105L618693J073265j356600l22438
$$ 3170606 2063969 -568013 -2895888 -2961888 -66783 3551910 4625175 3268575 2946137
8722B946137K172200J695994j899856m665072m153842j107940K877878N492843
$$ 2946137 5118337 6814331 4914475 249403 -3904439 -5012379 -2134501 3358342
8714C358342L502517k931919p413051m066747L779027P027722K636498l274349
$$ 3358342 6860859 3928940 -3484111 -7550858 -3771831 3255891 5892389 2618040
8706B618040m467715j635799Q19217P74671o18918j151667M00796K722028K718025
$$ 2618040 -1849675 -3485474 -2666257 -1891586 -2510504 -3662171 -3261375 -539347 2178678
8697B178678l35760k869963j892747K75853j11036j708927m54695K827550K989668
$$ 2178678 1842918 -1027045 -2919792 -2643939 -2754975 -4463902 -4918597 -2091047 898621
8688H98621j106704m319669k597384J823525M173564K709419p07213k918776j822474
$$ 898621 -208083 -4527752 -7125136 -5301611 -1128047 1581372 874159 -2044617 -3867091
8679c867091J352230K638314N58535j049404J109808L659359J529322l075394
$$ -3867091 -2514861 123453 681988 -367416 742392 4401751 5931073 2855679
8671B855679l500721M47512K082464j048668l511225j583605J040598N89940n54323
$$ 2855679 -645042 -197530 1884934 836266 -2674959 -4258564 -3217966 -2628026 -3182349
8662c182349O55221K062569Q29029j050600p62682J8744j069649j795019O69513
$$ -3182349 -2527128 -464559 364470 -686130 -1448812 -1430068 -2499717 -4294736 -3625223
8653c625223L572704K234713k218895m432823k840202p23386L3123R39689K440679
$$ -3625223 -52519 2182194 -36701 -4469524 -7309726 -8033112 -7999989 -7060300 -4619621
8644d619621K331872j47200k381824k025539J02362J921556K654527K420894J180149
$$ -4619621 -2287749 -2434949 -4816773 -6842312 -6739950 -4818394 -2163867 257027 1437176
8635A437176o49982j678163p86546J393436K724680J466664j693887l689061k152359
$$ 1437176 787194 -890969 -1677515 -284079 2440601 3907265 2213378 -1475683 -3628042
8626c628042J548059L791536L265032J956576J248458m4385k307301k906589m9083
$$ -3628042 -2079983 1711553 4976585 6933161 8181619 8137234 5829933 2923344 2874261
8617B874261L453660L500274K86394k583449l386503l325114l057125j839645
$$ 2874261 6327921 9828195 10114589 7531140 4144637 819523 -2237602 -4077247
8609d077247j57271K68874l02418M21977K640893L327940Q45381j915687j249983
$$ -4077247 -4234518 -3965644 -4268062 -3846085 -1205192 2122748 2968129 1052442 -197541
8600a97541K227476M522089L413322M74469j712889k318191j939930j197619n20509
$$ -197541 2029935 6552024 9965346 10439815 8726926 6408735 4468805 3271186 2750677
8591B750677l91331q56868j228441j027772q34054j218876j135705J031180M322876
$$ 2750677 2359346 1502478 274037 -753735 -1587789 -2806665 -3942370 -2911190 1411686
8582A411686M999291J208290l473972l820571Q0525K729026P96595k477492k542417
$$ 1411686 6410977 7619267 4145295 324724 405249 3134275 3930870 1453378 -1089039
8573a089039k74183L7680k225167l223521r48857J867907K467246K035380K617164
$$ -1089039 -1363222 -1325542 -3550709 -6774230 -7723087 -5855180 -3387934 -1352554 1264610
8564A264610L054369J314473j120798j128470O12229K37788k843990m271715j205030
$$ 1264610 4318979 5633452 4512654 3384184 3996413 4234201 1390211 -2881504 -4086534
8555d086534L102508L908346J455006m20477l02527j86749j246174k085083j365524
$$ -4086534 -984026 2924320 4379326 3958849 3656322 3469573 2223399 138316 -1227208
8546a227208M26909J952740J821743q26218m300191m401107K27975M425367K725002
$$ -1227208 -800299 1152441 2974184 2147966 -2152225 -6553332 -6325357 -1899990 825012
8537H25012k079990k579517J459968K494319k030028m688269j72373N399944L965806
$$ 825012 -1254978 -3834495 -2374527 119792 -1910236 -6598505 -6770878 -1370934 2594872
8528B594872j812498l475206j69344J638858l92097k003275p77529Q00207J158970
$$ 2594872 782374 -2692832 -2862176 -1223318 -1615415 -3618690 -4396219 -3596012 -2437042
8519b437042J644566K084917O24128j516110j136776R00323R42092l70424O62924
$$ -2437042 -792476 1292441 1916569 400459 -736317 164006 1106098 735674 1398598
8510A398598K672003O64893l728792k966995L216381N473717j10834m806435j422036
$$ 1398598 4070601 4735494 1006702 -1960293 1256088 6729805 6618971 1812536 390500
8501C90500L775382J862808l886328m150900R15619L118807K00003k008228n23874
$$ 390500 4165882 6028690 2142362 -2008538 -1092919 2025888 2225891 217663 -306211
8492c06211R29072l85020k226302k246162j004850N74636K023012J825691m78601
$$ -306211 622861 237841 -1988461 -4234623 -5239473 -4664837 -2641825 -816134 -1294735
8483a294735j849082P474J966860M81466j350177J350701N465503L482997l626581
$$ -1294735 -3143817 -3136343 -1169483 -688017 -2038194 -687493 4778010 8261007 4634426
8474D634426o274462o12246N418956L676045l423258p647309n321245O32512N185698
$$ 4634426 -1640036 -2252282 3166674 6842719 3419461 -4227848 -9549093 -8916581 -3730883
8465c730883N002915P04747l228951l413713j975533k441918l131447m10937L323262
$$ -3730883 1272032 1976779 -1252172 -4665885 -6641418 -9083336 -12214783 -12625720 -9302458
8456i302458K712214l91620R80512O176069O537969l1024m821206k573473P56902
$$ -9302458 -6590244 -6981864 -6001352 174717 6712686 6681662 1860456 -713017 43885
8447D3885R511k07474L917517O106586R15408m864435k877290J907186o44601
$$ 43885 53396 -154078 3763439 9870025 10785433 5920998 3043708 4950894 4306293
8438D306293p982654q448582j20876O819402O171459K369507J56963j551105l367651
$$ 4306293 -3676361 -12124943 -12245819 -5426417 745042 3114549 3271512 1720407 -1647244
8429a647244k484085J103087L069653J837030N95714R16478Q69669K39076Q27264
$$ -1647244 -4131329 -3028242 41411 1878441 2474155 3390633 4260302 4499378 5326642
8420E326642J304989r62340l170352n62741L535486J156207o035211p283671k45187
$$ 5326642 6631631 5669291 2498939 1936198 5471684 6627891 592680 -6690991 -6936178
8411f936178M167691m97727n634557k287621M294902M499634k1733j403593M09776
$$ -6936178 -2768487 -3266214 -8900771 -11188392 -6893490 -2393856 -2415589 -3819182 -3409406
8402c409406Q619j838548k74804K850994J434595k942098k255114M372247Q154205
$$ -3409406 -3400787 -5239335 -5514139 -2663145 -1228550 -4170648 -6425762 -2053515 6100690
8393F100690L712063l526107n782834k393221J982957L708596K323152j44448
$$ 6100690 9812753 6286646 503812 -1889409 93548 3802144 6125296 5980848
8385E980848p00263J108877J647867j604972m897223k973947K341612M108424
$$ 5980848 5280585 6389462 8037329 6432357 1535134 -1438813 902799 5011223
8377E011223L89985l536490l418788o71883K045257M255367N264081L435421m40018
$$ 5011223 5401208 1864718 -1554070 -2225953 -180696 4074671 9338752 12774173 12334155
8368A2334155l226915l875368l758400k643622N84959L290195J462800k562585
$$ 12334155 9107240 5231872 1473472 -1170150 -585191 2705004 4167804 1605219
8360A605219j813945M053666O630029J240593n531985n569094l32958L310347
$$ 1605219 -208726 3844940 10474969 11715562 6183577 614483 281525 3591872
8352C591872L275194K108662N99055k005084l841441k405796P80159K279041J971519
$$ 3591872 6867066 8975728 9574783 7569699 3728258 1322462 2102621 4381662 6353181
8343F353181J884556J744864K20665j326083j056474p70517k799993m613882k258053
$$ 6353181 8237737 9982601 10203266 8877183 7820709 7050192 4250199 -363683 -2621736
8334b621736K074442K317455j787493l895873j001743K266325J602574n97238
$$ -2621736 -547294 1770161 -17332 -3913205 -4914948 -2648623 -1046049 -1643287
8326a643287l34469J300072Q82429j203843j845140m50089Q62424J142423J195370
$$ -1643287 -1977756 -677684 204745 -999098 -2844238 -3294327 -2431903 -1289480 -94110
8317i4110J080295K10522n16902K86786J552898P82157j733367k701874p40189
$$ -94110 986185 1196707 679805 966591 2519489 3301646 1568279 -1133595 -1873784
8308a873784J283097M45634j887927k087942P42310L975507M883954K889098q87660
$$ -1873784 -590687 -145053 -2032980 -4120922 -3378612 596895 5480849 8369947 7482287
8299G482287m158365m167709n19725K862426J675346k527578l693825o1081K750875
$$ 7482287 3323922 -843787 -1363512 1498914 3174260 646682 -3047143 -3108224 -357349
8290c57349K81411l522389k549219J357231J420316k244283j989225M516194Q798461
$$ -357349 -75938 -3598327 -6147546 -4790315 -3369999 -5614282 -7603507 -3087313 5711148
8281E711148L675380n353096p509057j798144K847735J214911k024415j174387
$$ 5711148 9386528 4033432 -3475625 -5273769 -2426034 -1211123 -3235538 -4409925
8273d409925K007565K306451p86505l299033l063610j714167r95924m98581M62189
$$ -4409925 -2402360 -95909 -882414 -4181447 -7245057 -8959224 -9955148 -10453729 -9991540
8264i991540J274917J413667J686913K858082M046609L718966J718812p15427
$$ -9991540 -8716623 -7302956 -5616043 -2757961 1288648 5007614 6726426 6010999
8256F010999k515513l313816k799400q97054J346692K305381J516934m5144j428463
$$ 6010999 3495486 181670 -2617730 -3514784 -2168092 137289 1654223 1609079 180616
8247A80616k226729j835155J2972J863571J868459Q07840J110181K285788R57468
$$ 180616 -2046113 -3881268 -3868296 -2004725 -136266 671574 1781755 4067543 5025011
8238E025011k966201m404990n60016L830378L271687J4486j11035K334542J812068
$$ 5025011 2058810 -2346180 -2906196 924182 4195869 4210355 4099320 6433862 8245930
8229H245930k009111l507330j181597k74267k928445l708757P74047M880309K486891
$$ 8245930 6236819 2729489 1547892 1273625 -1654820 -5363577 -4589530 290779 2777670
8220B777670l075807m449585j574777k30683j668711j368045K226312M757647
$$ 2777670 -298137 -4747722 -6322499 -6553182 -8221893 -9589938 -7363626 -2605979
8212b605979L082585l11886k093101k685563l399373k616429J502490O313911
$$ -2605979 476606 164720 -1928381 -4613944 -8013317 -10629746 -9127256 -2813345
8204b813345O502089R56952m824551m852188J26362L718757K037180k014061l751662
$$ -2813345 3688744 4645696 -178855 -5031043 -4904681 -1185924 851256 -1162805 -4914467
8195d914467k902461j915952q10514J838400M327765L493507N25852k79544J310386
$$ -4914467 -7816928 -9732880 -10543394 -8704994 -4377229 -883722 -357870 -637414 672972
8186F72972J345071p47818j082723Q26703M75395k757202k972190J872146M874069
$$ 672972 2018043 1270225 187502 1014205 1489600 -1267602 -4239792 -2367646 2506423
8177B506423J277779k900395p54603L744956K776420k012035l231238q98994j132548
$$ 2506423 3784202 883807 129204 3874160 6650580 4638545 1407307 508313 -624235
8168f24235l839377k662159K994459O196421L883668P55747O3142p82463l145299
$$ -624235 -4463612 -7125771 -4131312 2065109 5948777 6704524 6767666 5985203 2839904
8159B839904l865064j834177n90940j540746j364664J232476K963931K662000
$$ 2839904 -1025160 -2859337 -3450277 -4991023 -6355687 -5123211 -2159280 502720
8151E02720L395343M994252K171636n655825j0079842m974684L872715O620887
$$ 502720 3898063 8892315 11063951 5408126 -4671716 -9646400 -5773685 847202
8143H47202K378748j790004j677961J20911l77388l491561n742176l119555L862261
$$ 847202 3225950 1435946 -242015 -121104 -498492 -3990053 -9732229 -12851784 -8989523
8134h989523Q436432M904976k395790l598322K254921N110783p49928p772802
$$ -8989523 -553091 4351885 1956095 -1642227 612694 5723477 4973549 -2799253
8126b799253o995870j031598K154536J927288K790346M301215K490871j354680
$$ -2799253 -9795123 -10826721 -8672185 -6744897 -3954551 346664 2837535 1482855
8118A482855k132005K36443J255088J78959M21078K211296K096080k36534j431948
$$ 1482855 -649150 -412707 842381 1021340 1442418 3653714 5749794 5513260 4081312
8109D081312j015323j918085l950861l196822J009554M440226M561981L282220
$$ 4081312 3065989 1147904 -2802957 -5999779 -4990225 -549999 4011982 7294202
8101G294202K035196k55281k948015l089003r12710n40234l004806l846584l27498
$$ 7294202 9329398 9074117 6126102 3037099 2124389 1584155 -1420651 -5267235 -5594733
8092e594733L935645M695362K903712J354505k65981k847604l918039j013658
$$ -5594733 -1659088 3036274 5939986 7294491 7028510 4180906 262867 -750791
8084g50791L213677L877031O94246k165628k477896k198372k981905l155559q04489
$$ -750791 2462886 6339917 7034163 4868535 2390639 192267 -2789638 -5945197 -6749686
8075f749686K556444L689927K089609N05394P70260J162842n47925k966544k786934
$$ -6749686 -4193242 -503315 1586294 2091688 2861948 4024790 3476865 510321 -2276613
8066b276613k58348O59338j381651k511371J86243L565387L264415O22217n8516
$$ -2276613 -2534961 -1875623 -3257274 -5768645 -5582402 -2017015 1247400 1869617 1811101
8057A811101J060808L27643k144510k424352j50471L28258k362471l795680j125671
$$ 1811101 2871909 3199552 1055042 -1369310 -1519781 -1191523 -3553994 -7349674 -8475345
8048h475345K157537K292750J310142K730588M906300L599314r08713l983053
$$ -8475345 -6317808 -4025058 -2714916 15672 4921972 8521286 7612573 3629520
8040C629520l145293o33743M39094m02821j603593j759310q01897K38539P27299
$$ 3629520 484227 -149516 289578 -113243 -1716836 -3476146 -4278043 -4039504 -3312205
8031c312205J403652K694160K822384K38647k525214j372263K519317L200510
$$ -3312205 -1908553 785607 3607991 3846638 1321424 -50839 2468478 5668988
8023E668988r72986m100506j855439J515264M13438k535341j046103L653760M322174
$$ 5668988 4696002 595496 -1259943 255321 668759 -1866582 -2912685 741075 5063249
8014E063249k35411k823178O22164M482424K249170l687829o010709k791126J315716
$$ 5063249 4827838 2004660 2626824 7109248 9358418 5670589 -340120 -3131246 -1815530
8005a815530K624699K306832K441681K060496q86206n291926o879544l035663
$$ -1815530 809169 3116001 5557682 7618178 6731972 1440046 -5439498 -8475161
7997h475161L260405N951696K975986q68830j13336L628799L572725k324236p509124
$$ -8475161 -5214756 736940 3712926 2844096 2730760 6359559 9932284 7608048 98924
7988I8924n449642J110533L857513O05317j987495J184029N477741L073889m925703
$$ 98924 -5350718 -4240185 -382672 222645 -1764850 -580821 4896920 7970809 3045106
7979C045106r027120m487750K059541K433664j566330k088388K352047N615548
$$ 3045106 -5982014 -10469764 -8410223 -5976559 -7542889 -9631277 -7279230 -1663682
7971a663682M554837L062238L553244K108646l361627o737609k217069N292512
$$ -1663682 2891155 5953393 9506637 11615283 8253656 1516047 -701022 4591490
7963D591490O095638l10436n081591l258228O34436J352615J14087K08344J176457
$$ 4591490 10687128 10376692 5295101 2036873 2671309 4023924 4138011 4346355 5522812
7954E522812J042177L31722L56238K81172j128468k848615k944959j113229J372347
$$ 5522812 6564989 6896711 7252949 7534121 6405653 3557038 612079 -501150 871197
7945H71197K751028J574596j482641l016995j022840J259115k23664l036102j302374
$$ 871197 3622225 5196821 3714180 697185 -325655 933460 709796 -2326306 -3628680
7936c628680L942009M842031p97599m902644j282375M609284M147875j584568
$$ -3628680 313329 5155360 4357761 -544883 -1827258 2782026 6929901 5345333
7928E345333m371212j034457L514981L782493p41164o190819p226069j789677
$$ 5345333 974121 -60336 3454645 7237138 6495974 305155 -6920914 -8710591
7920h710591M561836L453127m263901p570010j050453N998556L673512k923593
$$ -8710591 -4148755 -695628 -4959529 -12529539 -13579992 -7581436 -3907924 -6831517
7912f831517k674078L067135L976330p44670j757944K994433M781197K59616k702785
$$ -6831517 -9505595 -6438460 -2462130 -3206800 -4964744 -1970311 2810886 3070502 367717
7903C67717J25756J579518l309820p398378l291897M157922N966736K327844o10750
$$ 367717 493473 2072991 -1236829 -8635207 -11927104 -7769182 -1802446 525398 -85352
7894h5352j105897q21280J080429M811151N708163R88300l641668k034476J944823
$$ -85352 -1191249 -2012529 -932100 3879051 9587214 10575514 6933846 4899370 6844193
7885F844193N29572m894660o113414j514144K022878M39387k498631k392993L52393
$$ 6844193 7373765 2479105 -3634309 -5148453 -3125575 -2686188 -5184819 -7577812 -7225419
7876g225419L445296N565359N381837K256134j544438k983347k215242j169642
$$ -7225419 -3780123 1785236 7167073 9423207 7878769 4895422 2680180 1510538
7868A510538J65844K231048K962926R56661q67926K34398J475429n65538k876441
$$ 1510538 1676382 3907430 6870356 7827017 6959091 7193489 8668918 8103380 5226939
$$ [...]
##END NTUPLES=NMR SPECTRUM
##END=
