##TITLE=31Pdec_SR80 Gly2
 CDCl3, 24 sc
 31.08.2021
##JCAMPDX= 6.0         $$ Bruker NMR JCAMP-DX V2.0
##DATA TYPE= NMR SPECTRUM
##DATA CLASS= NTUPLES
##ORIGIN= UXNMR, Bruker Analytische Messtechnik GmbH
##OWNER= root
$$ XWIN-NMR		Version 3.5
$$ Tue Aug 31 11:43:26 2021 Russian Standard Time (UT+4h)  she@DPX200
##.OBSERVE FREQUENCY= 81.013821
##.OBSERVE NUCLEUS= ^31P
##.ACQUISITION MODE= SIMULTANEOUS
##.ACQUISITION SCHEME= undefined
##.AVERAGES= 24
##.DIGITISER RES= 16
##SPECTROMETER/DATA SYSTEM= spect
##.PULSE SEQUENCE= zgpg30
##.SOLVENT NAME= CDCl3
##.SHIFT REFERENCE= (INTERNAL, CDCl3, 0, 248.564)
##AUDIT TRAIL= $$ (NUMBER, WHEN, WHO, WHERE, WHAT)
$$ ##TITLE= Audit trail, XWIN-NMR		Version 3.5
$$ ##JCAMPDX= 5.01
$$ ##ORIGIN= Bruker BioSpin GmbH
$$ ##OWNER= she
$$ F:/spectra/data/she/nmr/P31/1/pdata/1/auditp.txt
$$ ##AUDIT TRAIL=  $$ (NUMBER, WHEN, WHO, WHERE, WHAT)
(   1,<2021-08-31 11:41:30.18 +0400>,<she>,<DPX200>,
      <created by zg, POWCHK disabled, PULCHK disabled
       configuration hash MD5:
       00 E9 B6 7A A2 85 ED C7 34 08 36 98 17 FE 4E 26
       data hash MD5: 32K
       8B C5 5F 2E 17 92 6A 0C 9A 35 C3 BC 27 C8 A7 E2>)
(   2,<2021-08-31 11:41:32.90 +0400>,<she>,<DPX200>,
      <Start of raw data processing
       efp BC_mod = 2 LB = 1 FT_mod = 6 PKNL = 1 PHC0 = -7757.956 PHC1 = 121.8734 SI = 64K 
       data hash MD5: 64K
       99 C6 7C 80 98 F9 7B 91 25 8E 6A F4 59 8E 48 1A>)
(   3,<2021-08-31 11:41:56.90 +0400>,<she>,<DPX200>,
      <pk PHC0 = 81.15858 PHC1 = -195.4001 
       data hash MD5: 64K
       97 63 0F 35 AD 8C 35 17 6D 85 68 14 D7 CB 5C E6>)
(   4,<2021-08-31 11:42:00.26 +0400>,<she>,<DPX200>,
      <abs ABSG = 5 
       data hash MD5: 64K
       4A 36 1E D5 B2 8B 57 60 52 2C 8D 3E 8F F9 03 E0>)
$$ ##END=
$$ 
$$ hash MD5
$$ 58 01 98 90 3E 1D BF 6D AC 39 B2 BE A2 B1 D9 A9
##$RELAX= 
##$RELAX= 
##$RELAX= 
##$RELAX= 
##$RELAX= 
##$RELAX= 
##$RELAX= 
##$RELAX= 
$$ Bruker specific parameters
$$ --------------------------
##$DU= <F:/spectra>
##$EXPNO= 1
##$NAME= <P31>
##$PROCNO= 1
##$TYPE= <nmr>
##$USER= <she>
##$AMP= (0..31)
100 100 100 100 100 100 100 100 100 100 100 100 100 100 100 100 100 100 
100 100 100 100 100 100 100 100 100 100 100 100 100 100 
##$AQSEQ= 0
##$AQ_mod= 1
##$AUNM= <au_zg>
##$AUTOPOS= <>
##$BF1= 81.014009
##$BF2= 200.13
##$BF3= 200.13
##$BF4= 200.13
##$BF5= 200.13
##$BF6= 200.13
##$BF7= 200.13
##$BF8= 200.13
##$BYTORDA= 1
##$CFDGTYP= 0
##$CFRGTYP= 5
##$CHEMSTR= <none>
##$CNST= (0..31)
1 1 145 1 1 1 1 1 1 1 1 1 1 1 1 1 1 1 1 1 1 1 1 1 1 1 1 1 1 1 1 1 
##$CPDPRG= <waltz16>
##$CPDPRG1= <>
##$CPDPRG2= <waltz16>
##$CPDPRG3= <>
##$CPDPRG4= <mlev>
##$CPDPRG5= <mlev>
##$CPDPRG6= <mlev>
##$CPDPRG7= <mlev>
##$CPDPRG8= <mlev>
##$CPDPRGB= <>
##$CPDPRGT= <>
##$D= (0..31)
0 1 0 0 0 0 0 0 0 0 0 0.03 2e-05 3e-06 0 0 0 0 0 0 0 0 0 0 0 0 0 0 0 0 
0 0 
##$DATE= 1630395689
##$DBL= (0..7)
120 120 120 11 120 120 24 19 
##$DBP= (0..7)
150 150 150 150 150 150 150 150 
##$DBP07= 0
##$DBPNAM0= <>
##$DBPNAM1= <>
$$ [...]
##$SUBNAM3= <"">
##$SUBNAM4= <"">
##$SUBNAM5= <"">
##$SUBNAM6= <"">
##$SUBNAM7= <"">
##$SUBNAM8= <"">
##$SUBNAM9= <"">
##$SW= 501.771253377433
##$SWIBOX= (0..15)
0 1 3 0 0 0 0 0 0 0 0 0 0 0 0 0 
##$SW_h= 40650.406504065
##$TD= 32768
##$TD0= 1
##$TE= 0
##$TE2= 300
##$TE3= 300
##$TEG= 300
##$TL= (0..7)
0 120 53 12 22 120 120 120 
##$TP= (0..7)
150 150 150 150 150 150 150 150 
##$TP07= 0
##$TPNAME0= <>
##$TPNAME1= <>
##$TPNAME2= <>
##$TPNAME3= <>
##$TPNAME4= <>
##$TPNAME5= <>
##$TPNAME6= <>
##$TPNAME7= <>
##$TPOAL= (0..7)
0.5 0.5 0.5 0.5 0.5 0.5 0.5 0.5 
##$TPOFFS= (0..7)
0 0 0 0 0 0 0 0 
##$TUNHIN= 0
##$TUNHOUT= 0
##$TUNXOUT= 0
##$USERA1= <user>
##$USERA2= <user>
##$USERA3= <user>
##$USERA4= <user>
##$USERA5= <user>
##$V9= 5
##$VALIST= <valist>
##$VCLIST= <CCCCCCCCCCCCCCC>
##$VD= 0
##$VDLIST= <DDDDDDDDDDDDDDD>
##$VPLIST= <PPPPPPPPPPPPPPP>
##$VTLIST= <TTTTTTTTTTTTTTT>
##$WBST= 1024
##$WBSW= 4
##$XGAIN= (0..3)
0 0 0 0 
##$XL= 0
##$YL= 0
##$YMAX_a= 2846
##$YMIN_a= -4500
##$ZGOPTNS= <>
##$ZL1= 120
##$ZL2= 120
##$ZL3= 120
##$ZL4= 120
##$ABSF1= 248.5645
##$ABSF2= -253.2056
##$ABSG= 5
##$ABSL= 3
##$ALPHA= 0
##$AQORDER= 0
##$ASSFAC= 0
##$ASSFACI= 0
##$ASSFACX= 0
##$ASSWID= 0
##$AUNMP= <proc_1d>
##$AZFE= 0.1
##$AZFW= 0.5
##$BCFW= 0
##$BC_mod= 2
##$BYTORDP= 0
##$COROFFS= 0
##$CY= -3
##$DATMOD= 1
##$DC= 0
##$DFILT= <>
##$DTYPP= 0
##$F1P= 0
##$F2P= 0
##$FCOR= 1
##$FTSIZE= 65536
##$FT_mod= 6
##$GAMMA= 0
##$GB= 0
##$INTBC= 1
##$INTSCL= 5.30512e-09
##$ISEN= 30
##$LB= 1
##$LEV0= 0
##$LPBIN= 0
##$MAXI= 10000
##$MC2= 0
##$MEAN= 0
##$ME_mod= 0
##$MI= 50
##$NCOEF= 0
##$NC_proc= -8
##$NLEV= 6
##$NOISF1= 182.463
##$NOISF2= 159.3651
##$NSP= 0
##$NTH_PI= 0
##$NZP= 0
##$OFFSET= 248.5645
##$PC= 4
##$PHC0= -7676.797
##$PHC1= -73.5267
##$PH_mod= 1
##$PKNL= yes
##$PPARMOD= 0
##$PSCAL= 0
##$PSIGN= 0
##$REVERSE= no
##$SF= 81.014009
##$SI= 65536
##$SIGF1= 159.3651
##$SIGF2= -187.1042
##$SINO= 113.3802
##$SIOLD= 16384
##$SREGLST= <1H.CDCl3>
##$SSB= 0
##$STSI= 65536
##$STSR= 0
##$SW_p= 40650.406504065
##$SYMM= 0
##$S_DEV= 0
##$TDeff= 32768
##$TDoff= 0
##$TI= <>
##$TILT= no
##$TM1= 0
##$TM2= 0
##$TOPLEV= 0
##$USERP1= <user>
##$USERP2= <user>
##$USERP3= <user>
##$USERP4= <user>
##$USERP5= <user>
##$WDW= 1
##$XDIM= 65536
##$YMAX_p= 476206272
##$YMIN_p= -21837414
$$ End of Bruker specific parameters
$$ ---------------------------------
##NTUPLES= NMR SPECTRUM
##VAR_NAME=  FREQUENCY,     SPECTRUM/REAL,   SPECTRUM/IMAG
##SYMBOL=    X,             R,               I
##VAR_TYPE=  INDEPENDENT,   DEPENDENT,       DEPENDENT
##VAR_FORM=  AFFN,          ASDF,            ASDF
##VAR_DIM=   65536,         65536,           65536
##UNITS=     HZ,            ARBITRARY UNITS, ARBITRARY UNITS
##FACTOR=    0.620285442955139, 1,           1
##FIRST=     20137.2065510759, 0,            0
##LAST=      -20513.1999529892, 0,           0
##MIN=       -20513.1999529892, -21837414,   0
##MAX=       20137.2065510759, 476206272,    0
$$ Real data points
##PAGE= N=1
##DATA TABLE= (X++(R..R)), XYDATA
$$ [...]
15145 -3628640 -3650166 -997808 -708268 -2914810 -2694237 1561426 5361020 5361499 4022921
15136 4022921 4259542 4314846 1812970 -1002274 -581182 2107003 3500407 3188178 3432862
15127 3432862 4567551 5213851 5847966 7645829 8606413 5639858 429139 -1659072 745096
15118 745096 2990631 1384725 -2054974 -3674378 -3143920 -2046458 -855128 186323
15110 186323 123291 -251766 2049093 7303808 10627986 8101259 3049591 1976991 5667874
15101 5667874 8826027 7968357 5013184 2627373 677204 -1033501 -619477 2438316
15093 2438316 4607680 2464337 -2030364 -3741742 -1319956 1184763 151674 -2827050
15085 -2827050 -3501144 -693548 2491595 2814370 510467 -1737091 -2155262 -1097287 430446
15076 430446 1935563 2931383 2634990 1030054 -611767 -1198412 -1159545 -1283832 -778421
15067 -778421 2032562 6910694 10829229 10584508 5880584 -417417 -4729363 -5421035 -3555561
15058 -3555561 -1316076 254462 1648748 3083178 3377014 1582078 -1057789 -2264819
15050 -2264819 -1700497 -1337778 -2606523 -4421941 -4579845 -2211962 1573209 4675366 5271493
15041 5271493 2996053 -593128 -3309281 -4381607 -4612632 -4606047 -4113836 -3465134 -4049376
15032 -4049376 -6266637 -8202058 -7824403 -5765771 -4314033 -4082091 -3587920 -2288032 -1816489
15023 -1816489 -2857536 -2508446 2639947 10876702 15457727 11807544 3046612 -3567809
15015 -3567809 -4638422 -2724578 -1220158 -586680 -421916 -1696550 -4595304 -6781749
15007 -6781749 -6722398 -6734587 -9507395 -13280633 -14259145 -12607695 -11693237 -11930118 -10310962
14998 -10310962 -6486754 -4105656 -4523460 -4240110 -1186491 1145160 -590078 -3697244
14990 -3697244 -3341639 772658 5630219 9754561 12339902 10439869 2594733 -6286270
14982 -6286270 -9091681 -4909581 1237013 5619779 7481633 5088793 -2773513 -11029142
14974 -11029142 -11360114 -3291305 3972358 3602252 -644461 -1600474 1403000 4278165
14966 4278165 5476533 6471405 7663753 8208282 8086836 7200897 4698963 1818242 2056744
14957 2056744 5382804 6310378 1975214 -2088350 108045 4992006 4467330 -1363986
14949 -1363986 -4504927 -1609908 1789023 913915 -1717672 -2068051 -747858 13211 635172
14940 635172 1804143 1775032 -287572 -1279631 2118241 8724770 14317439 15898770 12962779
14931 12962779 7113394 1999646 755712 1947653 1188166 -1985505 -3092940 -452316
14923 -452316 1292100 -1100051 -3396449 -708610 3938622 4180651 426233 -1515712
14915 -1515712 -173601 410586 -1173264 -1499427 801076 2418599 1487567 653542 1764554
14906 1764554 2663986 1911379 1940546 4425047 6698523 6134628 4413143 4059986 4266618
14897 4266618 3778999 4440804 7462600 9137962 5462839 -792614 -2940432 446748
14889 446748 4251261 4676846 3491884 3495713 4193519 3903777 2889211 2283414 2148963
14880 2148963 2323956 3422483 5555687 7453139 7890234 6785760 4420028 1171174
14872 1171174 -1461100 -1324153 2135869 7347184 12380750 15621340 15258272 11051604
14864 11051604 6726234 7038281 11371258 13784898 11010171 6585730 4685067 3950722
14856 3950722 1320689 -1471844 -272985 4683404 9441732 12363594 14126840 12813546
14848 12813546 5665466 -3548801 -5870035 1185578 9037591 9154984 3973440 1678907
14840 1678907 3849723 4673686 1009515 -3223850 -3677606 -1599051 -922121 -2376284 -3035573
14831 -3035573 -647857 3167654 4167149 146280 -5514806 -6618191 -1797996 2743785
14823 2743785 864695 -5140206 -7905164 -5593324 -3742106 -5899182 -8177386 -5888526
14815 -5888526 -748080 2588296 3492919 4115907 3888961 841640 -2884159 -2788698 329043
14806 329043 148900 -5825982 -11636305 -10759208 -4926334 -1219273 -2840750 -6831888 -9463910
14797 -9463910 -9592940 -6996539 -1656593 4218609 6814983 5116808 2434425 1984451
14789 1984451 2957292 2696006 982006 -24585 909826 2793377 3832103 2802459 -47515
14780 -47515 -2158395 -236893 5377788 9578492 8452385 4848470 4328569 6704725 6571334
14771 6571334 2451401 -419040 1293518 3164728 -50428 -5991370 -8555063 -7157652
14763 -7157652 -6104614 -6482527 -5304862 -2528281 -2107912 -4532083 -4647455 36558 4283346
14754 4283346 2510042 -2968097 -5829089 -4779102 -3467431 -3337223 -2291987 -231576
14746 -231576 -416752 -3834009 -6523483 -4941594 -1000671 895268 -170974 -1426983
14738 -1426983 -1088387 -301195 -361135 -645928 -421232 -651685 -2067003 -2732362 -250858
14729 -250858 3890879 5386797 3413050 2287264 4414933 5239068 -164309 -7944702
14721 -7944702 -9386008 -3771260 -293523 -4894622 -11854066 -12793999 -8383206 -5038392
14713 -5038392 -4178730 -2201990 900515 893668 -2406254 -3575194 -499230 1482829 -2074247
14704 -2074247 -7209811 -6996242 -1313119 3661928 4232196 2824558 2757313 3341676 2013959
14695 2013959 -855800 -1819904 1014539 5061156 6281090 4292095 2381085 2323881 2000777
14686 2000777 -278973 -2016051 -312368 2672823 2414849 -650855 -1353078 2114311
14678 2114311 5106795 3374142 -1173310 -4194152 -4993504 -5642552 -6525543 -6285193 -4883244
14669 -4883244 -3683035 -3180039 -2980844 -3293723 -4270752 -4509028 -2355003 1467973 4140286
14660 4140286 3606063 296833 -3371140 -4442969 -1474978 3690213 7109120 6770710
14652 6770710 4601202 3716814 4960597 7044383 8592282 8790508 7316811 4854554
14644 4854554 2627836 756918 -1464972 -3355630 -3259992 -1781163 -1554289 -2667934 -1976324
14635 -1976324 1080027 2172333 -1129170 -4376573 -2693593 1216498 1215967 -2551802 -4585217
14626 -4585217 -3434091 -3192581 -5393882 -6499480 -5149821 -5102684 -7739010 -7738440 -1038916
14617 -1038916 7318567 8919605 3239517 -2037408 -1186062 3476237 6056852 4428582
14609 4428582 1968548 3330817 9018371 14065317 13082335 6791586 1482444 1148518
14601 1148518 2985329 2660533 983177 1678004 4512581 5275869 2397103 -736029 -1032374
14592 -1032374 427565 1442434 2384876 4290647 5609999 4129259 1151566 548119
14584 548119 3462224 6664777 7023871 5283545 3944968 3367146 2237550 760332 604079
14575 604079 1742627 2060479 911316 618122 2839463 5359440 4687385 859744 -2417280
14566 -2417280 -1973101 2107119 7358526 10684602 9678084 4443943 -1466292 -3648858
14558 -3648858 -1166821 2547880 3329259 104284 -4641694 -7105314 -4957656 962536
14550 962536 7465798 11875981 13698566 13417788 11373697 8940309 8702086 11051336 12145891
14541 12145891 8333068 1796815 -1586665 20936 2211261 597469 -3615155 -5626948
14533 -5626948 -2678182 3295186 7356008 5815768 192380 -3694930 -2433629 502298
14525 502298 -148175 -3532207 -4463040 -2295524 -2107658 -5936703 -8811705 -6376665 -1483682
14516 -1483682 466391 -1213426 -3666360 -5457520 -6349758 -5029029 -1263242 1858166
14508 1858166 1742081 349646 697355 1462457 -639207 -4730693 -6585250 -4792215 -2011942
14499 -2011942 -507863 -127940 -408187 -1248082 -1720638 -1226406 -1262721 -3036444 -4241925
14490 -4241925 -1698360 3475916 6857439 6314995 3154469 -1413996 -6802414 -10578345
14482 -10578345 -10076285 -6694174 -4266080 -3024030 -82128 3481528 1944027 -6031150
14474 -6031150 -12836661 -10692818 -1896411 4031642 1977223 -3769352 -5910210 -2558005
14466 -2558005 1759528 2228093 -582567 -2118783 -486797 825198 -1495393 -4932715
14458 -4932715 -4499222 -69618 3849092 4737178 3790665 1556399 -2650851 -6489296 -5755019
14449 -5755019 -1568258 -494289 -4754011 -8126700 -5420595 -431768 668866 -990781
14441 -990781 -360978 1940771 678044 -4828403 -9475057 -10288382 -9462609 -8861396 -7192967
14432 -7192967 -4123826 -2092012 -1883865 -807141 2180265 3459866 156717 -4466840
14424 -4466840 -4896539 -981968 2208648 1762581 542787 2374631 6257018 7636080
14416 7636080 4621571 624877 -24349 2382498 3568393 1117988 -2432121 -3257498
14408 -3257498 -1293416 161885 -839372 -2454550 -1594169 2206520 5995579 6304416
14400 6304416 2829227 -1012400 -1839149 -279764 167439 -1964318 -4640009 -6324244
14392 -6324244 -8503568 -12169755 -14350554 -11452561 -4845666 206314 812237 -1336940
14384 -1336940 -3838196 -6320348 -8513118 -8571892 -5238265 -201186 3191083 2973123 -147045
14375 -147045 -3617762 -4897750 -3523922 -1560611 -1147279 -1948833 -2341642 -2479340 -3973978
14366 -3973978 -6660251 -8343630 -8378243 -8764879 -10382263 -10770455 -7826576 -3602163 -1588135
14357 -1588135 -1470121 186786 4197628 6977170 5671095 2497755 1735714 3678878
14349 3678878 4244723 739978 -4369419 -6778369 -5743736 -3956529 -2796440 -716627
14341 -716627 2849939 4942304 2904586 -1016254 -2078460 515807 2863829 2407542
14333 2407542 1387546 2682746 5034488 5084432 2552632 425342 402576 778520 -730974
14324 -730974 -4002323 -7047449 -8155886 -6847077 -3876886 -1046101 -33277 -585585
14316 -585585 -615590 1068949 2806717 1881880 -2107605 -6748664 -9499382 -9728342 -8040948
14307 -8040948 -5009475 -1371628 1558286 2932116 3460263 4397800 5639732 5939709 5021101
14298 5021101 4195780 4428910 4949141 4645875 3969707 4241477 5447276 6007313 4958908
14289 4958908 3398448 3191970 4744047 6590902 7040004 5803442 4002099 2871198
14281 2871198 2697802 3006785 3499044 4390175 5657341 6315006 5055551 1823320 -1716269
14272 -1716269 -3852256 -4810117 -6265442 -8697334 -10300225 -9448533 -7334687 -6513907 -7164171
14263 -7164171 -6876746 -4547067 -2180099 -1612191 -1650777 -511374 802568 428372 -284647
14254 -284647 1775584 6025091 7890740 5183549 1619084 1908648 5598338 8216702
14246 8216702 7139472 3815427 760001 -1282881 -2807296 -3814941 -3611418 -2000266
14238 -2000266 -122251 330049 -1019859 -2644550 -3091283 -3010932 -4053591 -6181350 -7667078
14229 -7667078 -7617087 -6703770 -5312712 -2939476 165565 2662326 3930941 4421019 4007954
14220 4007954 2268610 579610 963600 2182537 544971 -3907513 -5967331 -2740960
14212 -2740960 1129695 -283769 -5447125 -7591360 -4226211 443571 2343762 2164453
14204 2164453 2323477 3145805 3692246 3723241 3188381 1493287 -1418979 -4324308 -5794142
14195 -5794142 -5303585 -3217413 -513842 1683065 3014037 3709858 3031135 -380537 -5302789
14186 -5302789 -7359371 -4153833 906914 3014603 2547976 3514070 6679392 8903447
14178 8903447 9133497 10034128 12444176 12895176 9105454 4310441 3083111 5290080 7193034
14169 7193034 6936662 5986625 5739522 5294135 3162351 -68889 -1730183 -101141 2731780
14160 2731780 2423495 -2164212 -6589794 -6082403 -1930191 391162 -1154391 -3037199
14152 -3037199 -1960810 960587 3061778 3819611 3899995 3335896 2652263 3350876 5107552
14143 5107552 4655843 -30493 -5936976 -7838251 -4163816 1756115 5509858 5054945
14135 5054945 1137719 -3917665 -7780746 -9403918 -8917451 -6501412 -2379102 2029368
14127 2029368 4428416 3814587 1440652 -672763 -1371967 -729353 106910 -133958 -783823
14118 -783823 801625 5208404 8318352 6007834 715246 -760773 3760624 9199246
14110 9199246 10386508 7751690 4490951 2238396 1654017 3540914 6792972 8277072
14102 8277072 7041660 5739089 5989479 5798996 3728629 1704147 885867 -1165857 -5564720
14093 -5564720 -8190213 -5186486 633286 3487713 2305487 270634 -887941 -1383172
14085 -1383172 -293269 2869285 5112507 3626937 1152177 2393261 6202039 7042961
14077 7042961 3667101 287380 -983508 -2488278 -4667982 -3758359 1448332 5851050
14069 5851050 4610114 -287407 -3330097 -2503006 -178510 628696 -1539731 -6052341
14061 -6052341 -9860480 -9742405 -6476422 -4462780 -5688722 -6866422 -4566133 -301459
14053 -301459 2177368 2154566 1341326 -103813 -3359386 -7518577 -9606620 -8130902 -4397930
14044 -4397930 -337491 3030846 4962557 4682751 2234918 -1284871 -4426974 -5906944
14036 -5906944 -5254455 -3848124 -4208069 -6748237 -8156700 -5039008 1225602 5516469
14028 5516469 5064388 2271578 705387 633552 290784 -393504 -234236 -127051 -2371659
14019 -2371659 -5886733 -5673562 386434 6825525 6487326 -32717 -5106204 -4332704 -1497254
14010 -1497254 -1619268 -3514497 -2938024 -176105 240276 -3346769 -7132494 -7171446 -4328578
14001 -4328578 -2590272 -4149378 -7351691 -8771842 -6715095 -2892487 -566391 -1042376
13993 -1042376 -2817840 -4280935 -5600914 -7154919 -7930986 -6989159 -5111808 -3577001
13985 -3577001 -2570823 -1888157 -1452439 -64084 3957301 9364779 12052978 10574211
13977 10574211 8407401 8151496 7292183 3626171 950231 3697951 8742617 9149575
13969 9149575 4636992 1455725 2210168 2720713 -168399 -4184247 -6673722 -8198520
13961 -8198520 -9068692 -7587490 -3926441 -1019844 197231 1713814 3328134 2207731
13953 2207731 -811767 -904183 2188272 2076465 -4049458 -9941088 -10000819 -7845558 -8770999
13944 -8770999 -9618753 -4220357 5173438 10503750 9636496 7283961 5592433 2136563
13936 2136563 -2741818 -4674862 -2748886 -1194630 -1666051 -431989 3991283 6590202
13928 6590202 3305831 -2050322 -3113104 -97476 1237751 -1707470 -5226635 -5134699
13920 -5134699 -2366588 -1149448 -3110983 -5200682 -3937473 -364800 1189371 -776905
13912 -776905 -2745309 -1445794 1405671 2304814 1652766 2527071 5036010 6131542 4851717
13903 4851717 3514201 3043717 1271206 -2492285 -4911062 -3299756 -300037 -882811
13895 -882811 -5814377 -10588824 -10623841 -5887140 -315707 2361118 1967488 1330854 2590768
13886 2590768 4612132 4570493 1464947 -2845598 -5575272 -5056139 -1586324 2521677 4296439
13877 4296439 2701170 -587815 -3623138 -6005032 -7244403 -5567936 -704516 3990342
13869 3990342 5166753 3850941 3039387 2380294 -768960 -5846224 -9212512 -9848445 -10340283
13860 -10340283 -11447991 -10408512 -6379465 -3199889 -4074030 -6965376 -8185164 -7774507
13852 -7774507 -8212571 -9772243 -10249827 -8334627 -4970010 -2024694 -1057213 -2487398 -4873980
13843 -4873980 -5944796 -4929519 -2766700 -291380 1621210 697837 -4234704 -9112386
13835 -9112386 -7680493 -423271 4261397 733981 -6422668 -9414100 -7607270 -5929614
13827 -5929614 -6153434 -5792193 -4117519 -3309653 -3790811 -3635081 -3026919 -4578065 -8328012
13818 -8328012 -10650812 -9413342 -6724675 -5357866 -5488642 -5960834 -5924899 -4482969 -1583923
13809 -1583923 244181 -1713200 -5663263 -6556986 -2864048 1685184 4124941 5556765
13801 5556765 6567707 4310727 -2191005 -7810463 -7037855 -1473277 2787684 3351083
13793 3351083 2710164 2801269 3227714 4241029 6572457 8100102 5468303 3540 -2539800
13784 -2539800 135684 3460454 2889451 279020 -27496 1703747 1785649 -435026 -2000053
13775 -2000053 -1776983 -1950796 -3324109 -3298971 -564251 1530524 -690412 -5473551 -7487592
13766 -7487592 -4782809 -1016743 -605871 -4069036 -8700423 -11687775 -11605554 -8676324 -4928906
13757 -4928906 -2825080 -2483271 -1464267 1439369 3745108 2672759 -157081 -254268 3564502
13748 3564502 7338023 7163335 3875692 1121675 657088 1441903 2183598 2638686 2671708
13739 2671708 1777854 -82651 -2058521 -3069492 -2602247 -1089700 285047 695901 721387
13730 721387 1393556 2150382 1386305 -373423 -80147 3380992 6427033 5156199 1099364
13721 1099364 -648877 1592327 4581691 5792173 6644105 8710910 10319260 9543409
13713 9543409 7945392 8111473 9008560 7174860 2090252 -2690928 -4126641 -2972870
13705 -2972870 -1804438 -1782446 -2381082 -2693199 -1692925 1667283 6998344 11408399 11378971
13696 11378971 6292857 -528593 -4831561 -5170217 -3240483 -1017838 1209735 3676579
13688 3676579 5490163 5613046 4813684 4843856 5708478 5631661 4206442 3564924 5121706
13679 5121706 6774221 5291718 721485 -3547385 -4950644 -4137549 -2893455 -1548478
13671 -1548478 266131 1486848 372910 -2346551 -3098828 124875 4214386 4299703 324004
13662 324004 -2989418 -3423507 -4316871 -7690255 -8842279 -3271605 4078602 4119013 -2337970
13653 -2337970 -4305312 3331080 11781686 11272801 4816595 1948150 3982161 4184155
13645 4184155 -48504 -4177114 -5454445 -6610970 -9055406 -9442325 -5774517 -1457942
13637 -1457942 -273945 -1458461 -2302652 -2000587 -718454 1723400 4221389 4696552 3678901
13628 3678901 4052991 5677923 4479636 -777132 -5170732 -4428122 -1336378 -1396742 -4846096
13619 -4846096 -7034794 -4886008 504815 6038242 8247621 4673067 -2917482 -8180961
13611 -8180961 -6612649 -1312480 849773 -2190215 -6273556 -7350411 -5502402 -2490379
13603 -2490379 1266196 5923247 10402187 12720681 11674684 7976785 3905548 1318073
13595 1318073 -88598 -1576801 -2729241 -2028764 -69414 702301 157283 1095607 4330925
13586 4330925 6695874 5965276 4155614 3352467 2055884 -885424 -2376761 441714
13578 441714 4667783 5373358 2757828 852954 865684 644274 -558946 -1539653 -2304315
13569 -2304315 -3340212 -3033191 -437862 986876 -2205400 -6666998 -6034964 -811161
13561 -811161 2138868 68894 -2613065 -2871405 -3484262 -6512890 -8828934 -7583550 -4713194
13552 -4713194 -2475891 493490 4856443 7010885 4363677 407763 -128313 1675261
13544 1675261 1290328 -1983665 -4437560 -3304350 958446 6555291 11137990 11611166
13536 11611166 6426075 -1924963 -8676128 -10790146 -8314371 -3335821 983041 2105764
13528 2105764 651141 -232754 642554 657228 -2339871 -6177743 -7110496 -4731188 -1823945
13519 -1823945 -507601 -515304 -439073 736384 2560065 3049631 1116210 -969215 -6933
13510 -6933 3115968 4157596 1817949 -618588 -954726 -845057 -1156546 359419 3973641
13501 3973641 5747281 4196654 4080604 8623706 12710580 9968717 2879677 -998056
13493 -998056 -191245 479986 -875178 -1288850 140787 545453 -731082 -685907 1667867
13484 1667867 3649800 3984035 4439018 5614338 6189414 6891074 9575328 11727570 8418618
13475 8418618 1338216 -1141562 4065070 9487589 8035940 2959469 1353395 3033263
13467 3033263 2768646 184616 57648 3825745 7172494 6364557 2179038 -2801778 -6678507
13458 -6678507 -7714206 -5190301 -1466400 -47032 -1138107 -1975240 -1587565 -1813618 -3084387
13449 -3084387 -2922308 -190916 2326733 1848018 -157403 -127151 2458289 4436838 3092747
13440 3092747 -769141 -3932206 -3985113 -1392378 1229846 2075781 2281072 4210013 7678904
13431 7678904 9602784 8181087 5535012 4466710 4265118 2460934 -153253 106214
13423 106214 3782968 6240505 3829733 -704156 -2078354 119554 1523911 -431535
13415 -431535 -4011095 -7226990 -10072465 -11539152 -8771557 -1974334 3180778 1676276
13407 1676276 -4291294 -8209272 -7134219 -3344634 335975 2722583 2428383 -1548227
13399 -1548227 -6539224 -7442320 -2932391 2505472 4419462 3628875 3711642 5624859 7326957
13390 7326957 7317530 6043942 4320570 2418606 825552 493250 1838531 4003203 5470077
13381 5470077 5663929 5992177 8421889 12226218 13366403 9036950 2074827 -1751530
13373 -1751530 -727860 1486411 1936088 2182519 4265242 6201895 4715532 447052
13365 447052 -3003962 -4241590 -4908746 -5678365 -4882118 -1951395 696559 877345 -199895
13356 -199895 115256 1963378 2927979 1510305 -1121685 -2929164 -2959152 -1175163 1842707
13347 1842707 3958539 2184762 -3287204 -6965438 -3490776 4513122 7906626 2291547
13339 2291547 -5712416 -6797653 -893273 3738579 1965574 -2789381 -4872685 -3232514
13331 -3232514 -233819 2334583 3667643 3331701 2551647 3643419 6162157 6317090 2603999
13322 2603999 -756766 774059 5360455 7274981 4937283 2609438 4021283 7572441
13314 7572441 8853770 5950572 1276592 -1037792 600152 3304160 2842745 -964201
13306 -964201 -3863797 -3198295 -1688026 -2894791 -5495765 -5713077 -3706301 -3061421 -4393945
13297 -4393945 -4151552 -647103 2924750 3333943 1888687 1987171 4567424 8109352 11133516
13288 11133516 12553851 11185350 7137202 2703144 72578 -965531 -1588970 -1510655
13280 -1510655 -10668 1517735 568078 -2772610 -5151165 -3752462 506610 4382450
13272 4382450 5947984 5755897 4777875 2628838 -1283701 -5582847 -7585029 -6718992 -5815741
13263 -5815741 -7525663 -10400612 -10591792 -7189329 -3480022 -2220774 -1924771 532489
13255 532489 5125735 8572964 8542596 6176084 4155856 3413601 2359517 -881916 -5720693
13246 -5720693 -8887069 -7554863 -2650517 1906743 3597082 3836703 5404791 8436854
13238 8436854 10279935 8828897 4753137 547593 -1618069 -1213348 435719 1042629
13230 1042629 -756239 -4065392 -6529082 -6417128 -3776141 -73548 2732532 3375506
13222 3375506 2452255 2010885 3065738 4164062 3788450 3432157 5835198 9949726 10700926
13213 10700926 5647855 -520919 -1249259 3275756 6430812 4317646 816247 1508145
13205 1508145 5550880 7058194 3436495 -1246230 -1751670 2197149 6612210 8275588
13197 8275588 7377411 5865520 4677704 2941813 -378290 -4226687 -5531854 -2479864
13189 -2479864 2723903 5883132 5619569 4410241 4488627 4867676 3608549 1083627 -835185
13180 -835185 -1439160 -1130795 109843 2102040 3211891 2011958 -314477 -1412349 -1132065
13171 -1132065 -1145362 -1651846 -1327042 -604372 -1789606 -4983497 -6936366 -5576303 -3053703
13162 -3053703 -2287552 -2842919 -2743680 -2417070 -3658959 -5670876 -5470788 -2369542 809818
13153 809818 1732406 1463589 2192782 3795922 4323116 3146134 2035879 2842716 4887143
13144 4887143 5314362 2222498 -2880622 -6349758 -6169773 -3674789 -1315799 36584
13136 36584 714472 577671 -436877 -784018 1382858 5140789 7114734 5599433 2455503
13127 2455503 -180909 -2940542 -6766489 -9018858 -5593436 2650055 8871383 7744899
13119 7744899 1956922 -1385638 315961 2955354 2408395 -57768 -655666 1369897
13111 1369897 3666751 4639828 4510028 3297100 780734 -1415984 -539467 3584227 7618643
13102 7618643 8374288 5697189 1242243 -3384968 -6322670 -5766623 -2454981 -99938
13094 -99938 -1363442 -4574273 -6093311 -4742299 -2246923 -537342 -459224 -2101502 -4469870
13085 -4469870 -5581582 -4509040 -2519595 -951441 498104 1765279 866184 -2991656
13077 -2991656 -6633627 -6595139 -4162337 -3102727 -3678252 -3306864 -2294110 -3487667 -5870000
13068 -5870000 -4429106 1512715 5377926 2328288 -3199244 -3398663 2418222 7778286
13060 7778286 7681217 3031029 -2543255 -6351162 -7283390 -5934452 -4415837 -4248181 -4846118
13051 -4846118 -5274601 -5795610 -5930105 -3534575 1261383 3786671 620807 -4333662 -4541512
13042 -4541512 -458326 1098586 -2909538 -8128783 -10364683 -10715988 -10784263 -8603118 -3447917
13033 -3447917 -53112 -2735535 -8073744 -8769439 -3590600 1240721 287969 -5419663
13025 -5419663 -11042984 -12864613 -10186363 -5222528 -1756617 -1807135 -3457624 -3787013 -3175080
13016 -3175080 -3922541 -5249742 -3513841 1999706 7232701 8682297 7169399 4530486
13008 4530486 234105 -5640667 -9169617 -6766997 -1245597 762694 -2607543 -6468165
13000 -6468165 -6399414 -3658768 -1503099 -65038 2016557 3509037 2173977 -585438
12992 -585438 -802421 1934529 3267109 596555 -2471966 -1166607 3039499 3873037 -1148649
12983 -1148649 -7211640 -8539612 -5409342 -2590587 -2548376 -3117578 -1674982 1109295 2703938
12974 2703938 2090519 218254 -1895365 -3826607 -4793718 -3807231 -1413651 1889 -1069635
12965 -1069635 -2779818 -1677261 2758906 6748888 6478460 2799223 -62180 -232529
12957 -232529 -270826 -2439331 -4239816 -1565553 4515155 7723485 4370057 -1844170 -4909713
12948 -4909713 -3847276 -1918566 -495510 1865087 4565834 4114771 -171471 -3717658
12940 -3717658 -2747319 409268 1369456 287146 216343 904778 -641661 -3892635 -4387204
12931 -4387204 -619156 3351143 4058824 3277404 3916816 4905224 3641460 1058008 433721
12922 433721 2296632 3736454 2414301 -1079721 -4503021 -5831145 -4443241 -1878286
12914 -1878286 -616380 -1122127 -1573818 -1382677 -2336336 -4479321 -4137197 683270 5734842
12905 5734842 5619022 1418071 -1471921 -1668000 -2564628 -5252112 -6496218 -4777934 -3015481
12896 -3015481 -3284204 -3339682 -845073 2654142 4477043 4416244 3334194 1105413 -1729539
12887 -1729539 -2967464 -1741186 -173680 -41635 -232970 561969 1276802 679902 -449926
12878 -449926 -1432117 -3194000 -5495215 -5708172 -2970370 -478026 -769946 -1972212 -2002563
12869 -2002563 -2832833 -6138263 -8133452 -4524237 1565613 2897484 -1523089 -5562814
12861 -5562814 -5466691 -4070808 -4371659 -4820825 -3590713 -2728262 -4671543 -7826197 -8777342
12852 -8777342 -6851830 -4037416 -2030151 -1367875 -2111684 -3710495 -5149639 -6118707 -6895781
12843 -6895781 -6881030 -5231256 -3336841 -4110929 -7714249 -10385528 -9075609 -5272524 -2578325
12834 -2578325 -2155445 -2325362 -1490220 146085 1096909 -77005 -3178099 -5730526 -5205351
12825 -5205351 -2235788 21895 153753 41418 1286290 2341098 875154 -2634763
12817 -2634763 -5533421 -6277900 -5596446 -4934903 -4846409 -4675249 -3538782 -2054077 -2469378
12808 -2469378 -5604398 -8408173 -7139945 -2801487 -192823 -1074013 -1939121 70235
12800 70235 2945943 3852591 3636298 4012261 3612753 1027434 -990213 541298 2544522
12791 2544522 -485328 -6901828 -8372043 -1621472 6094381 6746891 2284558 862334
12783 862334 4956016 8675619 6705032 1117081 -2451854 -2210861 -1129349 -1814547 -3104014
12774 -3104014 -2093458 1935928 6451261 8075074 5582173 740797 -3408019 -5105786
12766 -5105786 -4950000 -4533077 -4203528 -2691986 730195 4267645 4704253 734485 -5272892
12757 -5272892 -9092796 -8091796 -3088072 2623742 6015149 6617340 6300150 6604390 6691409
12748 6691409 4733033 1061707 -1437344 -538343 2919994 6610194 9466088 11445723
12740 11445723 11466281 7907480 1703623 -3071809 -3373893 -1029220 -580027 -3498138 -6518811
12731 -6518811 -6272838 -3581983 -1664902 -1582428 -1641306 -623429 763904 1697892 2349597
12722 2349597 2783310 2627496 2303546 2847686 4216348 5590112 7252960 9600662 10387898
12713 10387898 6716503 649029 -1498887 2378388 6667079 6024559 2632189 1322526
12705 1322526 1493812 -521433 -3912207 -4577404 -2379983 -1009956 -1313572 -771480 697588
12696 697588 450419 -1384571 -2202308 -2653474 -5309510 -7342474 -2554927 7492487 12775073
12687 12775073 8674216 2486969 1410116 2044192 -1519854 -6236738 -5299786 -13875
12679 -13875 2585957 1299112 1177897 3547963 4072997 1327351 -237033 2101697 4654916
12670 4654916 2907207 -2264653 -6333617 -6494820 -3745813 -1299247 -1538521 -3487045
12662 -3487045 -3938741 -2074967 -909006 -2431122 -4278484 -4033623 -3511422 -4845890 -5606974
12653 -5606974 -2875833 563909 -66365 -3641919 -5088222 -3795001 -3647624 -5485637
12645 -5485637 -6079682 -4359683 -2262050 406041 5224494 9374611 8009526 3040059
12637 3040059 1771384 5385213 6906935 2948410 -1006439 -719021 -333621 -4257874
12629 -4257874 -9142075 -9886957 -7575272 -5494093 -2927247 920378 2274500 -1192147
12621 -1192147 -4703709 -3897232 -3140519 -8182669 -14791238 -14319398 -7995423 -5354068 -8985534
12612 -8985534 -11105427 -6835815 -1451607 -1100102 -4251333 -6660784 -8361739 -10797300
12604 -10797300 -11830662 -8696652 -2964560 1516593 3503403 4192946 4336268 4181715
12596 4181715 4357959 4616474 3680750 2146267 3033517 7283014 11199386 10963356 7544327
12587 7544327 4445135 2575243 463248 -1925852 -2992022 -2561030 -2128105 -2054949 -1100776
12578 -1100776 884868 1937571 394094 -2991934 -5867568 -6350864 -4235833 -1135568
12570 -1135568 496334 -493118 -2497676 -2598154 169306 3449455 3766139 -96584 -5961398
12561 -5961398 -10291372 -11234795 -9713710 -7829744 -6836997 -6845556 -7468705 -7715889 -6013918
12552 -6013918 -1920912 2475461 4640162 5022068 6232787 8333918 7610342 1820389
12544 1820389 -5418815 -8159036 -5117123 -536187 1656391 1811312 2063623 2484361 1638904
12535 1638904 -339968 -1467536 -705000 634913 985342 945457 2402099 5517537 7950661
12526 7950661 7727500 5936549 5298886 6321323 6386322 3221826 -1967735 -5891147 -6809033
12517 -6809033 -5375065 -2426569 1901839 6209380 7130285 2909774 -2927408 -4140553
12509 -4140553 995643 6982533 7430245 2786860 -797815 99094 2115218 699022
12501 699022 -3103477 -4214241 -484363 4931911 7976181 7780608 5878790 3661979
12493 3661979 1745805 313252 -1022403 -2736173 -4203317 -4096323 -2357500 -436285
12485 -436285 799792 1751123 2283890 1426891 -210850 -214819 1779725 2479966 -438620
12476 -438620 -4364506 -5451783 -4287915 -4015297 -4301763 -2052054 2176734 3914512 2206344
12467 2206344 2011970 6431485 11171701 10750370 6621764 4330628 5035186 5205873 3557710
12458 3557710 2628730 3141496 2133467 -1642100 -4953320 -5118534 -4060504 -4430753 -4815684
12449 -4815684 -2420398 1545900 3074104 1054888 -1781202 -3359908 -4304028 -5127401
12441 -5127401 -4707406 -2830469 -1520488 -1957206 -2175754 -162737 2197815 1102296 -3584323
12432 -3584323 -7521592 -7425787 -5068123 -4152905 -4888770 -4067909 -146209 4151894 5123259
12423 5123259 2480215 -625137 -1139453 1222975 4193126 4933108 2269238 -2178626
12415 -2178626 -5263775 -5261462 -3381288 -2165552 -2969729 -5182331 -6912534 -6081519 -2238638
12406 -2238638 1950495 2733011 110342 -1220372 2093758 6755172 6619356 995602
12398 995602 -4310299 -4505097 -1185946 787480 -738263 -3671429 -4403170 -1237473 3484667
12389 3484667 4547793 -948743 -9492920 -14415161 -13152151 -8718360 -4396197 -791374
12381 -791374 1500909 997576 -1040024 -343542 4381484 8957587 9947553 9427737 10217852
12372 10217852 10523950 8004770 5627419 7629028 11785572 11824086 6687693 1571042
12364 1571042 -220950 -822425 -2480429 -3956201 -3860146 -3171331 -2541616 -792065 1989440
12355 1989440 3075003 804844 -2894450 -5307765 -5928749 -5399221 -3881141 -1903285
12347 -1903285 -798494 -1120897 -2292271 -4203604 -7001807 -9172350 -8695945 -6550387
12339 -6550387 -5903338 -7087746 -6848766 -3864603 -1430559 -2533185 -5249307 -5524564 -2331716
12330 -2331716 2137884 5568253 6852773 5935180 3982038 2465006 1206705 -1074404
12322 -1074404 -4010177 -5774211 -6245834 -6809742 -6519632 -2490588 4464724 8780763 7036313
12313 7036313 2259119 -919927 -1542650 -324637 3062362 7162001 7637325 3546233
12305 3546233 733376 3698952 7684730 5118780 -2746380 -7594502 -5946814 -2134449
12297 -2134449 190064 2159988 4429319 4862588 3637196 4500820 8323576 11030548
12289 11030548 10821163 11650766 15607825 17436032 12176483 3922010 392202 1553822
12281 1553822 862083 -3121637 -4008090 1867466 8773277 9260642 4112262 206382 1082223
12272 1082223 4150813 6126541 6753917 6663983 5173591 1837128 -1968543 -4437800 -4898168
12263 -4898168 -3216480 475467 4344127 5223244 2374132 -572955 399398 4651418
12255 4651418 7767949 6724647 2383500 -2198698 -3930105 -1232002 4114467 7529403
12247 7529403 6590257 4407861 5123840 7401687 6533485 2230602 -834396 -651671 -511389
12238 -511389 -2387355 -3190420 -564235 2491633 2640792 1759094 3133791 5476405 5408584
12229 5408584 3330091 1981598 1020763 -2118506 -6995484 -10237761 -10337915 -8625649
12221 -8625649 -6135492 -3181615 -1405870 -2498661 -5106096 -6244763 -5368146 -4010238
12213 -4010238 -2288300 742144 3949031 5008316 4070762 3174643 2557190 1036846 -623289
12204 -623289 -586572 344008 -55152 -854517 993272 4936701 6633393 4230523 825254
12195 825254 -243301 955267 2503296 2373586 -1355783 -7958532 -11897697 -8184174
12187 -8184174 -317579 2665873 -1717574 -6209307 -4993792 -1936523 -3569235 -8821084
12179 -8821084 -10979518 -7040291 -465692 3729352 3114130 -1441811 -6294288 -7661513
12171 -7661513 -5889784 -5277872 -7936852 -10536111 -9382385 -5658871 -2619314 -495252
12163 -495252 2051936 3675645 1834990 -2365311 -4466245 -1737764 4228478 9373089
12155 9373089 10001997 5306761 -950358 -2954176 798996 5366690 5668238 2750999
12147 2750999 1148789 2193491 3271902 2279309 -386941 -3324302 -5049128 -4599714
12139 -4599714 -3372616 -4504771 -8102912 -9660602 -6351012 -2059522 -1950094 -4533531
12131 -4533531 -4339321 -790305 1478277 659553 79939 1651203 2634811 902168 -1176949
12122 -1176949 -601899 1893901 3607526 3361340 1453623 -1504930 -4151081 -4828187 -3720073
12113 -3720073 -2790660 -3011317 -3473594 -3205112 -1612398 2212481 7351671 8961355 2898500
12104 2898500 -7307051 -13128482 -11699847 -8491356 -7808347 -6889880 -2765120 1276743
12096 1276743 1335219 -68364 1056376 2156613 -1579498 -7420968 -7648403 -1438776 3605940
12087 3605940 2916254 665409 1542388 3393636 2081371 -1333482 -2954148 -2285549 -1649427
12078 -1649427 -1483825 -158057 2825816 6475368 9779875 11071821 8071867 1726836
12070 1726836 -2204093 507491 6141823 7522033 4062632 2137218 5105523 8526774
12062 8526774 7389242 3230028 563632 -204925 -1995468 -5111729 -6417521 -4236570
12054 -4236570 -805038 716739 -313775 -1912252 -1581034 1236382 3881142 2657850
12046 2657850 -2372486 -6158028 -4237585 1702105 6321564 7445199 7113012 6611853
12038 6611853 4768033 1984514 1764754 5852344 10789715 12002687 9361229 6268536
12030 6268536 4922513 4992342 5595150 5851922 4353300 755383 -2587621 -3155319 -2108988
12021 -2108988 -2912858 -6084014 -8201069 -6815979 -3564919 -1093481 552358 2469437
12013 2469437 3867172 3114077 768312 -1043912 -1926447 -3395595 -5565858 -6113937 -3599491
12004 -3599491 7473 1494428 -80931 -3214507 -6042228 -7058902 -4831859 776278
11996 776278 7150628 10622887 10142274 7940448 6289665 5174673 3804299 2789036
11988 2789036 3405938 5439206 6967078 6161710 2841848 -1352573 -4107123 -4442802 -3738598
11979 -3738598 -3861410 -4350764 -3041711 200331 2429155 1449046 -1075460 -1845630 154117
11970 154117 3390900 5898066 6034681 2812999 -2421970 -6061261 -6255635 -5556689 -7144391
11961 -7144391 -9927407 -10440661 -8344897 -6312655 -5041364 -2492656 1584911 4389187
11953 4389187 4443514 3786127 4404821 5595159 6357834 7385069 8809538 8757824 6327862
11944 6327862 3664494 2792122 2389207 106589 -3489441 -5654367 -5015926 -2364902 1024065
11935 1024065 3879128 4668394 2923225 451395 -359194 766139 2023218 1758570 -231156
11926 -231156 -2958470 -4852563 -4660574 -2606633 -403850 228643 -1180245 -3707250 -5409446
11917 -5409446 -4638829 -2310858 -1805160 -4622673 -7442090 -6409263 -3017382 -1547738
11909 -1547738 -1527497 1586688 7537496 9560304 4404322 -1852750 -2470204 301845 -266326
11900 -266326 -4746052 -7551582 -5670759 -1504706 2293881 5447837 7353264 6413117
11892 6413117 2986290 -350104 -2041205 -2384627 -1349830 1333518 3919266 3639972
11884 3639972 518751 -2231959 -1987253 1059214 5277939 9063260 10877739 9713372
11876 9713372 5855013 552634 -4346275 -6307865 -3966348 92107 1429151 -73269
11868 -73269 -17918 2729236 3335673 -478831 -3220970 -530135 2523008 -243555 -4580244
11859 -4580244 -2411227 3540695 3340628 -3156220 -5516860 -420248 2738236 -1677830
11851 -1677830 -5603454 -1022209 6498340 7041611 1412372 -2635895 -3514375 -5236527
11843 -5236527 -7554352 -6462595 -2697147 -845297 -753531 2031221 7260744 9153529
11835 9153529 5659917 1780105 1721804 3335755 2662475 -356775 -3049805 -3805529 -2926340
11826 -2926340 -1801500 -1980707 -3328459 -3481766 -1203582 944235 108099 -2175522 -2394913
11817 -2394913 -706651 110002 74031 1275579 2350659 -525677 -6501147 -9516300 -6446809
11808 -6446809 -779281 3476486 6352253 8074088 5964384 -962443 -8201575 -10620624
11800 -10620624 -8482479 -5330943 -2685301 -474339 -200284 -3323272 -7738428 -9704540
11792 -9704540 -8657167 -6902627 -5249080 -2412801 1233343 2666955 107700 -4145505
11784 -4145505 -6006789 -3910532 -252981 1223294 -430195 -2011595 1170 4348041
11776 4348041 5821107 2027243 -3116856 -4449296 -1921297 598089 1062857 631016
11768 631016 268318 -628821 -2058241 -2625216 -1627012 -140392 322816 -1015349 -3933062
11759 -3933062 -6537966 -5735968 -653804 5036069 6797730 4767279 2766891 2374427
11751 2374427 1770100 550290 921552 2421702 262817 -7510324 -14857635 -14399985 -7236783
11742 -7236783 -1326793 -857915 -2085188 -366279 3168697 4230353 1764757 -947145
11734 -947145 -430154 3595915 8486456 11317029 11561057 11273635 11903194 11489546 7031737
11725 7031737 -355547 -5488400 -5623502 -4260624 -6035929 -9827725 -10328593 -5868781
11717 -5868781 -1164120 -1347579 -5811365 -9567166 -9251290 -6170491 -4001925 -4770291 -7195470
11708 -7195470 -8473182 -7366499 -5098786 -2977721 -274242 4047172 8235908 8896455
11700 8896455 5694809 2435175 2060850 2784763 1318809 -1838127 -3283642 -2052424
11692 -2052424 -794120 -1283299 -1784400 -260934 1984821 1716293 -2249913 -7725744 -11088273
11683 -11088273 -9954435 -5147854 -626428 62916 -1995551 -2250283 1026251 4185273
11675 4185273 3805711 1964945 2604794 5010322 5536322 4573770 6111481 9809215 9502198
11666 9502198 2367537 -5406823 -6300865 -1308077 2595205 2407334 1244913 1512949 1452140
11657 1452140 -526783 -2552726 -2473977 -1391584 -1788254 -3878085 -5651130 -5563294 -3945347
11648 -3945347 -2309326 -1761468 -1565361 430725 4815606 8640551 8287534 4093387 55855
11639 55855 -994260 328501 2418404 4534880 5667826 4584319 2245079 1470256 2798394
11630 2798394 3362277 1453314 -751525 -1157547 -1355745 -3173324 -4318503 -1521929 3616885
11621 3616885 6307638 5490304 4761656 6167740 7347536 6151566 4306929 4185404 4692799
11612 4692799 3157848 -263311 -2727894 -2613852 -1117755 -77102 69441 -50003 211012
11603 211012 1145694 2358776 2461739 172824 -3533957 -5327940 -2980125 1339459 2911379
11594 2911379 105205 -3558218 -4181345 -2536632 -2017937 -2816337 -1652577 2451516 5851474
11585 5851474 5437240 2991543 1781294 1302654 -1036670 -4411724 -4885743 -1443819 1934403
11576 1934403 1664407 -660350 -914684 1789921 4346398 4237351 2753872 2861234 5028037
11567 5028037 6501974 4679504 62882 -4668876 -7533706 -8178161 -6926550 -4752763
11559 -4752763 -3827039 -5745913 -8699775 -8653257 -4477724 73506 1014965 -1008996 -2421917
11550 -2421917 -1853393 -1114316 -1457259 -1240334 1791109 6833126 9594007 6188088 -2121726
11541 -2121726 -8881739 -8574218 -2378676 3849361 6616830 7148725 7250547 6766731 5936645
11532 5936645 6165438 6743056 4781754 593501 -1097713 1775008 4740349 3870751 2390403
11523 2390403 5054058 9657181 10387028 7004238 3959697 2146285 -1103352 -4353177
11515 -4353177 -2231248 5381238 11329642 10892769 7706661 7130861 8842259 9456768 8368292
11506 8368292 7234437 6432856 5269227 3986793 3396036 3766903 4882761 5520152 3229393
11497 3229393 -2450156 -7110411 -5871230 -491345 2690575 2057881 2214901 5241197
11489 5241197 7099240 5351993 3887679 5847592 7597673 4788423 -238034 -2360169
11481 -2360169 -1099638 1051922 4018267 8198645 10312431 7260361 1877547 -983380
11473 -983380 -1973651 -4698050 -7607344 -5720169 -8893 2417224 -1198709 -5366047
11465 -5366047 -5373658 -4080800 -5857440 -8583984 -6833421 -624102 3976750 2762307 -1808379
11456 -1808379 -4621616 -4196415 -3131368 -3325086 -3181618 -654813 2608324 2799205 -396519
11447 -396519 -2523343 -97378 4608852 6474083 3660679 -1178558 -4677470 -5680730
11439 -5680730 -4935786 -3514298 -1604105 1393878 4882665 5843963 1990759 -3937970
11431 -3937970 -6364587 -4058123 -1351303 -964866 -237511 2996200 5615629 4289883
11423 4289883 1205561 14638 -347522 -2498111 -4383501 -2261461 2230858 4115142
11415 4115142 2675797 1009501 -538139 -3767767 -6335317 -3558682 2925477 5623097
11407 5623097 1946520 -2297998 -2455553 -1400911 -3078508 -5686836 -5588293 -3318845 -1367743
11398 -1367743 254395 2133947 2465264 38607 -2508408 -2316179 -872138 -1309373 -3246837
11389 -3246837 -3952414 -2870562 -1405217 380138 3256481 5873689 5640695 2444759
11381 2444759 -899590 -1835633 -192242 2226222 2972985 978155 -1730299 -1862184 725027
11372 725027 2740136 2597309 2554744 3746367 2993726 -1741885 -6061272 -4313042 1824206
11363 1824206 5260041 3213014 -271028 -1554030 -1666094 -2000719 -951179 2329103
11355 2329103 4758432 3417117 209929 -986118 -23555 131492 -1392927 -2440134
11347 -2440134 -2004345 -1778752 -2476529 -1693010 2336570 6809251 7042978 2566852 -2116537
11338 -2116537 -3264880 -2073404 -1957560 -3608488 -4825102 -4358314 -3565371 -3880862 -4320831
11329 -4320831 -2536821 2114106 7124256 8650637 5214662 -227059 -2707554 -292402
11321 -292402 4155326 6765802 6742174 5536383 3845931 1759571 620748 1802425 3966597
11312 3966597 4257376 2197416 -77625 -1258637 -1724411 -1076235 1839991 5841650 7544279
11303 7544279 5592493 2020483 -1111303 -3162827 -2636899 2071953 8194416 9706964
11295 9706964 5549409 1927437 2883721 3635693 -1336963 -7935678 -7566293 -550421 3618611
11286 3618611 -15481 -5128347 -3571834 4034986 10597118 11548336 8063891 3758652
11278 3758652 1408368 1836375 3791511 5160101 4901711 3163434 161743 -3097349
11270 -3097349 -3892740 -842472 2480074 1107599 -3761469 -5597493 -2291157 494783
11262 494783 -1237347 -2797975 1319873 7030313 5595174 -2774575 -8027781 -3885829
11254 -3885829 4235105 7260848 3207772 -3018741 -6318702 -4567167 1475112 7739712
11246 7739712 8801636 3768513 -1753317 -2796877 -1690115 -3322572 -6057352 -3655666
11238 -3655666 3751645 7607047 2910391 -3403309 -1358078 8088330 14163473 10595394
11230 10595394 2798727 -670895 1221163 3083360 1507297 -1724749 -3564957 -3106775
11222 -3106775 -976480 1836821 3900526 4142878 3356747 3204323 3334483 1482740 -2803678
11213 -2803678 -6635405 -7331251 -5737311 -4341567 -3616311 -2318996 -375630 816933
11205 816933 521376 -800386 -2508998 -3438225 -1489685 3648068 7962453 6879969 1955242
11196 1955242 -106076 3370261 6685416 3447719 -4507254 -9623061 -8075397 -2743390
11188 -2743390 2060454 4476833 3842783 7998 -4714981 -6359773 -3985054 -1072257
11180 -1072257 -535781 -809459 781423 2867496 1620891 -3044570 -6216939 -4112050
11172 -4112050 775453 2722520 23786 -3370888 -3914226 -3300793 -4709542 -6253506
11164 -6253506 -2863337 4886665 9096555 4711229 -3023877 -6024676 -4872286 -6361532
11156 -6361532 -11183121 -11907268 -4639261 4488145 7910657 5986646 3467484 1486853
11148 1486853 -1510212 -4268475 -4211103 -2836852 -4012750 -7316591 -8128934 -4690264 -511156
11139 -511156 1294159 2123526 4599926 8135094 9859275 8336349 4806872 1600743
11131 1600743 62955 -552738 -2121608 -4905968 -6524005 -4936166 -1535096 537726
11123 537726 354387 -542948 -1032455 -1183548 -790949 218798 366687 -1541118 -3444169
11114 -3444169 -2073638 1954341 4454089 3526434 1590031 788666 252216 -530001 397144
11105 397144 3631060 5988716 5103566 3469132 4257142 5759020 4426864 1506328 1392684
11096 1392684 4057344 4696417 1679905 -621684 858069 2680943 586056 -3443552
11088 -3443552 -4325042 -1709460 132827 -888500 -2763905 -4086535 -5976406 -8450152
11080 -8450152 -9139815 -7206509 -4823427 -3026176 118685 4875821 7242134 4432241
11072 4432241 -103502 -1028111 1864220 4821095 6024922 6011298 4320017 799664 -1147704
11063 -1147704 1929461 7473882 9829048 8716961 8829413 11062833 11081864 7693701 5218643
11054 5218643 4957235 1825499 -6171418 -12003475 -9177700 -1936478 875236 -1565995
11046 -1565995 -2563415 1093500 5354669 5709406 2350503 -1768258 -4164553 -3975549 -2510476
11037 -2510476 -2106352 -2792606 -2101792 206030 798344 -1283707 -1780008 1772691 4813643
11028 4813643 2732661 -1346957 -2083063 -1236155 -3975324 -8875116 -9934010 -6927218
11020 -6927218 -5332744 -6568327 -6550293 -4024194 -2216321 -1660013 489113 3017444 949691
11011 949691 -4926089 -7269665 -3679930 -828091 -3506729 -7280924 -6515748 -2723478
11003 -2723478 67879 1952466 3831971 3212643 -863811 -3497525 -501548 4504938
10995 4504938 5161110 1247876 -2765413 -5009650 -6635242 -7240488 -5079533 -571579
10987 -571579 4297933 8605575 11504273 10983606 6872820 2640404 1092337 945788 444837
10978 444837 681791 1823115 293208 -5459036 -10157076 -8281756 -2473861 545848
10970 545848 -30820 452917 3394870 5381756 4858214 4009575 3688481 2259393 227119
10961 227119 558456 3182264 4194640 2096829 112170 293337 -230056 -4264435 -9319009
10952 -9319009 -10773477 -8238379 -5640182 -5884431 -7931258 -9070136 -8361433 -7279801
10944 -7279801 -7565055 -9014270 -9764424 -8617563 -6216983 -3642564 -1019624 1696681
10936 1696681 3669854 3994915 2838981 1096680 -195218 173713 2615243 5310101
10928 5310101 5827699 4792637 5229076 7198687 6633686 1846686 -2444686 -1450288 2159798
10919 2159798 2008870 -2143883 -3814766 564614 6481699 7849514 4916833 2679909
10911 2679909 3480491 4511261 2641725 -819751 -1799793 849808 3439070 2360522
10903 2360522 -602921 -351237 4523262 9755963 11184763 9579039 8003421 6915178
10895 6915178 4504329 504559 -2964501 -4081838 -3206830 -2236237 -2952553 -5540449 -8243934
10886 -8243934 -9170657 -8465654 -7567502 -6648884 -4687790 -1879950 395224 2039536 4100271
10877 4100271 6224689 7207860 7884710 9758974 10790664 7235434 390718 -3770130
10869 -3770130 -3268609 -2763137 -5018640 -5790418 -1304550 4621019 6131206 3592095 816801
10860 816801 -1976491 -6202561 -8992379 -6137726 402143 4090178 2353552 -1606479
10852 -1606479 -4655518 -6098891 -4950055 -590336 3501002 2124054 -4144045 -8277501
10844 -8277501 -5491588 777708 3601313 982121 -2465850 -1472930 3546346 6840280
10836 6840280 4534926 159445 89076 4115730 5487947 1571592 -1478742 1679633
10828 1679633 6838267 6634107 1515045 -2093014 -1772065 -600940 -243982 903191 2984450
10819 2984450 3731393 2465110 656251 -1174332 -3172621 -3886794 -2509481 -1845544 -4250386
10810 -4250386 -6206781 -2482459 5353819 10374302 9810645 7439255 6521717 6009097 4315448
10801 4315448 1818530 -1030504 -3786829 -4358950 -1736447 381730 -2159347 -6868687
10793 -6868687 -7527187 -3549260 48524 1674929 4598153 8531438 8017943 2015856
10785 2015856 -2525795 -963589 1634562 -1301115 -7271322 -8482087 -3296131 1998171
10777 1998171 2168846 -721503 -843830 4035224 9955174 11464268 8455686 6466593
10769 6466593 8846742 11390414 8404590 1919779 -593310 2890238 6348077 4998477
10761 4998477 1470522 416755 1844279 2887014 2530997 1405611 -478594 -2890954
10753 -2890954 -4024909 -2241925 1795175 5762748 7424369 5792523 2328619 645988
10745 645988 2708372 5708504 5307466 1444438 -1989883 -2631717 -1494241 51984 1472203
10736 1472203 1605622 -191584 -1634515 16835 3396668 4847011 4268876 4725943 6491227
10727 6491227 6354744 3176275 -620420 -3615856 -6702367 -9075036 -7755890 -2532679
10719 -2532679 2754618 5188406 5500584 5156786 4423705 3857598 4013594 3364181 132353
10710 132353 -4006621 -5954690 -6239377 -7538862 -9055708 -7652929 -4002926 -1858012
10702 -1858012 -1507772 -32171 2095618 1299083 -1864896 -2704591 -628297 -486068 -4185572
10693 -4185572 -7570760 -7284350 -4389908 59439 6143111 10456583 8015721 845769
10685 845769 -3001678 -1325754 -517391 -3614230 -4702620 90376 4666570 2305562
10677 2305562 -4134709 -7888910 -8069652 -7246820 -4764586 496592 4868238 4077605 -313413
10668 -313413 -4023428 -6389399 -8634011 -9287723 -6639059 -3035942 -2036319 -3557477 -5396235
10659 -5396235 -6571412 -5997006 -1731648 4818435 7987201 5007787 157661 -1822817
10651 -1822817 -1914775 -2550226 -2325235 95941 1689165 304583 -193205 3946075 8969041
10642 8969041 8784275 4380944 1592276 1946027 2259327 1535213 1731080 2496608 1226775
10633 1226775 -1564199 -2053877 1154772 5073030 6539072 5370250 3340943 2550117
10625 2550117 4376166 7780933 9305961 6747097 1974157 -1569495 -2916528 -3424124
10617 -3424124 -3915637 -3834957 -2544767 -320937 1571769 1910741 1401822 2243831 4164865
10608 4164865 3277534 -1931287 -6331944 -4870124 -1009865 -1842114 -6397268 -6748844 -677980
10599 -677980 5009219 5081849 1969278 -655238 -2856922 -4601863 -3923268 -1413677 -238932
10590 -238932 -65294 2280070 5123250 2927863 -3541920 -6637305 -3502588 347071
10582 347071 1231150 1765124 2708244 519094 -3561802 -2370331 4992672 9945343 7846804
10573 7846804 4410474 4213230 3779743 1382471 2213696 7305214 8628091 2590892 -2482552
10564 -2482552 -41429 4382093 4595284 4367021 7656641 9128587 4389126 -368854
10556 -368854 834467 2833330 -571028 -4795919 -3175010 1303657 3056408 3911876
10548 3911876 6278504 5685927 258489 -2132737 3217223 7858539 4319661 -143988
10540 -143988 3756969 10851578 10860571 5314909 2078968 1290987 -656287 -1336825 1434473
10531 1434473 2056363 -2668730 -5225756 -573538 3047030 -1620981 -7358527 -5875562
10523 -5875562 -2512602 -4279225 -5950116 -1858128 1757061 -42537 -5386 5106590
10515 5106590 4404269 -5989543 -11045863 -3014568 2214009 -5686566 -10322517 209147
10507 209147 7464323 -4010864 -14853811 -5100154 7546512 903219 -8839222 -6140
10499 -6140 8580330 -6024893 -19032214 -461016 21182688 6629364 -13329256 10837797
10491 10837797 43517013 21322199 2510528 119646711 350134981 476206272 355756538
10484 355756538 119227823 -7777370 12347066 45518081 18314687 -11444647 2249046
10477 2249046 18643316 2469947 -15015587 -5095963 7343195 -986519 -8854184 2177881
10469 2177881 10624834 -1582403 -14078473 -7598436 1327960 -5129450 -12726430 -5439072
10461 -5439072 2778343 -4335974 -13572165 -6846505 5737849 5002288 -4459998 -6279336
10453 -6279336 -1005821 854320 747311 5195924 8612120 2869212 -5633811 -6031036
10445 -6031036 -1456979 -1924029 -6805021 -8418966 -5825033 -2980167 -222392 2369157
10437 2369157 1030121 -3442740 -2635847 5658123 10626034 4537283 -4822581 -7641015
10429 -7641015 -7375827 -11391691 -16012370 -13419601 -6166235 -2704189 -3718290 -3584428
10421 -3584428 -1090328 722511 1650697 3076478 3102775 -33973 -3101415 -2419372 195914
10412 195914 1031326 282133 58546 556263 1552905 3420786 4367562 1849953 -1768685
10403 -1768685 -1417781 1668158 1067095 -3246120 -3869115 843917 2863972 -1948958 -6466752
10394 -6466752 -4119339 1100341 2646976 1096099 -448910 -2825659 -6359941 -7097591
10386 -7097591 -3572178 -719447 -1629717 -2171421 1115575 4948949 6140910 6913037 8149800
10377 8149800 5352086 -2754041 -9356810 -9472730 -7103988 -6470807 -4423579 1438363
10369 1438363 5550774 3563418 1059884 4139799 8194120 5690665 -754156 -3184267
10361 -3184267 -1535256 -1857383 -4575870 -4474789 -698203 2126750 2040666 1567963 1984363
10352 1984363 2216093 2739665 4708876 5848996 2600024 -3916395 -8435365 -7807906 -3645372
10343 -3645372 329106 1229520 -1022768 -2947544 -1179605 2095057 1341267 -3529491
10335 -3529491 -5970826 -2537691 2242953 3742983 3512890 3792373 2507116 -1107342
10327 -1107342 -2281025 1767222 5670640 3783456 -753870 -1568255 755027 1090801
10319 1090801 -1248837 -2991185 -3536428 -4486776 -4831139 -2686922 134176 715542 96613
10310 96613 882842 2365006 2734927 3014304 3751306 1497552 -5374677 -10740003 -7641527
10301 -7641527 1056683 6049591 4433136 2202750 3994383 6870365 5862258 1018589
10293 1018589 -3082193 -2501851 2218718 6322821 5589671 1352814 -1356536 -1071308 -1377447
10284 -1377447 -3806277 -4332646 7109 5843031 8641746 8650670 7620893 4406654 -1104073
10275 -1104073 -4081036 -713172 5188266 7238931 5280762 3614462 3233085 1753282
10267 1753282 -906837 -2518660 -2914018 -3374896 -2930746 96960 3986614 5245247 3364392
10258 3364392 603029 -1483464 -2369545 -1540574 -29173 -514140 -3286476 -5160958 -4729509
10249 -4729509 -4564221 -5567674 -4449845 -535048 826532 -3351555 -7730345 -7032661
10241 -7032661 -4640070 -5775068 -7574781 -4413186 1167865 2048270 -1769465 -4127521
10233 -4127521 -3495080 -3786368 -5386146 -4261540 -288137 1623638 -257068 -2121305
10225 -2121305 -1661557 -1350650 -3289941 -5654828 -5357233 -998389 6060692 10613329 6632625
10216 6632625 -4120022 -10476297 -5168434 4073980 4469827 -4166221 -10892299 -10362848
10208 -10362848 -7602709 -6543705 -4640392 -769877 1145263 -536204 -2127038 -1575328
10200 -1575328 -1242071 -1610843 186972 3213822 2030139 -3672529 -6496978 -2395070
10192 -2395070 2908996 3102492 174792 -1111523 -1619280 -4567998 -8308993 -8567417 -5216806
10183 -5216806 -1710225 264146 1422022 1982034 1682020 1201872 832313 -584285 -3038601
10174 -3038601 -3640727 -92551 5427373 7911933 4444449 -3137456 -9384341 -9424928 -4080145
10165 -4080145 -73301 -2417663 -7871916 -9825047 -8036100 -7698710 -9531637 -8298823
10157 -8298823 -2728834 753549 -2096684 -6311654 -5444500 -997471 1419906 1170179
10149 1170179 1770165 3673419 3804484 1132242 -2255245 -5082405 -7706658 -9300971
10141 -9300971 -7981362 -4078005 -498714 554821 -583994 -2284439 -3042495 -2086529
10133 -2086529 -83002 1102999 389050 -1379832 -2875483 -3675413 -3561900 -2114031 -12533
10124 -12533 970039 441480 101631 820264 1061308 -235114 -1404741 -910371 -556696
10115 -556696 -2955523 -6704621 -7134296 -2239739 4236485 6541936 2803088 -3322635
10107 -3322635 -6405429 -4403117 -272079 1366868 -1134780 -5279374 -7231403 -5203464
10099 -5203464 -775347 2218215 850823 -3662568 -6640257 -5128169 -1407203 335975
10091 335975 -490073 -1201767 -547191 243918 773201 2094091 3441959 2114469 -1862676
10082 -1862676 -4404306 -3079291 -1302138 -3580998 -8296044 -8987966 -2956204 4505602
10074 4505602 5937201 179886 -6773846 -8979546 -6651515 -4127111 -3333242 -1869675
10066 -1869675 2290330 7036743 8846290 7458645 5622296 5179490 5565545 5699146 5331990
10057 5331990 4486442 3032219 1062578 -939134 -2100032 -1358753 1095704 2623948
10049 2623948 719395 -2555460 -1758360 4585187 10900758 11437906 7457495 4390621
10041 4390621 4336013 5190212 5276664 4548145 2294062 -2055335 -6104924 -6226061 -2281509
10032 -2281509 2263278 4706322 4894808 3275404 219887 -2828968 -4091625 -3327763
10024 -3327763 -1462279 602604 1443362 -357052 -3113892 -2376960 2831364 7335276
10016 7335276 6878960 4356924 4542965 6243311 5382580 2832408 2604512 4429874 4963128
10007 4963128 4733077 6785428 9587477 8780672 5471797 5096237 7951592 8699919 6005044
9998 6005044 4708333 6885181 8478852 7040163 5516277 5766611 5209264 2674760 1051303
9989 1051303 1423551 1054287 -289460 1080051 5074048 6141741 2914459 2006558 7452675
9980 7452675 13332507 12448155 6274116 602294 -3117940 -6091178 -6754221 -3308516 1898421
9971 1898421 5635556 7906113 8792140 6009586 203169 -2661952 334804 3531834
9963 3531834 1439583 -2398259 -2213916 -331027 -2191584 -5223456 -2272396 5916679
9955 5916679 11013721 9450505 6029990 4923345 4912473 4599218 5089305 5745370 3610253
9946 3610253 -890010 -3207364 -1720523 -478894 -2609432 -5568896 -5738550 -3995433
9938 -3995433 -3555765 -4749352 -4944973 -2603790 699606 2160039 821528 -1331114 -1658938
9929 -1658938 -196703 640180 -47971 -398366 433503 191041 -2447821 -4464369 -2372687
9920 -2372687 2353422 4991853 3474352 -178376 -3046493 -3481333 -1565647 375903
9912 375903 -414198 -2770536 -1721964 4519907 10845780 11750740 8274518 4640435 1474195
9903 1474195 -2746453 -6492074 -7047697 -5490792 -4383169 -2515551 2292427 7028640
9895 7028640 6579295 1940777 -1118737 -1004048 -1310553 -3136386 -3404010 -1537910 -837029
9886 -837029 -1716808 -393782 3469944 4399685 -455486 -6326701 -7870534 -6147033 -4916395
9877 -4916395 -4886486 -5879016 -10070038 -17558863 -21837414 -15780197 -1429956 10922537
9869 10922537 13705285 8929367 4035633 3704899 6483639 7801471 5383953 1731335
9861 1731335 969935 3706606 6603136 7072985 6084506 5505203 5185307 4386149 3995738
9852 3995738 4956239 5735754 3875933 -223967 -3163548 -2563025 239483 2255246 2649982
9843 2649982 3192019 4896038 5809959 3653478 -187127 -1713607 458181 3634197 5683787
9834 5683787 7929929 11326118 13003571 10175908 5186545 2518021 2259920 1083460
9826 1083460 -1006746 100453 5943032 12406060 14859924 13033694 9315469 5264227
9818 5264227 1663902 -243839 458496 3307401 6795900 8835969 7534027 3498445
9810 3498445 608055 1781325 4630184 4523564 1310588 -1101438 -1690010 -3727889 -7969488
9801 -7969488 -9646695 -5356920 963278 2706772 -1200072 -6153182 -8183038 -7209075
9793 -7209075 -5012458 -2852885 -1047567 748816 2779577 4169941 3681008 1919931
9785 1919931 1174191 2319252 3678298 3765359 3122825 2419725 1004182 -1181526 -2403363
9776 -2403363 -1602022 -132316 722810 1943284 4334827 5876732 4382810 1675871 2048131
9767 2048131 6625466 11744823 13454746 11866813 10230423 10647469 11581646 9744264 4289871
9758 4289871 -1571111 -4023147 -3141329 -2292112 -3194027 -3874225 -2299916 304378 1461488
9749 1461488 1053454 868353 1541954 2004482 1568979 738331 -95174 -1161573 -2005997
9740 -2005997 -840408 3638918 9791114 13375135 11473093 6079266 2437710 3125222
9732 3125222 5250751 4815971 2157947 665305 1281622 1541395 -50878 -1966301 -2550313
9723 -2550313 -1873295 241132 4811709 10691216 13910217 12205591 7837793 3895275
9715 3895275 549780 -2367937 -2188060 2799058 8271411 8076124 3453881 2369050 7753870
9706 7753870 11930501 7144980 -2221909 -4380375 3806898 12201344 10905157 2669544
9698 2669544 -2566304 -1394317 991212 669784 -151533 682463 659656 -2362961 -5134485
9689 -5134485 -3449769 1193812 3620598 1937135 -1208460 -2937569 -2372615 101806
9681 101806 2649261 2549959 75721 -251985 3956936 7727180 4978059 -1775403 -4245720
9672 -4245720 -449628 2776850 494345 -3533066 -3322792 1369437 6710423 10100664
9664 10100664 10724935 8512430 5572078 5404105 7941042 8639835 5215746 1756731 2854991
9655 2854991 6887630 8901451 7549096 5287165 3839682 3416687 4773271 8006489
9647 8006489 10215730 8039946 2216819 -3253727 -5982632 -6550464 -5593652 -2472904 2844865
9638 2844865 8530718 11895596 10980921 6055378 333212 -2407340 -2100715 -2342263 -4737671
9629 -4737671 -6095613 -3709836 -548938 -1240907 -4630012 -4913237 10221 5533455 6626072
9620 6626072 3784559 1066880 483714 435044 -1081113 -3478682 -4479062 -3529006 -2971829
9611 -2971829 -4662389 -6564813 -5263623 -1536515 62197 -1984645 -3677932 -1950282
9603 -1950282 323076 -711289 -3148027 -2249134 1794880 4152924 2931130 1553435
9595 1553435 2752812 4349515 2874854 -1348494 -4698042 -4379495 -790806 3419846
9587 3419846 5998240 7058210 8121856 9133278 8190870 5341481 4181449 7035445
9579 7035445 10513305 9522149 4645426 1384867 2083151 2871593 -148171 -5397145 -8537930
9570 -8537930 -7937523 -5120177 -1800000 1033535 2246006 1271715 -420732 -351652 2151356
9561 2151356 5168939 6400825 5298061 2751101 -330702 -3172665 -4455300 -3131167
9553 -3131167 -409334 612913 -1511881 -4645839 -6046923 -5774133 -5103987 -3379935 252440
9544 252440 3343302 2784478 452184 1040012 3880777 3022438 -2608815 -5679232 -1150000
9535 -1150000 5246395 4914124 -1446000 -5869759 -4497451 -628434 1819143 1942488 45608
9526 45608 -2338702 -1590982 3580723 7993097 5778222 -796049 -4382884 -3554297 -3696515
9517 -3696515 -6690579 -7354018 -2382346 3896918 6036324 4408419 2271117 474985
9509 474985 -1360202 -2076293 -868985 636682 799077 270108 334312 1395060 3925086
9500 3925086 7808166 10338762 8931021 6228683 7359674 11109536 10093587 2182177
9492 2182177 -4828789 -4179790 109472 19293 -4612546 -7496555 -6270989 -4891806 -6457400
9483 -6457400 -8963779 -8728844 -4977289 -829023 -798083 -5651249 -9223573 -4150138 7707641
9474 7707641 15544782 13147804 6558065 4020554 4436788 2309339 -1233023 -985345 2010172
9465 2010172 1923334 -1297864 -1750422 1826461 3752504 1167556 -1584771 -682128 1743223
9456 1743223 2609277 2485899 2384087 1115816 -1429058 -3061790 -3663309 -5865605 -8969342
9447 -8969342 -7590699 102104 7609229 7806717 1841129 -3592200 -4680104 -2385640
9439 -2385640 1159031 4008115 4097913 1270023 -1615586 -2154234 -1395043 -1263106 -1171524
9430 -1171524 372301 2831309 4675860 5478422 5057846 2753257 -672443 -2967355 -3857140
9421 -3857140 -5443136 -7530981 -6731040 -2645818 -121998 -1630385 -2306765 2308615 7920500
9412 7920500 7164240 588927 -4598497 -4725088 -2271845 -12925 1079482 -475974 -4485505
9403 -4485505 -5889565 -850810 5045232 2717500 -6510694 -11799665 -8634331 -4325286
9395 -4325286 -4899837 -6124964 -2679188 2278772 3415747 2206788 2347633 1971962 -1684212
9386 -1684212 -4586961 -1484419 4074979 4153054 -1035314 -3877801 -2009917 -1141386 -4220383
9377 -4220383 -6573846 -4835382 -3048983 -5348781 -8493806 -7023446 -1810291 1844136
9369 1844136 2115929 1691462 2274806 2667004 2128377 1768959 1900936 990149 -1579477
9360 -1579477 -3893245 -4173368 -3567371 -4378956 -6184811 -5991748 -2807475 138292 -451199
9351 -451199 -3087874 -3440525 -347677 3326526 5676443 7550262 8420412 5142308 -2383600
9342 -2383600 -8392796 -8018640 -3766125 -1167575 -1098124 -1296415 -2441519 -6160616 -8691558
9333 -8691558 -4044808 6138640 12876903 11518517 6850868 4636634 4371509 3415235
9325 3415235 2410279 2520199 1994195 -297593 -1780480 -586764 589389 -976112 -3169529
9316 -3169529 -2900991 -1449772 -1335402 -956333 2387758 6404301 6263529 1950722 -1849471
9307 -1849471 -2466589 -1245156 518841 2998374 5233498 5293823 3405044 1611828 401558
9298 401558 -1325429 -3536771 -5457975 -7624878 -10022113 -9628813 -4325129 1848192 2629132
9289 2629132 -1514948 -3904753 -1532356 1408643 1212284 -120778 -29248 -261170 -2654957
9280 -2654957 -4345439 -1812767 3091916 5713412 5464581 5758976 7697046 7916885 3702404
9271 3702404 -2421773 -4964195 -1728413 3371907 4473115 491419 -3899454 -4837999
9263 -4837999 -4400432 -6438148 -9438516 -8235519 -2450824 2033147 1389254 -1128424 -829868
9254 -829868 1910182 3897775 4478308 5087292 5771124 5469255 4166922 2181898 -974059
9245 -974059 -4745010 -6631354 -5596337 -4172150 -4506716 -4632100 -1731636 3126600 6939296
9236 6939296 9244026 10708700 9376348 3381774 -3535550 -4739822 421115 5230657
9228 5230657 4532969 849751 -546986 916413 1659789 -192156 -2698500 -3285699 -1591264
9219 -1591264 1248717 4531357 8008184 10326877 9051544 3699208 -1957917 -3117777
9211 -3117777 -49099 1698364 -1291857 -5389131 -5033762 -545984 2682330 1617968
9203 1617968 -1410365 -2839171 -1757422 521719 2118282 1625298 -353344 -1003080 1178099
9194 1178099 3422217 1919612 -2810730 -6813677 -8090738 -7540593 -5331887 -797224
9186 -797224 3983187 5121970 2335249 -746325 -2434628 -4628929 -7579439 -8092800 -4922999
9177 -4922999 -1038543 1821500 5674567 10365120 10704533 4143500 -3453618 -5129881
9169 -5129881 -2104589 -111585 -123530 691935 1614343 -492657 -4007767 -4084935 -1241229
9160 -1241229 -1106732 -4930299 -7608774 -6715488 -6156365 -8086190 -8237810 -3413107 2477328
9151 2477328 4713277 4832197 6021294 6215686 2301000 -2250077 -1155138 4867053 8832718
9142 8832718 7515560 4447521 2874155 2078967 1763531 3796762 7240400 7269330 2512632
9133 2512632 -1175360 1507402 7302637 8872951 4960969 1131174 1417159 4102136
9125 4102136 6131168 7370018 8860832 9935905 9201198 6728642 3675580 902249
9117 902249 -862986 -730348 1068783 2456093 1529339 -981049 -2370804 -953433 2353496
9108 2353496 5171850 5685100 3865552 1495114 664075 1402657 1205385 -1897897 -6023606
9099 -6023606 -6787879 -2412352 3952469 7775430 7754050 5936312 4580210 4410572 5074982
9090 5074982 5537061 4434798 1729529 -295935 579205 3320588 4665322 3212794 465796
9081 465796 -2029973 -3945275 -4392580 -2243761 617279 -112951 -5065594 -8871161 -6913873
9072 -6913873 -1687111 1062328 -9556 -2213413 -4483220 -7266547 -8170462 -4136697
9064 -4136697 1796591 2505448 -2719631 -6064905 -2595150 2363184 1800593 -2333475 -3151165
9055 -3151165 205354 2457534 1185146 -890993 -2285990 -4959292 -9077951 -11166710
9047 -11166710 -9557385 -7315612 -7447455 -8689005 -8323548 -6214692 -3680700 -734666
9039 -734666 3131999 6915078 8777448 7975458 5339004 2871297 2742767 4774885 5351282
9030 5351282 1746671 -2759189 -2176746 3224104 6169769 2617289 -2288775 -1959363 2450379
9021 2450379 5231994 4795586 3560102 1831242 -1829930 -5268291 -4295615 17076 1547995
9012 1547995 -2067297 -6182343 -6567853 -5061443 -5113163 -6125996 -5711179 -4233499 -3491242
9003 -3491242 -3270984 -2466038 -1553422 -914373 1240700 5958000 10305127 10579729 7532765
8994 7532765 5011793 4469381 4297783 3688801 3312259 2578541 128558 -2984380 -4475963
8985 -4475963 -5203171 -7966551 -11479438 -10645409 -4506104 1381706 3411648 5452821 11311265
8976 11311265 16385192 13545476 4761799 -724758 324357 1110227 -3920993 -10254577
8968 -10254577 -9842475 -2106061 6195514 9623444 8402044 5547113 3564915 3680793
8960 3680793 5261594 5764965 3330465 -566314 -2623163 -1539695 1089958 3066410
8952 3066410 3229080 1580235 -540163 -1105861 190013 1147394 304009 -576507 416698
8943 416698 1579378 356832 -1529613 -291160 2886855 2261324 -3692815 -8975826 -8273455
8934 -8273455 -4204045 -2646179 -4124463 -4307227 -1162938 2869040 5161201 5479792 4412932
8925 4412932 2525673 1180750 1343150 1576544 16712 -1868547 -820734 2652321 4013172
8916 4013172 1262429 -1781932 -1026663 1961827 2576865 -84661 -2368347 -1347558 1944337
8907 1944337 4856147 6446640 7569381 8877347 9653575 8423942 4719949 366952
8899 366952 -1739679 -881603 325721 -740033 -3062139 -3589330 -2109470 -1889174 -4568683
8890 -4568683 -6870711 -4522678 1852402 7100561 7401303 3788842 -33744 -1424001
8882 -1424001 -200743 1733659 1760922 -708542 -2763774 -1625322 181614 -2923859 -10650670
8873 -10650670 -14706193 -9434357 -737368 1431810 -2821221 -3958381 2325936 8823777
8865 8823777 7809858 1568685 -2430314 -1681054 1038098 3438687 4509786 2671566
8857 2671566 -1521339 -3454010 -570323 2237401 -626928 -5849411 -5672138 -545528
8849 -545528 1050008 -4192967 -9886244 -10645621 -9103180 -8727541 -7322943 -2785774 999898
8840 999898 -72811 -3485129 -4612876 -3726293 -2835243 9234 6585234 12297732 11509873
8831 11509873 6673036 4659539 5682366 3874133 -1561559 -4107791 -245472 5307329
8823 5307329 7004733 4921091 1339685 -3211179 -7398420 -7754926 -3628026 419464
8815 419464 445846 -1782750 -2067799 1011282 6157207 11100535 12568122 8748038 3705783
8806 3705783 4294413 10071704 12198819 6388148 572898 3408641 10688917 11641119 5263107
8797 5263107 721517 2331122 4066751 1156999 -1753417 1077853 6231503 5362083
8789 5362083 -3152792 -12065809 -14072454 -9204014 -3327757 -1532760 -3557872 -4929561
8781 -4929561 -2204187 3339321 7570824 8024311 5426439 2088029 695371 3213194
8773 3213194 8117120 9900491 5031219 -2149935 -3731771 1343926 5829053 4410046
8765 4410046 586249 580601 4450978 7155167 5919655 2600370 56503 -342550 1698018
8756 1698018 5168972 7201508 5371189 1003009 -1686687 -341379 2850504 3845648
8748 3845648 1514721 -1039283 -384705 2389947 2440632 -2189464 -6883410 -6229943 -1832748
8739 -1832748 -58608 -2539006 -4344688 -2787145 -2088248 -5892046 -10374814 -10033423 -6644754
8730 -6644754 -6291256 -9459001 -10636636 -7544689 -4405719 -4463816 -4716225 -1188281 4327675
8721 4327675 6567159 4020883 553736 173789 2575384 4401477 3664714 1964167 2175711
8712 2175711 4388250 5196997 1738035 -4380528 -8386161 -7335389 -2817474 1136869
8704 1136869 1943124 384156 -565969 1218087 4862426 7556905 7581500 5509805 2810985
8695 2810985 838759 957110 3210515 4457449 853904 -6407228 -10837853 -8300915
8687 -8300915 -2218308 1440448 1720558 1908088 3370600 4191139 2999871 618845 -1716497
8678 -1716497 -3037390 -2281252 258166 2217594 2218445 1822929 1867219 -328265 -6136715
8669 -6136715 -10886716 -9339208 -3878961 -1146223 -1905029 -1255953 1505258 1237386 -3349600
8660 -3349600 -6178398 -3302469 791358 632890 -2071742 -2486289 -358487 1166445 919958
8651 919958 -625788 -3938577 -8259558 -9753356 -6443808 -2620027 -3590773 -7760719 -8559432
8642 -8559432 -3252942 4355235 9405223 10407405 8531109 5860091 4462252 4638399
8634 4638399 4096551 763648 -3987273 -6512965 -4699675 427067 5603294 7050786
8626 7050786 3478451 -1476333 -2359158 1275997 4269529 3473434 1733152 1803707 1229298
8617 1229298 -2424642 -5626095 -3823842 750899 2228446 -59930 -1841259 -1426212
8609 -1426212 -844544 -363613 1869200 4659193 4059794 -435860 -4847545 -6205901 -4531680
8600 -4531680 277113 7929046 13871203 12023133 2885235 -6205411 -10176430 -10526564
8592 -10526564 -9697161 -7329088 -4238517 -3957222 -6910254 -8216595 -4925962 -839582
8584 -839582 -350739 -1819372 -1270089 1096147 2503538 2529880 2036779 -15379 -4112261
8575 -4112261 -6772458 -4180656 2207727 7622284 10010470 10334713 8664193 4503642
8567 4503642 34405 -1524636 -662941 -750292 -2478489 -2965778 -794759 1744397 2477314
8558 2477314 2320646 2977236 3928717 3374660 1028332 -1177251 -943504 1839130 4235987
8549 4235987 2994830 -1223212 -3951422 -2497890 542905 1228131 -534926 -2470112
8541 -2470112 -4270647 -6438234 -6502334 -1665554 4910226 6017994 126486 -5755416 -5409527
8532 -5409527 -1147848 1194170 1048664 2087345 4819270 5731420 3499976 1187003 1281658
8523 1281658 2457900 2717061 2387155 2092448 729786 -2015769 -3556632 -1826163 917250
8514 917250 1047875 -839809 -1109465 564023 375870 -3146615 -6149102 -5239976 -2737994
8505 -2737994 -2877330 -5307110 -6096023 -3688823 -109729 2961105 5583491 7211388 6602514
8496 6602514 4612806 3893376 4968642 5503431 4486022 4294095 6965887 10624104 11524228
8487 11524228 8452374 3748691 759381 937443 2704708 3128138 1604702 1126495 4246129
8478 4246129 8933117 11125255 10454016 9877230 10081016 8589287 4903813 1908047 784507
8469 784507 -922724 -4119310 -5436578 -2435769 2406505 5915861 8665273 11868676
8461 11868676 13445900 11111792 6540447 2806269 386611 -1062848 -400801 1810244
8453 1810244 1758129 -1367558 -1761881 4542868 11650776 11515949 6419976 5059847 8095439
8444 8095439 7531298 797489 -4789094 -4280065 -2317942 -3646969 -4818352 -1409656 3267461
8435 3267461 3628420 960023 24227 365636 -1536704 -3915816 -1419366 5124334 7853393
8426 7853393 2504329 -5488599 -8040357 -3953317 1117716 1966274 -1327125 -5035588
8418 -5035588 -6455648 -6318870 -6718937 -7620432 -7047897 -4656049 -2669747 -2304260 -1796928
8409 -1796928 293438 2332520 2540506 2435699 4349024 7129179 7561864 5114793 2294888
8400 2294888 1020146 1395526 3241327 5848995 6865125 4508759 521209 -2005002
8392 -2005002 -3098048 -4843870 -6485695 -4943609 -744653 1130962 -1712407 -4966795
8384 -4966795 -3350022 2161269 5892309 4829771 1654592 868272 3871560 7932650
8376 7932650 8979457 5401640 -583505 -5505127 -8032064 -8832143 -8092660 -5563287 -2741646
8367 -2741646 -1990087 -2924489 -2733582 -1014142 -798575 -3049130 -3983062 -1038735 1845356
8358 1845356 -642800 -6895945 -10243094 -8281536 -5213321 -4563901 -4840980 -4226850 -4691351
8349 -4691351 -7976704 -11024985 -9808547 -5891813 -4669756 -7460979 -9676266 -7833777
8341 -7833777 -4548889 -4101189 -5695422 -4645464 513950 5576564 6181254 3140457 526613
8332 526613 320839 1398427 2818056 5024922 7382448 7460865 4502939 1603132 2299241
8323 2299241 6209229 10088207 12041879 12122782 9609018 3272303 -4910338 -9581166 -7599400
8314 -7599400 -1882441 2299757 3355168 3667616 5198371 7377454 8931256 9298766 8019714
8305 8019714 4970464 1848357 1323247 3517896 5036108 3082946 -722979 -2550249
8297 -2550249 -1477430 -31675 219003 787429 2929938 4859396 4644339 4008907 5886424
8288 5886424 8850008 7946269 2087557 -3022686 -1697260 4637537 9874410 10580316 7756581
8279 7756581 3200018 -1653962 -3979259 -1234097 4615118 8174033 6900621 3213681
8271 3213681 -115641 -2864362 -4792890 -4552981 -2919395 -2822977 -3989112 -2129488 3735421
8262 3735421 8237330 7814213 6441627 7770241 7151604 -528741 -9406075 -9286854 -2048107
8253 -2048107 -110383 -7300486 -12620936 -7467022 1249104 2327989 -3382344 -6743161
8245 -6743161 -5205769 -4472337 -7508237 -10553957 -10182303 -7524288 -4607855 -1825319 15618
8236 15618 -501438 -2675525 -4271296 -5056993 -6316256 -6983996 -4225773 1741158 7155448
8227 7155448 9685577 10451728 10493483 8878127 5528337 2648226 1646318 1070408 -919462
8218 -919462 -3934553 -6293974 -6897038 -5464395 -2592624 -119136 114160 -1758387 -4061446
8209 -4061446 -5664895 -6312747 -5862145 -5020128 -5455600 -6855189 -5764676 -630720 4105724
8200 4105724 3482928 -86475 15089 4463326 7477170 6494825 5115237 4977491 2481926
8191 2481926 -3098350 -5633630 -1226777 4926059 6401576 4814534 5011461 6070509
8183 6070509 4436524 1972773 2606285 3661643 -531411 -7522074 -8488612 -1854079 3731766
8174 3731766 2445123 -840402 346803 4277371 5738680 5011074 5666636 6808118 4267292
8165 4267292 -1471011 -4519964 -1697503 2942009 3582756 33832 -2591137 -614078
8157 -614078 3847756 5951543 4398492 2635231 3313760 3992357 817500 -5044044 -8251633
8148 -8251633 -6449054 -2889476 -1013325 53518 2697976 6402527 8620475 8234385
8140 8234385 5942615 2618578 -716895 -2435355 -1689593 389887 2044362 2609100 2294089
8131 2294089 1718936 2252540 4785097 7351834 6531470 2500889 -222419 1027062 3360134
8122 3360134 3552399 3477751 6078960 8697614 6073625 -1006929 -5818364 -4829364 -1374794
8113 -1374794 965862 3259319 6964389 9580850 8384877 5163249 3146288 1694600
8105 1694600 -1548221 -4840008 -3673559 2112935 7231121 8153533 7295291 7738966 7500756
8096 7500756 3053432 -3437509 -5450934 -1277220 2645514 151491 -6160926 -8823855
8088 -8823855 -6112951 -3719789 -5505936 -7914357 -6292633 -2361790 -911252 -1974099
8080 -1974099 -1820389 -429485 -1749734 -5846997 -6952633 -2047450 3621277 3400623 -2156903
8071 -2156903 -7659607 -10663202 -12230263 -11992285 -8317946 -2859904 312678 591504 1227130
8062 1227130 3084690 2713951 -1592241 -6037648 -6208865 -2559161 1457071 3929955 4685783
8053 4685783 3563705 1264303 -194792 -334571 -1258794 -3437942 -3466643 447894 3739343
8044 3739343 1175458 -4603199 -5980272 -1268138 3247245 2940543 590053 237192 689864
8035 689864 -1079418 -3951125 -4466648 -2445556 -890704 -1414228 -2808189 -3332083 -2061355
8026 -2061355 1025592 4254350 4833681 2172113 -965995 -2457695 -3607878 -5498595
8018 -5498595 -5690029 -2638716 -604631 -4398018 -10630339 -10918380 -4235893 886918 -1197876
8009 -1197876 -5284965 -4135585 252858 436510 -4646337 -8565132 -7375227 -4245038
8001 -4245038 -2869654 -1777765 1753918 5865009 6274559 2863196 336076 1952073
7993 1952073 5398138 6364615 4443720 3158651 4469787 5771837 3631895 -1111237
7985 -1111237 -3953841 -1886172 3691496 8827775 10248336 7237231 2146007 -1293900
7977 -1293900 -1908958 -2521621 -5208630 -6691981 -2658727 4005925 5147165 -987585 -6023444
7968 -6023444 -2976868 3801100 5373263 854414 -2898158 -1710967 2254580 5963849
7960 5963849 8116639 6622482 68633 -7351627 -8464437 -2457033 3699004 4955150
7952 4955150 3896403 4425936 5451441 4612260 3389619 3817268 3810214 734112 -3038208
7943 -3038208 -3061422 455490 3375163 3727096 2789368 1285214 -955709 -2139149 34705
7934 34705 3757107 4215604 286627 -3531488 -3248631 -384278 833117 -1091333 -4050089
7925 -4050089 -5328799 -3928966 -831101 1967670 3104337 2863454 2180212 1193291 -157164
7916 -157164 -867556 -35938 1019635 -121193 -3502149 -6303998 -6346800 -4399135 -2270277
7907 -2270277 -156169 2807335 6063263 7150080 4351325 -474082 -2843577 -515055
7899 -515055 3354736 3928699 1277527 198376 2703917 4542497 1751551 -2827666 -3592448
7890 -3592448 -289565 2598960 3090827 3161110 3377246 1475107 -2728744 -5785436 -5727596
7881 -5727596 -4752318 -4925888 -4955731 -3510251 -2300499 -2998379 -3845604 -2521169 -474800
7872 -474800 -1103107 -4411630 -6324720 -3541271 2500134 6835682 5688753 142033 -4957055
7863 -4957055 -6205720 -4948638 -4254164 -4155239 -2590781 -2936 808476 -513589 -1133331
7854 -1133331 133382 1010683 34866 -1081040 -1025410 -1328499 -3258799 -5417486 -6282481
7845 -6282481 -6101127 -4747797 -1334901 2348923 2312743 -1288451 -2780837 883141 5155021
7836 5155021 4986005 2335368 1657102 2105333 331657 -2169360 -1336741 1710657 2015362
7827 2015362 -924947 -2627646 -1172948 941676 2739532 6195615 10451371 10579272
7819 10579272 4615896 -2703496 -5748954 -4192000 -1659817 -1288644 -3925653 -7792302
7811 -7792302 -9023904 -5509715 -576053 564440 -1920455 -3053222 -1215977 -549294
7803 -549294 -3724902 -7624468 -8806993 -8457396 -8596324 -7687248 -4033098 -92244 985254
7794 985254 713234 2885114 7393402 10356805 9574639 6578568 3840092 2712626 3616635
7785 3616635 5748521 6916259 5722253 3569785 2798277 3332874 2835000 -123381 -4247068
7776 -4247068 -6566108 -4803182 290758 4571899 4153030 117155 -2438858 -1012770
7768 -1012770 1165474 213009 -2908829 -4593441 -4073670 -3382721 -3149744 -2040179 -160329
7759 -160329 323670 -1293419 -2679222 -1612716 1024500 2697525 2495908 1504437 458236
7750 458236 -1141501 -2922457 -2350038 2277457 8073179 9803824 6696523 3661086 3705136
7741 3705136 3018011 -2265463 -7812461 -6044431 1944455 6681897 3394872 -2204919
7733 -2204919 -3450081 -1202736 870109 3080601 6401848 7466964 3321416 -2119125
7725 -2119125 -2768942 477619 1336657 -2295944 -6088037 -6202439 -3335935 240820 3086289
7716 3086289 3702514 1262760 -2412949 -4914220 -6854271 -9864408 -12005024 -9981440
7708 -9981440 -5653583 -4836268 -8541221 -10678056 -6648304 353201 4487347 4869500 4519751
7699 4519751 4571988 3543297 1070190 -1302082 -3027725 -5406946 -8726656 -10512254 -8224382
7690 -8224382 -3168647 10626 -1328007 -4244547 -4109773 -1547233 -2051386 -7502222 -11888647
7681 -11888647 -8722249 98485 7028518 8643815 7854344 7210310 5510517 2129150
7673 2129150 -109572 1194016 4394950 6224492 5563893 3244246 363935 -1572670
7665 -1572670 -835038 2557192 6435581 9078026 10711844 11843057 12109311 11641555 11440480
7656 11440480 11304971 9481593 5714043 2667011 2662289 4567958 5652534 5328601 5253012
7647 5253012 6294431 6993537 5273910 1144791 -2513570 -2302070 1988684 6501919 7000812
7638 7000812 2980129 -2540898 -6157920 -5946608 -2050351 2391249 2550926 -2847090 -8686851
7629 -8686851 -9095730 -4999869 -2345609 -3426961 -4449658 -2114233 1899221 4433019
7621 4433019 4978140 4510014 3360220 1964203 1131771 388572 -1407698 -3283137 -3175616
7612 -3175616 -2086344 -3104937 -5491365 -4594075 493447 4216052 2436007 -1549185
7604 -1549185 -2576603 -1249389 -1664197 -4445499 -6464923 -5741189 -3062846 -188031 950187
7595 950187 -839618 -3707194 -3931920 -1358084 -122445 -1656549 -1687881 2134318 4861972
7586 4861972 2025346 -1830675 487772 7013129 8947187 3375900 -3789870 -7076883
7578 -7076883 -6538272 -3557047 1271782 5015560 3677548 -1805603 -6279255 -7839053
7570 -7839053 -8747991 -8643451 -4315112 2098138 2876075 -3635315 -8622036 -4999432 2610709
7561 2610709 5922700 4986274 5017922 6000542 3810794 -713440 -2068705 974276 3804759
7552 3804759 3768867 3254670 4024487 4274396 3026935 2305566 2717024 1400583 -2853806
7543 -2853806 -6211167 -4751878 -149652 2757508 2174057 188657 -1183300 -1858925 -2274660
7534 -2274660 -2752133 -4142631 -6920699 -9565638 -9854507 -8121965 -7313282 -8972882 -10901329
7525 -10901329 -10206116 -7362785 -5174722 -4245828 -2139108 2151267 5416914 4194589
7517 4194589 91387 -1752811 688271 4088561 4749976 3001190 1275104 455907 360114
7508 360114 1709941 4671113 6685215 4989679 924131 -1395706 -913864 -1029849 -4164193
7499 -4164193 -7766814 -7664603 -3536987 1036118 2979297 2302191 774366 -249331 -453958
7490 -453958 -114457 272348 -136097 -2620323 -7692045 -12868005 -13028438 -5640891 4454330
7481 4454330 8647307 4250981 -2223589 -3506017 -537943 144915 -4077082 -9206627
7473 -9206627 -10792654 -8538954 -4307715 398348 3555170 2946635 -299037 -1459931
7465 -1459931 1738441 5184834 3620054 -1886784 -5167745 -2856674 2297958 5858540
7457 5858540 6208431 4143990 928395 -1933611 -2955254 -1996891 -253688 1451732 2973541
7448 2973541 3484406 1983469 -413851 -1107661 205888 940515 60502 170735 2907724
7439 2907724 5128654 3337931 10792 880605 6195171 9424521 6066343 -352469
7431 -352469 -3602481 -2816661 -1684897 -1666587 -434864 2945036 5331613 3728847 -330633
7422 -330633 -2764126 -1951144 254488 1890762 3310789 5966371 9973259 13436706 13926163
7413 13926163 10765446 6166132 3572380 4361718 6857490 9106114 11158844 13106921
7405 13106921 12585126 7457534 643217 -1530604 2940543 8884411 10776684 9405180
7397 9405180 8920032 9898263 9321668 6104552 2455761 -260 -1588206 -1922797 105599
7388 105599 2839843 2412452 -1424660 -3779018 -1573149 1208280 -1230092 -8209762 -13581021
7379 -13581021 -14035684 -12381913 -12237095 -13009593 -11656277 -7231052 -2065008 558023 -902911
7370 -902911 -4808241 -7018774 -4355288 1653325 5651273 4379096 770675 332935 3850089
7361 3850089 6135937 2963494 -3068728 -5922393 -4054507 -1739859 -2375842 -3938591
7353 -3938591 -2703700 1405155 5616430 8164054 8488642 5644172 134729 -4037595
7345 -4037595 -3243331 519719 2353131 1788063 2379901 4028281 2008967 -4350928 -8284600
7336 -8284600 -4783100 1918405 4815657 3779078 3093755 2874756 -171062 -4992100 -6256726
7327 -6256726 -2605814 1111982 1123768 -798356 -1766876 -2093518 -2914362 -3191461 -1627869
7318 -1627869 965870 3150289 4547115 4822362 3519985 2113581 3356477 7049869
7310 7049869 9370547 8207764 6102598 5602881 4943647 1662904 -2207319 -2787353 -613147
7301 -613147 153087 -1859462 -4031170 -5094934 -6939278 -9588094 -8982774 -3072074 3221319
7292 3221319 3604127 -581789 -1841272 2798216 7462521 5935235 466668 -1794064
7284 -1794064 1084548 3873145 2034294 -2788359 -6224321 -6576773 -4885367 -2350962
7276 -2350962 -37970 752538 99014 101913 1962837 3798971 3398064 1799362 1790479 3784817
7266 3784817 5493399 5038551 2319578 -1996751 -6649917 -9439924 -8816980 -5692654 -2313873
7257 -2313873 -46095 582199 -737747 -2858266 -3171362 -1088708 528925 14825 277054
7248 277054 3785439 6959845 4844584 -529656 -2715469 -935017 -667158 -3761054 -5368677
7239 -5368677 -2793117 -267932 -1414491 -3201365 -1696960 1663810 4204023 7129478
7231 7129478 11099196 11555061 5163447 -2603520 -3476060 2189050 6939614 7604806 7706382
7222 7706382 8908096 7912320 3547244 70141 405456 1499268 -203645 -3018228 -3381252
7213 -3381252 -1560307 -276680 -22827 725319 2228514 3542065 4678738 5833862 5349823
7204 5349823 1532757 -3516754 -4762252 -71087 6534101 8957053 5693927 1027567
7196 1027567 -475344 858097 1350067 -354881 -1636185 -374372 1537580 998220 -1927768
7187 -1927768 -4857448 -6849857 -8408400 -8704686 -6305437 -2655679 -1281767 -2656728
7179 -2656728 -3135591 -507876 2418572 2108792 -174665 -231991 2674988 4391592 1391684
7170 1391684 -4367065 -7533695 -5650813 -1887422 -866431 -2845889 -3974829 -2336325
7162 -2336325 -884725 -2516797 -4793693 -3039401 2625611 7366784 8483694 8026897
7154 8026897 8051766 7594927 5953006 4943626 5497614 5378709 2977510 405663 22324
7145 22324 737345 785319 1236855 3128573 3903512 1140716 -2372508 -2245422 382278
7136 382278 641382 -1998763 -3183371 -1205676 788672 965176 1132688 1169725 -2531122
7127 -2531122 -9656181 -12803544 -6749139 3245380 7730908 4703987 -376737 -3729116
7119 -3729116 -6301145 -8635581 -8759546 -6080979 -2865973 -790159 509411 1103061 655471
7110 655471 871025 3964886 8058118 8381518 4222266 354273 -19451 796853 359461
7101 359461 576981 3242243 5343388 3643345 858752 1865032 5600933 6467002 3267665
7092 3267665 1094277 3330961 6712066 6466348 2737919 -635226 -1328755 -187106 832370
7083 832370 547742 -723612 -1341784 -235484 1013458 -296772 -3687115 -4844547 -821054
7074 -821054 5654303 8905700 6560199 1536576 -1672347 -1276885 1071127 2574895 1946811
7065 1946811 207619 -864704 -783079 -465198 -656249 -1156455 -1598625 -1947417 -1938253 -940528
7055 -940528 1150884 3442577 4719382 4323688 2740846 1888903 3957683 8590999 11949947
7046 11949947 10554445 5782969 2345101 2310748 3339086 3398974 4090056 7367015 11504199
7037 11504199 13124235 11903553 10454690 9982994 8655446 4746597 -387495 -3302408
7029 -3302408 -1687906 3639015 9343503 12151681 11428407 9298833 8036709 7715817 6790021
7020 6790021 4421500 1538209 -175935 182320 2035100 3794019 4176534 3256153 2143975
7011 2143975 1836000 2672979 4428674 6189513 6673118 5719557 4905799 5280444 5144039
7002 5144039 2182098 -2463466 -4936732 -4009473 -2884256 -4310373 -6479730 -5961806 -2864025
6993 -2864025 -493856 -789764 -2421786 -3159555 -2268339 -536492 680397 335392 -1353852
6984 -1353852 -2610715 -1311688 3240738 9432687 13769730 12910425 6828590 -126656
6976 -126656 -3005447 -1243784 1676190 3108270 3224648 2388455 380035 -733890 2752660
6967 2752660 10015830 13871424 8927633 -874140 -6778795 -5547680 -1404292 958460
6959 958460 1073688 834420 1815206 4648524 8000004 8351479 3966575 -1208344 -1168522
6950 -1168522 4469096 9999936 11247729 9762926 8378216 6707112 3493173 249324
6942 249324 -660427 88050 -339236 -2841232 -5337500 -5635845 -3867650 -2007875 -1727003
6933 -1727003 -2712022 -3022038 -1516734 367624 270871 -1931191 -4094037 -4925712 -5357672
6924 -5357672 -6354055 -7175941 -6781595 -5459418 -3908486 -1922953 623209 2318886 1385970
6915 1385970 -1655156 -3709902 -2179111 2048673 5352759 5347124 3415550 2410567 2401891
6906 2401891 633838 -3819479 -7539202 -6560186 -1259582 4337588 6937890 5777815
6898 5777815 1461105 -4153905 -7415710 -5295381 964192 6624462 8358805 6729824
6890 6729824 3782865 505288 -2503060 -3830051 -2295407 1375971 4656569 4930222
6882 4930222 1613072 -2643247 -3634346 70167 4966132 6355705 3858315 1428439
6874 1428439 2071520 4480351 5266571 2963100 -810380 -3276321 -3183672 -1781259 -817691
6865 -817691 199832 3161849 7457025 9386409 6882348 2374457 -952708 -3125733
6857 -3125733 -5101599 -5374358 -2394310 1894031 4727984 6678649 9202440 10434732
6849 10434732 8186489 4869591 3833123 2798656 -2423606 -9087993 -10195877 -5964011
6841 -5964011 -4198267 -7682804 -9705497 -5383159 538431 1887129 168456 -89750
6833 -89750 640059 -394051 -1926697 -1197797 501343 323103 -872204 -777415 -478680
6824 -478680 -2134669 -4325747 -4461488 -3349928 -2702472 -831468 3945458 8100846 6888187
6815 6888187 1872493 -1226308 -1029499 -1153787 -3061889 -4041693 -2665104 -1199665 -1630446
6806 -1630446 -3200652 -4643246 -5722136 -6308383 -6481633 -6995114 -7342490 -5107649 -123440
6797 -123440 3329778 2456086 1125612 3825981 7219628 4656657 -2427749 -5479233 -1368770
6788 -1368770 3814171 5026402 4807094 6638590 8459597 6886148 2826368 -1109224
6780 -1109224 -4655956 -7721349 -8034011 -4739331 -1068159 202491 973518 3901863 7069131
6771 7069131 6673228 3187429 861297 1989007 4977916 7656074 9704029 11660583
6763 11660583 13317533 13465091 10842914 5843760 999960 -1749691 -3856701 -7711432
6755 -7711432 -11647638 -11130979 -5869104 -1658763 -2814278 -6163059 -5668855 -633804 3867987
6746 3867987 3301392 -2087645 -8134760 -9950732 -5674369 1228451 4891106 3634092
6738 3634092 1651808 2769638 5273662 5226481 2262340 -983403 -3170311 -4573547 -4479320
6729 -4479320 -1838769 1778734 2843043 -118627 -4865213 -7844683 -7253458 -4264872
6721 -4264872 -1962093 -2112694 -2779277 -1027208 1940025 1802350 -1572061 -2216745 3525495
6712 3525495 10635748 11779699 7006658 2123220 -296237 -2459268 -4971319 -5154583
6704 -5154583 -2573848 -910667 -2496211 -5058001 -5757568 -4982705 -4240806 -3416048 -2280537
6695 -2280537 -2153913 -3686062 -4783107 -3043765 646393 2746494 1117301 -2381039
6687 -2381039 -3443298 212382 5654435 7207085 3081907 -2196459 -3693978 -2058284
6679 -2058284 -706797 308359 2821710 4725895 1946613 -3760693 -5722399 -2549433
6671 -2549433 -618183 -3541508 -6133844 -3484435 556987 548319 -376715 4047551 11075368
6662 11075368 11889452 5844428 2084328 5371312 9360628 7618982 3263381 2088966
6654 2088966 2637233 252543 -3290318 -2170021 3250069 6257753 4266403 2663227
6646 2663227 6026974 11001525 11556121 7804346 5335571 7082458 9622575 8114815
6638 8114815 2507082 -2702665 -4108548 -3077988 -3036198 -4420245 -4614887 -2768990 -1494860
6629 -1494860 -2301185 -2654763 -613097 666686 -2268740 -6000346 -4155840 1866785 3373340
6620 3373340 -2421345 -7025288 -3116677 4017894 4521975 -787447 -1875931 4942352
6612 4942352 11640174 10625374 4912923 2016107 2843327 2136513 -2305461 -6096444 -4496727
6603 -4496727 999317 4063838 900349 -4996491 -6548097 -1653325 3937584 4014619 121176
6594 121176 -1032261 2763290 6722127 6716436 4609332 3804706 3599270 1326873 -2602221
6585 -2602221 -5299923 -5436778 -3803626 -1238572 1313544 1929525 -371552 -3661583 -5362914
6576 -5362914 -5531345 -5683237 -5580726 -3903945 -1321429 -43960 -532918 -1088242 -645967
6567 -645967 59867 -61672 -1592346 -4534873 -7237634 -6454244 -1015624 5329888 7523333
6558 7523333 5146089 2029019 649540 336683 674628 2494812 4649480 3806614 -719946
6549 -719946 -5085283 -5754932 -3526943 -977998 1196310 3001103 2983080 193583 -3442070
6540 -3442070 -5390424 -5696085 -5501846 -4131603 -699309 2640655 2580729 -444983 -2428301
6531 -2428301 -1170846 1211798 1711704 -83820 -2706880 -4878284 -5902655 -5757524 -5695186
6522 -5695186 -7132873 -9069531 -8363648 -3846996 1442239 3847770 3740588 4482144 7213848
6513 7213848 8993645 6825749 1868040 -1838457 -2241403 -1348260 -2063444 -4218497 -5093242
6504 -5093242 -3507542 -1563944 -1493699 -2350023 -1682856 295534 667688 -1732700 -4194908
6495 -4194908 -3801978 -1402373 77698 147665 1047653 3550072 4939408 2425066 -2876114
6486 -2876114 -6977622 -7623787 -6485452 -6484345 -7866077 -7829512 -4096824 1868186 5976018
6477 5976018 5812852 2977843 713308 105508 -336760 -1878574 -3780875 -4492310 -3490878
6468 -3490878 -1604856 -362660 -1113409 -3637584 -5453035 -4038014 -340368 1673373
6460 1673373 119035 -1991674 -964340 2169803 3311366 1513109 18300 733816
6452 733816 1363760 -230803 -2070390 -1315650 896379 1470820 733130 1529611 3294949
6443 3294949 1925137 -2911331 -5032980 196628 8453836 11716154 8998239 6521440
6435 6521440 7656913 8706772 6389917 3718213 4383679 5720588 2985716 -1698090
6427 -1698090 -1226458 5508609 10610052 7414457 -806531 -5537510 -3308846 2034518
6419 2034518 5285203 4654287 1458916 -1977209 -3829207 -3722579 -2323377 258398 4292203
6410 4292203 8030670 7832258 2693631 -3078880 -4177615 -243773 4622188 7187183
6402 7187183 7528754 6983411 6265339 5588933 4787972 3350147 1458351 235259 -75380
6393 -75380 -694838 -1804300 -1557263 629533 2411965 2606902 3874464 7804921 10523076
6384 10523076 8009001 3109857 1485388 2712416 2131035 71408 1383190 5902452
6376 5902452 7870244 6196052 6590501 10740365 12274224 8004614 4576645 7545143
6368 7545143 11445897 8700983 2284932 426832 2984362 2772954 -1735012 -4494469
6360 -4494469 -2354094 960033 2155991 2488063 3205060 2958386 1265215 -336536 -1460264
6351 -1460264 -2802810 -3006557 -510102 1870956 -77507 -4458450 -4980058 -785849 1936769
6342 1936769 -412776 -4026526 -4680128 -3565464 -3424176 -4124291 -4737098 -5213108 -3954893
6333 -3954893 933080 6035101 4652927 -2690729 -6719872 -2585954 2440298 313172
6325 313172 -5203777 -4979904 1169287 5255066 3697423 648526 -638666 -2059919 -5364430
6316 -5364430 -8827269 -10736968 -11512135 -11163212 -8687267 -5043351 -3262832 -4630298 -7384580
6307 -7384580 -9398170 -9659692 -7666709 -4311230 -2665216 -4599270 -7278119 -6465106 -2648902
6298 -2648902 -229507 -1204049 -3465919 -4810396 -4649910 -2411397 1339108 2773849 -1098465
6289 -1098465 -6336953 -5702838 975539 5969040 4618563 1082777 712603 2716146 4081375
6280 4081375 5343324 7600626 8002315 3579387 -3131780 -7130145 -7506726 -6618200 -4936178
6271 -4936178 -1594498 1439218 875268 -2544577 -4629139 -3719448 -2151430 -1583649 -746702
6262 -746702 1406986 3672029 4783962 5055712 5013716 4649439 4490749 5081983 4985407 1809859
6252 1809859 -4047527 -8981527 -10291634 -8639169 -5824605 -2559106 508493 1955285
6244 1955285 1429914 574144 535669 174290 -1507051 -2640225 -622264 3526636 5395320
6235 5395320 2527134 -2069040 -3170018 413571 4442380 4710835 2458019 2414868 6002882
6226 6002882 9365558 9235584 7854659 9310533 12799677 13184519 8098639 1278836 -2021483
6217 -2021483 -696381 2058829 2717832 818740 -799733 740254 4321659 5552924
6209 5552924 2934100 831027 3161319 6564068 4869200 -982699 -3786551 -1119522
6201 -1119522 1299628 -677438 -3368491 -2469617 -391091 -1261411 -3614392 -3886379 -3106920
6192 -3106920 -3782989 -3547480 1007255 6542990 6632321 2137664 265657 3079373 4461666
6183 4461666 48348 -6535428 -9706569 -8556117 -5119358 -1131082 1182437 -130187
6175 -130187 -2927250 -2470225 1408363 3652482 2338895 1694732 3916605 4485010 175623
6166 175623 -4181744 -2820638 1721139 2818052 -239555 -2785400 -2743155 -1936492 -1399567
6157 -1399567 -1146978 -2857340 -7128473 -9803570 -6916035 -1671465 -211245 -1837332
6149 -1837332 -553297 4207068 6101852 2113346 -3009711 -4596232 -3858887 -3320147 -2359144
6140 -2359144 -329928 1047251 1375924 2870341 5236505 4415802 -329196 -3356529 -795453
6131 -795453 3125963 2734797 -498699 -1632646 -850790 -1912657 -4300837 -3745094 -4968
6122 -4968 2136455 248638 -2807544 -4565590 -6693863 -10859487 -14676805 -14653829 -10968799
6113 -10968799 -6805291 -4149769 -2292875 -32608 2226136 2963466 1572480 -751786
6105 -751786 -2541755 -3828372 -5025411 -4490500 75037 6861687 9766454 5675232 -351618
6096 -351618 -727677 5023449 10016803 8987043 3642469 -1463578 -4539295 -6199019 -6428156
6087 -6428156 -4601787 -1331543 1819218 4133998 6011194 7654345 8334575 7038534
6079 7038534 3768598 302395 -927814 515927 2236179 2062693 1163350 2084510 4196480
6070 4196480 4014038 655640 -2139740 -1324488 698812 -534237 -4918762 -7707636 -5640791
6061 -5640791 -283237 4804189 7406547 6635138 2514586 -2853276 -5890779 -5101076 -2525613
6052 -2525613 -451168 1164100 2351098 1157892 -2785496 -5237321 -2411660 2384766
6044 2384766 2554174 -1686812 -3097891 1557255 6755013 7337278 5995557 6898183 7514895
6035 7514895 3401811 -2815149 -4683948 -1933324 162182 175832 1646231 4971699 5983418
6026 5983418 3693619 1997666 1845899 -738787 -6038311 -7638871 -2305204 4021029
6018 4021029 5286950 4138298 5537911 7243735 4247477 -1281185 -2771259 14052
6010 14052 950172 -2236133 -5000512 -3867516 -886920 1160391 2474033 3319580 2186517
6001 2186517 -823547 -2525172 -959683 1621543 2225677 1421383 2167866 5624827 9615358
5992 9615358 10763180 7708045 2592958 -1007329 -2072430 -2827587 -4695214 -5736442
5984 -5736442 -3980274 -1032079 352270 334432 518210 245001 -1985018 -4858053 -5994074
5975 -5994074 -6257426 -8127133 -10543340 -9918467 -6158976 -3192485 -3078493 -3776916 -3441940
5966 -3441940 -2960863 -3281035 -3745593 -3934667 -3966881 -2624604 1312978 5647339 6573626
5957 6573626 4286191 2619635 2634147 1252501 -2647352 -5675747 -5269861 -3044813 -836469
5948 -836469 1991755 4926835 4764497 928594 -1909593 -202210 3183911 3852291 2539204
5939 2539204 2570908 3668095 3162648 1424573 1257172 2917884 3984122 3442574 2023482
5930 2023482 -783353 -5867786 -10822454 -11397767 -7479026 -3958235 -4241352 -6007477 -5438161
5921 -5438161 -3161424 -3001874 -5649150 -6635774 -1818814 6787312 12660080 12019505 7444266
5912 7444266 3677449 2085142 1104790 244590 557642 1853699 2617243 2820502 4004330
5903 4004330 6233577 7628530 7321396 6330115 5248625 3769942 2563319 2434356 1488489
5894 1488489 -3009665 -9263820 -11688193 -8516643 -4505468 -3953777 -5050277 -3901184
5886 -3901184 -592175 1999157 2685702 2274540 1671732 2070989 4518214 7153196 5930929
5877 5930929 503271 -3981083 -3778028 -1670350 -1796532 -3118435 -2515107 -1184088 -2556680
5868 -2556680 -5734308 -6413776 -3606319 -668614 102055 -361196 -1164928 -2971013 -5590356
5859 -5590356 -7048550 -5863266 -2509956 1402414 4159821 4835722 4159479 3296839 1483841
5850 1483841 -2410735 -5566969 -3053551 4074316 7879301 4312957 -611038 -374655
5842 -374655 2003178 503650 -2285787 649074 7714213 10023782 5492576 1739453
5834 1739453 3241569 4817424 1440890 -3315373 -3497093 372154 3562655 4097369 3046131
5825 3046131 1019640 -1713735 -3736963 -4047458 -3497500 -2981807 -2195436 -1313525 -1421806
5816 -1421806 -2242310 -2023136 -530226 483165 254325 -338921 -1037763 -1809703 -732389
5807 -732389 3484106 7403785 6532331 2849704 2424538 5131689 4265199 -1666895 -4905747
5798 -4905747 -234255 6712969 8517973 6852507 7513900 9793473 8518308 3470452
5790 3470452 -775163 -2740465 -4984780 -7902692 -8609072 -6106873 -2808984 -816512
5782 -816512 -351674 -1259102 -2679206 -2485903 -467126 -154148 -3595714 -6736478 -4914311
5773 -4914311 -670187 -116212 -3149741 -4131713 -1786249 -986563 -3662980 -5310302 -3143828
5764 -3143828 -1058440 -2655980 -5008073 -4001026 -1232034 -257943 407306 4412268 9701471
5755 9701471 10058835 4630113 49383 1284915 5078403 5419949 2049857 -417811 -12141
5746 -12141 298095 -2068246 -5378553 -6329316 -4018969 382227 5399882 8645977 7120044
5737 7120044 1378037 -2688796 -483425 4116390 3220138 -3686194 -8653872 -6875400
$$ [...]
##END NTUPLES=NMR SPECTRUM
##END=
