##TITLE=31Pdec_SR7_2
 CDCl3, 124 sc
 27.1.2020
##JCAMPDX= 6.0         $$ Bruker NMR JCAMP-DX V2.0
##DATA TYPE= NMR SPECTRUM
##DATA CLASS= NTUPLES
##ORIGIN= UXNMR, Bruker Analytische Messtechnik GmbH
##OWNER= root
$$ XWIN-NMR		Version 3.5
$$ Mon Jan 27 14:06:05 2020 Russian Standard Time (UT+4h)  she@DPX200
##.OBSERVE FREQUENCY= 81.013821
##.OBSERVE NUCLEUS= ^31P
##.ACQUISITION MODE= SIMULTANEOUS
##.ACQUISITION SCHEME= undefined
##.AVERAGES= 24
##.DIGITISER RES= 17
##SPECTROMETER/DATA SYSTEM= spect
##.PULSE SEQUENCE= zgpg30
##.SOLVENT NAME= CDCl3
##.SHIFT REFERENCE= (INTERNAL, CDCl3, 0, 182.463)
##AUDIT TRAIL= $$ (NUMBER, WHEN, WHO, WHERE, WHAT)
$$ ##TITLE= Audit trail, XWIN-NMR		Version 3.5
$$ ##JCAMPDX= 5.01
$$ ##ORIGIN= Bruker BioSpin GmbH
$$ ##OWNER= she
$$ F:/spectra/data/she/nmr/P31/1/pdata/1/auditp.txt
$$ ##AUDIT TRAIL=  $$ (NUMBER, WHEN, WHO, WHERE, WHAT)
(   1,<2020-01-27 14:04:21.90 +0400>,<she>,<DPX200>,
      <created by zg, POWCHK disabled, PULCHK disabled
       configuration hash MD5:
       00 E9 B6 7A A2 85 ED C7 34 08 36 98 17 FE 4E 26
       data hash MD5: 32K
       25 F1 6B E6 18 41 1A 28 4B A7 33 F5 23 85 85 87>)
(   2,<2020-01-27 14:04:43.21 +0400>,<she>,<DPX200>,
      <Start of raw data processing
       efp BC_mod = 2 LB = 1 FT_mod = 6 PKNL = 1 PHC0 = -1713.191 PHC1 = 138.0012 SI = 64K 
       data hash MD5: 64K
       B4 B4 9B FF 23 17 98 10 C5 2A 1E A7 72 36 27 DA>)
(   3,<2020-01-27 14:05:02.00 +0400>,<she>,<DPX200>,
      <pk PHC0 = 32.28545 PHC1 = 0 
       data hash MD5: 64K
       D1 25 E4 5D 7B D4 A4 F9 F2 D6 06 B9 54 E8 9B 56>)
(   4,<2020-01-27 14:05:22.84 +0400>,<she>,<DPX200>,
      <pk PHC0 = -3.599996 PHC1 = 0 
       data hash MD5: 64K
       B4 10 98 DD 51 5C 80 17 4D BE 91 F2 4D 8A DD AE>)
(   5,<2020-01-27 14:05:28.35 +0400>,<she>,<DPX200>,
      <abs ABSG = 5 
       data hash MD5: 64K
       00 D6 BB 56 19 86 49 3E 22 EB 98 BA A9 65 DF E4>)
$$ ##END=
$$ 
$$ hash MD5
$$ BB 66 85 20 93 41 16 12 9D D8 6B 84 73 EA 2B A2
##$RELAX= 
##$RELAX= 
##$RELAX= 
##$RELAX= 
##$RELAX= 
##$RELAX= 
##$RELAX= 
##$RELAX= 
$$ Bruker specific parameters
$$ --------------------------
##$DU= <F:/spectra>
##$EXPNO= 1
##$NAME= <P31>
##$PROCNO= 1
##$TYPE= <nmr>
##$USER= <she>
##$AMP= (0..31)
100 100 100 100 100 100 100 100 100 100 100 100 100 100 100 100 100 100 
100 100 100 100 100 100 100 100 100 100 100 100 100 100 
##$AQSEQ= 0
##$AQ_mod= 1
##$AUNM= <au_zg>
##$AUTOPOS= <>
##$BF1= 81.014009
##$BF2= 200.13
##$BF3= 200.13
##$BF4= 200.13
##$BF5= 200.13
##$BF6= 200.13
##$BF7= 200.13
##$BF8= 200.13
##$BYTORDA= 1
##$CFDGTYP= 0
##$CFRGTYP= 5
##$CHEMSTR= <none>
##$CNST= (0..31)
1 1 145 1 1 1 1 1 1 1 1 1 1 1 1 1 1 1 1 1 1 1 1 1 1 1 1 1 1 1 1 1 
##$CPDPRG= <waltz16>
##$CPDPRG1= <>
##$CPDPRG2= <waltz16>
##$CPDPRG3= <>
##$CPDPRG4= <mlev>
##$CPDPRG5= <mlev>
##$CPDPRG6= <mlev>
##$CPDPRG7= <mlev>
##$CPDPRG8= <mlev>
##$CPDPRGB= <>
##$CPDPRGT= <>
##$D= (0..31)
0 1 0 0 0 0 0 0 0 0 0 0.03 2e-05 3e-06 0 0 0 0 0 0 0 0 0 0 0 0 0 0 0 0 
0 0 
$$ [...]
##$SUBNAM3= <"">
##$SUBNAM4= <"">
##$SUBNAM5= <"">
##$SUBNAM6= <"">
##$SUBNAM7= <"">
##$SUBNAM8= <"">
##$SUBNAM9= <"">
##$SW= 369.568048894756
##$SWIBOX= (0..15)
0 1 3 0 0 0 0 0 0 0 0 0 0 0 0 0 
##$SW_h= 29940.119760479
##$TD= 32768
##$TD0= 1
##$TE= 0
##$TE2= 300
##$TE3= 300
##$TEG= 300
##$TL= (0..7)
0 120 53 12 22 120 120 120 
##$TP= (0..7)
150 150 150 150 150 150 150 150 
##$TP07= 0
##$TPNAME0= <>
##$TPNAME1= <>
##$TPNAME2= <>
##$TPNAME3= <>
##$TPNAME4= <>
##$TPNAME5= <>
##$TPNAME6= <>
##$TPNAME7= <>
##$TPOAL= (0..7)
0.5 0.5 0.5 0.5 0.5 0.5 0.5 0.5 
##$TPOFFS= (0..7)
0 0 0 0 0 0 0 0 
##$TUNHIN= 0
##$TUNHOUT= 0
##$TUNXOUT= 0
##$USERA1= <user>
##$USERA2= <user>
##$USERA3= <user>
##$USERA4= <user>
##$USERA5= <user>
##$V9= 5
##$VALIST= <valist>
##$VCLIST= <CCCCCCCCCCCCCCC>
##$VD= 0
##$VDLIST= <DDDDDDDDDDDDDDD>
##$VPLIST= <PPPPPPPPPPPPPPP>
##$VTLIST= <TTTTTTTTTTTTTTT>
##$WBST= 1024
##$WBSW= 4
##$XGAIN= (0..3)
0 0 0 0 
##$XL= 0
##$YL= 0
##$YMAX_a= 23318
##$YMIN_a= -22991
##$ZGOPTNS= <>
##$ZL1= 120
##$ZL2= 120
##$ZL3= 120
##$ZL4= 120
##$ABSF1= 182.463
##$ABSF2= -187.1042
##$ABSG= 5
##$ABSL= 3
##$ALPHA= 0
##$AQORDER= 0
##$ASSFAC= 0
##$ASSFACI= 0
##$ASSFACX= 0
##$ASSWID= 0
##$AUNMP= <proc_1d>
##$AZFE= 0.1
##$AZFW= 0.5
##$BCFW= 0
##$BC_mod= 2
##$BYTORDP= 0
##$COROFFS= 0
##$CY= -3
##$DATMOD= 1
##$DC= 0
##$DFILT= <>
##$DTYPP= 0
##$F1P= 0
##$F2P= 0
##$FCOR= 1
##$FTSIZE= 65536
##$FT_mod= 6
##$GAMMA= 0
##$GB= 0
##$INTBC= 1
##$INTSCL= 5.30512e-09
##$ISEN= 30
##$LB= 1
##$LEV0= 0
##$LPBIN= 0
##$MAXI= 10000
##$MC2= 0
##$MEAN= 0
##$ME_mod= 0
##$MI= 50
##$NCOEF= 0
##$NC_proc= -6
##$NLEV= 6
##$NOISF1= 182.463
##$NOISF2= 159.3651
##$NSP= 0
##$NTH_PI= 0
##$NZP= 0
##$OFFSET= 182.463
##$PC= 4
##$PHC0= -1684.506
##$PHC1= 138.0012
##$PH_mod= 1
##$PKNL= yes
##$PPARMOD= 0
##$PSCAL= 0
##$PSIGN= 0
##$REVERSE= no
##$SF= 81.0140089999434
##$SI= 65536
##$SIGF1= 159.3651
##$SIGF2= -187.1042
##$SINO= 113.3802
##$SIOLD= 16384
##$SREGLST= <1H.CDCl3>
##$SSB= 0
##$STSI= 65536
##$STSR= 0
##$SW_p= 29940.119760479
##$SYMM= 0
##$S_DEV= 0
##$TDeff= 32768
##$TDoff= 0
##$TI= <>
##$TILT= no
##$TM1= 0
##$TM2= 0
##$TOPLEV= 0
##$USERP1= <user>
##$USERP2= <user>
##$USERP3= <user>
##$USERP4= <user>
##$USERP5= <user>
##$WDW= 1
##$XDIM= 65536
##$YMAX_p= 504367029
##$YMIN_p= -8854036
$$ End of Bruker specific parameters
$$ ---------------------------------
##NTUPLES= NMR SPECTRUM
##VAR_NAME=  FREQUENCY,     SPECTRUM/REAL,   SPECTRUM/IMAG
##SYMBOL=    X,             R,               I
##VAR_TYPE=  INDEPENDENT,   DEPENDENT,       DEPENDENT
##VAR_FORM=  AFFN,          ASDF,            ASDF
##VAR_DIM=   65536,         65536,           65536
##UNITS=     HZ,            ARBITRARY UNITS, ARBITRARY UNITS
##FACTOR=    0.456856943014862, 1,           1
##FIRST=     14782.0589164792, 0,            0
##LAST=      -15158.0608439998, 0,           0
##MIN=       -15158.0608439998, -8854036,    0
##MAX=       14782.0589164792, 504367029,    0
$$ Real data points
##PAGE= N=1
##DATA TABLE= (X++(R..R)), XYDATA
$$ [...]
$$ plain form
45242 4533631 2851857 1129012 1144197 3072658 4782381 4283510 1921004 -602642 -2140322
45233 -2140322 -2220182 -751968 1181202 1563985 -154727 -1986138 -1975557 -748196 -186937
45224 -186937 -696620 -1264224 -1288637 -814668 304196 2003895 3347711 3535428 3027901
45215 3027901 2656394 2394614 1996123 1807169 1789735 915037 -1079961 -2540055 -2138425
45206 -2138425 -1153943 -1654229 -3382091 -4462382 -4387191 -4102394 -3687714 -2294549 -288955
45197 -288955 698335 80168 -1032549 -1581905 -1469322 -835291 10674 117437 -1069318
45188 -1069318 -2429765 -2532318 -1882051 -1985439 -2607891 -2162799 -664668 109727 -384358
45179 -384358 -694491 -120509 54954 -1101455 -2626332 -3350105 -3375171 -3062341 -2278386
$$ packed form
45242D533631j681774j722845J5185J928461J709723m98871k362506k523646j537680
45233b140322p9860J468214J933170L82783j718712j831411J0581J227361N61259
45224a86937n09683n67604k4413M73969J118864J699699J343816J87717n07527
45215C027901l71507k61780l98491j88954j7434q74698j994998j460094M01630
45206b138425R84482n00286j727862j080291P5191K84797M14680J393165K005594
45197b88955R87290o18167j112717n49356J12583O34031Q45965J06763j186755
45188a069318j360447j02553O50267j03388o22452M45092J498131P74395m94085
45179c84358l10133N73982J75463j156409j524877p23773k5066L12830P83955
$$ plain form
45170 -2278386 -1459597 -1676451 -2742296 -2934221 -1503838 201512 1013265 1518505 2276346
45161 2276346 2349678 1080892 -330768 -674848 -720716 -1615898 -2555425 -2001169 -330158
45152 -330158 731495 818759 1180283 2359673 3288683 2886814 1342852 -416416 -1638647
45143 -1638647 -1984941 -1558442 -851274 -313934 -45084 -35142 -286488 -509065 -328142 -50421
45133 -50421 -428778 -1269016 -1143156 897976 3983461 6260307 6475339 4606533 1920859
45124 1920859 543391 1588369 3336786 2867300 105839 -1624059 -134479 2553911
45116 2553911 3313784 2225313 1548753 1806229 1603038 706934 554877 1572887 2332374
45107 2332374 1904963 1205983 1325421 1936057 2004475 1048400 -753774 -2836789 -4329781
$$ packed form
45170b278386Q18789k16854j065845j91925J430383J705350Q11753N05240P57841
45161B276346P3332j268786j411660l44080m5868q95182r39527N54256J671011
45152c30158J061653Q7264L61524J179390R29010m01869j543962j759268j222231
45143a638647l46294M26499P07168N37340K68850R942k51346k22577J80923K77721
45133e0421l78357q40238J25860K041132L085485K276846K15032j868806k685674
45124A920859j377468J044978J748417m69486k761461j729898J489580K688390
45116B553911P59873j088471o76560K57476k03191q96104j52057J018010P59487
45107B332374m27411o98980J19438O10636O8418r56075j802174k083015j492992
$$ plain form
45098 -4329781 -4563965 -3638158 -2048324 -156599 1360713 1405076 -5126 -940975 19358
45089 19358 1250001 65401 -3036251 -4580164 -2936276 -470285 124718 -606227 -591066
45080 -591066 289538 592976 250277 841566 2883123 4621395 4240125 2284507 1039594
45071 1039594 1762226 3186620 3027379 665257 -2203493 -3672302 -3658107 -3277683 -2879224
45062 -2879224 -1801962 78456 1720404 2082275 1105865 -614309 -2325664 -3164123 -2676124
45053 -2676124 -1626865 -1387241 -2061389 -2044782 -24184 3228423 5639120 5920723 4421314
45044 4421314 2422565 1158267 1160028 2009012 2820990 3180176 3371256 3645751 3740440 3312267
45034 3312267 2379152 1117036 -289380 -1355134 -1402685 -358882 942386 1611068 1540452
$$ packed form
45098d329781k34184R25807J589834J891725J517312M4363j410202r35849R60333
45089A9358J230643j184600l101652j543913J643888K465991N95003p30945J5161
45080e91066Q80604L03438l42699N91289K041557J738272l81270j955618j244913
45071A039594P22632J424394j59241k362122k868750j468809J4195L80424L98459
45062b879224J077262J880418J641948L61871r76410j720174j711355q38459M87999
45053b676124J049259K39624o74148J6607K020598L252607K410697K81603j499409
45044D421314j998749j264298J761Q48984Q11978L59186J91080K74495R4689m28173
45034C312267r33115j262116j406416j065754m7551J043803J301268O68682p0616
$$ plain form
45025 1540452 1121572 500368 -465640 -1685274 -2610040 -2573492 -1378186 302664 1235627
45016 1235627 720063 -604567 -1381874 -1000341 -138860 116640 -609283 -1684952 -2004054
45007 -2004054 -972036 740540 1740848 1618344 1636312 3035687 5108070 5945048 4870994
44998 4870994 3043666 1703140 1007694 767870 1111123 1908029 2481486 2439265 2080454
44989 2080454 1597272 681559 -647214 -1690828 -2149880 -2768574 -4137381 -5427310 -5177592
44980 -5177592 -3123545 -574444 980420 1220199 991726 1270973 2199502 3101223 3339349
44971 3339349 2819917 1552522 -621040 -3276675 -4997646 -4666439 -2871530 -1139240
44963 -1139240 -106682 557098 878313 595114 221711 613387 1510383 2003578 2370475
$$ packed form
45025A540452m18880o21204r66008j219634r24766L6548J195306J680850R32963
45016A235627n15564j324630p77307L81533Q61481K55500p25923j075669l19102
45007b004054J032018J712576J000308j22504J7968J399375K072383Q36978j074054
44998D870994j827328j340526o95446k39824L43253P96906N73457m2221l58811
44989B080454m83182r15713j328773j043614m59052o18694j368807j289929K49718
44980e177592K054047K549101J554864K39779k28473K79247R28529R01721K38126
44971C339349n19432j267395k173562k655635j720971L31207J794909J732290
44963a139240J032558O63780L21215k83199l73403L91676Q96996M93195L66897
$$ plain form
44954 2370475 3672060 5435618 5832286 4656725 3916681 4528816 4677601 2925525 871315
44945 871315 681694 1582280 1191303 -605191 -1555451 -554506 894561 995777 -148276
44936 -148276 -1095226 -793123 582369 1957797 2450414 2290228 2223871 2009937 677229
44927 677229 -1367854 -2129482 -860429 618110 851284 1184863 3176739 5191600 4409073
44918 4409073 1340048 -744506 -695969 -686560 -2064063 -3016283 -1655521 918023 2263366
44909 2263366 1691649 220175 -1293229 -2488448 -2852665 -2130505 -1000647 -386493 -333391
44900 -333391 -115577 874855 2639870 4486464 5279437 4464771 2972858 2307018 2644407
44891 2644407 2832697 2407393 2335142 3245001 4153874 3797433 2326098 827291 -124478
$$ packed form
44954B370475J301585J763558L96668j175561p40044O12135J48785j752076k054210
44945H71315j89621R00586l90977j796494r50260J000945J449067J01216j144053
44936a48276r46950L02103J375492J375428M92617j60186o6357k13934j332708
44927F77229k045083p61628J269053J478539K33174L33579J991876K014861p82527
44918D409073l069025k084554M8537R409j377503r52220J360762K573544J345343
44909B263366n71717j471474j513404j195219l64217P22160J129858O14154N3102
44900c33391K17814R90432J765015J846594P92973q14666j491913o65840L37389
44891B644407J88290m25304p2251R09859R08873l56441j471335j498807r51769
$$ plain form
44882 -124478 -623852 -738180 -495060 -224653 -255354 -480265 -632610 -712139 -835703 -983585
44872 -983585 -1132373 -1345202 -1629472 -1999608 -2553268 -3052210 -2783594 -1598600 -675672
44863 -675672 -1095869 -1906213 -1067351 1570522 3764151 3716384 1959494 -37811 -1541402
44854 -1541402 -2132060 -1309887 329773 951771 -142705 -1167650 -281234 1674018 2391323
44845 2391323 1238687 -406079 -1332518 -1383894 -582153 967759 2371089 2580200 1805939
44836 1805939 1152224 980977 869364 984212 1953236 3233299 3195929 1390988 -610938
44827 -610938 -1371116 -1439387 -2144959 -3447472 -4147658 -3757007 -2955483 -2210177 -1053793
44818 -1053793 765297 2185780 1817525 -70912 -1448376 -837461 906582 1806942 1234789
$$ packed form
44882a24478m99374j14328K43120K70407l0701k24911j52345p9529j23564j47882
44872i83585j48788k12829k84270l70136n53660m98942K68616J184994R22928
44863f75672m20197q10344Q38862K637873K193629m7767j756890j997305j503591
44854a541402n90658Q22173J639660O21998j094476j024945Q86416J955252P17305
44845B391323j152636j644766r26439n1376Q01741J549912J403330K09111p74261
44836A805939o53715j71247j11613J14848R69024J280063l7370j804941k001926
44827f10938p60178o8271p05572j302513p00186L90651Q01524P45306J156384
44818a053793J819090J420483l68255j888437j377464O10915J744043R00360n72153
$$ plain form
44809 1234789 179570 -616629 -1392129 -2045663 -1620059 67196 1494537 1241139 -166362
44800 -166362 -1314792 -1954991 -2670453 -3202176 -2695951 -1329199 -153685 631954 1797642
44791 1797642 3379807 4292980 3946804 2999156 2170309 1499478 1106475 1437728 2306305
44782 2306305 2905701 3216701 4014889 4921584 4187986 1589061 -179730 1092866 3513855
44773 3513855 3239448 -185283 -3129447 -2829671 -659247 587183 591266 872061 1562806
44764 1562806 1099057 -1048037 -3236361 -3744670 -2723495 -1484364 -823363 -696866 -812955
44755 -812955 -855683 -625979 -483556 -1082353 -2142975 -2243294 -675184 1195714 1622615
44746 1622615 1061106 1537182 3445927 4669454 3530966 1181151 -86851 104484 247489
$$ packed form
44809A234789j055219p96199p75500o53534M25604J687255J427341k53398j407501
44800a66362j148430o40199p15462n31723N06225J366752J175514P85639J165688
44791A797642J582165R13173l46176r47648q28847o70831l93003L31253Q68577
44782B306305N99396L11000P98188R06695p33598k598925j768791J272596K420989
44773C513855k74407l424731k944164K99776K170424J246430M083K80795O90745
44764A562806m63749k147094k188324n08309J021175J239131O61001J26497j16089
44755h12955m2728K29704J42423n98797j060622j00319J568110J870898M26901
44746A622615n61509M76076J908745J223527j138488k349815j268002J91335J43005
$$ plain form
44737 247489 -414962 -759260 436194 2570871 3721248 2797187 811280 -127192 913328
44728 913328 2641030 3097329 2006458 825464 510951 388271 -298317 -957023 -822525
44719 -822525 -582419 -1368507 -2647190 -2746228 -1440787 -434224 -938151 -2231397 -3227045
44710 -3227045 -4070637 -5141744 -5592657 -4366045 -2188693 -1042852 -1551742 -2165999 -1423968
44701 -1423968 -2982 273968 -1159935 -3129566 -4337481 -4510912 -3960109 -3022018 -2267946
44692 -2267946 -2286519 -2637614 -1938549 72458 1411181 193071 -2400367 -3272107 -1564768
44683 -1564768 233510 -59443 -1438570 -1726458 -916473 -705516 -1574449 -2281016 -2068392
44674 -2068392 -1676962 -1913949 -2522834 -2885914 -2905816 -2752894 -2345060 -1430047 44670
$$ packed form
44737B47489o62451l44298J195454K134677J150377r24061j985907r38472J040520
44728I13328J727702M56299j090871j180994l14513j22680o86588o58706J34498
44719h22525K40106p86088j278683r9038J305441J006563n03927j293246r95648
44710c227045q43592j071107m50913J226612K177352J145841n08890o14257P42031
44701a423968J420986K76950j433903j969631j207915j73431N50803R38091P54072
44692b267946j8573l51095O99065K011007J338723j218110k593438q71740J707339
44683a564768J798278k92953j379127k87888Q09985K10957q68933p06567K12624
44674b068392L91430k36987o08885l63080j9902J52922M07834R15013J474717
$$ plain form
44665 44670 1614749 2277257 1384589 -75850 -58025 1798385 3013557 1307777 -1964110
44656 -1964110 -3303151 -1699475 310437 455172 -503422 -634076 350910 1420043 2076855
44647 2076855 2515515 2708677 2541291 2348130 2364059 2104518 1140193 23430 -417337
44638 -417337 -332866 -545694 -1213578 -1593289 -1098794 -13968 872404 1028134 689207 795753
44628 795753 2104642 4129063 5351516 4806750 3110810 1668743 1274925 1741202 2383717
44619 2383717 2500542 1838832 989728 895603 1625942 2158907 1774070 1047260 851577 912134
44609 912134 212714 -1348371 -2528115 -2131557 -372544 1335603 1718467 673825 -870198
44600 -870198 -1933935 -2189744 -1799416 -1025494 -286566 -123149 -552656 -801338 -273952
$$ packed form
44665D4670J570079O62508q92668j460439J7825J856410J215172j705780l271887
44656a964110j339041J603676K009912J44735r58594j30654R84986J069133O56812
44647B076855M38660J93162j67386j93161J5929k59541r64325j116763m40767
44638d17337Q4471k12828o67884l79711M94495J084826Q86372J55730l38927J06546
44628G95753J308889K024421J222453n44766j695940j442067l93818M66277O42515
44619B383717J16825o61710q49104r4125P30339N32965l84837p26810j95683O0557
44609I12134o99420j561085j179744L96558J759013J708147L82864j044642j544023
44600h70198j063737k55809L90328P73922P38928J63417m29507k48682N27386
$$ plain form
44591 -273952 603276 1185923 1669238 2322966 2307184 772253 -1219512 -1712411 -798124
44582 -798124 -533991 -1625354 -2432612 -2061002 -2053050 -3544340 -4903811 -4239158 -2545963
44573 -2545963 -2026798 -2528911 -2183372 -817770 -128851 -697173 -1267045 -1125986 -1004412
44564 -1004412 -1284297 -1336539 -1120250 -1556509 -2679014 -3162458 -2480283 -1938862 -2617220
44555 -2617220 -3662902 -3709723 -2868016 -2193259 -2040563 -2032605 -2030552 -2109288 -1950380 -1134613
44545 -1134613 130874 1174853 1620093 1619051 1522562 1535618 1485481 891767 -383656 -1621868
44535 -1621868 -1903623 -1238131 -474932 -237191 -657773 -1917373 -3941904 -5587139 -5436388
44526 -5436388 -3770105 -2542513 -2888503 -3800801 -3915125 -3432446 -3337910 -3678628 -3731336
$$ packed form
44591b73952Q77228N82647M83315O53728j5782j534931j991765m92899R14287
44582g98124K64133j091363q07258L71610P952j491290j359471O64653J693195
44573b545963N19165n02113L45539J365602O88919n68322n69872J41059J21574
44564a004412k79885n2242K16289m36259j122505m83444O82175N41421o78358
44555b617220j045682m6821Q41707O74757J52696P958K053p8736J58908Q15767
44545a134613J265487J043979M45240j042r6489J3056n0137n93714j275423j238212
44535a621868k81755O65492P63199K37741m20582j259600k024531j645235J50751
44526e436388J666283J227592l45990r12298j14324M82679R4536l40718n2708
$$ plain form
44517 -3731336 -3249354 -2496615 -1488442 -170251 941009 1158224 527652 -254475 -561664
44508 -561664 -4278 1578265 3535460 4248345 2508151 -971549 -4063608 -5230138 -4617239
44499 -4617239 -3413633 -2661948 -2538254 -2330981 -1253258 447993 1533513 1233461 172915
44490 172915 -594941 -902692 -1234648 -1771129 -2386525 -3038247 -3350510 -2439480 -223394
44481 -223394 1628801 1409511 -207915 -907985 91406 1132038 731351 -434409 -952315
44472 -952315 -790019 -907958 -1676196 -2830166 -4326005 -5994705 -6759721 -5549842 -3011448
44463 -3011448 -1153497 -1039670 -1769693 -2016530 -1575805 -833964 390124 2465598 4750663
44454 4750663 5745820 4641547 2261555 376381 332785 2175933 4604493 5794766 4815298
$$ packed form
44517c731336M81982P52739J008173J318191J111260K17215o30572p82127l07189
44508e61664N57386J582543J957195P12885j740194l479700l092059j166530O12899
44499d617239J203606P51685J23694K07273J077723J701251J085520l00052j060546
44490A72915p67856l07751l31956n36481o15396o51722l12263R11030K216086
44481b23394J852195k19290j617426p00070R99391J040632m00687j165760n17906
44472i52315J62296j17939p68238j153970j495839j668700p65016J209879K538394
44463c011448J857951J13827p30023k46837M40725P41841J224088K075474K285065
44454D750663R95157j104273k379992j885174m3596J843148K428560J190273r79468
$$ plain form
44445 4815298 2452087 364619 -599289 -914740 -1331990 -1976051 -2613903 -3079097 -3049003
44436 -3049003 -2090911 -518364 387335 -220932 -1526329 -2014471 -1347696 -387463 383040
44427 383040 1307134 2356506 2694415 1928288 832303 159889 -473617 -1711145 -3056106
44418 -3056106 -3335265 -2319422 -960389 -1481 810750 1887687 2890980 3184516 2799671
44409 2799671 2337555 1978263 1191877 -272767 -1516715 -1171409 1026020 3739158 5226309
44400 5226309 4748270 2830608 672778 -557083 -501177 -93932 -682377 -2197020 -2874829
44391 -2874829 -1474634 945901 2392196 2379044 1786083 881221 -811709 -2812514 -3727313
44382 -3727313 -3406306 -3371987 -4414321 -5324158 -4918553 -3838334 -3155360 -2516665 -1122297
$$ packed form
44445D815298k363211k087468r63908l15451m17250o44061o37852m65194L0094
44436c049003R58092J572547R05699o08267j305397m88142O66775R60233P70503
44427C83040R24094J049372L37909p66127j095985o72414o33506j237528j344961
44418c056106k79159J015843J359033R58908Q12231J076937J003293K93536l84845
44409B799671m62116l59292p86386j464644j243948L45306K197429K713138J487151
44400E226309m78039j917662k157830j229861N5906M07245n88445j514643o77809
44391b874829J400195K420535J446295j3152n92961r04862j692930k000805r14799
44382c727313L21007L4319j042334r09837M05605J080219O82974O38695J394368
$$ plain form
44373 -1122297 484036 1192818 1179801 1390777 1678371 1072177 -330386 -1299025 -1276962
44364 -1276962 -858381 -438988 223034 966875 1144021 881438 1117292 1956302 2266260
44355 2266260 1480412 571416 486937 768834 659863 492696 726384 484228 -1277351
44346 -1277351 -3444367 -3407945 -527296 2533091 2890694 888654 -731963 -486292 515333
44337 515333 828575 596247 430593 -198092 -1897641 -3371862 -2387016 1089392 4325892
44328 4325892 5042959 3893507 2902924 2632758 2133825 954596 -188312 -522528 39494
44319 39494 1116985 1979869 1730707 279840 -1088216 -1037562 140860 1092583 1342415
44310 1342415 1518582 1796029 1504812 554490 -3235 644551 2094271 3582310 4836678
$$ packed form
44373a122297J606333P08782j3017K10976K87594o06194j402563r68639K2063
44364a276962M18581M19393O62022P43841J77146k62583K35854Q39010L09958
44355B266260p85848r08996q4479K81897j08971j67167K33688k42156j761579
44346a277351k167016L6422K880649L060387L57603k002040j620617K45671J001625
44337E15333L13242k32328j65654o28685j699549j474221R84846L476408L236500
44328D325892P17067j149452r90583k70166m98933j179229j142908l34216N62022
44319C9494J077491Q62884k49162j450867j368056N0654J178422R51723K49832
44310A342415J76167K77447k91217r50322n57725O47786J449720J488039J254368
$$ plain form
44301 4836678 5517487 4843126 2707201 477634 -355396 9865 193190 -194358 60379
44292 60379 1865038 4142628 4907375 3812767 2695290 3153843 4305934 3895712 1390715
44283 1390715 -1186922 -1774462 -519396 1015154 1822117 1800194 1121398 373468 597056
44274 597056 1998762 3234991 3121516 2315824 1962187 1565408 76136 -1603109 -1534905
44265 -1534905 23273 791154 79530 -376001 179791 70752 -1544669 -2621445 -1482513
44256 -1482513 36322 -793961 -3322563 -4514587 -3338027 -1594541 -827311 -865358 -1343425
44247 -1343425 -2258433 -2671489 -1070025 2181591 4500351 4143908 2313678 1340846 1900516
44238 1900516 2957970 3560439 3578646 3093799 1995378 229416 -1945150 -3930211 -4982338
$$ packed form
44301D836678O80809o74361k135925k229567q33030L65261J83325l87548K54737
44292F0379J804659K277590P64747j094608j117477M58553J152091m10222k504997
44283A390715k577637n87540J255066J534550Q06963k1923o78796p47930K23588
44274E97056J401706J236229j13475q05692l53637l96779j489272j679245O8204
44265a534905J558178P67881p11624m55531N55792j09039j615421j076776J138932
44256a482513J518835q30283k528602j192024J176560J743486P67230l8047m78067
44247a343425r15008m13056J601464L251616K318760l56443j830230r72832N59670
44238A900516J057454O02469J8207m84847j098421j765962k174566j985061j052127
$$ plain form
44229 -4982338 -4764010 -3820564 -3150015 -3122019 -3090875 -2209127 -427798 1358136 2024420
44220 2024420 1169069 -483601 -1754423 -2143561 -1998626 -1616373 -944432 -420992 -1068500
44211 -1068500 -2973940 -4565737 -4442587 -3176962 -2125508 -1237896 356852 2152152
44203 2152152 2650224 1876871 1386746 1366155 -18903 -3293088 -5751874 -4738008 -1540139
44194 -1540139 102384 -1143307 -2879104 -2601386 -840054 66164 -853245 -2261020 -2338681
44185 -2338681 -818733 822528 925504 -626313 -2246165 -2321864 -943988 315083 267906
44176 267906 -656778 -1141678 -520030 714591 1676728 1964600 1818343 1776494 2262050 3190934
44166 3190934 3821487 3295235 1603572 -233407 -1265349 -1579541 -1711273 -1486444 -338739
$$ packed form
44229d982338K18328R43446O70549K7996L1144Q81748J781329J785934O66284
44220B024420q55351j652670j270822l89138J44935L82253O71941N23440o47508
44211a068500j905440j591797J23150J265625J051454Q87612J594748J795300
44203B152152M98072p73353m90125k0591j385058l274185k458786J013866L197869
44194a540139J642523j245691j735797K77718J761332R06218r19409j407775p7661
44185b338681J519948J641261J02976j551817j619852p5699J377876J259071m7177
44176B67906r24684m84900O21648J234621R62137K87872j46257m1849M85556R28884
44166C190934O30553n26252j691663j836979j031942l14192j31732K24829J147705
$$ plain form
44157 -338739 1294267 1957149 927575 -858698 -2031357 -2081045 -1010693 1187664 3828230
44148 3828230 5287850 4674696 3096303 2107889 1593923 610259 -313957 335287 2284115
44139 2284115 3181684 1734155 -456627 -1129806 -293985 111927 -1193257 -3436843 -4654109
44130 -4654109 -3541986 -848139 978049 166057 -2272893 -3619279 -2641364 -697270
44122 -697270 413294 381648 -147395 -606845 -367625 1044511 2740054 2760270 559113
44113 559113 -2011565 -3202946 -3538548 -4257412 -5009379 -4816667 -4167012 -4086886 -3906776
44104 -3906776 -2216013 276653 1160301 -225265 -1895509 -2255945 -2008924 -2222100 -2377866
44095 -2377866 -1643590 -696320 -754455 -1554417 -1692688 -695513 339010 140944 -1383518
$$ packed form
44157c38739J633006O62882j029574j786273j172659m9688J070352K198357K640566
44148C828230J459620o13154j578393r88414n13966r83664r24216O49244J948828
44139B284115Q97569j447529k190782o73179Q35821M05912j305184k243586j217266
44130d654109J112123K693847J826188q11992k438950j346386R77915J944094
44122f97270J110564l1646n29043m59450K39220J412136J695543K0216k201157
44113E59113k570678j191381l35602p18864p51967J92712O49655Q0126J80110
44104c906776J690763K492666Q83648j385566j670244l60436K47021k13176j55766
44095b377866P34276R47270n8135p99962j38271R97175J034523j98066j524462
$$ plain form
44086 -1383518 -3170931 -3897540 -2944651 -865371 1075191 1925626 1572566 454072 -804550
44077 -804550 -1547421 -1454027 -833896 -132414 709365 1762698 2236360 1202584 -668140
44068 -668140 -1313384 204275 2342201 2919544 1539146 -470973 -1726613 -1614783 -203758
44059 -203758 1689205 2801889 2691385 2360315 2920594 4146695 5152953 5842637 6544260
44050 6544260 6749269 5674708 3909350 2958332 3000808 2660446 1461031 890932 2037154
44041 2037154 3524329 3253080 1352548 -178597 -387751 -289062 -770546 -1154636 -547972
44032 -547972 481354 546784 -765459 -2525109 -3548252 -3253787 -1818565 -208614 218534
44023 218534 -1005284 -2612938 -2835909 -1521866 -142018 474493 1290452 3265613 5392693
$$ packed form
44086a383518j787413p26609R52889K079280J940562Q50435l53060j118494j258622
44077h04550p42871R3394O20131P01482Q41779J053333M73662j033776j870724
44068f68140o45244J517659K137926N77343j380398k010119j255640J11830J411025
44059b03758J892963J112684j10504l31070N60279J226101J006258O89684P01623
44050F544260K05009j074561j765358r51018M2476l40362j199415n70099J146222
44041B037154J487175k71249j900532j531145k09154R8689m81484l84090O06664
44032e47972J029326O5430j312243j759650j023143K94465J435222J609951M27148
44023B18534j223818j607654k22971J314043J379848O16511Q15959J975161K127080
$$ plain form
44014 5392693 5719075 3915085 1626004 350203 134917 522176 1513611 2934824 3832799
44005 3832799 3498800 2595737 2349895 2867816 3079651 2239945 708553 -750103 -1670578
43996 -1670578 -1751427 -786799 839784 2072986 2073961 1042021 -42314 -297522 477912
43987 477912 1697660 2298686 1627899 328033 -110333 868563 1949306 1435333 -522453
43978 -522453 -1941703 -1370800 411152 1390472 567239 -1221406 -2465998 -2467669 -1623313
43969 -1623313 -634889 228052 1078197 1906723 2458705 2643015 2708214 2744517 2305609 990001
43959 990001 -717498 -1712676 -1455346 -465108 424406 851059 881389 714808 639274 824243
43949 824243 997381 824303 647888 1045556 1503901 728032 -1119233 -1842849 -125844
$$ packed form
44014E392693L26382j803990k289081j275801k15286L87259R91435J421213Q97975
44005C832799l33999r03063k45842N17921K11835q39706j531392j458656r20475
43996a670578q0849R64628J626583J233202R75j031940j084335k55208P75434
43987D77912J219748O01026o70787j299866m38366R78896J080743n13973j957786
43978e22453j419250N70903J781952R79320q23233j788645j244592j671Q44356
43969a623313R88424Q62941Q50145Q28526N51982J84310O5199L6303m38908j315608
43959I90001j707499r95178K57330R90238Q89514M26653L0330j66581p5534J84969
43949H24243J73138j73078j76415L97668M58345p75869j847265p23616J717005
$$ plain form
43940 -125844 2147013 2271743 680008 284321 2007291 3412854 2442247 242992 -991365
43931 -991365 -1102631 -1191589 -1198098 -271850 1200465 1840560 1266852 307227 -516730 -1276910
43921 -1276910 -1623751 -943447 477180 1672479 2293231 2551672 2242812 1253013 672797
43912 672797 1608455 3019225 2780257 1078542 497981 2078242 3587782 2908791 1056010
43903 1056010 239375 701826 1325068 1884064 2637444 2839564 1839526 807115 1164391
43894 1164391 1985305 1301566 -470474 -975304 289713 1307723 1038261 859216 1598083
43885 1598083 1722945 29366 -2001921 -2368069 -1405716 -611508 -40916 1036931 2025529
43876 2025529 1832888 1112289 1340877 2027029 1280110 -748880 -1518624 53017 1631877
$$ packed form
43940a25844K272857J24730j591735l95687J722970J405563r70607k199255j234357
43931i91365j11266q8958o509R26248J472315O40095n73708r59625q23957p60180
43921a276910l46841O80304J420627J195299O20752K58441l08860r89799n80216
43912F72797R35658J410770k38968j701715n80561J580261J509540o78991j852781
43903A056010q16635M62451O23242N58996P53380K02120j000038j032411L57276
43894A164391Q20914o83739j772040n04830J265017J018010k69462j79045P38867
43885A598083J24862j693579k031287l66148R62353P94208N70592J077847R88598
43876B025529j92641p20599K28588O86152p46919k028990p69744J571641J578860
$$ plain form
43867 1631877 685568 -2033259 -3794731 -3491177 -2233299 -1069239 88099 1301230
43859 1301230 1917244 1551293 855844 746989 1298860 1791404 1638123 1012651 587060
43850 587060 710811 935733 576858 -272463 -741257 -414887 -56913 -610263 -1844826
43841 -1844826 -2623981 -2353936 -1550576 -979968 -802217 -691261 -372171 145680 638506
43832 638506 895464 995637 1210915 1422004 936143 -636200 -2511777 -3350569 -2786076
43823 -2786076 -1855060 -1794467 -2732818 -3577561 -2963576 -549276 2273515 3389107 2292134
43814 2292134 908102 1180253 2444073 2665805 1866871 2128057 3824540 4366562 2148738
43805 2148738 -405342 -55212 2413991 3292725 1271923 -1177120 -1835713 -1329784 -884441
$$ packed form
43867A631877r46309k718827j761472L03554J257878J164060J157338J213131
43859A301230O16014l65951o95449j08855N51871M92544j53281o25472m25591
43850E87060J23751K24922l58875q49321m68794L26370L57974n53350j234563
43841a844826p79155K70045Q03360N70608J77751J10956L19090N17851M92826
43832F38506K56958J00173K15278K11089m85861j572343j875577q38792N64493
43823b786076R31016O0593r38351q44743O13985K414300K822791J115592j096973
43814B292134j384032K72151J263820K21732p98934K61186J696483N42022k217824
43805B148738k554080L50130K469203Q78734k020802k449043o58593N05929M45343
$$ plain form
43796 -884441 -88956 1568628 2943724 2879402 2221943 2369045 2932324 2756373 2303234
43787 2303234 2789112 3495789 2450560 -103901 -1416250 -176389 1465976 1113779 -535128
43778 -535128 -1288662 -936776 -955246 -1531966 -1264123 164989 1173109 740928 -78199
43769 -78199 23209 774416 1381563 2061513 3094825 3409182 1911841 -273620 -789321
43760 -789321 737612 2218115 2123258 1208977 587038 -88334 -1242276 -1754146 -585036
43751 -585036 884091 290977 -2090898 -3258436 -1522924 1125554 1770093 415590 -396535
43742 -396535 677051 1964571 1102767 -1778121 -4070339 -3733859 -1522727 223205 385540
43733 385540 -221358 -651849 -977460 -1257731 -827117 331109 753121 -393752 -1326973
$$ packed form
43796h84441P95485J657584J375096o4322o57459J47102N63279j75951m53139
43787B303234M85878P06677j045229k554461j312349J239861J642365l52197j648907
43778e35128p53534L51886j8470n76720K67843J429112J008120m32181q19127
43769g8199J01408P51207O07147O79950J033312L14357j497341k185461n15701
43760g89321J526933J480503r4857r14281o21939o75372j153942n11870J169110
43751e85036J469127n93114k381875j167538J735512K648478O44539j354503q12125
43742c96535J073586J287520q61804k880888k292218L36480K211132J745932J62335
43733C85540o06898m30491l25611k80271M30614J158226M22012j146873r33221
$$ plain form
43724 -1326973 163673 2987136 3585348 744490 -2758697 -4084570 -3657859 -3286335 -3045428
43715 -3045428 -2007491 -628688 -150661 -310761 304505 1896684 3197305 3428017 2935380
43706 2935380 1974191 443006 -1115253 -1780889 -1730935 -2039912 -2792734 -2857908 -1908162
43697 -1908162 -1140680 -1287981 -1288817 65917 2206493 3599370 3785853 3549570 3476207 3316052
43687 3316052 2632748 1359897 -245788 -1714497 -2499500 -2383797 -1708847 -1008161 -554391
43678 -554391 -351773 -272551 -60365 477525 1140618 1527831 1642210 1874976 2276593 2368188
43668 2368188 1917867 1408642 1400988 1821191 2209852 2356501 2388691 2484174 2728146 3062615
43658 3062615 3276444 3244687 3096658 2816881 1939258 324128 -919541 -297244 2043022
$$ packed form
43724a326973J490646K823463N98212k840858l503187j325873M26711L71524K40907
43715c045428J037937J378803M78027j60100O15266J592179J300621K30712m92637
43706B935380r61189j531185j558259o65636M9954l08977p52822o5174R49746
43697a908162P67482j47301q36J354734K140576J392877J86483k36283p3363j60155
43687C316052o83304j272851j605685j468709p85003J15703O74950P00686M53770
43678e54391K02618P9222K12186N37890O63093L87213J14379K32766M01617R1595
43668B368188m50321n09225p654M20203L88661J46649L2190R5483K43972L34469
43658C062615K13829l1757j48029k79777q77623j615130j243669O22297K340266
$$ plain form
43649 2043022 4075155 4117921 2489318 530382 -1048032 -2116496 -2336075 -1529639 -398702
43640 -398702 162014 246160 536533 935444 620242 -468257 -1202854 -782226 33444 -154586
43630 -154586 -1508506 -2629943 -2210495 -558659 885531 1312869 1187000 1054791 604624
43621 604624 -418244 -1127969 -525821 755949 1167070 687940 962950 2573933 3862924
43612 3862924 3414373 2199876 1886831 2217070 1745835 407249 -471484 -404600 -296062
43603 -296062 -746229 -1308796 -1606312 -1854725 -2026843 -1715475 -1147719 -1205160 -2051396 -2752126
43593 -2752126 -2617462 -1920318 -930945 629703 2573530 3730893 3304697 2022141 1149166
43584 1149166 944961 841968 601447 419240 234513 -180199 -545899 -273865 569232
$$ packed form
43649B043022K032133M2766j628603j958936j578414j068464k19579Q06436J130937
43640c98702N60716Q4146K90373L98911l15202j088499p34597M20628Q15670j88030
43630a54586j353920j121437M19448J651836J444190M27338j25869j32209m50167
43621F04624j022868p09725O02148J281770M11121m79130K75010J610983J288991
43612C862924m48551j214497l13045L30239m71235j338586q78733O6884J08538
43603b96062m50167n62567k97516k48413j72118L11368N67756n7441q46236p00730
43593b752126J34664O97144R89373J560648J943827J157363m26196j282556q72975
43584A149166k04205j02993k40521j82207j84727m14712l65700K72034Q43097
$$ plain form
43575 569232 1081218 524181 -838346 -2079558 -2549579 -2274590 -1538131 -403764 1066902
43566 1066902 2260892 2261630 1002451 -249727 -142780 1208981 2460785 2668372 2098598
43557 2098598 1554120 1578761 2282277 3212656 3379061 2209251 624904 330751 1755024
43548 1755024 3477036 4030194 3472224 2732152 2233794 1843509 1531125 1286337 773367
43539 773367 -186332 -995857 -780931 533509 2024665 2596617 1874843 547280 -105858
43530 -105858 522009 1461052 1157851 -442713 -1647890 -1282221 -273140 -199156 -1078238
43521 -1078238 -1693104 -1602719 -1597095 -2266721 -3224827 -3890275 -4166623 -4122325 -3682611 -2872236
43511 -2872236 -1863736 -659407 833615 2383244 3546454 4202255 4515756 4422114 3660368
$$ packed form
43575E69232N11986n57037j362527j241212m70021K74989P36459J134367J470666
43566A066902J193990P38j259179j252178J06947J351761J251804K07587n69774
43557B098598n44478K4641P03516R30379J66405j169810j584347k94153J424273
43548A755024J722012N53158n57970p40072m98358l90285l12384k44788n12970
43539G73367r59699q09525K14926J314440J491156N71952p21774j327563o53138
43530a05858O27867R39043l03201j600564j205177L65669J009081P3984q79082
43521a078238o14866R0385N624o69626r58106o65448k76348M4298M39714Q10375
43511b872236J008500J204329J493022J549629J163210O55801L13501r3642p61746
$$ plain form
43502 3660368 2311077 823757 -438664 -1228937 -1217422 -465242 65893 -599679 -1958227
43493 -1958227 -2367664 -1197350 273100 627179 157444 184952 1156371 2341462 3099303
43484 3099303 3476171 3564543 3193550 2560895 2424358 3068743 3483853 2306096 -359189
43475 -359189 -2635746 -2796447 -1249102 -117651 -775428 -2261031 -2534191 -1041937 608890
43466 608890 723167 -312107 -568929 843047 2537448 2623630 1126249 -234229 -505154
43457 -505154 -615792 -1613869 -2887630 -3160164 -2508177 -2020640 -1799145 -918339 508495
43448 508495 988976 59442 -636960 129780 1034470 251141 -1422590 -1590478 37315
43439 37315 1177542 413698 -953153 -1198059 -544216 -150310 -115425 155189 496243 263844
$$ packed form
43502C660368j349291j487320j262421p90273J1515P52180N31135o65572j358548
43493a958227m09437J170314J470450L54079m69735K7508R71419J185091P57841
43484C099303L76868Q8372l70993o32655j36537O44385M15110j177757k665285
43475c59189k276557j60701J547345J131451o57777j485603k73160J492254J650827
43466F08890J14277j035274k56822J411976J694401Q6182j497381j360478k70925
43457e05154j10638r98077j273761k72534O51987M87537K21495Q80806J426834
43448E08495M80481r29534o96402P66740R04690p83329j673731j67888J627793
43439C7315J140227p63844j366851k44906O53843L93906L4885K70614L41054k32399
$$ plain form
43429 263844 -420762 -923432 -1311629 -2176366 -3287019 -3462327 -2056172 83209 1420349
43420 1420349 1172387 -111447 -1121276 -973631 -57239 461023 146425 -122287 506945
43411 506945 1479960 1593221 802798 255201 497893 726383 197981 -537502 -506544 225851
43401 225851 750844 593150 11200 -734841 -1544315 -1926718 -1210423 402167 1752557
43392 1752557 2134443 2099965 2310165 2314657 1387663 48067 -460860 -30521 293550 251132
43382 251132 820320 2173447 2751861 1560946 87506 288252 1588108 1877629 1012077
43373 1012077 944298 2142627 2385477 305963 -1951844 -1511943 1099858 2709151 1802234
43364 1802234 43640 -517316 74787 514407 165268 -593792 -1077803 -716641 586916
$$ packed form
43429B63844o84606n02670l88197q64737j110653j75308J406155K139381J337140
43420A420349k47962j283834j009829J47645R16392N18262l14598k68712O29232
43411E06945R73015J13261p90423n47597K42692K28490n28402p35483L0958P32395
43401B25851N24993j57694n81950p46041q09474l82403P16295J612590J350390
43392A752557L81886l4478K10200M492r26994j339596n08927M30339L24071m2418
43382B51132N69188J353127N78414j190915j473440K00746J299856K89521q65552
43373A012077o7779J198329K42850k079514k257807M39901K611801J609293r06917
43364A802234j758594n60956N92103M39620l49139p59060m84011L61162J303557
$$ plain form
43355 586916 2015622 2338194 1332707 185937 -5322 377691 160612 -948693 -2043196
43346 -2043196 -2219594 -1490707 -466491 400430 1070269 1643294 1992981 1711860 558155
43337 558155 -1009626 -2031976 -1989455 -1271102 -420598 727366 2583109 4652183 5643182
43328 5643182 4961615 3443463 2170044 1107052 -437318 -2392789 -3829750 -4248117
43320 -4248117 -4145614 -4100381 -4003519 -3526321 -2692339 -1575869 -95703 1360465 1840880
43311 1840880 1191259 883807 2353148 4855322 6259861 5851830 4902670 4292924 3257924
43302 3257924 1275325 -387318 -420384 314204 -60 -1280011 -1680593 -467526 1039593
43293 1039593 1757263 2363571 3616471 4507724 3499735 951242 -1080357 -1351992 -636877
$$ packed form
43355E86916J428706L22572j005487j146770j91259L83013k17079j109305j094503
43346b043196j76398P28887J024216Q66921O69839N73025L49687k81121j153705
43337E58155j567781j022350M2521P18353Q50504J147964J855743K069074R90999
43328E643182o81567j518152j273419j062992j544370j955471j436961m18367
43320d248117J02503M5233R6862M77198Q33982J116470J480166J456168M80415
43311A840880o49621l07452J469341K502174J404539m08031r49160o09746j035000
43302C257924j982599j662643l3066P34588l14264j279951m00582J213067J507119
43293A039593P17670O06308J252900Q91253j007989k548493k031599k71635P15115
$$ plain form
43284 -636877 -304466 -671465 -1113222 -1027557 -142691 1578359 3658632 5002649 4772132
43275 4772132 3389782 2154649 1825833 2099777 2494104 2969106 3340889 2942989 1697259
43266 1697259 923259 1932646 3989077 4885861 3747545 2085272 1609182 2165856 2673999
43257 2673999 3037696 3815147 4578951 4134842 2419912 913623 803362 1709765 2654733
43248 2654733 3416570 4285753 5099357 5283781 4622938 3419603 2042702 802325 163741
43239 163741 517940 1576242 2397365 2342144 1844978 1920775 2919369 4075027 4375334 3530930
43229 3530930 1874831 -237096 -2353749 -3566988 -3103949 -1415703 58872 450892
43221 450892 140564 -218026 -376637 147167 2146220 5209155 7128878 6147780 3258027
$$ packed form
43284f36877L32411l66999m41757Q5665Q84866J721050K080273J344017k30517
43275D772132j382350j235133l28816K73944L94327M75002L71783l97900j245730
43266A697259p74000J009387K056431Q96784j138316j662273m76090N56674N08143
43257B673999L63697P77451P63804m44109j714930j506289j10261R06403R44968
43248B654733P61837Q69183Q13604J84424o60843j203335j376901j240377o38584
43239A63741L54199J058302Q21123n5221m97166P5797R98594J155658L00307q44404
43229C530930j656099k111927k116653j213239M63039J688246J474575L92020
43221D50892l10328l58590j58611N23804J999053L062935J919723r81098k889753
$$ plain form
43212 3258027 1021006 538992 915747 1313669 1880108 2570255 2686654 2079900 1537570
43203 1537570 1507035 1579920 1631363 2175644 3031620 3000797 1743174 761297 1446333 3136323
43193 3136323 4250675 4476232 4543623 4517098 3772429 2445158 1631739 2106371 3694887
43184 3694887 5760680 7444343 7656639 5882489 3049086 794471 -142404 -180496 156203
43175 156203 630317 832569 450900 79313 693111 2072556 2754558 1950408 597592
43166 597592 -19041 143474 383630 669655 1594545 3116450 4229579 4147447 3331058
43157 3331058 2970987 3588556 4477763 4611914 3798246 2614619 1455447 306485 -494241
43148 -494241 -158151 1370051 2864673 3233876 2932790 3070594 3599072 3551218 2838236
$$ packed form
43212C258027k237021m82014L76755L97922N66439O90147J16399o06754n42330
43203A537570l0535P2885N1443N44281Q55976l0823j257623r81877O85036J689990
43193C136323J114352K25557O7391k6525p44669j327271q13419M74632J588516
43184C694887K065793J683663K12296j774150k833403k254615r36875l8092L36699
43175A56203M74114K02252l81669l71587O13798J379445O82002q04150j352816
43166E97592o16633J62515K40156K86025R24890J521905J113129q2132q16389
43157C331058l60071O17569Q89207J34151q13668j183627j159172j148962q00726
43148d94241L36090J528202J494622L69203l01086J37804N28478m7854p12982
$$ plain form
43139 2838236 2446053 2664206 2425576 971313 -853371 -1689840 -1327141 -576738 -40969
43130 -40969 310460 702965 1291497 2115485 2906206 3127117 2455017 1023096 -808348
43121 -808348 -2464520 -3039793 -2056277 -558740 -444825 -2148334 -3903403 -4030441 -3055769
43112 -3055769 -2608812 -3027950 -3307129 -2900242 -2222404 -1568950 -829430 -227036 -107650
43103 -107650 -25 799739 1653544 1165353 -283587 -351535 1963851 4501121 4880383
43094 4880383 3848121 3662133 4176656 3254799 989634 474899 3144957 5929917 5310687
43085 5310687 2518509 1839903 4385628 6643964 5758572 3373714 2635403 3573742 3818329
43076 3818329 2644529 1633171 1567840 1254355 18593 -809323 -107082 985499 781476
$$ packed form
43139B838236l92183K18153k38630j454263j824684q36469L62699P50403N35769
43130d0969L51429L92505N88532Q23988P90721K20911o72100j431921j831444
43121h08348j656172n75273R83516J497537J13915j703509j755069j27038R74672
43112c055769M46957m19138k79179M06887O77838O53454P39520O02394J19386
43103a07650J07625P99764Q53805m88191j448940o7948K315386K537270L79262
43094D880383j032262j85988N14523r21857k265165n14735K670058K784960o19230
43085E310687k792178o78606K545725K258336q85392k384858p38311R38339K44587
43076C818329j173800j011358o5331l13485j235762q27916P02241J092581k04023
$$ plain form
43067 781476 -243143 -166355 1443621 3005974 3378777 3302137 3877528 4798696 4973821
43058 4973821 4238434 3492650 3299393 3155468 2397886 1357985 1150054 2330289 4118498
43049 4118498 5197588 5110154 4484880 3911809 3138518 1687128 -154759 -1462373 -1623569
43040 -1623569 -747147 712384 2252147 3296458 3387693 2570169 1344883 212998 -568356
43031 -568356 -960046 -1210870 -1745687 -2493967 -2513486 -979604 1434288 2933305 2612941
43022 2612941 1412109 700607 614989 401461 -150904 -481245 -299576 -74439 -320999
43013 -320999 -881810 -1111929 -560617 565872 1484173 1550621 1146820 1545218 3360966
43004 3360966 5303585 5210365 2540204 -728038 -2054505 -845056 1316723 2583019
$$ packed form
43067G81476j024619P6788J609976J562353L72803p6640N75391R21168J75125
43058D973821p35387p45784j93257j43925p57582j039901k07931J180235J788209
43049D118498J079090q7434o25274n73071p73291j451390j841887j307614j61196
43040a623569Q76422J459531J539763J044311R1235q17524j225286j131885p81354
43031e68356l91690k50824n34817p48280j9519J533882K413892J499017l20364
43022B612941j200832p11502q5618k13528n52365l30341J81669K25137k46560
43013c20999n60811k30119N51312J126489R18301O6448m03801L98398J815748
43004C360966J942619r3220k670161l268242j326467J209449K161779J266296
$$ plain form
42996 2583019 2496885 1893516 1737488 2303181 3216398 3934981 4129433 3807448 3261969 2839936
42986 2839936 2558623 1973271 723027 -722812 -1283165 -539269 572799 834781 278414
42977 278414 50263 831451 2037955 2678411 2409766 1566871 684606 209472 229352 354115
42967 354115 337217 755308 2236102 3948750 4079678 2354953 834489 1219343 2539657
42958 2539657 2921745 2635966 3401042 5097776 5497585 3688718 1674335 1489801 2344962
42949 2344962 2075232 410358 -743500 108773 2419436 4482768 5087154 4272074 3007255
42940 3007255 2167063 1694438 1088037 660781 1410528 3289797 4682240 4438796 3584213
42931 3584213 3958905 5748233 7400257 7592549 6360247 4676459 3767750 4339090 5574421
$$ packed form
42996B583019q6134o03369j56028N65693R13217P18583J94452l21985n45479m22033
42986B839936k81313n85352j250244j445839n60353P43896J112068K61982n56367
42977B78414k28151P81188J206504O40456k68645q42895q82265m75134J9880J24763
42967C54115j6898M18091J480794J712648J30928j724725j520464L84854J320314
42958B539657L82088k85779P65076J696734L99809j808867k014383j84534Q55161
42949B344962k69730j664874j153858Q52273K310663K063332O04386q15080j264819
42940C007255q40192m72625o06401m27256P49747J879269J392443k43444q54583
42931C584213L74692J789328J652024J92292j232302j683788r08709N71340J235331
$$ plain form
42922 5574421 5522336 3505481 1401593 1220799 2211331 2140689 855429 318705 1150108
42913 1150108 1581180 528117 -537889 3527 1454206 2196548 2184240 2494659 3381891
42904 3381891 4247683 4843283 5195347 4965700 4107875 3521757 3782682 3860167 2579272
42895 2579272 880922 901836 2835412 4415943 3945343 2348583 1471538 1567091 1610677
42886 1610677 1398175 1955634 3769694 5673884 6159615 5322397 4672462 5001587 5344696
42877 5344696 4588817 3289403 2795537 2998533 2396750 552749 -954502 -674594 768265
42868 768265 1700450 1483389 768077 460518 1210661 3123338 5153122 5615744 4195961
42859 4195961 2589008 2197319 2221955 1301807 -2867 -66288 1197947 2469675 3306573
$$ packed form
42922E574421n2085k016855k103888j80794R90532p0642j285260n36724Q31403
42913A150108M31072j053063j066006N41416J450679P42342j2308L10419Q87232
42904C381891Q65792N95600L52064k29647q57825n86118K60925P7485j280895
42895B579272j698350K0914J933576J580531m70600j596760q77045R5553M3586
42886A610677k12502N57459J814060J904190M85731q37218o49935L29125L43109
42877E344696p55879j299414m93866K02996o01783j844001j507251K79908J442859
42868G68265R32185k17061p15312l07559P50143J912677K029784M62622j419783
42859D195961j606953l91689K4636r20148j304674o3421J264235J271728Q36898
$$ plain form
42850 3306573 4266270 4897815 3843686 1403622 -22241 1027534 3114681 3937954 3096180
42841 3096180 1848873 1150576 987100 1031001 1054512 996637 1081487 1507941 1884436 1625340
42831 1625340 1026708 1096980 2112643 3276190 4070993 4907811 6000363 6642135 6198290
42822 6198290 4987095 3735300 3021794 3503329 5419052 7355723 6978305 3985010 1085904
42813 1085904 862305 2721475 4223603 4367758 3981919 3653477 3144477 2650025 2932053
42804 2932053 4004447 4985046 5469897 5946025 6639591 7012526 6724795 6203564 5873157
42795 5873157 5509178 4716181 3543663 2367420 1526128 1181936 1218037 1288851 1247197 1322638
42785 1322638 1568320 1558562 1154631 1044521 1734338 2484837 2266599 1405328 1072135 1374859
$$ packed form
42850C306573R59697O31545j054129k440064j425863J049775K087147Q23273q41774
42841C096180j247307o98297j63476M3901K3511n7875Q4850M26454L76495k59096
42831A625340n98632P0272J015663J163547P94803Q36818J092552O41772m43845
42822F198290j211195j251795p13506M81535J915723J936671l77418k993295k899106
42813A085904k23599J859170J502128J44155l85839l28442n09000m94452K82028
42804B932053J072394R80599M84851M76128O93566L72935k87731n21231l30407
42795E873157l63979p92997j172518j176243q41292l44192L6101P0814m1654P5441
42785A322638K45682r758m03931j10110O89817P50499k18238q61271l33193L02724
$$ plain form
42775 1374859 1402758 1180549 1864642 3474922 4182016 2995736 1718541 2603117 5007736
42766 5007736 6257102 5425287 4268036 4229199 4533420 4113162 3683436 4375856 5429478
42757 5429478 5082968 3346393 2089005 2313319 3048973 3372545 3841829 5035024 6150909
42748 6150909 6351507 6332589 7023356 7609131 6650358 4691774 3820611 4641543 5566151
42739 5566151 5463654 5269958 6265571 8202294 9958125 10883610 10758787 9521550 7795545
42730 7795545 6687417 6396118 6029032 5298072 5079848 5634554 5849819 5301537 5428785
42721 5428785 7139458 8685812 7843068 5210718 3352922 3320628 4012674 4551132 5240121
42712 5240121 6222492 7043688 7718325 8670019 9501226 9310056 8353350 7990720 8868180
$$ packed form
42775A374859K7899k22209O84093J610280P07094j186280j277195Q84576K404619
42766E007736J249366q31815j157251l8837L04221m20258m29726O92420J053622
42757E429478l46510j736575j257388K24314P35654L23572M69284J193195J115885
42748F150909K00598j8918O90767N85775r58773j958584q71163Q20932R24608
42739E566151j02497j93696R95613J936723J755831R25485j24823j237237j726005
42730G795545j108128k91299l67086p30960k18224N54706K15265n48282J27248
42721E428785J710673J546354q42744k632350j857796l2294O92046N38458O88989
42712E240121R82371Q21196O74637R51694Q31207j91170r56706l62630Q77460
$$ plain form
42703 8868180 10448373 12222599 13872558 14380601 12869473 10548076 9900839 11394922
42695 11394922 12755807 12159509 10384766 8990320 8188201 7734134 8274749 10184154 12190275
42686 12190275 12811226 12452848 12587773 13376446 13603898 12782448 11934613 12110902 13127475
42677 13127475 14038362 14173026 13482982 12395378 11617704 11806051 13110383 14945967 16256433
42668 16256433 16261093 15235135 14439966 14950601 16607776 18383002 19575416 20294441 21000138
42659 21000138 21976046 23036001 23487251 22855941 21891369 21960385 22961040 23127112 21885001
42650 21885001 21353796 23281010 25945344 26590919 25936869 27221312 31088014 34734563
42642 34734563 36562493 38422305 42205711 47203098 52294133 58133266 65605579 74536330
$$ packed form
42703H868180J580193J774226J649959N08043j511128k321397o47237J494083
42695A1394922J360885n96298j774743j394446q02119m54067N40615J909405K006121
42686A2190275O20951l58378J34925P88673K27452q21450q47835J76289J016573
42677A3127475R10887J34664o90044j087604p77674J88347J304332J835584J310466
42668A6256433M660j025958p95169N10635J657175J775226J192414P19025P05697
42659B1000138R75908J059955M51250o31310r64572O9016J000655J66072j242111
42650B1885001n31205J927214K664334O45575o54050J284443L866702L646549
42642C4734563J827930J859812L783406M997387N091035N839133P472313Q930751
$$ plain form
42634 74536330 85445881 100156704 119359755 142655862 172457657 212948649 260466897
42627 260466897 298136509 306788172 282322320 238934028 195344903 161324518 136921441
42620 136921441 118924497 104715155 92601767 81963244 73146750 66317103 61017577
42613 61017577 57102587 54856485 53823879 52835800 51599943 51013474 51582414 52803069
42605 52803069 54354619 56527032 59142490 61422004 63360497 66082764 70546972 76931009
42597 76931009 85276637 95558848 107386187 121104293 138813059 162643161 193000938
42590 193000938 231140240 281722922 346397812 412124786 451714763 443537932 391613769
42583 391613769 322614484 262597850 219478565 187237131 160429602 139545722 125362805
$$ packed form
42634G4536330J0909551J4710823J9203051K3296107K9801795M0490992M7518248
42627B60466897L7669612Q651663k4465852m3388292m3589125l4020385k4403077
42620A36921441j7996944j4209342j2113388j0638523q816494o829647n299526
42613F1017577l914990k246102j032606r88079j235857n86469N68940J220655
42605E2803069J551550K172413K615458K279514J938493K722267M464208O384037
42597G6931009Q345628J0282211J1827339J3718106J7708766K3830102L0357777
42590A93000938L8139302N0582682O4674890O5726974L9589977q176831n1924163
42583C91613769o8999285o0016634m3119285l2241434k6807529k0883880j4182917
$$ plain form
42576 125362805 115244959 107120741 102780533 104008096 108228180 111860082 116317066 126252602
42568 126252602 142720088 163629112 191706527 235311653 297245898 367407841 430933812
42561 430933812 478770718 504367029 496053617 445153336 363010575 279253069 217331093
42554 217331093 177429872 146961640 120054859 99566617 85872179 74109587 62236505
42547 62236505 53774428 50761991 49671827 46510288 41711152 37697130 34866449 32350952
42539 32350952 30388276 29617359 29374550 28492516 27034180 26039674 26056188 26632597 26923216
42530 26923216 26533750 26022228 26258229 26883511 26257158 23811510 21371043 20684334 20689115
42521 20689115 19172975 16352253 14440285 13980403 13135821 10881242 8562206 7632647
$$ packed form
42576A25362805j0117846q124218m340208J227563M220084L631902M456984R935536
42568A26252602J6467486K0909024K8077415M3605126O1934245P0161943O3525971
42561D30933812M7836906K5596311q313412n0900281q2142761q3757506o1921976
42554B17331093l9901221l0468232k6906781k0488242j3694438j1762592j1873082
42547F2236505q462077l012437j090164l161539m799136m014022k830681k515497
42539C2350952j962676p70917k42809q82034j458336r94506J6514N76409K90619
42530B6923216l89466n11522K36001O25282o26353k445648k440467o86709M781
42521B0689115j516140k820722j911968m59882q44582k254579k319036r29559
$$ plain form
42513 7632647 7813812 8255692 8838883 9556432 10021814 10213262 10445374 10282010 8949272
42504 8949272 7131291 6673046 7993486 9464420 9962246 10349444 11698830 13741589 15955118
42495 15955118 18530619 21225242 22853545 23141497 23640744 25469210 27438785 27830723
42487 27830723 26829483 25629393 24154239 21473111 17931894 15148358 13998848 13937557
42479 13937557 14244174 14774855 15440278 15965189 16412577 17330907 19227969 22198854 25927930
42470 25927930 29728336 32766919 34547192 35118799 34973839 35158682 37065863 40953193
42462 40953193 44615128 44864101 40835087 34716030 28809994 23299661 17679143 12846353
42454 12846353 10302843 10093429 10797853 11039077 10154367 8175665 6089791 5297669 5865576
$$ packed form
42513G632647J81165M41880N83191P17549M65382J91448K32112j63364j332738
42504H949272j817981m58245J320440J470934M97826L87198J349386K042759K213529
42495A5955118K575501K694623J628303K87952M99247J828466J969575L91938
42487B7830723j001240j200090j475154k681128l541217k783536j149510o1291
42479A3937557L06617N30681O65423N24911M47388R18330J897062K970885L729076
42470B5927930L800406L038583J780273N71607j44960J84843J907181L887330
42462D0953193L661935K48973m029014o119057n906036n510333n620518m832790
42454A2846353k543510k09414P04424K41224q84710j978702k085874p92122N67907
$$ plain form
42445 5865576 6196287 5343263 4453093 4685338 5073349 4265208 3260918 4103200 6364855
42436 6364855 7351937 5900340 3814261 3079775 3505693 3797928 3449344 2793633 2301209
42427 2301209 2404265 3110437 3511183 2675818 1168068 482982 828570 860764 -44562
42418 -44562 -742967 -137885 1336856 2771980 3990855 4821369 4426177 2541393 521257
42409 521257 19530 1162125 2806618 3964555 4259238 3752907 3138958 3396273 4492265
42400 4492265 5202410 4936562 4715578 5345293 5741457 4475792 2085779 220018 -818645
42391 -818645 -1841087 -2539002 -1588973 928784 3219215 4299657 4968704 5642371 5196445
42382 5196445 3139509 1248406 1392857 2824372 3309460 2255125 1037928 629586 611353
$$ packed form
42445E865576L30711q53024q90170K32245L88011q08141j004290Q42282K261655
42436F364855R87082j451597k086079p34486M25918K92235l48584o55711m92424
42427B301209J03056P06172M00746q35365j507750o85086L45588L2194r05326
42418d4562o98405O05082J474741J435124J218875Q30514l95192j884784k020136
42409E21257n01727J142595J644493J157937K94683n06331o13949K57315J095992
42400D492265P10145k65848k20984O29715L96164j265665k390013j865761j038663
42391h18645j022442o97915R50029K517757K290431J080442O69047O73667m45926
42382E196445k056936j891103J44451J431515M85088j054335j217197m08342j8233
$$ plain form
42373 611353 566433 847029 1499932 1670912 758833 -607893 -1310818 -954114 -12772 728344
42363 728344 650034 -246755 -1122499 -1029682 -24737 958416 1369029 1453983 1368920 868350
42353 868350 186752 138919 753160 874315 -56924 -912827 -709559 -521502 -1950265 -4264363
42343 -4264363 -4944982 -3108761 -637968 517865 619299 1023931 2102724 3169696 3533138
42334 3533138 2770009 793324 -1496145 -2428828 -1462478 -271747 -864268 -2988471 -4521382
42325 -4521382 -4279170 -3314593 -3212238 -4013953 -4356116 -3214424 -1033882 773285 1161579
42316 1161579 195000 -1392702 -3013628 -4347403 -5014696 -4778179 -4006070 -3288246 -2620207
42307 -2620207 -1682681 -797453 -527632 -301643 1142471 3556151 5044558 4912949 4839311
$$ packed form
42373F11353m4920K80596O52903J70980r12079j366726p02925L56704R41342P41116
42363G28344p8310q96789q75744R2817J004945R83153M10613Q4954q5063n00570
42353H68350o81598m7833O14241J21155r31239q55903K03268J88057j428763k314098
42343d264363o80619J836221K470793J155833J01434M04632J078793J066972L63442
42334C533138p63129j976685k289469r32683R66350J190731n92521k124203j532911
42325d521382K42212R64577J02355q01715l42163J141692K180542J807167L88294
42316A161579r66579j587702j620926j333775o67293K36517P72109P17824O68039
42307b620207R37526Q85228K69821K25989J444114K413680J488407j31609p3638
$$ plain form
42298 4839311 5834073 5917763 3146691 -365816 -442820 3458808 7539402 9040038 9358098
42289 9358098 10561983 11534462 9892000 6143255 3384596 3272030 4303770 4243605 2807896
42280 2807896 1529341 1766660 3226895 4250937 3650010 2260823 2027379 3320933 4203059
42271 4203059 3050534 837004 -394922 -491572 -1013185 -2440228 -3288909 -2303436 -116104
42262 -116104 1824348 2842116 2904913 1929984 164853 -1354429 -1723257 -1364557 -1542271
42253 -1542271 -2712331 -3979363 -4266919 -3500187 -2431338 -1714471 -1500538 -1706373 -2193074
42244 -2193074 -2571067 -2234908 -1008280 346645 741071 57412 -546598 27073 1440088
42235 1440088 2336399 2016010 1105732 421578 -213148 -1453089 -3047387 -3769699 -2942002
$$ packed form
42298D839311R94762Q3690k771072l512507p7004L901628M080594J500636L18060
42289I358098J203885R72479j642462l748745k758659j12566J031740o0165j435709
42280B807896j278555K37319J460235J024042o00927j389187k33444J293554Q82126
42271D203059j152525k213530j231926r6650n21613j427043q48681R85473K187332
42262a16104J940452J017768O2797r74929j765131j519282l68828L58700j77714
42253a542271j170060j267032k87556P66732J068849P16867K13933k05835m86701
42244b193074l77993L36159J226628J354925L94426o83659o04010N73671J413015
42235A440088Q96311l20389r10278o84154o34726j239941j594298p22312Q27697
$$ plain form
42226 -2942002 -1388899 -344588 165812 1076410 2553597 3513587 3221809 2478515 2470815
42217 2470815 3095757 3382196 3146648 3052757 3124738 2485569 893523 -608014 -1154943
42208 -1154943 -1214477 -1564717 -1987754 -1879238 -1445378 -1173371 -550363 1388113 4190456
42199 4190456 5866895 5162145 3226930 2371199 3407578 4769813 4394225 2236212 555727
42190 555727 1492793 4676739 7812220 9452132 10223680 11125243 11878825 11854473 11584510
42181 11584510 11973835 12513505 11716645 9223767 6227187 3843553 2281128 1561575 1633477
42172 1633477 1595540 351953 -1473657 -1794146 27218 1971961 2072444 955665 422932
42163 422932 755443 1067995 1391685 2476653 3951836 4561451 4180835 3925202 4214906
$$ packed form
42226b942002J553103J044311N10400R10598J477187R59990k91778p43294p700
42217B470815O24942K86439k35548r3891P1981o39169j592046j501537n46929
42208a154943n9534l50240m23037J08516M33860K72007O23008J938476K802343
42199D190456J676439p04750j935215q55731J036379J362235l75588k158013j680485
42190E55727R37066L183946L135481J639912P71548R01563P53582k4352k69963
42181A1584510L89325N39670p96860k492878k996580k383634j562425p19553P1902
42172A633477l7937j243587j825610l20489J821364J944743J00483j116779n32733
42163D22932L32511L12552L23690J084968J475183O09615l80616k55633K89704
$$ plain form
42154 4214906 4378149 4290879 4629792 5128119 4452274 2562573 1395518 2077979 3067229
42145 3067229 2466573 810473 -114002 -99191 -252385 -619005 -119848 1332235 2508449
42136 2508449 2736986 2488744 1992469 878696 -546298 -1235993 -988011 -635715 -356560
42127 -356560 531370 1584081 965413 -1758719 -4223538 -4046135 -1707248 693580 2265598
42118 2265598 3303894 3577652 2597053 1020025 38870 -269607 -467581 -174783 1298596
42109 1298596 3138627 3737558 3087947 2625993 2711485 2181083 588983 -1025892 -1959512
42100 -1959512 -2554040 -2686273 -1571819 247470 805559 -354550 -1091769 189888 2092973
42091 2092973 2442681 1356245 390584 12995 -196356 55947 1183196 2335995 2519362
$$ packed form
42154D214906J63243q7270L38913M98327o75845j889701j167055O82461R89250
42145C067229o00656j656100r24475J4811j53194l66620M99157J452083J176214
42136B508449K28537k48242m96275j113773j424994o89695K47982L52296K79155
42127c56560Q87930J052711o18668k724132k464819J77403K338887K400828J572018
42118B265598J038296K73758r80599j577028r81155l08477j97974K92798J473379
42109A298596J840031N98931o49611m61954Q5492n30402j592100j614875r33620
42100a959512n94528j32233J114454J819289N58089j160109p37219J281657J903085
42091B092973L49708j086436r65661l77589k09351K52303J127249J152799J83367
$$ plain form
42082 2519362 2381255 2955924 3333117 1863401 -626406 -1306734 614473 2553438 2092026
42073 2092026 99095 -762753 588741 2861359 4214004 3960049 2786485 1844359 1583418
42064 1583418 1512611 1251306 1260506 1889804 2324300 1537155 -118816 -1399231 -1874986 -1949493
42054 -1949493 -1621916 -708934 46708 -218697 -773867 -242290 816574 445918 -1332099
42045 -1332099 -2065260 -576976 1211249 1409369 976019 1757167 3472136 4508527 4362019
42036 4362019 3487805 1951109 81324 -684405 314102 1155541 -323868 -2980618 -3546149
42027 -3546149 -1225089 1227097 1347583 -207006 -1326327 -1150726 -195373 898271 1775216
42018 1775216 2354707 3027705 4189284 5302134 5300603 4167198 3080695 2650434 2112662
$$ packed form
42082B519362j38107N74669L77193j469716k489807o80328J921207J938965m61412
42073B092026j992931q61848J351494K272618J352645k53955j173564r42126k60941
42064A583418p0807k61305R200O29298M34496p87145j655971j280415m75755p4507
42054a949493L27577R12982P55642k65405n55170N31577J058864l70656j778017
42045a332099p33161J488284J788225J98120m33350P81148J714969J036391j46508
42036D362019q74214j536696j869785p65729R98507Q41439j479409k656750n65531
42027c546149K321060K452186J20486j554589j119321J75601R55353J093644Q76945
42018A775216N79491O72998J161579J112850j531j133405j086503m30261n37772
$$ plain form
42009 2112662 843882 -367306 -349081 887578 2324001 3079112 2793817 1548727 136031
42000 136031 -142237 1165761 2722110 2598326 486278 -1753856 -1893883 465152 3507426
41991 3507426 4995663 4472520 3467905 3391971 3818872 3544586 2756914 2813650 3905099
41982 3905099 4498033 3688352 2710350 3113157 4585323 5877824 7019014 9090464 12362845
41973 12362845 16409904 21884279 30007492 39424822 45343648 43623094 35294777 25669919
41965 25669919 19046829 15453261 12632020 9680166 7580889 6893706 6528569 5267017
41957 5267017 3510083 2648945 3097690 3845821 3946437 3575427 3275476 2912963 2099024
41948 2099024 1214438 1112399 1818253 2382337 2306223 2316887 3095318 3842352 3120554 1042361
$$ packed form
42009B112662j268780j211188J8225J236659J436423P55111k85295j245090j412696
42000A36031k78268J307998J556349j23784k112048k240134j40027K359035L042274
41991C507426J488237n23143j004615p5934M26901k74286p87672N6736J091449
41982C905099N92934q09681r78002M02807J472166J292501J141190K071450L272381
41973A2362845M047059N474375Q123213R417330N918826j720554q328317r624858
41965B5669919o623090l593568k821241k951854k099277o87183l65137j261552
41957E267017j756934q61138M48745P48131J00616l71010k99951l62513q13939
41948B099024q84586j02039P05854N64084p6114J0664P78431P47034p21798k078193
$$ plain form
41938 1042361 -419755 244258 2152507 3075589 2049324 299465 -327337 668336 2055245
41929 2055245 2147121 537351 -1267913 -1303905 478302 1920515 1406293 183588 707372
41920 707372 3055607 4613438 3507462 769794 -1437206 -2181089 -1510008 543280 3286251
41911 3286251 4865596 4080795 2037146 612362 12691 -664555 -1271869 -966552 -263106
41902 -263106 -573228 -1685240 -1814108 -515262 477331 -41027 -1090653 -1401039 -1160827
41893 -1160827 -786977 382065 2747036 5100357 6092051 6048066 5963991 5667389 4520817
41884 4520817 3199125 3104129 4356783 5833029 7035390 8688879 11589053 15881291
41876 15881291 21201502 26417918 29495481 28879174 25114157 20268846 15941161 12660910
$$ packed form
41938A042361j462116O64013J908249R23082j026265j749859o26802R95673J386909
41929B055245R1876j609770j805264l5992J782207J442213n14222j222705N23784
41920G07372K348235J557831j105976k737668k207000p43883O71081K053288K742971
41911C286251J579345p84801k043649j424784n99671o77246o07314L05317P03446
41902b63106l10122j112012j28868J298846R92593n18358j049626l10386K40212
41893a160827L73850J169042K364971K353321R91694m3985q4075k96602j146572
41884D520817j321692r4996J252654J476246J202361J653489K900174M292238
41876A5881291N320211N216416L077563o16307l765017m845311m327685l280251
$$ plain form
41868 12660910 10740331 10321358 10590604 10174059 8526422 6126500 3462180 808800
41860 808800 -1228347 -2170618 -2578188 -3303056 -3969741 -3581916 -2547068 -2413283 -3356346
41851 -3356346 -3707651 -2577982 -1220286 -856900 -756043 258122 1685233 2219449 1830567
41842 1830567 1506242 1535794 1445573 1228034 1309730 1519513 1276628 663450 211644 -254434
41832 -254434 -1392248 -2882072 -3330336 -2018203 88396 1549064 2121699 2776373 4328900
41823 4328900 6440229 8015887 8546431 8893315 10406316 13286466 16391874 18752593
41815 18752593 20394476 21250134 20391957 17443841 13971403 12068634 11900071 11979551 11634681
41806 11634681 11644142 12386123 13104867 13649411 15386514 19244715 23841590 26723144 26875428
$$ packed form
41868A2660910j920579m18973K69246m16545j647637k399922k664320k653380
41860H08800k037147r42271m07570p24868o66685L87825J034848J33785r43063
41851c356346l51305J129669J357696L63386J00857J014165J427111N34216l88882
41842A830567l24325K9552r0221k17539Q1696K09783k42885o13178m51806m66078
41832b54434j137814j489824m48264J312133K106599J460668N72635O54674J552527
41823D328900K111329J575658N30544L46884J513001K880150L105408K360719
41815A8752593J641883Q55658q58177k948116l472438j902769j68563P9480l44870
41806A1634681R461P41981P18744N44544J737103L858201M596875K881554J52284
$$ plain form
41797 26875428 25059260 22286945 19123605 16126211 13699094 11439643 8663779 5784664
41789 5784664 4200634 4395421 5020346 4574423 3371640 2874841 3335447 3284165 1747260
41780 1747260 -73037 -302981 972592 1849115 1359056 727987 1316463 2559967 3069101
41771 3069101 2873169 3060787 3598229 3205454 1574077 107252 -164546 -20077 -475050
41762 -475050 -943167 -261370 1149672 1570962 271340 -1683984 -2985023 -3381434 -3147685
41753 -3147685 -2224490 -625255 796900 901251 -233265 -959485 159616 2337509 3090335
41744 3090335 1141084 -1915355 -3594029 -3511875 -3180846 -3230713 -2613601 -864430 710505
41735 710505 1066363 1047612 1657614 2081682 1123682 -452443 -968215 -524194 -585177 -1275502
$$ packed form
41797B6875428j816168k772315l163340k997394k427117k259451k775864k879115
41789E784664j584030J94787O24925m45923j202783m96799M60606n1282j536905
41780A747260j820297k29944J275573Q76523m90059o31069N88476J243504N09134
41771C069101j95932J87618N37442l92775j631377j466825k71798J44469m54973
41762d75050m68117O81797J411042M21290j299622j955324j301039l96411K33749
41753c147685R23195J599235J422155J04351j134516p26220J119101K177893P52826
41744C090335j949251l056439j678674Q2154L31029m9867O17112J749171J574935
41735G10505L55858j8751O10002M24068r58000j576125n15772M44021o0983o90325
$$ plain form
41725 -1275502 -1302539 -548334 -433144 -1282530 -1586669 -716698 -266602 -1437545 -2895521
41716 -2895521 -2776888 -1394672 -286420 288065 1093004 1941631 1856781 946876 500079
41707 500079 1158484 2235714 2892971 2941811 2462957 1610028 898348 894800 1496180 2039020
41697 2039020 2047288 1453598 411250 -612173 -1003516 -826202 -928190 -1645564 -2132326
41688 -2132326 -1707626 -964921 -572013 5750 1250971 2034530 993344 -1251941 -3035830
41679 -3035830 -4125762 -5241045 -5725814 -4215292 -1491091 -34013 -451086 -964876 -898855
41670 -898855 -1712689 -3552397 -3887728 -1488939 923260 447507 -1685980 -2253083 -840881
41661 -840881 369663 479347 492309 576117 -337291 -2046296 -2677632 -1356838 506741
$$ packed form
41725a275502k7037P54205J15190q49386l04139Q69971M50096j170943j457976
41716b895521J18633J382216J108252N74485Q04939Q48627q4850r09905m46797
41707E00079O58405J077230O57257M8840m78854q52929p11680l548O01380N42840
41697B039020Q268n93690j042348j023423l91343J77314j01988p17374m86762
41688b132326M24700P42705L92908N77763J245221P83559j041186k245285j783889
41679c035830j089932j115283m84769J510522K724201J457078m17073n13790O6021
41670h98855q13834j839708l35331K398789K412199m75753k133487n67103J412202
41661h40881J210544J09684J2962Q3808r13408j709005o31336J320794J863579
$$ plain form
41652 506741 989806 -646817 -3896430 -7099677 -7911416 -5521275 -2237285 -964895 -1353867
41643 -1353867 -639438 1863420 3791183 3616946 2693056 2449272 2192820 1113568 110200
41634 110200 -111485 -691104 -2443113 -3856985 -3367995 -2035684 -1663256 -1627099 -221209
41625 -221209 1752449 1629975 -1020051 -3556780 -3868057 -2649478 -1607046 -1307133 -1473845
41616 -1473845 -1811084 -1807918 -1011961 -42597 -119096 -1171216 -1740733 -1205932 -637996 -778718
41606 -778718 -678918 611049 2270840 2899651 2572989 2465194 3081098 4036558 5055422
41597 5055422 5988677 6202868 5136842 3361375 2105702 1789333 1853167 1897072 2065998
41588 2065998 2344069 2377798 2103085 1759935 1194484 -49605 -1754156 -2872942 -2627223
$$ packed form
41652E06741M83065j636623l249613l203247q11739K390141L283990J272390l88972
41643a353867P14429K502858J927763j74237r23890k43784k56452j079252j003368
41634A10200k21685n79619j752009j413872M88990J332311L72428L6157J405890
41625b21209J973658j22474k650026k536729l11277J218579J042432K99913j66712
41616a473845l37239L166P95957R69364p6499j052120n69517N34801N67936j40722
41606g78718R9800J289967J659791O28811l26662j07795O15904R55460J018864
41597E055422R33255K14191j066026j775467j255673l16369O3834M3905J68926
41588B065998K78071L3729k74713l43150n65451j244089j704551j118786K45719
$$ plain form
41579 -2627223 -1227119 557535 1885214 1914436 355044 -1748651 -2705212 -2105423 -1217736
41570 -1217736 -1007627 -849691 -31789 615847 32090 -873883 -153514 2109777 3441960
41561 3441960 2207180 -278466 -1685434 -1529380 -1021040 -932585 -923487 -684225 -559243
41552 -559243 -836252 -1112662 -649469 834240 2673665 3555729 2768205 1294236 915045
41543 915045 1829292 2125924 449993 -1764287 -2039022 -197274 1615843 1991439 1615298
41534 1615298 1438255 1278112 912667 1028764 2041948 3049796 2998344 2078402 1029623
41525 1029623 -151071 -1748343 -3193349 -3540449 -2812017 -1943784 -1566299 -1570475 -1646482
41516 -1646482 -1558848 -1107012 -431779 -122937 -488241 -1018314 -1023405 -347228 937293 2748057
$$ packed form
41579b627223J400104J784654J327679K9222j559392k103695r56561N99789Q87687
41570a217736K10109J57936Q17902O47636n83757r05973P20369K263291J332183
41561C441960j234780k485646j406968J56054N08340Q8455R098K39262J24982
41552e59243k77009k76410M63193J483709J839425Q82064p87524j473969l79191
41543I15045R14247K96632j675931k214280k74735J841748J813117L75596l76141
41534A615298j77043j60143l65445J16097J013184J007848n1452r19942j048779
41525A029623j180694j597272j445006l47100P28432Q68233L77485m176p6007
41516a646482Q7634M51836O75233L08842l65304n30073n091O76177J284521J810764
$$ plain form
41506 2748057 4278424 4079195 1969983 14252 182835 1666406 2063203 762353 -648534
41497 -648534 -1149753 -1454140 -2106859 -2344770 -1606100 -624019 -158867 70449 421452 602128
41487 602128 744030 1824837 3921752 5322632 4738359 3337470 3031311 3561966 3055786
41478 3055786 1051665 -835077 -1321218 -920498 -641499 -577830 -401750 -246054 -377840
41469 -377840 -620393 -694686 -724809 -953360 -1268528 -1383228 -1276397 -1196299 -1356200 -1731502
41459 -1731502 -1997788 -1673514 -614301 564160 862809 -93496 -1540264 -2197228 -1399227
41450 -1399227 374326 2007953 2736209 2603005 2005121 1088843 -111881 -1209519 -1716197
41441 -1716197 -1732703 -1779202 -1894780 -1613459 -992990 -837023 -1506875 -2285591 -2382469 -1774758
$$ packed form
41506B748057J530367j99229k109212j955731J68583J483571L96797j300850j410887
41497f48534n01219l04387o52719k37911P38670R82081M65152K29316L51003J80676
41487F02128J41902J080807K096915J400880n84273j400889l06159N30655n06180
41478C055786k004121j886742m86141M00720K78999O3669J76080J55696j31786
41469c77840k42553p4293l0123k28551l15168j14700J06831Q0098j59901l75302
41459a731502k66286L24274J059213J178461K98649r56305j446768o56964P98001
41450a399227J773553J633627P28256j33204n97884r16278j200724j097638n06678
41441a716197j6506m6499j15578K81321O20469J55967o69852p78716r6878O07711
$$ plain form
41431 -1774758 -572799 1394389 3510972 4013902 2108516 -284133 -540800 1204198
41423 1204198 2287355 1230409 -482749 -809192 209762 1074859 972005 268905 -454433
41414 -454433 -933498 -1087796 -1030004 -1067395 -1352884 -1720212 -1969677 -1963620 -1451972 -395608
41404 -395608 492861 307384 -712839 -1185567 -328369 980494 1337393 430967 -895447
41395 -895447 -1646234 -1340340 -236599 689115 514350 -495456 -1033483 -343259 935215
41386 935215 1813285 2115423 2164691 2051166 1762040 1415210 906962 5726 -839052 -702191
41376 -702191 305112 800645 94752 -787052 -924137 -984212 -1586798 -1577921 134760 2012488
41366 2012488 1476593 -1275973 -3336090 -3051349 -1781306 -1330265 -1730791 -2305919 -3030437
$$ packed form
41431a774758J201959J967188K116583N02930j905386k392649k56667J744998
41423A204198J083157j056946j713158l26443J018954Q65097j02854p03100p23338
41414d54433m79065j54298N7792l7391k85489l67328k49465O057N11648J056364
41404c95608Q88469j85477j020223m72728Q57198J308863L56899r06426j326414
41395h95447p50787L05894J103741R25714j74765j009806n38027O90224J278474
41386I35215Q78070L02138M9268j13525k89126l46830n08248r01236q44778J36861
41376g02191J007303M95533p05893q81804j37085o0075o02586Q877J712681J877728
41366B012488n35895k752566k060117K84741J270043M51041m00526n75128p24518
$$ plain form
41357 -3030437 -3812702 -3978762 -3530501 -3581366 -4539771 -5169831 -4522929 -3495168 -3229189
41348 -3229189 -3200499 -2330842 -928454 95687 1048643 2643940 3920321 2996698 -22562
41339 -22562 -2625518 -2798838 -1107327 458289 576361 -819195 -2965909 -4699985 -5141714
41330 -5141714 -4420974 -3343434 -2295839 -1060530 317306 1251003 1356652 865684 221747
41321 221747 -204705 -152483 106609 -309225 -1577542 -2114234 -255841 2962053 4350567
41312 4350567 2467342 -501107 -1621563 -654912 527090 828821 723260 771868 900310
41303 900310 1091514 1585097 2182684 2155095 1050796 -798879 -2469885 -2842745 -1315372
41294 -1315372 1264130 2863956 2269528 486175 -585877 -418952 92445 344915 558529
$$ packed form
41357c030437p82265j66060M48261n0865r58405o30060O46902J027761K65979
41348c229189K8690Q69657J402388J024141R52956J595297J276381r23623l019260
41339b2562k602956j73320J691511J565616J18072j395556k146714j734076m41729
41330e141714P20740J077540J047595J235309J377836R33697J05649m90968o43937
41321B21747m26452N2222K59092m15834j268317n36692J858393L217894J388514
41312D350567j883225k968449j120456R66651J182002L01731j05561M8608J28442
41303I00310J91204M93583N97587k7589j104299j849675j671006l72860J527373
41294a315372K579502J599826n94428j783353j072052J66925N11397K52470K13614
$$ plain form
41285 558529 788312 665700 192167 -306601 -1038967 -2381707 -3594773 -3256200 -1307728
41276 -1307728 626768 1371710 1305086 880222 -280845 -1833681 -1927785 364269 2966754
41267 2966754 3011265 473281 -2202075 -3596141 -4386772 -5053700 -4824676 -3567062 -2714486
41258 -2714486 -3106536 -3410699 -2110735 32932 1064914 668436 267381 569522 690899
41249 690899 11941 -559670 40313 1361215 2086002 1874471 1644823 2103898 2783576
41240 2783576 2823855 2260247 2066558 2906458 4122499 4245999 2625258 405206 -400791
41231 -400791 1064731 3566285 5003806 4453924 2838940 1752866 1962103 3013560 3862376
41222 3862376 3690075 2505045 1295275 1270435 2463860 3326644 2376448 183128 -1099309
$$ packed form
41285E58529K29783j22612m73533m98768p32366j342740j213066L38573J948472
41276a307728J934496P44942o6624m24864j161067j552836r4104K292054K602485
41267B966754M4511k537984k675356j394066p90631o66928K29024J257614Q52576
41258b714486l92050l04163J299964K143667J031982l96478m01055L02141J21377
41249F90899o78958n71611N99983J320902P24787k11531k29648M59075O79678
41240B783576M0279n63608j93689Q39900J216041J23500j620741k220052q05997
41231d00791J465522K501554J437521n49882j614984j086074K09237J051457Q48816
41222C862376j72301j185030j209770k4840J193425Q62784r50196k193320j282437
$$ plain form
41213 -1099309 -379366 1059275 1398264 602207 -2091 115547 159446 -439671 -1102981
41204 -1102981 -1062157 -390129 311354 585597 180241 -837740 -1650447 -1166091 501541
41195 501541 1766957 1512519 627606 708448 1784019 2470946 2081262 1287880 667167
41186 667167 -82603 -1035921 -1369045 -641303 79397 -607087 -2509934 -4009572 -4011314 -2967415
41176 -2967415 -1970560 -1567704 -1644155 -1842485 -1724060 -939802 305002 1159383 944787
41167 944787 31110 -527929 -351777 -283493 -1179102 -2433617 -2415029 -520010 1849305
41158 1849305 2826981 2151838 1120672 857464 1411405 2354298 3260020 3472652 2470810
41149 2470810 947339 561826 1836707 3064354 2310495 7741 -1564370 -1155396 271503
$$ packed form
41213a099309P19943J438641L38989p96057o04298J17638M3899n99117o63310
41204a102981M0824O72028P01483K74243m05356j017981q12707M84356J667632
41195E01541J265416k54438q84913Q0842J075571O86927l89684p93382o20713
41186F67167p49770r53318l33124P27742P20700o86484j902847j499638j742J043899
41176b967415R96855M02856p6451j98330J18425P84258J244804Q54381k14596
41167I44787r13677n59039J76152O8284q95609j254515J8588J895019K369315
41158A849305R77676o75143j031166k63208N53941R42893R05722K12632j001842
41149B470810j523471l85513J274881J227647p53859k302754j572111M08974J426899
$$ plain form
41140 271503 1270889 1610607 1755160 1632800 761951 -777048 -2157427 -2545898 -1793675
41131 -1793675 -562398 153515 -48342 -474666 -200229 527900 429435 -1010189 -2630182
41122 -2630182 -3015942 -2209497 -1329166 -974121 -799102 -397844 162463 585290 534329 -220072
41112 -220072 -1250732 -1407743 -136636 1378098 1413478 29737 -920854 -326596 787450
41103 787450 909622 3667 -1035802 -2035917 -3463570 -4998081 -5337081 -3697799 -918415
41094 -918415 1206218 1493931 313767 -845362 -832239 64137 721828 846575 1337428
41085 1337428 2736656 4196065 4679533 4404718 4096049 3493395 1986011 363289 231674
41076 231674 1467664 1924805 423438 -1406248 -1410456 51555 798873 -54603 -1224376
$$ packed form
41140B71503R99386L39718J44553j22360q70849j538999j380379l88471P52223
41131a793675J231277P15913k01857m26324K74437P28129r8465j439624j619993
41122b630182l85760Q06445Q80331L55045J75019M01258N60307M22827n0961p54401
41112b20072j030660j57011J271107J514734L5380j383741r50591N94258J114046
41103G87450J22172r05955j039469j000115j427653j534511l39000J639282K779384
41094i18415K124633K87713j180164j159129J3123Q96376O57691J24747M90853
41085A337428J399228J459409M83468k74815l08669o02654j507384j622722j31615
41076B31674J235990M57141j501367j829686m208J462011P47318q53476j169773
$$ plain form
41067 -1224376 -1408257 -879584 -541925 -481744 -133177 699503 1556794 1791292 1040449 -453461
41057 -453461 -1797761 -2113201 -1494477 -939873 -1074683 -1377623 -1047856 -210084 315855
41048 315855 200792 -77971 -70117 79889 -14039 -558493 -1622858 -3072690 -4257134 -4336045
41038 -4336045 -3319202 -2288468 -2057756 -2048171 -1205913 283802 1147907 866636 313174
41029 313174 209475 -32404 -1150711 -2467453 -2572257 -1316173 -65013 142669 -224091
41020 -224091 -216928 125734 23742 -615007 -721131 710798 3205505 5050092 5120566 4129177
41010 4129177 3575845 3672254 3170699 1444550 -306758 -652933 150123 878773 1238180
41001 1238180 1666387 1762063 672591 -961539 -1318604 -108169 846300 554439 553132
$$ packed form
41067a224376j83881N28673L37659O0181L48567Q32680Q57291K34498p50843j493910
41057d53461j344300l15440O18724N54604j34810l02940L29767Q37772N25939
41048C15855j15063k78763P854J50006r3928n44454j064365j449832j184444p8911
41038d336045J016843J030734K30712R585Q42258J489715Q64105k81271n53462
41029C13174j03699k41879j118307j316742j04804J256084J251160K07682l66760
41020b24091P163L42662j01992o38749j06124J431929K494707J844587P0474r91389
41010D129177n53332R6409n01555j726149j751308l46175Q03056P28650L59407
41001A238180M28207R5676j089472j634130l57065J210435R54469k91861j307
$$ plain form
40992 553132 2284927 4384373 4511838 2883265 1827659 2244978 2646192 1852000 679225
40983 679225 312604 569333 690420 762904 1402358 2659248 3984096 4891474 5203970
40974 5203970 4995785 4550808 4002781 3009719 1400795 69958 215510 1460058 1873965
40965 1873965 504410 -1138244 -1072358 407255 1132902 -61117 -1959587 -2589225 -1414247
40956 -1414247 429896 1615216 1864561 1741851 1556463 954502 -182994 -937302 -218887
40947 -218887 1622934 2883965 2428663 821943 -722628 -1719086 -2248736 -2208080 -1526064
40938 -1526064 -723184 -493955 -866155 -1261910 -1228538 -768829 -223861 -134045 -839461 -1892355
40928 -1892355 -2310974 -1753655 -890172 -227842 669479 2107844 3164015 2738732 1370054
$$ packed form
40992E53132J731795K099446J27465j628573j055606M17319M01214p94192j172775
40983F79225l66621K56729J21087P2484O39454J256890J324848R07378L12496
40974E203970k08185m44977n48027r93062j608924j330837J45552J244548M13907
40965A873965j369555j642654O5886J479613P25647j194019j898470o29638J174978
40956a414247J844143J185320K49345j22710j85388o01961j137496p54308P18415
40947b18887J841821J261031m55302j606720j544571r96458n29650M0656O82016
40938a526064Q02880K29229l72200l95755L3372M59709N44968Q9816p05416j052894
40928a892355m18619N57319Q63483O62330Q97321J438365J056171m25283j368678
$$ plain form
40919 1370054 918509 2404414 4879740 6431286 5760171 3018180 -188834 -1775779
40911 -1775779 -925105 1075261 2178641 1577546 -29999 -1612464 -2467041 -2198710 -1044785
40902 -1044785 35083 487849 991697 2125824 2815315 1691011 -292302 -590913 1252907
40893 1252907 2683429 1773585 -23588 -178526 1270513 2187799 1685728 1094776 1643717
40884 1643717 2778671 3255812 2840429 2298551 2271426 2712293 3217417 3469351 3252294
40875 3252294 2286402 471213 -1561947 -2652753 -2402971 -1832927 -1947382 -2070174 -848538
40866 -848538 1266050 2206394 1308666 344526 645185 994564 -82248 -1465488 -1010209
40857 -1010209 945066 2041745 1630573 1603277 3056134 4352216 3627211 1584202 363942
$$ packed form
40919A370054m51545J485905K475326J551546o71115k741991l207014j586945
40911a775779Q50674K000366J103380o01095j607545j582465q54577K68331J153925
40902a044785J079868M52766N03848J134127O89491j124304j983313k98611J843820
40893A252907J430522r09844j797173j54938J449039R17286n02071n90952N48941
40884A643717J134954M77141m15383n41878k7125M40867N05124K51934k17057
40875C252294r65892j815189k033160j090806K49782N70044j14455j22792J221636
40866h48538K114588R40344q97728r64140L00659L49379j076812j383240M55279
40857a010209J955275J096679m11172k7296J452857J296082p25005k043009j220260
$$ plain form
40848 363942 614091 1083738 681401 -271906 -814798 -533844 209351 847713 1226839 1619243
40838 1619243 2025094 1733813 154284 -1995297 -3114112 -2573440 -1460580 -1157699 -1849576
40829 -1849576 -2841224 -3653286 -4181365 -4310762 -4114316 -4125598 -4696135 -5203356 -4562150 -2621014
40819 -2621014 -586861 150135 -563561 -1529447 -1499137 -550841 33130 -569697 -1529690
40810 -1529690 -1396990 -131205 729818 56371 -1554179 -2765540 -2986805 -2394200 -1315567
40801 -1315567 -330481 -278435 -1239575 -1974527 -1325106 151693 894886 435304 -236641
40792 -236641 -280931 110275 537196 995213 1296570 880573 -210048 -921320 -453038 563230
40782 563230 824280 1984 -964687 -1092677 -404131 222797 -19445 -1037648 -1810717
$$ packed form
40848C63942K50149M69647m02337r53307n42892K80954P43195O38362L79126L92404
40838A619243M05851k91281j579529k149581j118815N40672J112860L02881o91877
40829a849576r91648q12062n28079j29397J96446j1282n70537n07221O41206J941136
40819b621014K034153P36996p13696r65886L0310R48296N83971o02827r59993
40810a529690J32700J265785Q61023o73447j610550j211361k21265N92605J078633
40801a315567R85086N2046r61140p34952O49421J476799P43193m59582o71945
40792b36641m4290L91206M26921M58017L01357m15997j090621p11272M68282J016268
40782E63230K61050q22296r66671j27990O88546O26928k42242j018203p73069
$$ plain form
40773 -1810717 -1375788 54234 1245227 1349255 776074 430815 547622 735016 809032
40764 809032 923786 963385 459212 -684461 -1810517 -2138032 -1565220 -653050 -4739
40755 -4739 83551 -504927 -1731513 -3063094 -3437304 -2141456 167812 1836189 1951573
40746 1951573 1323146 1278426 1886187 2083112 1341102 322976 -176684 -76848 419116 1236627
40736 1236627 2026015 2132043 1462994 718515 317074 -126513 -758816 -872295 -83782
40727 -83782 827067 1225125 1801365 3217170 4524170 4556663 4122705 4796036 5951479
40718 5951479 5334833 2688956 384158 -195228 -517899 -2050774 -3766260 -4111114 -3595737
40709 -3595737 -3502904 -3501458 -2627681 -1486687 -1286462 -1534099 -939833 2761 -312557 -1691888
$$ packed form
40773a810717M34929J430022J190993J04028n73181l45259J16807J87394P4016
40764H09032J14754L9599n04173j143673j126056l27515N72812R12170O48311
40755d739Q8290n88478j226586j331581l74210J295848K309268J668377J15384
40746A951573o28427m4720O07761J96925p42010j018126m99660R9836M95964Q17511
40736A236627P89388J06028o69049p44479m01441m43587o32303j13479P88513
40727h3782R10849L98058N76240J415805J307000L2493m33958O73331J155443
40718E951479o16646k645877k304798n79386l22671j532875j715486l44854N15377
40709c595737R2833J446Q73777J140994K00225k47637N94266R42594l15318j379331
$$ plain form
40699 -1691888 -2314501 -1796921 -1649286 -2373687 -2547283 -1498665 -606321 -897476 -1406369
40690 -1406369 -1156902 -908228 -1476565 -1970615 -1351929 -398591 -351943 -667326 55758 1619273
40680 1619273 2477609 2046830 1198145 675327 375015 43561 -458712 -1378877 -2551575
40671 -2551575 -3025284 -2237048 -1093798 -771297 -989358 -778422 -387400 -791554 -1574394
40662 -1574394 -1086663 1075536 3239826 3643669 2107576 -352542 -2328580 -2411174 -279897
40653 -279897 2263721 2734430 887396 -1002628 -1110108 45852 1087478 1615451 1734894
40644 1734894 1107134 -370448 -1784066 -2091660 -1235724 214328 1782280 2935170 3170308
40635 3170308 2929347 3459550 4956761 5781940 4488173 1833249 -241169 -962323 -1019230
$$ packed form
40699a691888o22613N17580J47635p24401j73596J048618Q92344k91155n08893
40690a406369K49467K48674n68337m94050O18686R53338M6648l15383P23084J563515
40680A619273Q58336m30779q48685n22818l00312l31454n02273r20165j172698
40671b551575m73709P88236J143250L22501k18061K10936L91022m04154p82840
40662a574394M87731K162199K164290M03843j536093k460118j976038q2594K131277
40653b79897K543618M70709j847034j890024j07480J155960J041626N27973J19443
40644A734894o27760j477582j413618l07594Q55936J450052J567952J152890K35138
40635C170308k40961N30203J497211Q25179j293767k654924k074418p21154n6907
$$ plain form
40626 -1019230 -1082153 -1166741 -1191964 -1177969 -958226 -375050 332247 746887 622213 -206772
40616 -206772 -1686510 -3086595 -3520713 -3279515 -3577766 -4437590 -4142104 -1738987 1240696
40607 1240696 2869008 3390177 4066058 4564089 3629847 1785042 1031908 1792653 2241730
40598 2241730 1174537 -226870 -228125 1193703 2655506 3000907 2148002 1056760 958684
40589 958684 1780375 1607546 -948122 -4118111 -4618726 -2108012 194923 130125 -438000
40580 -438000 1163305 4146472 5437457 4019921 1781104 456482 -42000 -148254 434367
40571 434367 1631225 2374721 2035856 1428859 1467803 1645454 893863 -556536 -1341486
40562 -1341486 -923408 -309294 -463167 -886452 -518225 465949 757205 -151680 -1059851
$$ packed form
40626a019230o2923q4588k5223J3995K19743N83176P07297M14640j24674q28985
40616b06772j479738j400085m34118K41198k98251q59824K95486K403117K979683
40607A240696J628312N21169O75881M98031r34242j844805p53134P60745M49077
40598B241730j067193j401407j255J421828J461803L45401q52905j091242r8076
40589I58684Q21691j72829k555668l169989n00615K510714K302935o4798n68125
40580d38000J601305K983167J290985j417536k238817j324622m98482j06254N82621
40571D34367J196858P43496l38865o06997L8944J77651p51591j450399p84950
40562a341486M18078O14114j53873m23285L68227R84174K91256r08885r08171
$$ plain form
40553 -1059851 -563973 1138714 2580312 2799959 2110859 1213504 227747 -1154702 -2851749
40544 -2851749 -3968729 -3381564 -1071309 1191352 1251122 -941649 -2979480 -2803452 -1152826
40535 -1152826 -260114 -726669 -1067510 -213647 982939 1145895 216168 -683731 -628155
40526 -628155 287428 1205582 1511457 1730047 2945245 4876662 5403549 3083639 -602615
40517 -602615 -2956123 -3369556 -3193416 -2901923 -1754807 -194834 138358 -584208 -12516
40508 -12516 2621712 4907852 4941172 4154598 4473852 4937603 3743239 1825053 1370257
40499 1370257 1976964 1478641 -34269 -282729 1106835 1719262 208948 -1671239 -1890420
40490 -1890420 -722797 577879 1669467 2433836 2142914 767869 -148506 698994 2590276
$$ packed form
40553a059851M95878J702687J441598K19647o89100q97355r85757j382449j697047
40544b851749j116980N87165K310255K262661N9770k192771k037831J76028J650626
40535a152826Q92712m66555l40841Q53863J196586J62956r29727q99899N5576
40526f28155R15583R18154L05875K18590J215198J931417N26887k319910l686254
40517f02615k353508m13433J76140K91493J147116J559973L33192p22566N71692
40508a2516K634228K286140L3320p86574L19254M63751j194364j918186m54796
40499A370257O06707m98323j512910k48460J389564O12427j510314j880187k19181
40490a890420J167623J300676J091588P64369k90922j375045r16375Q47500J891282
$$ plain form
40481 2590276 3858094 3864834 2972917 1558479 180437 -149462 848285 1845258 1449709
40472 1449709 240716 41114 1313854 2475512 2005784 276861 -1213784 -1850645 -2466429
40463 -2466429 -3916089 -5588203 -5811667 -3768598 -543189 2019555 3074632 2956160
40455 2956160 2116686 778501 -489934 -816815 28540 1260049 1866468 1491706 589287
40446 589287 13108 203715 449916 -480492 -2428936 -3443153 -2367874 -974755 -1847047
40437 -1847047 -4625039 -6324356 -5354020 -3164174 -1581306 -651358 70046 102006 -834490
40428 -834490 -1842302 -2258810 -2695520 -3504512 -3620009 -2289521 -668135 -205618 -588555
40419 -588555 -782478 -954129 -1654893 -2159808 -1559045 -693181 -979449 -1927454 -1940447 -1165421
$$ packed form
40481B590276J267818O740q91917j414438j378042l29899R97747R96973l95549
40472A449709j208993j99602J272740J161658m69728j728923j490645o36861o15784
40463b466429j449660j672114k23464K043069L225409K562744J055077j18472
40455B956160q39474j338185j268435l26881Q45355J231509O06419l74762r02419
40446E89287n76179J90607K46201r30408j948444j014217J075279J393119q72292
40437a847047k777992j699317R70336K189846J582868R29948P21404L1960r36496
40428h34490j007812m16508m36710q08992j15497J330488J621386M62517l82937
40419e88555j93923j71651p00764n04915O00763Q65864k86268r48005j2993P75026
$$ plain form
40409 -1165421 -1266619 -2438516 -2969511 -2122504 -1274949 -1530685 -2146762 -2206148 -2117692 -2400661
40399 -2400661 -2472616 -1837865 -1281839 -1661338 -2430432 -2506968 -1830891 -1003630 -132874 813483
40389 813483 1142243 229524 -1135733 -1454365 -511455 435653 533891 309309 443085 577918
40379 577918 28990 -979683 -1652625 -1911710 -2437018 -3337805 -3681365 -2858695 -1717329
40370 -1717329 -1470821 -1855803 -1460596 78246 1335132 981536 -543330 -1882339 -2482958
40361 -2482958 -2716072 -2914211 -3074364 -3018804 -2223637 -177112 2364472 3367387 1852167
40352 1852167 -533506 -1521119 -1076310 -798207 -1162310 -1188107 -485785 336273 1208790
40343 1208790 2487473 3201802 1714170 -1295895 -2813562 -1542956 91001 -564812
$$ packed form
40409a165421j01198j171897n30995Q47007Q47555k55736o16077n9386Q8456k82969
40399b400661p1955O34751N56026l79499p69094p6536O76077Q27261Q70756R46357
40389H13483L28760r12719j365257l18632R42910R47108R8238k24582J33776J34833
40379E77918n48928j008673o72942k59085n25308r00787l43560Q22670J141366
40370a717329K46508l84982L95207J538842J256886l53596j524866j339009o00619
40361b482958k33114j98139j60153N5560P95167K046525K541584J002915j515220
40352A852167k385673r87613M44809K78103l64103k5797P02322Q22058Q72517
40343A208790J278683P14329j487632l010065j517667J270606J633957o55813
$$ plain form
40335 -564812 -2694272 -3567710 -2418235 -837790 -158356 -245098 -444412 -237609 752604
40326 752604 2248285 3183672 3008388 2491670 2320366 1840688 404276 -1052554 -1351932
40317 -1351932 -1148308 -1838385 -2991527 -2853214 -1170358 439397 944956 857608 582674
40308 582674 -294642 -1633650 -2357778 -2064003 -1567829 -1305296 -631176 688645 1711756
40299 1711756 1789714 1518225 1450327 1081672 -42519 -1307515 -1948290 -2001290 -1645177 -706322
40289 -706322 437600 706646 8213 -166647 1050957 2334535 2136206 1091480 841560
40280 841560 1377847 1397674 733106 505380 1041713 1448489 1345683 1372117 1709642 1636119
40270 1636119 961783 521631 686357 603726 -414113 -1744344 -2369151 -2159544 -1670871
$$ packed form
40335e64812k129460q73438J149475J580445O79434q6742j99314K06803R90213
40326G52604J495681R35387j75284n16718j71304m79678j436412j456830k99378
40317a351932K03624o90077j153142J38313J682856J609755N05559q7348k74934
40308E82674q77316j339008p24128K93775M96174K62533O74120J319821J023111
40299A711756P7958k71489o7898l68655j124191j264996o40775n3000L56113R38855
40289g06322J143922K69046o98433j74860J217604J283578j98329j044726k49920
40280H41560N36287J9827o64568k27726N36333M06776j02806K6434L37525p3523
40270A636119o74336m40152J64726q2631j017839j330231o24807K09607M88673
$$ plain form
40261 -1670871 -1329210 -1310406 -1631393 -1972375 -1951613 -1773047 -1917081 -2075367 -1333072 305136
40251 305136 1581989 1608727 803425 -273438 -1806345 -3594873 -4209314 -2620547 -35409
40242 -35409 1240115 557760 -529577 -397195 873222 1885264 1498040 4097 -1017652
40233 -1017652 -391300 980064 1011917 -591204 -1558587 -219526 1918561 2336121 1089416
40224 1089416 167812 91853 -329977 -1147259 -987290 -184 -227929 -2017449 -2812794
40215 -2812794 -1154218 637428 6991 -1716626 -1518412 496228 1616238 1027106 510392
40206 510392 759038 335551 -995880 -1032166 1277184 3565207 3355909 1695970 1232241
40197 1232241 2050124 1957832 290584 -1126198 -1028158 -541959 -1092244 -2015436 -1490695
$$ packed form
40261a670871L41661J8804l20987l40982K0762J78566j44034j58286P42295J638208
40251C05136J276853K6738q05302j076863j532907j788528o14441J588767K585138
40242c5409J275524o82355j087337J32382J270417J012042l87224j493943j021749
40233a017652O26352J371364L1853j603121r67383J339061K138087M17560j246705
40224A089416r21604p5959m21830q17282J59969R87106k27745j789520p95345
40215b812794J658576J791646o30437j723617J98214K014640J120010n89132n16714
40206E10392K48646m23487j331431l6286K309350K288023k09298j659939m63729
40197A232241Q17883r2292j667248j416782R8040M86199n50285r23192N24741
$$ plain form
40188 -1490695 864863 3409174 4335300 3425797 1870626 749933 6032 -1019663 -2271158
40179 -2271158 -2730642 -1752441 -166807 554642 26204 -826617 -1214105 -1389729 -1891426
40170 -1891426 -2596848 -3058619 -3314290 -3703163 -4057415 -3755806 -2705670 -1721156 -1576171
40161 -1576171 -1993595 -1972924 -976638 584054 1915435 2370721 1429428 -1050869 -4048453
40152 -4048453 -5488825 -4124858 -1226319 520171 9402 -1187870 -1087214 195900
40144 195900 925940 124521 -1533789 -2963493 -3718007 -3643850 -2541937 -792494 412301
40135 412301 311819 -312784 -171129 538526 257533 -1491850 -2929898 -2276334 -474162
40126 -474162 -203375 -2154421 -3778283 -2522683 754133 2778010 1786446 -696706 -1932324
$$ packed form
40188a490695K355558K544311R26126r09503j555171j120693p43901j025695j251495
40179b271158m59484R78201J585634P21449n28438q52821l87488j75624n01697
40170a891426p05422m61771k55671l88873l54252L01609J050136R84514J44985
40161a576171m17424K0671R96286J560692J331381M55286r41293k480297k997584
40152d048453j440372J363967K898539J746490n10769j197272J00656J283114
40144A95900P30040q01419j658310j429704p54514P4157J101913J749443J204795
40135D12301j00482o24603J41655P09655k80993j749383j438048O53564J802172
40126d74162K70787j951046j623862J255600L276816K023877r91564k483152j235618
$$ plain form
40117 -1932324 -811113 1507317 2955795 2282228 74796 -1600042 -1052579 1271856
40109 1271856 3240086 3343778 2144581 1323036 1776609 2862065 3177090 1968423 -501
40100 -501 -1099968 -668767 156412 35311 -633906 -394137 943263 1977837 1777714 898117
40090 898117 106781 -484228 -615052 228534 1416970 1254677 -535802 -1911996 -1338340
40081 -1338340 -57849 6090 -725038 -472329 891049 1914100 2015832 1756265 1072435
40072 1072435 -578910 -2417321 -2808858 -1718882 -778092 -742498 -849946 -885273 -1649257
40063 -1649257 -2816783 -2629252 -766024 523163 -518699 -2662990 -3620938 -2915298 -1424913
40054 -1424913 416392 2271525 2963204 1695958 -557883 -2373380 -3689940 -4840906
$$ packed form
40117a932324J121211K318430J448478o73567k207432j674838N47463K324435
40109A271856J968230J03692j199197q21545M53573J085456L15025j208667j968924
40100e01j099467M31201Q25179j21101o69217K39769J337400J034574k00123q79597
40090H98117p91336n91009j30824Q43586J188436j62293j790479j376194N73656
40081a338340J280491O3939p31128K52709J363378J023051J01732k59567o83830
40072A072435j651345j838411l91537J089976R40790L5594j07448l5327p63984
40063a649257j167526J87531J863228J289187j041862k144291r57948P05640J490385
40054a424913J841305J855133O91679j267246k253841j815497j316560j150966
$$ plain form
40046 -4840906 -4896008 -2996441 -615372 -213432 -1777699 -2810726 -1974404 -781196 -1078363
40037 -1078363 -2505176 -3326222 -2667227 -1122120 132336 305704 -337804 -561914 440070
40028 440070 1716005 1508640 -426778 -2500524 -3412397 -3415776 -3162618 -2617745 -1817905
40019 -1817905 -1528056 -2132776 -2696034 -2151635 -838430 129742 525278 993088 1725956
40010 1725956 2292299 2689625 3388316 4078984 3482477 1079726 -1701705 -2887145 -2249756
40001 -2249756 -1440435 -1887259 -3283359 -4319716 -4261232 -3400491 -2443859 -1998330 -2383254
39992 -2383254 -3369568 -4199050 -4294996 -3779332 -2883372 -1320737 910876 2501918 1920042
39983 1920042 -388627 -2244062 -2542265 -2387302 -2775744 -2785428 -1353647 554500 1354857
$$ packed form
40046d840906n5102J899567K381069M01940j564267j033027Q36322J193208k97167
40037a078363j426813q21046O58995J545107J254456J73368o43508k24110J001984
40028D40070J275935k07365j935418k073746r11873l379K53158N44873P99840
40019a817905K89849o04720n63258N44399J313205R68172L95536M67810P32868
40010A725956N66343L97326O98691O90668n96507k402751k781431j185440O37389
40001b249756Q09321m46824j396100j036357N8484Q60741R56632M45529l84924
39992b383254r86314q29482r5946N15664Q95960J562635K231613J591042n81876
39983A920042k308669j855435k98203J54963l88442r684J431781J908147Q00357
$$ plain form
39974 1354857 1468035 2469512 4084791 4251274 2321088 157932 -538068 -279892 -411966
39965 -411966 -1163531 -1988419 -2636801 -2951596 -2579139 -1741278 -1407641 -1913635 -2320152 -1964256
39955 -1964256 -1670129 -2400115 -3574707 -3936603 -3455814 -3139896 -3363390 -3581154 -3447308
39946 -3447308 -3061389 -2195549 -397147 1963853 3590802 3467083 1736538 -546942 -2104391
39937 -2104391 -2161537 -1162920 -571404 -1324366 -2702407 -3334638 -2955038 -2374517 -2103511
39928 -2103511 -2020725 -2146696 -2570138 -2681477 -1751882 -406203 -171230 -1143096 -1451179
39919 -1451179 168068 2383574 2890408 1261723 -845877 -1787884 -1215650 319679 1927891
39910 1927891 2618931 1945743 567627 -435706 -784970 -934310 -963444 -427747 605111
$$ packed form
39974A354857J13178J001477J615279J66483j930186k163156o96000K58176j32074
39965d11966p51565q24888o48382l14795L72457Q37861L33637n05994m06517L55896
39955a964256K94127p29986j174592l61896M80789L15918k23494k17764J33846
39946c447308L85919Q65840J798402K361000J626949j23719j730545k283480j557449
39937b104391n7146R98617N91516p52962j378041o32231L79600N80521K71006
39928b103511Q2786j25971m23442j11339R29595J345679K34973r71866l08083
39919a451179J619247K215506N06834j628685k107600r42007N72234J535329J608212
39910A927891O91040o73188j378116j003333l49264j49340k9134N35697J032858
$$ plain form
39901 605111 1297968 1193008 856581 888283 935845 332782 -733739 -1382952 -1142635 -317416
39891 -317416 542282 968350 582945 -498921 -1292146 -709113 1087753 2680807 2964647
39882 2964647 2189564 1255832 634255 371505 506767 860561 879834 364296 -20453 337656
39872 337656 893624 606850 -465417 -1160205 -831062 -85647 284326 274319 273474 465807
39862 465807 966460 1801245 2345472 1584735 -464461 -2283137 -2488278 -1378570 -197457
39853 -197457 476971 762985 578984 -87954 -400496 496062 1894024 2091239 742737
$$ packed form
39901F05111O92857j04960l36427L1702M7562o03063j066521o49213K40317Q25219
39891c17416Q59698M26068l85405j081866p93225N83033J796866J593054K83840
39882B964647p75083r33732o21577k62750J35262L53794J9273n15538l84749L58109
39872C37656N55968k86774j072267o94788L29143P45415L69973j0007q45J92333
39862D65807N00653Q34785N44227p60737k049196j818676k05141J109708J181113
39853a97457O74428K86014j84001o66938l12542Q96558J397962J97215j348502
$$ [...]
##END NTUPLES=NMR SPECTRUM
##END=
