##TITLE=31Pdec_SR77_kr
 CDCl3, 124 sc
 29.09.2021
##JCAMPDX= 6.0         $$ Bruker NMR JCAMP-DX V2.0
##DATA TYPE= NMR SPECTRUM
##DATA CLASS= NTUPLES
##ORIGIN= UXNMR, Bruker Analytische Messtechnik GmbH
##OWNER= root
$$ XWIN-NMR		Version 3.5
$$ Wed Sep 29 12:35:26 2021 Russian Standard Time (UT+4h)  she@DPX200
##.OBSERVE FREQUENCY= 81.013821
##.OBSERVE NUCLEUS= ^31P
##.ACQUISITION MODE= SIMULTANEOUS
##.ACQUISITION SCHEME= undefined
##.AVERAGES= 124
##.DIGITISER RES= 16
##SPECTROMETER/DATA SYSTEM= spect
##.PULSE SEQUENCE= zgpg30
##.SOLVENT NAME= D2O
##.SHIFT REFERENCE= (INTERNAL, D2O, 0, 248.564)
##AUDIT TRAIL= $$ (NUMBER, WHEN, WHO, WHERE, WHAT)
$$ ##TITLE= Audit trail, XWIN-NMR		Version 3.5
$$ ##JCAMPDX= 5.01
$$ ##ORIGIN= Bruker BioSpin GmbH
$$ ##OWNER= she
$$ F:/spectra/data/she/nmr/P31/1/pdata/1/auditp.txt
$$ ##AUDIT TRAIL=  $$ (NUMBER, WHEN, WHO, WHERE, WHAT)
(   1,<2021-09-29 12:33:17.56 +0400>,<she>,<DPX200>,
      <continue with go, POWCHK disabled, PULCHK disabled
       configuration hash MD5:
       00 E9 B6 7A A2 85 ED C7 34 08 36 98 17 FE 4E 26
       data hash MD5: 32K
       C5 12 47 38 51 55 9F FB A6 20 DF B9 E1 68 B2 6A>)
(   2,<2021-09-29 12:33:19.95 +0400>,<she>,<DPX200>,
      <Start of raw data processing
       efp BC_mod = 2 LB = 1 FT_mod = 6 PKNL = 1 PHC0 = -9052.494 PHC1 = 705.4691 SI = 64K 
       data hash MD5: 64K
       BC E3 15 FA 7E 29 64 92 3B A1 92 BB 29 3E DD CB>)
(   3,<2021-09-29 12:33:51.15 +0400>,<she>,<DPX200>,
      <pk PHC0 = -49.45317 PHC1 = 19.80001 
       data hash MD5: 64K
       5B 9E 35 1B 3E D8 E7 EB D7 98 4D EB 97 6E 87 F8>)
(   4,<2021-09-29 12:33:54.04 +0400>,<she>,<DPX200>,
      <abs ABSG = 5 
       data hash MD5: 64K
       1D 32 AD 9D 67 C4 F0 29 B6 C9 51 1D C6 92 D2 EB>)
(   5,<2021-09-29 12:34:34.96 +0400>,<she>,<DPX200>,
      <pk PHC0 = 79.12765 PHC1 = -94.20003 
       data hash MD5: 64K
       E3 39 B0 08 4D C9 59 44 A9 BB 21 50 88 05 4F BF>)
$$ ##END=
$$ 
$$ hash MD5
$$ 3C CB 72 E2 39 BA 0D CF 56 14 BE FB 25 6A 70 9F
##$RELAX= 
##$RELAX= 
##$RELAX= 
##$RELAX= 
##$RELAX= 
##$RELAX= 
##$RELAX= 
##$RELAX= 
$$ Bruker specific parameters
$$ --------------------------
##$DU= <F:/spectra>
##$EXPNO= 1
##$NAME= <P31>
##$PROCNO= 1
##$TYPE= <nmr>
##$USER= <she>
##$AMP= (0..31)
100 100 100 100 100 100 100 100 100 100 100 100 100 100 100 100 100 100 
100 100 100 100 100 100 100 100 100 100 100 100 100 100 
##$AQSEQ= 0
##$AQ_mod= 1
##$AUNM= <au_zg>
##$AUTOPOS= <>
##$BF1= 81.014009
##$BF2= 200.13
##$BF3= 200.13
##$BF4= 200.13
##$BF5= 200.13
##$BF6= 200.13
##$BF7= 200.13
##$BF8= 200.13
##$BYTORDA= 1
##$CFDGTYP= 0
##$CFRGTYP= 5
##$CHEMSTR= <none>
##$CNST= (0..31)
1 1 145 1 1 1 1 1 1 1 1 1 1 1 1 1 1 1 1 1 1 1 1 1 1 1 1 1 1 1 1 1 
##$CPDPRG= <waltz16>
##$CPDPRG1= <>
##$CPDPRG2= <waltz16>
##$CPDPRG3= <>
##$CPDPRG4= <mlev>
##$CPDPRG5= <mlev>
##$CPDPRG6= <mlev>
##$CPDPRG7= <mlev>
##$CPDPRG8= <mlev>
##$CPDPRGB= <>
##$CPDPRGT= <>
##$D= (0..31)
$$ [...]
##$SUBNAM3= <"">
##$SUBNAM4= <"">
##$SUBNAM5= <"">
##$SUBNAM6= <"">
##$SUBNAM7= <"">
##$SUBNAM8= <"">
##$SUBNAM9= <"">
##$SW= 501.771253377433
##$SWIBOX= (0..15)
0 1 3 0 0 0 0 0 0 0 0 0 0 0 0 0 
##$SW_h= 40650.406504065
##$TD= 32768
##$TD0= 1
##$TE= 0
##$TE2= 300
##$TE3= 300
##$TEG= 300
##$TL= (0..7)
0 120 53 12 22 120 120 120 
##$TP= (0..7)
150 150 150 150 150 150 150 150 
##$TP07= 0
##$TPNAME0= <>
##$TPNAME1= <>
##$TPNAME2= <>
##$TPNAME3= <>
##$TPNAME4= <>
##$TPNAME5= <>
##$TPNAME6= <>
##$TPNAME7= <>
##$TPOAL= (0..7)
0.5 0.5 0.5 0.5 0.5 0.5 0.5 0.5 
##$TPOFFS= (0..7)
0 0 0 0 0 0 0 0 
##$TUNHIN= 0
##$TUNHOUT= 0
##$TUNXOUT= 0
##$USERA1= <user>
##$USERA2= <user>
##$USERA3= <user>
##$USERA4= <user>
##$USERA5= <user>
##$V9= 5
##$VALIST= <valist>
##$VCLIST= <CCCCCCCCCCCCCCC>
##$VD= 0
##$VDLIST= <DDDDDDDDDDDDDDD>
##$VPLIST= <PPPPPPPPPPPPPPP>
##$VTLIST= <TTTTTTTTTTTTTTT>
##$WBST= 1024
##$WBSW= 4
##$XGAIN= (0..3)
0 0 0 0 
##$XL= 0
##$YL= 0
##$YMAX_a= 2399
##$YMIN_a= -11265
##$ZGOPTNS= <>
##$ZL1= 120
##$ZL2= 120
##$ZL3= 120
##$ZL4= 120
##$ABSF1= 248.5645
##$ABSF2= -253.2056
##$ABSG= 5
##$ABSL= 3
##$ALPHA= 0
##$AQORDER= 0
##$ASSFAC= 0
##$ASSFACI= 0
##$ASSFACX= 0
##$ASSWID= 0
##$AUNMP= <proc_1d>
##$AZFE= 0.1
##$AZFW= 0.5
##$BCFW= 0
##$BC_mod= 2
##$BYTORDP= 0
##$COROFFS= 0
##$CY= -3
##$DATMOD= 1
##$DC= 0
##$DFILT= <>
##$DTYPP= 0
##$F1P= 0
##$F2P= 0
##$FCOR= 1
##$FTSIZE= 65536
##$FT_mod= 6
##$GAMMA= 0
##$GB= 0
##$INTBC= 1
##$INTSCL= 5.30512e-09
##$ISEN= 30
##$LB= 1
##$LEV0= 0
##$LPBIN= 0
##$MAXI= 10000
##$MC2= 0
##$MEAN= 0
##$ME_mod= 0
##$MI= 50
##$NCOEF= 0
##$NC_proc= -7
##$NLEV= 6
##$NOISF1= 182.463
##$NOISF2= 159.3651
##$NSP= 0
##$NTH_PI= 0
##$NZP= 0
##$OFFSET= 248.5645
##$PC= 4
##$PHC0= -9022.819
##$PHC1= 631.0691
##$PH_mod= 1
##$PKNL= yes
##$PPARMOD= 0
##$PSCAL= 0
##$PSIGN= 0
##$REVERSE= no
##$SF= 81.014009
##$SI= 65536
##$SIGF1= 159.3651
##$SIGF2= -187.1042
##$SINO= 113.3802
##$SIOLD= 16384
##$SREGLST= <1H.CDCl3>
##$SSB= 0
##$STSI= 65536
##$STSR= 0
##$SW_p= 40650.406504065
##$SYMM= 0
##$S_DEV= 0
##$TDeff= 32768
##$TDoff= 0
##$TI= <>
##$TILT= no
##$TM1= 0
##$TM2= 0
##$TOPLEV= 0
##$USERP1= <user>
##$USERP2= <user>
##$USERP3= <user>
##$USERP4= <user>
##$USERP5= <user>
##$WDW= 1
##$XDIM= 65536
##$YMAX_p= 469300391
##$YMIN_p= -23343878
$$ End of Bruker specific parameters
$$ ---------------------------------
##NTUPLES= NMR SPECTRUM
##VAR_NAME=  FREQUENCY,     SPECTRUM/REAL,   SPECTRUM/IMAG
##SYMBOL=    X,             R,               I
##VAR_TYPE=  INDEPENDENT,   DEPENDENT,       DEPENDENT
##VAR_FORM=  AFFN,          ASDF,            ASDF
##VAR_DIM=   65536,         65536,           65536
##UNITS=     HZ,            ARBITRARY UNITS, ARBITRARY UNITS
##FACTOR=    0.620285442955139, 1,           1
##FIRST=     20137.2065510759, 0,            0
##LAST=      -20513.1999529892, 0,           0
##MIN=       -20513.1999529892, -23343878,   0
##MAX=       20137.2065510759, 469300391,    0
$$ Real data points
##PAGE= N=1
##DATA TABLE= (X++(R..R)), XYDATA
$$ [...]
##PAGE= N=2
##DATA TABLE= (X++(I..I)), XYDATA
13027b873175l746330j33183J378017K171123L275371K352442j465050m296293
$$ -2873175 -6619505 -6752688 -5374671 -3203548 71823 2424265 959215 -3337078
13019c337078k529981J730762L372451Q09169k587303k794883N63751L846744
$$ -3337078 -5867059 -4136297 -763846 45323 -2541980 -5336863 -4773112 -926368
13011i26368L106226j127384l684729j200945K620952J642166l379840m879146
$$ -926368 2179858 1052474 -2632255 -3833200 -1212248 429918 -2949922 -7829068
13003g829068O55231O634509M817431l269919q058851m268851K930319N269857
$$ -7829068 -7173837 -539328 4278103 1008184 -7050667 -11319518 -8389199 -3119342
12995c119342J622339j795055k38838L613096L710877j170184n762159m986727
$$ -3119342 -1497003 -3292058 -3530896 82200 3793077 2622893 -3139266 -8125993
12987h125993m2269L684462L399387J427522J161246K552041K692941M8265l149815
$$ -8125993 -8168262 -4483800 -1084413 343109 1504355 4056396 6749337 6797602 3647787
12978C647787l273239J99354L533062K893283j058449m160169l979863k062156
$$ 3647787 374548 573902 4106964 7000247 5941798 1781629 -2198234 -4260390
12970d260390o86911K68376J843096L090487J746732k421912o247949n774343
$$ -4260390 -4947301 -4678925 -2835829 254658 2001390 -420522 -6668471 -12442814
12962a2442814n34812M968790N510952J552213q83167J449163L976695J494562
$$ -12442814 -12977626 -8008836 -2497884 -945671 -1828838 -379675 3597020 5091582
12954E091582k806883j947431K893014L366916k306752n625765j265580M337674
$$ 5091582 2284699 337268 3230282 6597198 4290446 -1335319 -2600899 1736775
12946A736775L591734m60139m05202L121533L708485K87158k322363k042575j244762
$$ 1736775 5328509 4868370 4463168 7584701 11293186 11580344 9257981 7215406 5970644
12937E970644j026460m46540l99627k080984k903416j25200L049744J713893j897466
$$ 5970644 4944184 4497644 4098017 2017033 -886383 -1011583 2038161 3752054 1854588
12928A854588j270258L451813N297372J520546k870227l693439k490230j441860
$$ 1854588 584330 4036143 9333515 10854061 7983834 4290395 1800165 358305
12920C58305k55812K86603j727493m252180k661793K254943M436983K222549N50173
$$ 358305 102493 389096 -1338397 -5590577 -8252370 -5997427 -1560444 662105 1212278
12911A212278J587618J285829j715655k275611J643772L748820l58633n128633
$$ 1212278 2799896 4085725 2370070 94459 1738231 5487051 5128418 -215
12903b15m014453J62824J385806R42603K934633M237626o88218p639242o387460
$$ -215 -4014668 -3851844 -2466038 -1523435 1411198 5648824 4960606 -2678636 -9066096
12894i066096L226701R331849M833737k863268l591990J428800L601493L46386
$$ -9066096 -5839395 3492454 8326191 5462923 1870933 3299733 6901226 7247612
12886G247612k879786k271933l82421j56290l2625K002026L575982J512164j968974
$$ 7247612 4367826 2095893 1713472 1557182 1524557 3526583 7102565 8614729 6645755
12877F645755j689374K208275L664498k76838m811921m462282m51703K588310
$$ 6645755 4956381 7164656 10829154 10552316 5740395 1278113 826410 3414720
12869C414720L343493K937046J014143k153116k961771K95143K638269m90143
$$ 3414720 6758213 9695259 10709402 8556286 5594515 5889658 8527927 8037784
12861H037784m523346k455555K425940Q91418n979434o913687J157867P197443
$$ 8037784 3514438 1058883 3484823 4376241 -1603193 -8516880 -7359013 -161570
12853a61570L551758k326574j290951K624097P74830m517328m526096O12242K905274
$$ -161570 3390188 1063614 -227337 2396760 3171590 -1345738 -5871834 -5259592 -2354318
12844b354318M87819n77054J735920K079022j812902m382345j388612L354256
$$ -2354318 -1866499 -2443553 -707633 1371389 -441513 -4823858 -6212470 -2858214
12836b858214M518815L048138K779918L213535Q46101l894302n894614k264933
$$ -2858214 1660601 4708739 7488657 10702192 11548293 7653991 1759377 -505556
12828e05556L284715N035383K544765M41122J100841J343875j464533l915646
$$ -505556 2779159 7814542 10359307 10800429 11901270 13245145 11780612 7864966
12820G864966j827458J697559O2422n796703p731423k874615K029564J687003
$$ 7864966 6037508 7735067 7797489 2000786 -5730637 -8605252 -6575688 -4888685
12812d888685j83005R95209K403263L14775j521507J806847O196207L782169l897068
$$ -4888685 -5071690 -4076481 -1673218 -1358443 -2879950 -1073103 5123104 8905273 5008205
12803E008205p077524k022383M011172L621305j461516m496391k566871J398577
$$ 5008205 -2069319 -4091702 -80530 3540775 2079259 -2417132 -4984003 -3585426
12795c585426L032255J270742n99471R26110M063318L168148k763097p123435
$$ -3585426 -553171 717571 118100 1044210 5107528 8275676 5512579 -1610856
12787a610856m566683J326887L856283K669814J733206J482752j23219j438931
$$ -1610856 -6177539 -4850652 -994369 1675445 3408651 4891403 4768184 3329253
12779C329253M56493K901984R24435l674693m462188j161312J03035k251846k939839
$$ 3329253 3785746 6687730 7612165 3937472 -524716 -1686028 -1582993 -3834839 -6774678
12770f774678o0527J360676p69147j007395L563128O655601K610067l526685l346488
$$ -6774678 -6835205 -5474529 -6243676 -7251071 -3687943 2967658 5577725 2051040 -1295448
12761a295448J894997L662243o15755m499344k864783J348666K682046P67690
$$ -1295448 599549 4261792 3646037 -853307 -3718090 -2369424 312622 1080312
12753A080312n35073Q10629K744653K548351N77847n16876L15754J104753j3469
$$ 1080312 545239 1355868 4100521 6648872 7226719 6709843 7025597 8130350 8116881
12744H116881j950689k515993j566184k32226J356376K846825K001327j925290
$$ 8116881 6166192 3650199 2084015 1851789 3208165 6054990 8056317 6131027
12736F131027m726900k156354K536247K045175l574765n813617l78870N899829
$$ 6131027 1404127 -752227 1784020 3829195 254430 -5559187 -5938057 -38228
12728c8228N273759K93749j348630R97657J325313k185055m160367q06960M256278
$$ -38228 5235531 5529280 4180650 5178307 6503620 4318565 158198 -648762 3607516
12719C607516N341759J918976k078811l625346k879809j533900q48012q46516
$$ 3607516 8949275 10868251 8789440 5164094 2284285 750385 -97627 -944143
12711i44143m94056R20433K351288J920016l65328j987510q39813J996769L293530
$$ -944143 -1438199 -517766 1833522 3753538 3388210 1400700 560887 2557656 5851186
12702E851186J218873k707773n067122l760330r9798K287259J237319j285853
$$ 5851186 7070059 4362286 -704836 -4465166 -4564964 -2277705 -1040386 -2326239
12694b326239j417105J394958L138533O59884l340688l559716L41791L105464
$$ -2326239 -3743344 -2348386 790147 1450031 -1890657 -5450373 -5108582 -2003118
12686b003118J557624r78942k12931K640439L376920J225899j234543k647320
$$ -2003118 -445494 -1424436 -1637367 1003072 4379992 5605891 4371348 1724028
12678A724028l068799j322398K853822N361896K278113k862416k954016J436022
$$ 1724028 -1344771 -2667169 186653 5548549 7826662 4964246 2010230 3446252
12670C446252K389881k367118n340060j661469K859456J699421j910538j570120
$$ 3446252 5836133 3469015 -1871045 -3532514 -673058 1026363 -884175 -2454295
12662b454295J555286K515331J809909K367173J882402k582467o172240k555925
$$ -2454295 -899009 1616322 3426231 5793404 7675806 5093339 -1078901 -3634826
12654c634826M079038M181172j686576m061008p38387Q11772j581764p65684N049242
$$ -3634826 444212 4625384 2938808 -1122200 -1860587 -1048815 -2630579 -3396263 1652979
12645A652979O913375Q72982l396409J476935P103963K892410o044758p455764
$$ 1652979 8566354 9439336 6042927 7519862 14623825 17516235 11471477 4015713
12637D015713j863428J90533l001191l060469J557196K268636l244516n102346
$$ 4015713 2152285 2342818 -658373 -3718842 -2161646 106990 -3137526 -8239872
12629h239872K377388R860231O760677k836193p215200l865200L61048J992857
$$ -8239872 -5862484 3997747 10758424 7922231 707031 -3158169 -2797121 -804264
12621h04264L798494O146113N010066j77761m486073n361968n705866o570680
$$ -804264 2994230 9140343 14150409 13972648 9486575 4124607 -1581259 -8151939
12613h151939l853449L388610P722601K984793n152246n911007J261484O103450
$$ -8151939 -12005388 -8616778 -894177 2090616 -3061630 -8972637 -7711153 -1607703
12605a607703K643224k905520k293770L108414N740960K990518o18236q93153
$$ -1607703 1035521 -1869999 -4163769 -1055355 4685605 7676123 7057887 6164734
12597F164734J172801K296487J243712q16470k398837l011468k951091k381168
$$ 6164734 7337535 9634022 10877734 10061264 7662427 4650959 1699868 -681300
12589f81300j026732P75172J459064J51928j260451j40414K872442M321675K699359
$$ -681300 -1708032 -932860 526204 678132 -582319 -722733 2149709 6471384 9170743
12580I170743M3293j689396k763559l346134k391832k26936R07599L13709l15905
$$ 9170743 9214036 7524640 4761081 1414947 -976885 -1203821 -296222 17487 -298418
12571b98418n99151k102111l923804k412677K428517N294816L428106R89157J828435
$$ -298418 -897569 -2999680 -6923484 -9336161 -6907644 -1612828 1815278 2804435 4632870
12562D632870L284351J987148M62720J912761L237487K69853m005527l957630
$$ 4632870 7917221 9904369 10367089 12279850 15517337 15787190 11781663 7824033
12554G824033p33597O06358L98750K330213M476998J770764l768724m977566j634690
$$ 7824033 7090436 7696794 8095544 10425757 14902755 16673519 12904795 7927229 6292539
12545F292539p10027l576972l289109K591410O355140K136170m622383n443757
$$ 6292539 5582512 2005540 -1283569 1307841 7662981 9799151 5176768 -266989
12537b66989n09033L432084K489068j573325m739857l887374N83166L920608K368411
$$ -266989 -776022 2656062 5145130 3571805 -1168052 -5055426 -4472260 -551652 1816759
12528A816759q95339m56253J702728p41836n836809m280042M465176Q457623J359344
$$ 1816759 921420 465167 2167895 1426059 -4410750 -8690792 -4225616 4232007 5591351
12519E591351o712738m721063K540765L754648n37519j213823K567936K923136
$$ 5591351 -1121387 -5842450 -3301685 452963 -84556 -1298379 1269557 4192693
12511D192693j831348m196931o79946K749666J305857j432397r44963Q87457O08886
$$ 4192693 2361345 -1835586 -2515532 234134 1539991 107594 -837369 50088 658974
12502F58974j59312J794980M568264L259720k270435o064590l335802L330209
$$ 658974 499662 2294642 6862906 10122626 7852191 1787601 -1548201 1782008
12494A782008O679292L139201l194371n800723l473419m73319K79211N16004K284546
$$ 1782008 8461300 11600501 8406130 2605407 -868012 -1341331 -1062120 -546116 1738430
12485A738430M025459L252061M51323k082099l228036k847260p63358K012936
$$ 1738430 5763889 9015950 9467273 7385174 4157138 1309878 546520 2559456
12477B559456L042052J351356j197803k693887l090000k473653n22882J225586
$$ 2559456 5601508 6952864 5755061 3061174 -28826 -2502479 -3025361 -1799775
12469a799775K78607k209617j944228J581289L425914R17227k158575k281078
$$ -1799775 -1521168 -3730785 -5675013 -4093724 -667810 249417 -1909158 -4190236
12461d190236j564726k228097j472046K540706M972243J503922l140028j696251
$$ -4190236 -5754962 -7983059 -9455105 -6914399 -1942156 -438234 -3578262 -5274513
12453e274513L797224N092340Q51533k036669q5328K252279J131946r54055o57687
$$ -5274513 -1477289 3615051 4466584 2429915 2344587 4596866 5728812 4774757 4117070
12444D117070P76608N90232j029830k097871j560047N79928L282568M014132J101651
$$ 4117070 4893678 5483910 4454080 2356209 796162 1376090 4658658 8672790 9774441
12435I774441l089240m228463j512558J702361K659725J616494l36601k677511
$$ 9774441 6685201 2456738 944180 2646541 5306266 6922760 6586159 3908648
12427C908648m469877m714464l825107k677655q82187J813149L712626L361654
$$ 3908648 -561229 -5275693 -9100800 -11778455 -12660642 -10847493 -7134867 -3773213
12419c773213K045692J469599R64888j13092J9983J915944K055607j623181m696156
$$ -3773213 -1727521 -257922 706966 593874 613857 2529801 4585408 2962227 -1733929
12410a733929k582748J262633N60945l003227k561156J872573L500214J007589
$$ -1733929 -4316677 -3054044 -2493099 -5496326 -8057482 -6184909 -2684695 -1677106
12402a677106P90889M875352O419668J412518l871068k747879J645452K343113
$$ -1677106 -886217 3989135 10408803 11821321 7950253 5202374 6847826 9190939
12394I190939p64058k772334k194482j177915j65861J690858K586666o7951m555887
$$ 9190939 8426881 5654547 3460065 2282150 2116289 3807147 6393813 6325862 1769975
12385A769975n969087k352488L125708N838456L745396j239701m597228l368469
$$ 1769975 -4199112 -6551600 -3425892 2412564 6157960 4918259 321031 -3047438
12377c047438J95979J289456p28704j618481Q39599L466413L143756J357088N82172
$$ -3047438 -2851459 -1562003 -2290707 -3909188 -3069589 396824 3540580 4897668 5479840
12368E479840J86680r10805j287771j23911L47827j045636j602900K45100J206380
$$ 5479840 5666520 4755715 3467944 3344033 3691860 2646224 1043324 1288424 2494804
12359B494804j162222l213541j114296J914530P71629k331913j442824K361581
$$ 2494804 1332582 -1880959 -2995255 -1080725 -309096 -2641009 -4083833 -1722252
12351a722252K151862l073130o088740k506103L267178N677112N079576L949464
$$ -1722252 429610 -2643520 -8732260 -11238363 -7971185 -2294073 2785503 6734967
12343F734967J893596j613540m191347m114950l001979j740384J727302O808217
$$ 6734967 8628563 7015023 2823676 -1291274 -4293253 -6033637 -4306335 2501882
12335B501882P614617J436501m602977k464687M225344M752693k565980p805369
$$ 2501882 10116499 11553000 6950023 4485336 8710680 13463373 10897393 3092024
12327C092024m546525J096856Q90899l179763l422225J285492M982919M422409
$$ 3092024 -1454501 -357645 533254 -2646509 -6068734 -4783242 199677 4622086
12319D622086K459737J665555P07342j331057k038263K16693K703242J834712
$$ 4622086 7081823 8747378 9454720 8123663 6085400 6302093 9005335 10840047
12311A0840047j763469m290605l713686j503682M9208N40749J257054K965989
$$ 10840047 9076578 4785973 1072287 -431395 -382187 158562 1415616 4381605
12303D381605M348198L292245K4369k537830k813815k968920m830933n617541
$$ 4381605 8729803 12022048 12046417 9508587 6694772 3725852 -1105081 -6722622
12295f722622j945784L425533M578969J957331K118818O485356P835234J824319
$$ -6722622 -8668406 -5242873 -663904 1293427 3412245 9897601 17732835 19557154
12287A9557154n207471n845023k754008k666149m349510j932759K952378K934058
$$ 19557154 14349683 8504660 5750652 3084503 -1265007 -3197766 -245388 2688670
12279B688670j837634k923307K205422N475276J523775l668512l096935L70897
$$ 2688670 851036 -2072271 133151 5608427 7132202 3463690 366755 737652
12271G37652N34941j171625M11270L729561K893222j700672l730245j448011K79089
$$ 737652 1272593 100968 512238 4241799 7135021 5434349 1704104 256093 535182
12262E35182o83327j14364M123938O745147K647883m665729p332155l433097J457341
$$ 535182 -148145 -262509 3861429 10606576 13254459 8588730 1256575 -2176522 -719181
12253g19181K105900p77075k923458j765648J449736L413905K197934n27601j209667
$$ -719181 1386719 609644 -2313814 -4079462 -2629726 784179 2982113 2454512 1244845
12244A244845J066770L037057J590361j736543k892107j088708N00970j66098
$$ 1244845 2311615 5348672 6939033 5202490 2310383 1221675 1722645 1556547
12236A556547j482066j731458j856649k707951k592124m31353J383607J014491
$$ 1556547 74481 -1656977 -3513626 -6221577 -8813701 -9245054 -7861447 -6846956
12228f846956J420531N388500Q274030K963782p591781j1170743l037382O027121
$$ -6846956 -5426425 -37925 8236105 11199887 3608106 -7562637 -10600019 -4572898
12220d572898M650641k921985m390009J428939M146266m71047m176181o32440
$$ -4572898 77743 -2844242 -7234251 -5805312 -1659046 -2130093 -6306274 -6938714
12212f938714M495786L811435J5389l54667J390603j66971l266152j523710L759551
$$ -6938714 -2442928 1368507 1383896 1029229 2419832 2252861 -1013291 -2537001 1222550
12203A222550M177488j780236n119442l02997N856966M943410m65626k265677
$$ 1222550 5400038 3619802 -1499640 -1802637 4054329 8997739 8532113 6266436
12195F266436J43541Q15500j413906j592160J417815K270246j433125m512718
$$ 6266436 6409977 7225477 5811571 4219411 5637226 7907472 6474347 1961629
12187A961629k666066P02535P64443q27673R5580K391349K125151K60839R41244
$$ 1961629 -704437 -1902 762541 -65132 30448 2421797 4546948 4807787 5749031
12178E749031L218184J578477m626965q760240n963709N62273M784956M927429
$$ 5749031 8967215 10545692 5918727 -2841513 -8805222 -8242949 -3457993 1469436
12170A469436K770364o4232k064329j355020J579928L240323J823873P783M14282
$$ 1469436 4239800 4175568 2111239 756219 2336147 5576470 7400343 7408126 7822408
12161G822408J168437p07731l856223m332621j409953J811916K791379J680654
$$ 7822408 8990845 8283114 4426891 94270 -1315683 496233 3287612 4968266
12153D968266j87955j433835r54023O93846J053313j161850l852024m240963k422164
$$ 4968266 4780311 3346476 2392453 3086299 4139612 2977762 -874262 -5115225 -7537389
12144g537389k80104J395388K405610J626546j054800k711827n18802L813575
$$ -7537389 -7817493 -6422105 -4016495 -2389949 -3444749 -6156576 -6675378 -2861803
12136b861803N673319L253838p83286k909486j896253R86695K982246J805353
$$ -2861803 2811516 6065354 5282068 2372582 476329 1463024 4445270 6250623
12128F250623j651454l555021j662684J728916K906940J057735k091919m614477
$$ 6250623 4599169 1044148 -618536 1110380 4017320 5075055 2983136 -1631341
12120a631341m559865p87202L924179M020332j233089m875784j307496N216060
$$ -1631341 -6191206 -6978408 -3054229 966103 -266986 -5142770 -6450266 -1234206
12112a234206O564518K291640j288942j637397k130812l953038l569997q5183
$$ -1234206 5330312 7621952 6333010 4695613 2564801 -1388237 -4958234 -5043417
12104e043417J698856j139729m231008k074702L827348O928842M001338j542604
$$ -5043417 -3344561 -4484290 -8715298 -10790000 -6962652 -33810 3967528 2424924
12096B424924m107162j738782K588589M696313L598831J463913k53734k176065
$$ 2424924 -1682238 -3421020 -832431 3863882 7462713 8926626 8672892 6496827
12088F496827l979038l408576j78708K530997K848636K807379L482624K132486
$$ 6496827 2517789 -890787 -1069495 1461502 4310138 7117517 10600141 12732627
12080A2732627k007176m239720j917165j02427l101992n712930j409078N407851
$$ 12732627 10725451 6485731 4568566 4466139 1364147 -4348783 -5757861 -350010
12072c50010N513883j60182k896759j297602j616197l827424j113907N252000
$$ -350010 5163873 5003691 2106932 809330 -806867 -4634291 -5748198 -496198
12064d96198M877459l690358p836110n66652P513019M913095l116583m447855
$$ -496198 4381261 690903 -7145207 -7711859 -198840 4714255 1597672 -2850183
12056b850183J038953M041667J460556j789044k985053l603120l351738p62321
$$ -2850183 -1811230 2230437 3690993 1901949 -1083104 -4686224 -8037962 -8800283
12048h800283J967379J922991J241036L316534N672557L328843k838996p408300
$$ -8800283 -6832904 -4909913 -3668877 -352343 5320214 8649057 5810061 -1598239
12040a598239p922862n358631p1829O427301Q877298M529765p80070j77004L379818
$$ -1598239 -9521101 -14879732 -14951561 -8524260 353038 4882803 4102733 3925729 7305547
12031G305547J893069m234020o686910k506805K192854K560989Q37934K87006
$$ 7305547 9198616 4964596 -1722314 -4229119 -2036265 524724 1362658 1649664
12023A649664N51787R02810J793718J720434j446608n018874l845205Q21043J899586
$$ 1649664 2201451 3104261 4897979 6618413 5171805 152931 -3692274 -2871231 -971645
12014i71645k253233m610198n88645M727921M823827J052679j378957j640940
$$ -971645 -3224878 -7835076 -8423721 -3695800 1128027 2180706 801749 -839191
12006h39191j927299j796169L23136K500637J649846r22109j034677K135468N324744
$$ -839191 -2766490 -4562659 -4239523 -1738886 -89040 -1011149 -2045826 89642 5414386
11997E414386N916052L795871n41767n720281p870526l887775K994620N228759
$$ 5414386 11330438 15126309 14584542 8864261 993735 -2894040 100580 5329339
11989E329339L70794n253402m929764l19696J966554K05893j108703P96998L312397
$$ 5329339 5700133 446731 -4483033 -4802729 -2836175 -2630282 -3738985 -2941987 370410
11980C70410M045444M568880N517248L286531l267481p384995k919053M481193
$$ 370410 4415854 8984734 14501982 17788513 14521032 7136037 4216984 8698177
11972H698177L546287n684338j0816113n243526K449697K438501j795359r17775
$$ 8698177 12244464 6560126 -4255987 -9499513 -7049816 -4611315 -6406674 -7324449
11964g324449M629008O267978J569640k713525j750825J246218J404186j349997
$$ -7324449 -2695441 3572537 5142177 2428652 677827 1924045 3328231 1978234
11956A978234l901716l750392l22318M062441M859991O70741l199259j212446
$$ 1978234 -1923482 -5673874 -5996192 -1933751 2926240 3596981 397722 -814724
11948h14724L674515L732412j616086m613140j053016L724673L625917L78673
$$ -814724 2859791 6592203 4976117 362977 -690039 3034634 6660551 7039224
11940G039224q22009O05518J604172J111297J27111j453981l810098m754767k435288
$$ 7039224 6217215 6822733 8426905 9538202 9665313 8211332 4401234 -353533 -2788821
11931b788821P35983Q80435j260338j211850J971344L571551J72924m657918m860125
$$ -2788821 -2052838 -1172403 -2432741 -3644591 -1673247 1898304 2071228 -2586690 -7446815
11922g446815k06769L663464L294831J407119J304440J277990j619085m881376
$$ -7446815 -7653584 -3990120 -695289 711830 2016270 3294260 1675175 -3206201
11914c206201l174565K720492N538105J893096k490800j409031K666004L073805
$$ -3206201 -6380766 -3660274 1877831 3770927 1280127 -128904 2537100 5610905
11906E610905o67432l032573j725273o08329k670059n205312m166680J27703M051631
$$ 5610905 4943473 1910900 185627 -422702 -3092761 -8298073 -12464753 -12337050 -8285419
11897h285419N357488M625556L154043J455021k6174j31287J672355L224854J041433
$$ -8285419 -2927931 1697625 4851668 6306689 6280515 6149228 7821583 11046437 12087870
11888A2087870m526481p540187l399251L750489N494502R31510k176919M63812
$$ 12087870 7561389 21202 -3378049 372440 5866942 6798452 4621533 5085345
11880E085345L453391J415776j952376p64764K610516J721457k872064m781997
$$ 5085345 8538736 9954512 8002136 7237372 9847888 11569345 8697281 3915284
11872C915284k254499K99451M68565K59538M96003l06292j209735M09606K984471
$$ 3915284 1660785 1960236 2428801 2688339 3184342 2878050 1668315 2077921 5062392
11863E062392K184839j225378j883440P59289R09140l469252o342429l030235
$$ 5062392 7247231 6021853 4138413 4897702 5806842 2337590 -4004839 -7035074
11855g035074K424248L787662J414558k39258J37173O80468P17441R60112J320258
$$ -7035074 -4610826 -823164 591394 352136 489309 1169777 1887218 2847330 4167588
11846D167588J713041L056041M883370M309267L7229m836393o662948n844210
$$ 4167588 5880629 8936670 13820040 18129307 18166536 13330143 6667195 822985
11838H22985n103872n110331m375888k063259J205696M105118M856274K546854
$$ 822985 -4280887 -9391218 -13767106 -15830365 -14624669 -10519551 -5663277 -3116423
11830c116423o06986p15918K482966M392607J758649k389828k831120O01535L062527
$$ -3116423 -3723409 -4439327 -1956361 2436246 4194895 1805067 -1026053 -424518 2638009
11821B638009J355180k319388l739994j850160O56254J351105J173683K356849
$$ 2638009 3993189 1673801 -2066193 -3916353 -3260099 -1908994 -735311 1621538
11813A621538M131936L218315p67702l699597k791457o90371n74618o99058J606945
$$ 1621538 5753474 8971789 8204087 4504490 1713033 1022662 448044 -251014 1355931
11804A355931L766103J813174j947262k123934M63190N38064j293002R00314O509236
$$ 1355931 5122034 6935208 4987946 2864012 3327202 3865266 2572264 3472578 9981814
11795I981814P044313l2856n828990l730678L31683j446088n574109l899393K180461
$$ 9981814 17026127 16993271 11164281 7433603 7765286 6319198 745089 -3154304 -973843
11786i73843M275649P90385j830620q05153n96740l638072n566308k487059K986889
$$ -973843 3301806 4092191 2261571 1456418 859678 -2778394 -8344702 -10831761 -7844872
11777g844872N938319N063337K010134j439405l266025j592365K400761M444445
$$ -7844872 -1906553 3156784 5166918 3727513 461488 -1130877 1269884 5714329
11769E714329K276751j260160k215880p20640J76562n19492q38114K02866N86063
$$ 5714329 7991080 6730920 4515040 3794400 3970962 3451470 2613356 2816222 3402285
11760C402285j323463l368557k214795J208421K169119r15531l327704n82181
$$ 3402285 2078822 -1289735 -3504530 -2296109 -126990 -1042521 -4370225 -4952406
11752d952406M563626N686620J790443j866042j707927K29215R64999M34452p64353
$$ -4952406 -388780 5297840 7088283 5222241 3514314 3743529 4708528 5142980 4378627
11743D378627l050687n255734m340668j04576L298500K863127N47563m39843K49041
$$ 4378627 1327940 -3927794 -8268462 -8373038 -5074538 -2211411 -1663848 -2103691 -1854650
11734a854650J722053L829042N221975L350430r65845k918475n16586K099694
$$ -1854650 -132597 3696445 8918420 12268850 11303005 8384530 7867944 9967638
11726I967638J247926q53290r42392m45982j860711l612394l342832k348142j952760
$$ 9967638 11215564 10362274 9419882 8973900 7113189 3500795 157963 -2190179 -4142939
11717d142939K9476L860151M204335j208353m729571L92070P109607L865553o031182
$$ -4142939 -4113463 -253312 3951023 2742670 -1986901 -1594831 5514776 9380329 3349147
11708C349147p654158K457955J0371707O057830k290624k687162K581239L301734
$$ 3349147 -4305011 -1847056 8524651 14582481 12291857 9604695 12185934 15487668
11700A5487668j607548m490293k750461j699943m087513n541820k162756L406689
$$ 15487668 13880120 9389827 6639366 4939423 851910 -4689910 -6852666 -3445977
11692c445977N665363K441002l662521p484389n200683J370784N284783K418796
$$ -3445977 2219386 4660388 997867 -6486522 -11687205 -10316421 -5031638 -2612842
11684b612842k356913j124473N654053Q829845K868268o278664q561602k147456
$$ -2612842 -4969755 -6094228 -440175 8389670 11257938 4979274 -3582328 -5729784
11676e729784N177167N936051J160501k255683o80563K074730O36228l765457
$$ -5729784 -552617 5383434 6543935 4288252 3607689 5682419 6318647 2553190
11668B553190m513086N91962N118915K729378l469800n390490j760973Q74436
$$ 2553190 -1959896 -1367934 3750981 6480359 3010559 -2379931 -4140904 -3266468
11660c266468j016607k848588K0526M970582O727822M810600K024112p68591l499877
$$ -3266468 -4283075 -7131663 -7111137 -2140555 4587267 9397867 11421979 10653388 7153511
11651G153511l596108N79615M975167M322790J27147j757470o49875j285856m320521
$$ 7153511 3557403 4137018 9112185 13434975 13562122 11804652 11154777 9868921 5548400
11642E548400m350464K67367L231163K50553l504165j814582K204780J471979
$$ 5548400 1197936 1465303 4696466 4947019 1442854 -371728 1833052 3305031
11634C305031l035089l922774L55892L196060O66418k732137j727836K133310
$$ 3305031 269942 -3652832 -3296940 -100880 565538 -2166599 -3894435 -1761125
11626a761125M078656L129742J784941J250326L37679k026738n243539p192120
$$ -1761125 2317531 5447273 7232214 8482540 8820219 6793481 1549942 -5642178
11618e642178n323423O05985O439904O964468K480399q72071Q27015L821632K126163
$$ -5642178 -10965601 -10359616 -3919712 3044756 5525155 4653084 5480099 9301731 11427894
11609A1427894l809732p600282n355828l0938L213211K998327J453216P7976j356049
$$ 11427894 7618162 17880 -5337948 -5368886 -2155675 842652 2295868 2373844 1017795
11600A017795k163112j20442M684765P510806L869730l589346o999873l268454
$$ 1017795 -1145317 -1265759 3419006 10929812 14799542 11210196 4210323 941869
11592I41869J764428J701906j691319k421517k484N96424k190023l957701j769591
$$ 941869 2706297 4408203 2716884 295367 292883 889307 -1300716 -5258417 -7028008
11583g028008J309556J570625K31481N50860K520551L665435L014172J354235
$$ -7028008 -5718452 -4147827 -3916346 -3365486 -844935 2820500 5834672 7188907
11575G188907q84315l253551l922925j410114K607687M353481K116126j843027
$$ 7188907 6304592 3051041 -871884 -2281998 325689 4679170 6795296 4952269
11567D952269l759600k109710J173963K927267K046959K17378o88798q36425j260961
$$ 4952269 1192669 -917041 256922 3184189 5231148 5448526 4759728 3923303 2662342
11558B662342j772628j571883r82015p94604o74588q318N23316J51153j71341
$$ 2662342 889714 -682169 -1664184 -2458788 -3133376 -3141694 -2618378 -2467225 -2638566
11549b638566O82475J670514J178305q5353m19636k83220j126723k001085o63575
$$ -2638566 -1956091 -285577 892728 807375 387739 104519 -1022204 -3023289 -3686864
11540c686864K365481M003943K711395j42206k405421k433953K78164L340002
$$ -3686864 -1321383 2682560 5393955 5251749 2846328 412375 690539 4030541
11532D030541K673805j593794l781652j115976Q85811k568578n934803j454490
$$ 4030541 6704346 5110552 1328900 212924 1098735 -1469843 -7404646 -8859136
11524h859136O684601P309090J02615l693327L72840L594427K3064l581430n39931
$$ -8859136 -2174535 5134555 5237170 1543843 1916683 5511110 5534174 1952744 1412813
11515A412813L635643Q32849n884354p496659k636077K573771M324139L400335
$$ 1412813 5048456 5881305 -3049 -7499708 -10135785 -7562014 -3237875 162460
11507A62460J096172p91461O45709M533376M879730n87469n398935m005948n41411
$$ 162460 1258632 467171 1112880 5646256 10525986 9938517 4539582 533634 -7777
11498g777r04181k357697K52300L652486J848500j832913J50219N408287M804704
$$ -7777 -911958 -3269655 -3017355 635131 2483631 650718 800937 6209224 11013928
11489A1013928j460764l629570R57969L572419n70310m541701k313807J269904
$$ 11013928 9553164 5923594 6881563 10453982 9883672 5341971 3028164 4298068
11481D298068j88196l767625l227487M06979J898972R54737J001423J934663J069206
$$ 4298068 4109872 342247 -2885240 -2478261 -579289 375448 1376871 3311534 4380740
11472D380740n85103L73054K919469K296712k061216m941905l285012p40969j420636
$$ 4380740 3795637 4168691 7088160 9384872 7323656 2381751 -903261 -1644230 -3064866
11463c064866l087741r89962L708245M757261L68179l445216j648651K289004
$$ -3064866 -6152607 -7142569 -3434324 1322937 1691116 -1754100 -3402751 -1113747
11455a113747K166539j016757j043621L074947N540381L155717m63697j855695
$$ -1113747 1052792 36035 -1007586 2067361 7607742 10763459 10299762 8444067
11447H444067k365114l072185j555084K293816L248860j406809o175555m953520
$$ 8444067 6078953 3006768 1451684 3745500 6994360 5587551 -588004 -5541524
11439e541524J49568L185811L285051L233628L112348J676205N56755Q57217o29908
$$ -5541524 -5391956 -2206145 1078906 4312534 7424882 9101087 9657842 10515059 9885151
11430I885151n165651o492322K31700P960735O183564k750795o683156k137795
$$ 9885151 4719500 -1772822 -1541122 6419613 12603177 9852382 3169226 1031431
11422A031431J883936j42873k348229M71411L482603R49129l357382k469670K261241
$$ 1031431 2915367 2772494 424265 895676 4378279 5327408 1970026 -499644 1761597
11413A761597L492967o83583m048605j063087N624072P978918K160440n868261
$$ 1761597 5254564 4570981 522376 -540711 5083361 13062279 15222719 9354458
11405I354458o594413N57174N443991J313866m817299k895351L815395L590627
$$ 9354458 2760045 3317219 8761210 10075076 5257777 2362426 6177821 9768448
11397I768448m468015q349604k099496N247906M507318n99707k037751j27288
$$ 9768448 5300433 -3049171 -5148667 99239 4606557 4006850 1969099 1841811
11389A841811M87050M55057K557766M091985J078681l581109m291846k156349
$$ 1841811 2328861 2783918 5341684 9433669 10512350 6931241 2639395 483046
11381D83046k173784l482379r84868M374178N771779J667190j440629L23795K230425
$$ 483046 -1690738 -5173117 -6157985 -1783807 3987972 5655162 4214533 4538328 6768753
11372F768753n18036m411070l237659J823267L830745M60845k959586j663529
$$ 6768753 6250717 1839647 -1398012 425255 4256000 4716845 1757259 93730
11364I3730J976822K711934J77481j363021J52856K076438J882701P52366N44458
$$ 93730 2070552 4782486 4959967 3596946 3749802 5826240 7708941 8461307 9005765
11355I005765M44134o76008j279015l490O67334k243744o451019o557738j713775
$$ 9005765 9449899 8773891 7494876 7491386 8158720 5914976 -536043 -7093781 -8807556
11346h807556L276589M850848M366235L924064K805545J24767k268452k051009
$$ -8807556 -5530967 -680119 3686116 7610180 10415725 10540492 8272040 6221031
11338F221031K56614J963183J015549k441887n853856n708011j269635L409155
$$ 6221031 6477645 8440828 9456377 7014490 1160634 -4547377 -5817012 -2407857
11330b407857L732084M82359j465711o3922J881000J828140P43289J78155l10919
$$ -2407857 1324227 1806586 340875 276953 2157953 3986093 4729382 4907537 4596618
11321D596618j251228j615104o40645P99855J512923Q45470j603476m756871n359151
$$ 4596618 3345390 1730286 1089641 1889496 3402419 4247889 2644413 -2112458 -7471609
11312g471609j851502J980487J575473r91212J84915M579738M771935j657711
$$ -7471609 -9323111 -7342624 -5767151 -6758363 -6573448 -1993710 2778225 1120514
11304A120514o801233l345372M863638Q663867N766527J055151k340895n469194
$$ 1120514 -5680719 -9026091 -4162453 4501414 10267941 11323092 8982197 3513003
11296C513003p906189o350943n04189M476135M124417M11720j347289L93554K263876
$$ 3513003 -4393186 -10744129 -11248318 -6772183 -2647766 -2236046 -3583335 -3189781 -925905
11287i25905J488741l52725k37119J705241K657867J214375j312218l205453l536276
$$ -925905 562836 210111 -27008 1678233 4336100 5550475 4238257 1032804 -2503472
11278b503472j524329K245083M381241K393145m22121R99179M406518K357790
$$ -2503472 -4027801 -1782718 2598523 4991668 4569547 5568726 9975244 12333034
11270A2333034m740132o673413O13759O510609J578666o503804m507791M803683
$$ 12333034 7592902 919489 1533248 8043857 9622523 3118719 -1389072 3414611
11262C414611O790499j757752q241437m576904J937023K390401r72259j852636
$$ 3414611 10205110 8447358 205921 -4370983 -2433960 -43559 -1015818 -2868454
11254b868454k71571Q02785J817664L348304K454653j970575n279502l496889
$$ -2868454 -3140025 -2337240 -519576 2828728 5283381 3312806 -1966696 -5463585
11246e463585Q30524L370213L999344M226399L297007P91408j089079j247667
$$ -5463585 -4633061 -1262848 2736496 6962895 10259902 11051310 9962231 8714564
11238H714564j685801l139210l225996j274896L8145J09577J819763N095113N239434
$$ 8714564 7028763 3889553 663557 -611339 -573194 -463617 1356146 6451259 11690693
11229A1690693P00875l660234m231360l291276k861673q58524K804762L468550
$$ 11690693 12391568 8731334 4499974 1208698 -1652975 -2511499 293263 3761813
11221C761813k24502k380231R07290M825190L652279q61412m141211n638878n889128
$$ 3761813 3537311 1157080 2064370 6889560 10541839 9680427 5539216 -99662 -5988790
11212e988790l203669J299068K055013j954598l636387Q90542N148386L236577
$$ -5988790 -9192459 -7893391 -5838378 -7792976 -11429363 -10538821 -5390435 -2153858
11204b153858l71025n7765L52562l907741p293900k727549M709031N257359P40922
$$ -2153858 -2524883 -2582648 -2230086 -6137827 -13431727 -16159276 -11450245 -6192886 -5451964
11195e451964M14613M208466L778252j380226k619176K383183N425955J474630
$$ -5451964 -5037351 -828885 2949367 1569141 -1050035 1333148 6759103 8233733
11187H233733m115864n073668k141003J113635K981898K275504j032761l033542
$$ 8233733 4117869 -955799 -3096802 -1983167 998731 3274235 2241474 -792068
11179g92068k60740L480864J861300l304901m416880m17478K381882J676573J590964
$$ -792068 -1052808 2428056 4289356 984455 -3432425 -3849903 -1468021 208552 1799516
11170A799516L070934K040734j204356r56298L130621M293511O29862j461326
$$ 1799516 4870450 6911184 5706828 4750530 7881151 12174662 12804524 11343198
11162A1343198N36046L63951m654076p137380k415222K262253j65932m073993
$$ 11343198 11879244 12243195 7589119 451739 -1963483 298770 132838 -3941155
11154c941155q80013N730979N677842q39979m121144o62362K731210R79999k546287
$$ -3941155 -4821168 909811 6587653 5747674 1626530 964168 3695378 4675377 2129090
11145B129090l368706k253691j298516K80947L015772M216109J615404k701456
$$ 2129090 -1239616 -3493307 -4791823 -4510876 -1495104 2721005 4336409 1634953
11137A634953m705914k996310P41529M006225M701628J991408k187746l894201
$$ 1634953 -3070961 -6067271 -5325742 -1319517 3382111 5373519 3185773 -708428
11129g08428j467598J935900K197087j17242o98095J819583L529097J379530j665983
$$ -708428 -2176026 -240126 1956961 1839719 1141624 2961207 6490304 7869834 6203851
11120F203851j230879J073809J22859l573129l652110J603156N265820K184696
$$ 6203851 4972972 6046781 6169640 2596511 -1055599 547557 5813377 7998073
11112G998073k705758k460362N44140p15899n143824m950025O83944L375010o18294
$$ 7998073 5292315 2831953 3376093 2660194 -2483630 -7433655 -6749711 -3374701 -3992995
11103c992995l716508O59501O890951N728307j192426m102173m3102L861332K601407
$$ -3992995 -7709503 -7050002 -159051 5569256 4376830 274657 231555 4092887 6694294
11094F694294L25716J782132L630857L14398n585780o261801r11515K427549q95523
$$ 6694294 7020010 8802142 12432999 12747397 7161617 899816 -11699 2415850 1520327
11085A520327m849118k078175M600678O478585J944849k042566j077538J226908
$$ 1520327 -3328791 -5406966 -806288 5672297 7617146 5574580 4497042 5723950
11077E723950N60677j547670j672716j39362R16978J497311K192062J647687r17260
$$ 5723950 6284627 4736957 3064241 2924879 3841857 5339168 7531230 9178917 8261657
11068H261657k970159j738879J586739L383562K042460r17796k797243j825957
$$ 8261657 5291498 3552619 5139358 8522920 10565380 9647584 6850341 5024384
11060E024384Q32672J166246k677993o088560l406388K689477L821088j090160
$$ 5024384 5857056 7023302 4345309 -1743251 -5149639 -2460162 1360926 270766
11052B70766l452839J364990O492496M865555J27038q65488L89290j580991n426650
$$ 270766 -3182073 -1817083 4675413 9540968 9668006 8802518 9191808 7610817 2184167
11043B184167n559470k140309j7156j16800M18114J760912K241943L077429N161326
$$ 2184167 -3375303 -5515612 -5532768 -5649568 -5231454 -3470542 -1228599 1848830 7010156
11034G010156M339261k215165q220319n924842J161794L042572j125694k822152
$$ 7010156 11349417 9134252 913933 -5010909 -3849115 -806543 -1932237 -4754389
11026d754389R54632L641203J168240k289851k947872k454949j694037J629194
$$ -4754389 -3799757 -158554 1009686 -1280165 -4228037 -6682986 -8377023 -6747829
11018f747829O223652O394941J318096k543175j447953P01322N08925L10327J567401
$$ -6747829 -524177 5870764 7188860 4645685 3197732 3899054 4407979 4718306 6285707
11009F285707Q20691l243524n773974l615174o82411o54047o62029K426288N380237
$$ 6285707 7106398 3862874 -1911100 -5526274 -6208685 -6862732 -7524761 -5098473 281764
11000B81764M109327P45139o24072q96748k831577m811422l570914k02008J846510
$$ 281764 4391091 5136230 4512158 3615410 783833 -4027589 -7598503 -7800511 -5954001
10991e954001K207805K375061J770745l58127j794877o78931O84988n4414l07886
$$ -5954001 -3746196 -1371135 399610 41483 -1753394 -2432325 -1747337 -1801751 -2109637
10982b109637K937524O226649L721656l054370o346722l403692m0690j022414
$$ -2109637 827887 7054536 10776192 7721822 1375100 -2028592 -2069282 -3091696
10974c091696k862702j72504N085070O106492J400861l051367k573242K3344k77433
$$ -3091696 -5954398 -6126902 -1041832 5064660 6465521 3414154 840912 864256 586823
10965E86823k846722l167138n47684J041556k45649j574170p19571R05132K111894
$$ 586823 -2259899 -5427037 -5974721 -4933165 -5178814 -6752984 -7472555 -6567423 -4455529
10956d455529L775270M677594J282717m992311o469720j38063O095963M483827
$$ -4455529 -680259 3997335 5280052 287741 -6181979 -6320042 -224079 4259748
10948D259748q50788j255904K240934J856966k793750m197318L8126L946700L900714
$$ 4259748 3408960 2153056 4393990 6250956 3457206 -740112 -701986 3244714 7145428
10939G145428K970093K755110J2676n533508q179849m881649k02229J018415Q2953
$$ 7145428 10115521 12870631 12883307 7349799 -830050 -5711699 -5913928 -4895513 -4812560
10930d812560J96758J180604J636203J784756J552796q097j757811j296166L73191
$$ -4812560 -4615802 -3435198 -1798995 -14239 1538557 1530460 -227351 -1523517 -1150326
10921a150326q2166k248695k654192j498174j831475j943937K989290J0362249
$$ -1150326 -1232492 -3481187 -6135379 -7633553 -9465028 -11408965 -8419675 1942574
10913A942574J0663692J842159n873197m206885K225729M582546J946339j230236
$$ 1942574 12606266 14448425 8575228 4368343 6594072 11176618 13122957 11892721
10905A1892721l279067m456571l336557k21416O18042k251501l338746J198074
$$ 11892721 8613654 4157083 820526 599110 1217152 -1034349 -4373095 -3175021
10897c175021N960260M066446j814887l680131m61122J604270m32403k428120
$$ -3175021 2785239 6851685 5036798 1356667 895545 2499815 2067412 -360708
10889c60708m27015L728846N420947K631869k483594n564815l814068R38222L885076
$$ -360708 -787723 2941123 8362070 10993939 8510345 2945530 -868538 69684 3954760
10880C954760K757194o7773j589329j664812j338218n25155R92368K450953L161448
$$ 3954760 6711954 6644181 5054852 3390040 2051822 1526667 2519035 4969988 8131436
10871H131436K864842J002593j952489l157510q10856J975722R40723k591395
$$ 8131436 10996278 11998871 10046382 6888872 6078016 8053738 8994461 6403066
10863F403066l696718j704190l01849m36613L64306J766072Q00189j443466p35970
$$ 6403066 2706348 1002158 700309 263696 628002 2394074 3194263 1750797 1014827
10854A014827K061667J565333k358414l745489r13125J074195K10948N81664L117159
$$ 1014827 3076494 4641827 2283413 -1462076 -2375201 -1301006 -1090058 -508394 2608765
10845B608765L007496m78226j572025Q90280N21398l937180m341221K341171O740914
$$ 2608765 5616261 5138035 3566010 4456290 4977688 1040508 -3300713 -959542 5781372
10836E781372K195140l793353k512391J691088O98336k871831k091609R44867
$$ 5781372 7976512 4183159 1670768 3361856 4060192 1188361 -903248 41619
10828D1619L58431j255400J827882O004565L704497k802696n212517l391479l363667
$$ 41619 400050 -855350 972532 6977097 10681594 7878898 2666381 -725098 -4088765
10819d088765l998707Q69848Q236226P753600r55884n938698j163520M700340
$$ -4088765 -8087472 -7217624 1018602 8772202 7816318 1877620 714100 5414440
10811E414440K861106k399705k095893L144798M978232Q7899n674299n518129
$$ 5414440 8275546 5875841 3779948 6924746 11902978 11990877 6316578 798449
10803G98449J4461M139902J957041l732592n862291j969099L079225M039429J504804
$$ 798449 812910 4952812 6909853 3177261 -2685030 -4654129 -1574904 2464525 3969329
10794C969329q23191j510413j222084l72377J30688j174462l026115j698081K733766
$$ 3969329 3146138 1635725 413641 41264 171952 -1002510 -4028625 -5726706 -2992940
10785b992940M628785P64930m132206l884273Q65808M876205N334829K959955
$$ -2992940 1635845 2400775 -1731431 -5615704 -4749896 126309 5461138 8421093
10777H421093n40698k815898j988979K27428L92079o16153R14076L350447J212923
$$ 8421093 7880395 5064497 3075518 3302946 3695025 3078872 3992948 7343395 8556318
10768H556318l591551k449943M592739O222587j408270o424952q30416M860924
$$ 8556318 4964767 2514824 7107563 13330150 11921880 5496928 4666512 9527436
10760I527436n90952q617024m519659P025759Q808949j131483p485861k719992
$$ 9527436 8936484 319460 -4200199 2825560 11634509 10503026 3017165 297173
10752B97173L660731L250482L02175N03663J339311n51328k494041j627164J31533
$$ 297173 3957904 7208386 7510561 8014224 9353535 8802207 6308166 4681002 4812535
10743D812535Q56203J559274J869247l88734l438266k490094J760945K751510
$$ 4812535 5668738 7228012 9097259 8708525 5270259 2780165 4541110 7292620
10735G292620j779678o114701n337822j492317J307590K191409J823940M86591
$$ 7292620 5512942 -601759 -5939581 -7431898 -6124308 -3932899 -2108959 -1622368
10727a622368k94446J358677L935085L725621K98218l006039l870137k634742
$$ -1622368 -1916814 -558137 3376948 7102569 7400787 4394748 524611 -2110131
10719b110131j90759J900518J002974k641412m069949m61622L431838K464014
$$ -2110131 -2300890 -400372 602602 -2038810 -6108759 -6570381 -3138543 -674529
10711f74529m0557K082631O519661N458844j599744o634504m728868M88560L421127
$$ -674529 -715086 1367545 7887206 13346050 11746306 5111802 382934 871494 4292621
10702D292621K339462j390206m635173l719587J174859M711746L634718J642342
$$ 4292621 6632083 5241877 606704 -3112883 -1938024 2773722 6408440 8050782
10694H050782K282266K328106j277380l893932r30690K698216N58467l347775
$$ 8050782 10333048 12661154 11383774 7489842 6559152 9257368 9815835 6468060
10686F468060j563554K858478J609944l647087m371305m67180J029027K45035
$$ 6468060 4904506 7762984 9372928 5725841 1354536 887356 1916383 2161418
10678B161418L075404O904650L132111n740753p304779L80244N131092R87807
$$ 2161418 5236822 12141472 15273583 9532830 2228051 2608295 7739387 8727194
10670H727194l072555k51346K754740q39584n639027m007117J478257L999953
$$ 8727194 5654639 5403293 8158033 7318449 1679422 -2327695 -849438 3150515
10662C150515L246631K640438K140998L75206j135030r65377n97401r26704n95087
$$ 3150515 6397146 9037584 11178582 11553788 10418758 9453381 8855980 7929276 7334189
10653G334189K55196k29759j190946l29590N63670j532922l367063L64147N979414
$$ 7334189 7589385 7359626 6168680 5839090 6402760 4869838 1502775 1866922 7846336
10644G846336M537764l074397o302475j684113K587327J500882K06466K117554
$$ 7846336 12384100 9309703 3007228 1323115 3910442 5411324 5617790 7735344
10636G735344K358969j418246l239754j74211J303601k719332n429747q80076
$$ 7735344 10094313 8676067 5436313 5262102 6565703 3846371 -1583376 -2463452
10628b463452N298755N038648P5806k971201l176627l215336k285628J425772
$$ -2463452 2835303 7873951 7949757 4978556 1801929 -1413407 -3699035 -2273263
10620b273263N279428N262141J429331l493775p111055o705524r16510N925501
$$ -2273263 3006165 8268306 9697637 6203862 -907193 -7612717 -8529227 -2603726
10612b603726P267473L734932J974702L037369J021202m631154o086775n18279
$$ -2603726 4663747 8398679 10373381 13410750 14431952 9800798 3714023 3195744
10604C195744L940646J339742k730792j559185J869134J829843k68416n94564
$$ 3195744 7136390 8476132 5745340 4186155 6055289 7885132 7616716 7022152
10596G022152o05240k557452l401629l94035K606282J249159j895990k336766
$$ 7022152 6416912 3859460 457831 63796 2670078 3919237 2023247 -313519
10588c13519j113581j100486p20698K246500M811697L059861j061940k910624
$$ -313519 -1427100 -2527586 -3248284 -1001784 3809913 6869774 5807834 2897210
10580B897210k181108j677623j660323k03281K545186M249352L483637Q78711
$$ 2897210 716102 -961521 -2621844 -2825125 -279939 3969413 7453050 8331761
10572H331761j487007j223118J663872L485774J375817j821660j236106K516668
$$ 8331761 6844754 5621636 7285508 10771282 12147099 10325439 9089333 11606001
10564A1606001M375112K509133k12462j665566k265717k188836j527712j766887
$$ 11606001 15981113 18490246 18277784 16612218 14346501 12157665 10629953 8863066
10556H863066k879253j788115J989499L683428J202512m59985J245428N58151
$$ 8863066 5983813 4195698 6185197 9868625 11071137 10611152 11856580 12414731
10548A2414731m985532o663703R68592P718480L290002m526292k936637L828145
$$ 12414731 7429199 765496 1734088 9452568 12742570 8216278 5279641 9107786
10540I107786L581336j173042J11251L921868n97488q331030n117039N692004
$$ 9107786 12689122 11516080 11627331 15549199 14951711 6620681 1503642 7195646
10532G195646P754960M13472j950007K237179M04034p477436p216367K582742
$$ 7195646 14950606 15364078 13414071 15651250 16055284 8577848 1361481 3944223
10524C944223P386806L139145R66499L581040K017171k884681j314527L295998
$$ 3944223 11331029 14470174 15436673 19017713 21034884 18150203 16835676 20131674
10516B0131674l52873n972307P53599J0802879M049268j0847087p550621R552969
$$ 20131674 19778801 13806494 14560093 25362972 29412240 18565153 11014532 20567501
10508B0567501J1384840k425709m157674P095955M370532r830993m153351J6765372
$$ 20567501 31952341 29526632 25368958 32464913 36835445 27004452 22851101 39616473
10500C9616473J3459678j1363661j0145625J8659258J9975138j2353154j3774388
$$ 39616473 53076151 41712490 31566865 50226123 70201261 57848107 44073719
10493D4073719K8442992L8019923n117711k622513Q2979639J07875270m7835850
$$ 44073719 72516711 110536634 105418923 102796410 185776049 293651319 245815469
10486B45815469k45815744k43767256m2716089J12509908Q2527417q889586j2182455
$$ 245815469 -275 -243767531 -286483620 -173973712 -91446295 -100335881 -112518336
10479a12518336L5251251K9115251j3985846j4115445K0608398K3976363l469347
$$ -112518336 -77267085 -48151834 -62137680 -76253125 -55644727 -31668364 -35137711
10472c5137711q591376J0847320J1730608p983697j0875978O209452J1332210
$$ -35137711 -43729087 -32881767 -21151159 -29134856 -40010834 -33801382 -22469172
10465b2469172L96862j287300P651981N323111o322446n431424N070196L108957
$$ -22469172 -22072310 -23359610 -15707629 -10384518 -16706964 -22138388 -17068192 -13959235
10457a3959235q436446o911102O476012R446419J55556k927432K138564J064531
$$ -13959235 -22395681 -29306783 -22830771 -13384352 -13228796 -16156228 -14017664 -12953133
10449a2953133m311346J36623R078295M821448p766156p588419M724267Q564830
$$ -12953133 -17264479 -17127856 -8049561 -3228113 -10994269 -18582688 -13858421 -5293591
10441e293591L84186l671258o6562p37291n112330r42115P688586M544779o709422
$$ -5293591 -4909405 -8580663 -8647225 -9384516 -14496846 -15438961 -7750375 -3205596 -9915018
10432i915018o157804N823106P822595l842626q080625K992455J0284895J699350
$$ -9915018 -16072822 -10249716 -2427121 -6269747 -14350372 -11357917 -1073022 626328
10424F26328q442082o089704Q42174N53461l247412k671877J98970J212092K272798
$$ 626328 -7815754 -13905458 -13063284 -12509823 -15757235 -18429112 -18230142 -17018050 -14745252
10415a4745252L642175J032559m126958m453013p9679J296811l22694K657799
$$ -14745252 -11103077 -10070518 -14197476 -18650489 -18730168 -17433357 -17756051 -15098252
10407a5098252Q532530O761791k013456m535058K486739O659363J995937j773315
$$ -15098252 -6565722 196069 -1817387 -6352445 -3865706 2793657 4789594 3016279
10399C016279J166925K045802m503092q685982k634970N307398M870019L3142
$$ 3016279 4183204 6229006 1725914 -6960068 -9595038 -4287640 582379 615521
10391F15521n60285J330800k52403k902161j056312K559391J363444l422542m710534
$$ 615521 55236 1386036 1133633 -1768528 -2824840 -265449 1097995 -2324547 -7035081
10382g035081o27174L592146L486272J28408k272315q67952K901949M474027J833551
$$ -7035081 -7662255 -4070109 -583837 -455429 -2727744 -3595696 -693747 3780280 5613831
10373E613831j506262k034730j643681k855023k711825J662502N331231K270246
$$ 5613831 4107569 2072839 429158 -2425865 -5137690 -3475188 1856043 4126289
10365D126289l142051j662982N312634O856713n49862p928053p572353k396958
$$ 4126289 984238 -678744 4633890 11490603 10940741 3012688 -4559665 -6956623
10357f956623J127278J359003J89868k77118J723927N125850M774062j480244
$$ -6956623 -5829345 -4470342 -4280474 -4557592 -2833665 2292185 7066247 5586003
10349E586003o797399l984425K664102L254724k440716n904265m172323j903290
$$ 5586003 -1211396 -5195821 -2531719 723005 -1717711 -7621976 -11794299 -13697589
10341a3697589j99065M362570R163318O673520j819575n723331j449015K332469
$$ -13697589 -13896654 -9534084 -370766 6302754 4483179 -1240152 -2689167 -356698
10333c56698l76337l866260j821216K441361K977653O50551k86492R36053K664583
$$ -356698 -733035 -4599295 -6420511 -3979150 -1001497 -350946 -637438 298615 2963198
10324B963198L706536K311568k485653o831433n327871M55762L322915J226518
$$ 2963198 6669734 8981302 6495649 -335784 -5663655 -5207893 -1884978 -658460
10316f58460o43052L81878P62963j190861j801275N29421J882576J30429j122984
$$ -658460 -1301512 -919634 -156671 -1347532 -3148807 -2619386 -736810 -606381 -1729365
10307a729365O81652K347341L95205l523658n306862k826669L146644Q728996
$$ -1729365 -1047713 1299628 1694833 -1828825 -7135687 -9962356 -6815712 1913284
10299A913284Q496104J900540l786163k522991J432352N62090l372043l041823
$$ 1913284 10409388 12309928 8523765 6000774 7433126 7995216 4623173 1581350
10291A581350J105759K003453j154842k509203j216062j817198l242615P4859
$$ 1581350 2687109 4690562 3535720 1026517 -189545 -2006743 -5249358 -5174499
10283e174499N604949M449608k706353m961705P33903M723465J774479j015220
$$ -5174499 430450 4880058 2173705 -2788000 -2054097 2669368 4443847 3428627
10275C428627J131292K063396k095334m255994N05927M850662J629074l798663
$$ 3428627 4559919 6623315 4527981 271987 777914 5628576 7257650 3458987
10267C458987l323449Q52248K411953J998955K690867J891529k877621o737240
$$ 3458987 135538 987786 3399739 5398694 8089561 9981090 7103469 366229
10259C66229m962193j537308j765543k710666L37622M171282L566485J116313
$$ 366229 -4595964 -6133272 -7898815 -10609481 -10271859 -6100577 -2534092 -1417779
10251a417779J855908L320917M81930m037946m267215j409712o42691j116389
$$ -1417779 438129 3759046 4240976 203030 -4064185 -5473897 -6116588 -7232977
10243g232977J174897L770418J197284m025748m048023J424186M581990K101108
$$ -7232977 -6058080 -2287662 -1090378 -5116126 -9164149 -7739963 -3157973 -1056865
10235a056865p56950J71865K322696K490108J594009Q51011j131181m693087o782935
$$ -1056865 -1813815 -1641950 680746 3170854 4764863 5615874 4484693 -208394 -6991329
10226f991329m751124K15543M743213O237508M098969L48914j267974P23919K978513
$$ -6991329 -11742453 -11526910 -6783697 -546189 3552780 3901694 2633720 3357639 6336152
10217F336152J268063l714796p064051n622018r64672L012297L670044J567838
$$ 6336152 7604215 3889419 -3174632 -8796650 -9761322 -6749025 -3078981 -1511143
10209a511143R6386J797741M282187K519318l474213o994966l479657K687736
$$ -1511143 -1414757 382984 4665171 7184489 3710276 -3284690 -6764347 -4076611
10201d076611M227425R22696j367508L9623J683669K39733k862406m336770l208461
$$ -4076611 150814 1073510 -293998 -254375 1429294 1669027 -1193379 -5530149 -8738610
10192h738610m58647L047564O184688O509071K242251m228260p094766l506923
$$ -8738610 -9197257 -6149693 34995 6544066 8786317 4558057 -2536709 -6043632
10184f043632J977689K493432j779392l669686L07431M538646K993073j723207
$$ -6043632 -4065943 -1572511 -3351903 -7021589 -6714158 -2175512 817561 -905646
10176i05646l243098j142088O24098J453216K903264K634997k087753o816958
$$ -905646 -4148744 -5290832 -4666734 -3213518 -310254 2324743 236990 -6579968
10168f579968m947065Q61087K185389o98507P97607P412541Q697145J89719p765046
$$ -6579968 -11527033 -10665946 -8480557 -9179064 -8381457 -968916 7728229 7917948 152902
10159A52902n251371K867179N845104K462150r86899j999012k459573k084855
$$ 152902 -5098469 -2231290 3613814 6075964 5089065 3090053 630480 -1454375
10151a454375P10571L872240M040022J861407J60111p26560j690365j905946r04959
$$ -1454375 -743804 3128436 7168458 9029865 9189976 8463416 6773051 4867105 3962146
10142C962146m19927r98211n91643P25380m01811l884654m199315O59054M319484
$$ 3962146 3542219 2544008 1952365 2677745 2275934 -1608720 -5808035 -5148981 -829497
10133h29497J444395l702860m175355p53695J136466O15936O24495J357544J085098
$$ -829497 614898 -3087962 -7263317 -8017012 -6880546 -6264610 -5640115 -4282571 -3197473
10124c197473J004057L105872N129844L235494j622612m606721l216078P13036
$$ -3197473 -2193416 912456 6042300 9277794 7655182 3048461 -167617 545419
10116E45419L772290L533378M37575j753657m81869Q92526j856217m954936j266894
$$ 545419 4317709 7851087 8288662 6535005 6053136 6945662 5089445 134509 -1132385
10107a132385N919300N018955m878817r891447k464208O264348M554783j637885
$$ -1132385 4786915 9805870 4927053 -4964394 -7428602 -1164254 3390529 1752644
10099A752644p29565M574090M105085p54154p74601L206946K002479m539056o986392
$$ 1752644 1023079 5597169 9702254 8948100 8173499 11380445 13382924 8843868 1857476
10090A857476k853429J94191j527799l039188j604675p65826j685459r53192J377822
$$ 1857476 -995953 -801762 -2329561 -5368749 -6973424 -7739250 -9424709 -10377901 -9000079
10081i000079J365791j85617J535677N343316N037739J041366J47314K623860
$$ -9000079 -7634288 -7819905 -6284228 -940912 4096827 5138193 5285507 7909367
10073G909367J298730m448142o095003r92656K188439j793523n972564l575355
$$ 7909367 9208097 4759955 -1335048 -2327704 -139265 -1932788 -7905352 -11480707
10065a1480707J207484K214403J714672L604825M385845M7008m477879k221223
$$ -11480707 -10273223 -8058820 -6344148 -2739323 1646522 1693530 -2784349 -5005572
10057e005572L899694N163952K77663l841941l164963r14351o71697j249345j1872
$$ -5005572 -1105878 4058074 4335737 493796 -2671167 -3585518 -4257215 -5506560 -5518432
10048e518432K491043L167272N25621k750727k248954K222266M992959J815154
$$ -5518432 -3027389 139883 665504 -2085223 -4334177 -2111911 2881048 4696202
10040D696202l262445l302714P12819J382841k787531m714734o23417L638631
$$ 4696202 1433757 -1868957 -1156138 226703 -2560828 -7275562 -7898979 -4260348
10032d260348K575377j2354J795926N583820M515480j615902o171279n185206
$$ -4260348 -1684971 -1697325 98601 5682421 10197901 8581999 2410720 -2774486
10024b774486j433273Q34835R00771O95668J489047K275576J093573j676892k436919
$$ -2774486 -4207759 -3372924 -2472153 -1776485 -287438 1988138 3081711 1404819 -1032100
10015a032100Q27403M157821K243046l213733n200454j782933J514807J123391
$$ -1032100 -204697 3953124 6196170 2982437 -2218017 -4000950 -2486143 -1362752
10007a362752K72176J524065J519206k150846m931718k001623L635119N672806
$$ -1362752 -1090576 433489 1952695 -198151 -5129869 -7131492 -3496373 2176433
9999B176433L535151J162699k26180k365982m944386n640692l994794j329880
$$ 2176433 5711584 6874283 6648103 4282121 -662265 -6302957 -10297751 -11627631
9991a1627631J555760L509054K639768K13089J161271O276150Q119948Q93636
$$ -11627631 -10071871 -6562817 -3923049 -3709960 -2548689 3727461 11847409 12741045
9983A2741045r065290j0207454j511406O464833O125489R07516k434552k586595
$$ 12741045 3675755 -6531699 -8043105 -1578272 4547217 5454733 3020181 433586
9975D33586j846308j008465K77573J456694K232697L256182L818412J740040k541375
$$ 433586 -1412722 -2421187 -2143614 -686920 1545777 4801959 8620371 10360411 7819036
9966G819036m835750k693247N97594N82076j799596j951958R83932K741404Q35444
$$ 7819036 2983286 290039 887633 1469709 -329887 -2281845 -1297913 1443491 2278935
9957B278935j126034J064300N130635N193205R93776j049835K344266N625122
$$ 2278935 1152901 2217201 7347836 12541041 13534817 12484982 14829248 20454370
9949B0454370K497578m362373p333769n041240k846828l161879k671429r7818
$$ 20454370 22951948 18589575 11255806 6214566 3367738 205859 -2465570 -2563388
9941b563388P07499j874253l423244q10012K456647K536161J640026L118834M772962
$$ -2563388 -1855889 -3730142 -7153386 -7963398 -5506751 -2970590 -1330564 1788270 6561232
9932F561232K690811j740250m143606l627556j944167Q14010M441316N508779
$$ 6561232 9252043 7511793 3368187 -259369 -2203536 -1389526 3051790 8560569
9924H560569J723112l052548l729654j490310o45273q19248J058749L412161K248796
$$ 8560569 10283681 7231133 3501479 2011169 1365896 546648 1605397 5017558 7266354
9915G266354p79067m91399K333501J808643k533806m478415j697619O12560r85783
$$ 7266354 6487287 5995888 8329389 10138032 7604226 3125811 1428192 2040752 1054969
9906A054969k875545j494910J007109J626827J124683P09410l22214j001749J407574
$$ 1054969 -1820576 -3315486 -2308377 -681550 443133 1152543 830329 -171420 1236154
9897A236154N407861N501410J173269j204796J318788L404797Q82155k519737
$$ 1236154 6644015 12145425 13318694 12113898 13432686 16837483 17719638 15199901
9889A5199901k779886k243999l029791j681998K952933M571106j30223l968694
$$ 15199901 12420015 10176016 7146225 5464227 8417160 12988266 12858043 8889349
9881H889349r78482L188368K881458M154847J0373451O568758k0369370n0996173
$$ 8889349 7910867 11099235 13980693 18135540 28508991 35077749 14708379 -36287794
9873c6287794m8769200r961144K6379331K8297183Q918086p1490O529269J0086446
$$ -36287794 -85056994 -95018138 -68638807 -40341624 -31423538 -31495028 -24965759 -14879313
9865a4879313L292698j886589J589190N367187K513562j726031j120219J903182
$$ -14879313 -11586615 -13473204 -11884014 -6516827 -4003265 -5729296 -6849515 -4946333
9857d946333K912032K140214K95971l682706o993323l672232M894937Q562463
$$ -4946333 -2034301 105913 401884 -3280822 -10274145 -13946377 -9051440 -488977
9849d88977K646468m313524l245566K124587K382824k602011m804880j326823
$$ -488977 2157491 -2156033 -5401599 -3277012 -894188 -3496199 -8301079 -9627902
9841i627902K380835K292191R40578J193088J320366o97261k513134r07281K458003
$$ -9627902 -7247067 -4954876 -4014298 -2821210 -1500844 -2198105 -4711239 -5618520 -3160517
9832c160517K552459k033852o352662m568368K773568Q459178O335186j393226
$$ -3160517 -608058 -2641910 -8994572 -13562940 -10789372 -2330194 4004992 2611766
9824B611766o185149k897641M106082O069063K56236o787502o992738k39791N735939
$$ 2611766 -3573383 -6471024 -2364942 3704121 3960357 -2827145 -9819883 -10059674 -4323735
9815d323735M793311n39986l239142j342682L91350j308279k953483k92220M000318
$$ -4323735 469576 -70410 -3309552 -4652234 -4260884 -5569163 -8522646 -8814866 -4814548
9806d814548L644841j700193n647405m122891j21608K031129K449351L075604
$$ -4814548 -1169707 -2869900 -8517305 -12640196 -12761804 -10730675 -8281324 -5205720
9798e205720L264046J632932l15900l19147N01953n10058k353454j108205L627892
$$ -5205720 -1941674 -308742 -624642 -943789 -441836 -951894 -3305348 -4413553 -785661
9789g85661O826472M487289o76787k817467p84927R87203n42335k827406k418123
$$ -785661 6040811 10528100 9851313 7033846 6248919 7236122 6693787 3866381 1448258
9780A448258o80662j152387l042430k257899J260387K634733r066k071491N1741
$$ 1448258 767596 -384791 -3427221 -5685120 -4424733 -1790000 -1799066 -3870557 -3818816
9771c818816L050039K535222L30587M79202J680180K11613k239672r38705L023722
$$ -3818816 -768777 1766445 2097032 2576234 4256414 4468027 2228355 1289650 4313372
9762D313372L688841o8612l073149k697215j964951k488678j495747J870805M009148
$$ 4313372 8002213 7933601 4860452 2163237 198286 -2290392 -3786139 -1915334 2093814
9753B093814L247834K415406K436207J83814m066768m428194O76863L467836k096388
$$ 2093814 5341648 7757054 10193261 10377075 6310307 1882113 2558976 6026812 3930424
9744C930424j0062390j0416629k874759M396834O465297M926255K032705j275051
$$ 3930424 -6131966 -16548595 -19423354 -15026520 -8561223 -3634968 -1602263 -2877314
9736b877314k716074o16532J870443J26903m495546n654512o13887O360579R383521
$$ -2877314 -5593388 -6209920 -4339477 -4212574 -8708120 -14362632 -14976519 -8615940 767581
9727G67581O431662n4275m976806m005607J699005N467676K830049k570963m065620
$$ 767581 7199243 7144968 2168162 -1837445 -138440 5329236 8159285 5588322 1522702
9718A522702p72853K570694K593439o7109l375415n111017l271659Q58697K379257
$$ 1522702 749849 3320543 5913982 5846873 2471458 -2639559 -5911218 -5052521 -2673264
9709b673264m00071k020377J967153O495439L842109l604058o134057j546348
$$ -2673264 -3073335 -5093712 -3126559 3368880 7210989 3606931 -2527126 -4073474
9701d073474K073092k69640l413856j892739J118006J11252l285562l342535N78079
$$ -4073474 -2000382 -2270022 -5683878 -7576617 -6458611 -6347359 -9632921 -12975456 -12397377
9692a2397377L518117K266046j079095k518039l89271L461818N121345K082241
$$ -12397377 -8879260 -6613214 -7692309 -10210348 -10599619 -7137801 -2016456 65785
9684F5785l394946n614969j646083M846889P557995M713977O53967N8277K044996
$$ 65785 -3329161 -8944130 -10590213 -5743324 1814671 6528648 7182615 7240892 9285888
9675I285888J647305k774798o057138k725066M527733P195787K175855m205175
$$ 9285888 10933193 8158395 2101257 -623809 3903924 11099711 13275566 9070391
9667I070391n277038k217327J29369Q50924J570055J327595j278611l403589j472467
$$ 9070391 3793353 1576026 1705395 2556319 4126374 5453969 4175358 771769 -700698
9658g00698K202089K348324o33910j143218K418663M868325K069038l217548n343518
$$ -700698 1501391 3849715 3215805 2072587 4491250 9359575 11428613 8211065 2867547
9649B867547k601334J561480K596683k87848k842239q66138L199987K810083k166807
$$ 2867547 266213 1827693 4424376 4136528 1294289 428151 3628138 6438221 4271414
9640D271414l676848J814458N980959J104099o547872n637262K451438O191022
$$ 4271414 594566 2409024 8389983 9494082 2946210 -2691052 -239614 5951408
9632E951408K052542k091932j691739j351469l679553l927106m2521K046859j387184
$$ 5951408 8003950 5912018 4220279 2868810 -810743 -4737849 -4780370 -2733511 -4120695
9623d120695m857131k569735K574480M401290K144316j100546l473749l843324
$$ -4120695 -8977826 -11547561 -8973081 -4571791 -2427475 -3528021 -7001770 -10845094
9615a0845094j078624K868145M018045K658739K749727L672495N26440n104145
$$ -10845094 -11923718 -9055573 -5037528 -2378789 370938 4043433 4569873 -534272
9607e34272m472717L717732Q237351J841021o635260n685670J551476M078493
$$ -534272 -5006989 -1289257 6948094 8789115 2153855 -3531815 -1980339 2098154
9599B098154P97882n00797J856132J785985k073591l638899n14760J804327m16082
$$ 2098154 2896036 2395239 4251371 6037356 3963765 324866 -189894 1614433 1198351
9590A198351l145763j685188K270896M312307L651451K307228R88370r57551l012679
$$ 1198351 -1947412 -3632600 -1361704 2950603 6602054 8909282 9897652 8940101 5927422
9581E927422l488235j947515l35897r74043l289987l586033M01153N587184O862888
$$ 5927422 2439187 491672 155775 -818268 -4108255 -7694288 -7293135 -1705951 5156937
9572E156937L827311O12633q48618k613886m981906m555579m58827K769533J841305
$$ 5156937 8984248 9596881 8748263 6134377 1152471 -3403108 -3861935 -1092402 748903
9563G48903l43360q677J638368J762561J008219J135245J261782M17356J68890
$$ 748903 405543 396866 2035234 3797795 4806014 5941259 7203041 7620397 7789287
9554G789287R68728P24l362418m509898o33238L730002L362696J61169j293924
$$ 7789287 8758015 8758739 5396321 886423 253185 3983187 7345883 7507052 6213128
9545F213128j469897k895059l684412j129178J805369R94248r09404J143512M879191
$$ 6213128 4743231 1848172 -1836240 -2965418 -1160049 -165801 -1075205 68307 4947498
9536D947498L794163j648652m584887k978579j710781k930567k658837J133905
$$ 4947498 8741661 7093009 2508122 -470457 -2181238 -5111805 -7770642 -6636737
9528f636737M376023L491550L65101j732428k330190j860587l879K153463K083089
$$ -6636737 -2260714 1230836 1595937 -136491 -2466681 -4327268 -4331147 -2177684 -94595
9519i4595m01803k316469j414105J481599L911040L294965j399900o568556n393039
$$ -94595 -496398 -2812867 -4226972 -2745373 1165667 4460632 3060732 -3507824 -8900863
9510h900863L082587R503846N255759m616546p559978j357004L410847k78884
$$ -8900863 -5818276 3685570 8941329 4324783 -3235195 -4592199 -1181352 -1460236
9502a460236o405333o277491n59842M036334M401373K269745k76373j965173j499663
$$ -1460236 -7865569 -14143060 -14702902 -10666568 -6265195 -3995450 -4271823 -6236996 -7736659
9493g736659Q98224K752395K289661N16782o72892l87895J573925M209968M547151
$$ -7736659 -6838435 -4086040 -1796379 -1279597 -1952489 -2340384 -766459 3443509 7990660
9484G990660Q57355l336876k515049L075073O931403M359225k582903q507860
$$ 7990660 8848015 5511139 2996090 6071163 13002566 17361791 14778888 6271028
9476F271028r409614m318791L317422O393586J452488n173734m422702K667198
$$ 6271028 -3138586 -7457377 -4139955 2253631 3706119 -1467615 -5890317 -3223119
9468c223119O322347K597769j858469j692894n25685k394785l810449o73285L399339
$$ -3223119 3099228 5696997 3838528 2145634 1619949 -774836 -4585285 -5258570 -1859231
9459a859231K807639o94847j530646K02731k41740l637930n503501k911621K108578
$$ -1859231 948408 253561 -1277085 -1074354 -1316094 -4954024 -10457525 -13369146 -11260568
9450a1260568N713471N662055K527147l21526J94179K240866Q88366l710163m995217
$$ -11260568 -5547097 114958 2642105 2320579 2514758 4755624 5643990 1933827 -3061390
9441c061390j42812M214927J700237l646123l846067M58208J964906j231814l913832
$$ -3061390 -3204202 1010725 2710962 -935161 -4781228 -4323020 -2358114 -3589928 -7503760
9432g503760l193715j657609p67237J358323M374037M717443J874913l71698m90738
$$ -7503760 -10697475 -12355084 -13122321 -11763998 -7389961 -2672518 -797605 -1169303 -1660041
9423a660041j038791k461736j567277J535854J769539k155308l885445Q67337
$$ -1660041 -2698832 -5160568 -6727845 -5191991 -3422452 -5577760 -9463205 -8595868
9415h595868O581029N797472Q1821l449145k979359k231352k202957l43028K636410
$$ -8595868 -2014839 3782633 3864454 415309 -2564050 -4795402 -6998359 -7341387 -4704977
9406d704977K596966m64692j421774J579267L876508K094895n18629j89329R83896
$$ -4704977 -2108011 -2572703 -3994477 -2415210 1461298 3556193 3037564 2848235 3832131
9397C832131o19774l305617k982772m33623k1638k169802k588519N71462L496432
$$ 3832131 3212357 -93260 -3076032 -3509655 -3531293 -5701095 -8289614 -7718152 -4221720
9388d221720K248783j714923l510352o78389M167327N952137K457380k600273
$$ -4221720 -1972937 -3687860 -7198212 -7876601 -3709274 2242863 4700243 2099970
9380B099970l308816O54998K816854r97700n758239m125403K323005N139285J391106
$$ 2099970 -1208846 -553848 2263006 1265306 -4492933 -8618336 -6295331 -1156046 235060
9371B35060l036149l266789j384969k65899J531699M713423N209430N75899m081528
$$ 235060 -2801089 -6067878 -7452847 -7718746 -6187047 -1473624 3735806 4311705 230177
9362B30177k468121L519274O362736L110117k058192m493053l843965k274970
$$ 230177 -2237944 1281330 7644066 10754183 8695991 4202938 358973 -1915997
9354a915997j291335p90192K51584J847063J771429j524569n017123m191572m01325
$$ -1915997 -3207332 -3997524 -3745940 -1898877 -127448 -1652017 -6669140 -10860712 -11262037
9345a1262037L35998k849495l946712p79416P01797k303047k623103M696258J1383447
$$ -11262037 -10926039 -13775534 -17722246 -18501662 -17799865 -20102912 -22726015 -18029757 -6646310
9336f646310P490760k051873m328172J912788O078473L473980L41078O74529M05956
$$ -6646310 844450 -1207423 -5535595 -3622807 2455666 5929646 6270724 6945253 7351209
9327G351209k754153m647742l152164j713945j410875J048073M495128K650088
$$ 7351209 4597056 -50686 -3202850 -4916795 -6327670 -5279597 -784469 1865619
9319A865619l832973n177797K240815Q545323N165002k193012l519954L76344
$$ 1865619 -1967354 -7145151 -4904336 3640987 8805989 6612977 3093023 3469367
9311C469367J756074j031822l465733l601054k831589j216329J102972J294669
$$ 3469367 5225441 4193619 727886 -2873168 -5704757 -6921086 -5818114 -4523445
9303d523445j198996j369502L254201O173276J258771o124687o217050M18926
$$ -4523445 -5722441 -7091943 -3837742 2335534 3594305 -2530382 -8747432 -8328506
9295h328506M678699L065910M42580j72181q89797j923858m97240K055565O70437
$$ -8328506 -3649807 -583897 -141317 -313498 -1203295 -3127153 -3624393 -1568828 -898391
9286h98391m060229m953847N45410N566918L911684j177685k565475R64845M434465
$$ -898391 -4958620 -9912467 -9367057 -3800139 111545 -1066140 -3631615 -2666770 1767695
9277A767695L315350k247244p630114p083804K47084P418791O684630m28598m799003
$$ 1767695 5083045 2835801 -4794313 -11878117 -11631033 -4212242 2472388 2043790 -2755213
9268b755213j938553L106391M435307K676692R76085m56993j910530j429957J022277
$$ -2755213 -4693766 -1587375 2847932 5524624 6500709 6043716 4133186 2703229 3725506
9259C725506J169305k918825n803719j964563N026502O828076J963768l105069
$$ 3725506 4894811 1975986 -3827733 -5792296 -765794 6062282 8026050 4920981
9251D920981l756035j890518m54063Q75480K720246L375042J654985p16493j607241
$$ 4920981 1164946 -725572 -1179635 -304155 2416091 5791133 7446118 6729625 5122384
9242E122384j022826J81837J709811K763894K087210K20469q19332j030919k423806
$$ 5122384 4099558 4281395 5991206 8755100 10842310 11062779 10243447 9212528 6788722
9233F788722m339835k895443K380609N567042K065856m090499n578010j851123
$$ 6788722 2448887 -446556 1934053 7501095 9566951 5476452 -101558 -1952681
9225a952681J677343K553697K867255K816175Q9566l552985k703947K312860L932022
$$ -1952681 -275338 2278359 5145614 7961789 8051355 4498370 1794423 4107283 8039305
9216H039305r91456n271396k585639K168391J103538l473673l213364K059181
$$ 8039305 7047849 1776453 -809186 1359205 2462743 -1010930 -4224294 -2165113
9208b165113M105515k31481m548141l427213N02682K708853L285545M034357M268037
$$ -2165113 1940402 1708921 -2839220 -6266433 -5763751 -3054898 230647 4265004 8533041
9199H533041K898511Q98693p60306k320890l064719j709771K01291k32900j816480
$$ 8533041 11431552 12330245 11569939 9249049 6184330 4474559 4675850 4442950 2626470
9190B626470o95596J922264K44689n764267p953193j973288N240731N564781J307320
$$ 2626470 1930874 3853138 4097827 -1666440 -9619633 -11592921 -6352190 -787409 519911
9181E19911L3620K433792K951026j61868k823609k319749l99287P55223Q85280
$$ 519911 553531 2987323 5938349 5776481 2952872 633123 233836 989059 1874339
9172A874339Q4678j317942j752182l92820R53014P24718L47639J012783N68864
$$ 1874339 1959017 641075 -1111107 -1503927 -550913 173805 521444 1534227 2103091
9163B103091k272599l635799K22796N504580M935694j544008o177124l902799
$$ 2103091 -169508 -3805307 -3582511 1922069 6857763 5313755 -863369 -4766168
9155d766168J701787M112077J488156k594434l418067K66607M288386L041520
$$ -4766168 -3064381 1047696 2535852 -58582 -3476649 -3210042 1078344 4119864
9147D119864k793606n609657j133596M700255M270798l08697j400196J535957
$$ 4119864 1326258 -4283399 -5416995 -716740 3554058 3245361 1845165 3381122
9139C381122K271161m94687j364710J001203R22986l735182o769211l551051J761626
$$ 3381122 5652283 5157596 3792886 4794089 5717075 1981893 -4787318 -8338369 -6576743
9130f576743L582760K763384K168956P98721k001200k305237J926974N147606
$$ -6576743 -2993983 -230599 1938357 2737078 735878 -1569359 357615 5505221
9122E505221K009402l360652l534094J45754K78881l608262m083995J596394O630230
$$ 5505221 7514623 4153971 619877 765631 1044512 -2563750 -6647745 -5051351 1578879
9113A578879N095961P2871k448513k029555j659460j522040M6537J941321J453985
$$ 1578879 6674840 6747711 4299198 2269643 610183 -911857 -865320 1076001 2529986
9104B529986j033086k451581j655464l19957M41876J105691J268250m73413l166636
$$ 2529986 1496900 -954681 -2610145 -2930102 -2488226 -1382535 -114285 -587698 -3754334
9095c754334l167773P67375M432423L099936j745577l888277n99600L871118M260717
$$ -3754334 -6922107 -6154732 -1722309 1377627 -367950 -4256227 -4855827 -984709 3276008
9086C276008R47313j679990j529895l31469L62781J149887K098801J301201k037888
$$ 3276008 4223321 2543331 1013436 681967 1044748 2194635 4293436 5594637 3556749
9077C556749n276631n346456k618208M55546L141164N923575P073410L641721
$$ 3556749 -1719882 -7066338 -9684546 -9229000 -6087836 -164261 6909149 10550870
9069A0550870l280094p940214o692462k563207m24363k07143J332904L953076
$$ 10550870 7270776 -669438 -7361900 -9925107 -10349470 -10556613 -9223709 -5270633
9061e270633M030546J228096j70335J799252L237966O91458k971333k920874K96513
$$ -5270633 -1240087 -11991 -182326 1616926 4854892 5546350 2575017 -345857 -49344
9052d9344K244580J523295N05320J32749j155470l144540k978207L08419L823912
$$ -49344 2195236 3718531 4223851 4356600 3201130 56590 -2921617 -2613198 1210714
9043A210714M541205K391698q15704k944358k053056J517989L725543J083284
$$ 1210714 5751919 8143617 7327913 4383555 2330499 3848488 7574031 8657315
9035H657315l734528m678674q45941K520289K109265K69428o12369j605255k847601
$$ 8657315 4922787 244113 -601828 1918461 4027726 4297154 3684785 2079530 -768071
9026g68071j688907J518752J773590k204537l966844P91600O071016M380299j029515
$$ -768071 -2456978 -938226 835364 -1369173 -5336017 -4544417 1526599 5906898 4877383
9017D877383j385996L085739L519917l045879q826297p094144j050818K492435
$$ 4877383 3491387 6577126 10097043 7051164 -1775133 -8869277 -9920095 -7427660
9009g427660K147694O73481o27456j836353j726926P63350L770444M187762J454296
$$ -7427660 -5279966 -4606485 -5233941 -7070294 -8797220 -8033870 -4263426 -75664 1378632
9000A378632k086821l837781k808743J43707K814456L134381J076189j215265
$$ 1378632 -708189 -4545970 -7354713 -7211006 -4396550 -1262169 -185980 -1401245
8992a401245j522078L38349K249889J623425j632379m062350k425753J356361
$$ -1401245 -2923323 -2584974 -335085 1288340 -344039 -4406389 -6832142 -5475781
8984e475781K038708j102246k286379K072273O738249M555837k740049o460408
$$ -5475781 -3437073 -4539319 -6825698 -4753425 1984824 6540661 3800612 -2659796
8976b659796k763710L205678N342010L507833R73836p57546k201837l516476l927297
$$ -2659796 -5423506 -2217828 3124182 6632015 7605851 6848305 4646468 1129992 -2797305
8967b797305k636862J11231K259455J364725j882689l480409j447266J166240
$$ -2797305 -5434167 -5322936 -3063481 -1698756 -3581445 -7061854 -8509120 -7342880
8959g342880J323070Q88292K463532L653411J084338k448619j577522K392052
$$ -7342880 -6019810 -5131518 -2667986 985425 2069763 -378856 -1956378 435674
8951D35674L133221k55802k151347m08988M68837j790478k874826J20811L073789
$$ 435674 3568895 3313093 1161746 752758 1221595 -568883 -3443709 -3322898 -249109
8942b49109J586026k048077l152319j626179l12681O5048M94624J084213J862846
$$ -249109 1336917 -711160 -3863479 -5489658 -5802339 -5737291 -5242667 -4158454 -2295608
8933b295608L320566M063637J548052k919887m336091j438259R37510l19447j869120
$$ -2295608 1024958 5088595 6636647 3716760 -619331 -2057590 -1120080 -1439527 -3308647
8924c308647n24742J241445R63770J457882M573728N260959p08362p515977o354066
$$ -3308647 -3833389 -2591944 -1628174 -170292 4403436 9664395 8956033 1440056 -4914010
8915d914010J026065M771768J792229r67305J175788L878681K180788j592824
$$ -4914010 -3887945 883823 2676052 1708747 2884535 6763216 8944004 7351180
8907G351180k563279q07217K29723n08500j328325j113094j56579Q55969Q99629
$$ 7351180 4787901 3980684 4210407 3701907 2373582 1260488 1103909 1959878 2859507
8898B859507o97460k373832j354730K068700L837745J646383j362886j107473
$$ 2859507 2162047 -211785 -1566515 502185 4339930 5986313 4623427 3515954
8890C515954J329159J627124p91433j809716P62409L435216K140451j651347l218271
$$ 3515954 4845113 6472237 5680804 3871088 4633497 8068713 10209164 8557817 5339546
8881E339546j593153l38823j255986j584720P20788K863267J705034o82010m71365
$$ 5339546 3746393 3407570 2151584 566864 1287652 4150919 5855953 5173943 4702578
8872D702578J034910m26440l777866k930923L269889P735329M984058r95039l165271
$$ 4702578 5737488 5311048 1533182 -1397741 1872148 9607477 14591535 13596496 10431225
8863A0431225j497696j106689l035604l070296P41344M792530N127372K011218
$$ 10431225 8933529 7826840 4791236 1720940 2462284 7254814 12382186 14393404
8855A4393404j909777m843826n803357l900606L10335M063010M648436K223837
$$ 14393404 12483627 7639801 1836444 -2064162 -1753827 2309183 6957619 9181456
8847I181456m77957j213066n10134n70219k108802l322425k603832q68555M28758
$$ 9181456 8703499 7490433 6980299 6410080 4301278 978853 -1624979 -2493534 -2064776
8838b064776K019244M700858N795873K042357m095517o098114k588601M69941
$$ -2064776 -45532 4655326 10451199 12493556 8398039 2299925 -288676 181265
8830A81265q75371k645896k79102L448098L420898Q45550K95916J225667j48374
$$ 181265 -694106 -3340002 -3619104 -171006 3249892 4095442 4391358 5617025 5468651
8821E468651k343502j92211N075277N588015j275220q016071p405912j799168
$$ 5468651 3125149 2932938 8008215 13596230 12321010 4304939 -3100973 -4900141
8813d900141J838980J242612j108366l158309l869667j739591K661607M934862
$$ -4900141 -3061161 -1818549 -2926915 -6085224 -9954891 -11694482 -9032875 -4098013
8805d098013K050329k442108k725770J076969L442504J525176j706320k561544
$$ -4098013 -2047684 -4489792 -7215562 -6138593 -2696089 -1170913 -2877233 -5438777
8797e438777q89852J440564K975183K788331J043873k7293J420679L233595J627401
$$ -5438777 -6328629 -4888065 -1912882 875449 1919322 1892029 3312708 6546303 8173704
8788H173704k454187l831032j259371J02454k647292m411180j28349N859991N489943
$$ 8173704 5719517 1888485 629114 731568 -1915724 -6326904 -6455253 -595262 4894681
8779D894681m89297l636550r46795J605805J95268p90632K178496M437930J143831
$$ 4894681 4405384 768834 -177961 1427844 1623112 832480 3010976 7448906 8592737
8770H592737l428445k325645K362940K646971k488821n859291l624347J3730J087935
$$ 8592737 5164292 2838647 5201587 7848558 5359737 -499554 -4123901 -4110171 -3022236
8761c022236J454508L327135M517189K810574J98080r61755j899327l945093m858132
$$ -3022236 -1567728 1759407 6276596 9087170 9285250 8323495 6424168 2479075 -2379057
8752b379057k561550O46514J686025J760187L475889N118526K759315k789133
$$ -2379057 -4940607 -4294093 -2608068 -847881 2628008 7746534 10505849 7716716
8744G716716n895110l485192J232982L492695K578082J246414J376979J915550
$$ 7716716 1821606 -1663586 -430604 3062091 5640173 6886587 8263566 10179116
8736A0179116Q04421k016502m128084l428302q04870J149992J712933K387148
$$ 10179116 10983537 8967035 4838951 1410649 605779 1755771 3468704 5855852
8728E855852L546014L280640Q25173j253565m52449J625679J097601k875210o743397
$$ 5855852 9401866 12682506 13507679 12254114 11801665 13427344 14524945 11649735 4906338
8719D906338o793126l300435J28947P76383l38859k34468J764269K958535J224720
$$ 4906338 -1886788 -5187223 -5058276 -4281893 -4620752 -4855220 -3090951 -132416 1092304
8710A092304j637551k313213m43521J645547K734984L470541L768543K348838
$$ 1092304 -545247 -2858460 -3301981 -1656434 1078550 4549091 8317634 10666472
8702A0666472q90332m148191n350823l157297K153730O817084N331444k290126
$$ 10666472 9776140 5627949 277126 -2880171 -726441 6090643 11422087 9131961
8694I131961p882859m831586K247506M031623L32809j125467J211104L40651n707032
$$ 9131961 1249102 -3582484 -1334978 2696645 3029454 1903987 3115091 3455742 -2251290
8685b251290q684211l434261L079521K806911j126813r67218L011232M730414
$$ -2251290 -10935501 -14369762 -11290241 -8483330 -9610143 -10577361 -7566129 -2835715
8677b835715K885069J253152J231838J087741N55178L78730l99935j806001r76289
$$ -2835715 49354 1302506 2534344 3622085 4177263 4555993 4156058 2350057 1373768
8668A373768K231331K270335l389894p685812l741075L485431M410685j79974
$$ 1373768 3605099 5875434 2485540 -5200272 -8941347 -5455916 -1045231 -1225205
8660a225205j771628P55476L53179l957082m117129K804478Q119131M326806l689728
$$ -1225205 -2996833 -2241357 -1888178 -5845260 -9962389 -7157911 961220 5288026 1598298
8651A598298o200575j766828K867166K698044m59253j591487J390992M964903
$$ 1598298 -4602277 -6369105 -3501939 -803895 -1263148 -2854635 -1463643 3501260
8643C501260L781160j872695n059749j660143K868385J589715k696014k045084
$$ 3501260 7282420 5409725 349976 -1310167 1558218 3147933 451919 -1593165
8635a593165L249962N190005J449711j616538n66667K73725j799934k917249q42177
$$ -1593165 1656797 6846802 8296513 6679975 6113308 6387033 4587099 1669850 827673
8626H27673M42260j253854j798477R84601K417928k17649j788185J371238L733823
$$ 827673 1269933 16079 -1782398 -797797 1620131 1402482 -385703 985535 4719358
8617D719358j76841n471787m600209j8462M19263l056773l307607J020690L920206
$$ 4719358 4542517 -929270 -5529479 -5547941 -5128678 -8185451 -11493058 -10472368 -6552162
8608f552162K932584K241058L503927K298318l114537o623473k475722N921961
$$ -6552162 -3619578 -1378520 2125407 4423725 1309188 -5314285 -7790007 -1868046
8600a868046R911424N902547j551935n652304l988883P9074J428698j238499m050740
$$ -1868046 8043378 13945925 12393990 6741686 2752803 2831877 4260575 3022076 -1028664
8591a028664l051754M96274K016348n129k465082k492661q35150M57462J084954
$$ -1028664 -4080418 -3584144 -1567796 -1572925 -4038007 -6530668 -7365818 -6908356 -5823402
8582e823402J704037J936308R51824q11997j883083j434426j3954J184185J456569
$$ -5823402 -4119365 -2183057 -1231233 -2043230 -3926313 -5360739 -5374693 -4190508 -2733939
8573b733939J291283J969470L924881N515048M362732M05145l244462l469062
$$ -2733939 -1442656 526814 4451695 9966743 14329475 14734620 11490158 8021096
8565H021096p91600J341270Q70325q30474j728464j932547k084512r85851K149739
$$ 8021096 7229496 8570766 9441091 8610617 6882153 4949606 2865094 1879243 4028982
8556D028982M441293K475905j644308k309557P93344J573697k502634n510460
$$ 4028982 8470275 10946180 9301872 6992315 7785659 9359356 6856722 1346262
8548A346262k401414K528324K609688n42485q57173J237668L74273l053631k981155
$$ 1346262 -1055152 1473172 4082860 3540375 2683202 3920870 4295143 1241512 -1739643
8539a739643J469998M135261K171494j01747J57395p893k089528k460077J67827
$$ -1739643 -269645 3865616 6037110 5935363 6092758 6084865 3995337 1535260 1703087
8530A703087J129873j744593l216887L66012L821717J415994l267644l109154
$$ 1703087 2832960 1088367 -2128520 -1762508 2059209 3475203 207559 -2901595
8522b901595J182462L192744J456548L23115J458820J582613j059988l620900
$$ -2901595 -1719133 1473611 2930159 3253274 4712094 6294707 5234719 1613819
8514A613819l111164k09921K089274J461222j645982l458062l71336N455625P252176
$$ 1613819 -1497345 -1707266 382008 1843230 197248 -3260814 -3632150 1823475 9075651
8505I075651K719052k095713j510731J540330R12703k881397m304538j858781
$$ 9075651 11794703 9698990 8188259 9728589 10641292 7759895 3455357 1596576
8497A596576P00640R49617j7501j143561k099319j279166K094834M815216L307038
$$ 1596576 2297216 3246833 3229332 2085771 -13548 -1292714 802120 5617336 8924374
8488H924374p50828l099757l519067m335219m087680M97795O700184P292057J106738
$$ 8924374 8173546 5073789 1554722 -2780497 -6868177 -6370382 329802 7621859 8728597
8479H728597m387568l273078J515830L554053R86014l313445n869623m648245
$$ 8728597 4341029 1067951 2583781 6137834 7123848 3810403 -2059220 -6707465
8471f707465j03569M118793M353850J709790N59929J891505K214953j72561k485076
$$ -6707465 -6811034 -2692241 1661609 3371399 3931328 5822833 8037786 7865225 5380149
8462E380149k548777k011311k273937j579785J033601K716398R69745k217718
$$ 5380149 2831372 820061 -1453876 -3033661 -2000060 716338 1686083 -531635
8454e31635l478729k675697j496177k3729K078341L057750J161640j955326k801667
$$ -531635 -4010364 -6686061 -8182238 -8205967 -6127626 -3069876 -1908236 -3863562 -6665229
8445f665229l74692L078949M763711L355706k50955k801018j180960L234150M965929
$$ -6665229 -7039921 -3960972 802739 4158445 3907490 1106472 -74488 3159662 8125591
8436H125591J385290l113777k945920P77494K200656o07723l520723l083829q74519
$$ 8125591 9510881 6397104 3451184 4228678 6429334 5821611 2300888 -782941 -1657460
8427a657460L97616J203178K869063L828847J765603j913350l357898j759519
$$ -1657460 -1259844 -56666 2812397 6641244 8406847 6493497 3135599 1376080
8419A376080j81032m10992l54813J871366M211577L611149O15006j891757l010795
$$ 1376080 1195048 784056 429243 2300609 6512186 10123335 10738341 8846584 5835789
8410E835789l659215l288969p37216K055058J596514j305227j795794J442841
$$ 5835789 2176574 -1112395 -1849611 205447 1801961 496734 -1299060 143781
8402A43781L484755O44108l602237l847052n04874J859448J425440K7106r89572
$$ 143781 3628536 4272644 670407 -3176645 -3681519 -1822071 -396631 -369525 -1359097
8393a359097j599809j155851M64761J143698j68294k23660L729223P562041M630168
$$ -1359097 -2958906 -4114757 -3649996 -2506298 -2674592 -2898252 830971 8393012 13023180
8384A3023180l785549q762744n729501k17293Q65703j599413k245672L05590K788773
$$ 13023180 9237631 474887 -5254614 -5471907 -4606204 -6205617 -8451289 -8145699 -5356926
8375e356926K986608J877408P57268l83712j263886n32789K220854M738599L864616
$$ -5356926 -2370318 -492910 264358 -119354 -1383240 -1916029 304825 5043424 8908040
8366H908040m24245l853056k548509J434071K242399j367997l751668j005598
$$ 8908040 8483795 4630739 2082230 3516301 5758700 4390703 639035 -366563
8358c66563K496827R32151l251808l042207J741109M332548J990859q06446j238503
$$ -366563 2130264 3062415 -189393 -3231600 -1490491 2842057 4832916 4026470 2787967
8349B787967k050265l908179k118637M265309P578904K446120m448816l438309
$$ 2787967 737702 -3170477 -5289114 -1023805 6555099 9001219 4552403 1114094
8341A114094L466703N769674K48405n491930n372431k251254p99436l41876J272225
$$ 1114094 4580797 10350471 10598876 5106946 -265485 -2516739 -3316175 -3658051 -2385826
8332b385826K239806J40441k811120k689319j9365J493036J308119K492491N514604
$$ -2385826 -146020 -5579 -2816699 -5506018 -5525383 -4032347 -2724228 -231737 5282867
8323E282867O107667J509936m428995n730850k176636J062755J197823Q67495
$$ 5282867 11390534 12900470 8471475 2740625 563989 1626744 2824567 3692062
8315C692062K187093K273749j694318o167417n135984P87481M596127K673469
$$ 3692062 5879155 8152904 6458586 291169 -4844815 -4057334 538793 3212262
8307C212262q39089j186148M53729P64983M90033K223967M424605K685660l342628
$$ 3212262 2373173 1187025 1640754 2405737 2895770 5119737 9544342 12230002 8887374
8298H887374q406087p782952k289695L442137N564947L428528o05354k897293
$$ 8887374 481287 -7301665 -9591360 -6149223 -584276 2844252 2238898 -658395
8290f58395j374079K502836N060846L888325k11998m201959n257783l039890k06522
$$ -658395 -2032474 470362 5531208 9419533 9207535 5005576 -252207 -3292097 -3498619
8281c498619K29683j314727j280283J881911M690828K956342k128087m990207
$$ -3498619 -3268936 -4583663 -5863946 -3982035 708793 3665135 1537048 -3453159
8273c453159k552700K404278N065861L651451J26889k325698j854019N90233J777393
$$ -3453159 -6005859 -3601581 1464280 5115731 5242620 2916922 1062903 1653136 3430529
8264C430529m04998l737629l690512N72944M332606L132152j307518l501190j522979
$$ 3430529 3025531 -712098 -4402610 -3829666 502940 3635092 2327574 -1173616 -2696595
8255b696595J221006J681249J161970J901192K635296Q06275k434645l284417
$$ -2696595 -1475589 205660 1367630 3268822 5904118 6710393 4275748 991331
8247I91331j051352J009702J170516J438685K739744K216371j598307m719630
$$ 991331 -60021 949681 2120197 3558882 6298626 8514997 6916690 2197060
8239B197060l108523P74371J802448L20636N56406K256318R10484l271131l969275
$$ 2197060 -911463 -137092 1665356 1985992 2542398 4798716 5709200 2438069 -1531206
8230a531206J198881N852854L908845k015376n635362n573623l927039p14643
$$ -1531206 -332325 5520529 9429374 7413998 1778636 -3794987 -7722026 -8436669
8222h436669M192071O909454L999021q29548j076741K538920L201889q83287l489894
$$ -8436669 -4244598 2664856 6663877 5834329 4757588 7296508 10498397 9615110 6125216
8213F125216k53418M528431M154912j602880p054232p424820k981746J713478
$$ 6125216 5871798 10400229 14555141 12952261 5898029 -1526791 -4508537 -2795059
8205b795059J727130k887777n791885j710647N477531P016641J832963j763601
$$ -2795059 -1067929 -3955706 -9747591 -11458238 -5980707 1035934 2868897 1105296
8197A105296R56582L784948o237o320745o435195k79030M463404M270751K661594
$$ 1105296 2061878 5846826 5840589 -480156 -6915351 -7194381 -2730977 1539774 4201368
8188D201368J814281l92484l697977l594155Q42270L817575J483233j860142r81440
$$ 4201368 6015649 5623165 1925188 -1668967 -826697 2990878 4474111 2613969 1632529
8179A632529J653823M46076l414404l459283J552977N191147K614120k871199
$$ 1632529 3286352 3732428 318024 -3141259 -1588282 3602865 6216985 3345786
8171C345786m883599k066478J607655K540758R32079p27431p39178L06539M97726
$$ 3345786 -1537813 -3604291 -1996636 544122 1476201 748770 9592 316131 813857
8162H13857r21312k316283j614019R10519K972836L154773K053482O70996p52964
$$ 813857 -107455 -2423738 -4037757 -3127238 -154402 3000371 5053853 5724849 4971885
8153D971885k062499k741245k497948j341404O74916K601030K344924n93745k880991
$$ 4971885 2909386 168141 -2329807 -3671211 -2996295 -395265 1949659 1355914 -1525077
8144a525077q72102L703620N142192J539131k681256l439021k021375r89230N08992
$$ -1525077 -2397179 1306441 6448633 7987764 5306508 1867487 -153888 -1143118 -634126
8135f34126L295579L942108l72132n278808m032722J997149M552906Q14758k656087
$$ -634126 2661453 6603561 6231429 952621 -3080101 -1082952 3469954 4284712 1628625
8126A628625p65989K274455O60438l124675k640015J780346L813126J323327j338131
$$ 1628625 862636 3137091 3797529 672854 -1967161 -186815 3626311 4949638 3611507
8117C611507j555309k035173m043431l473285K141614P529648O055114o40025
$$ 3611507 2056198 21025 -4022406 -7495691 -5354077 2175571 8230685 7590660
8109G590660m990142m016192j660818q81225K57557K784263L085008r74821m494787
$$ 7590660 2600518 -1415674 -3076492 -3957717 -3700160 -915897 2169111 1194290 -3300497
8100c300497j493459N699086Q563123L727690k747321l644171P56118M343160
$$ -3300497 -4793956 905130 9468253 13195943 10448622 6804451 7560569 11903729
8092A1903729K894967k073195n818664n120554j110428K062491J865721J5670
$$ 11903729 14798696 12725501 6906837 1786283 675855 2738346 4604067 4619737
8084D619737q02302j242375l250731m981475k600733K538594M132489M19539k168966
$$ 4619737 3817435 2575060 -675671 -5657146 -8257879 -5719285 -1586796 -1167257 -3336223
8075c336223J330447O144200M641412k156578o343625m397507k29780K161037
$$ -3336223 -2005776 4138424 8779836 6623258 279633 -4117874 -4347654 -2186617
8067b186617K708358J911247k96326j515358J182454N055449L849224j922384
$$ -2186617 521741 2432988 2136662 621304 1803758 6859207 10708431 8786047
8059H786047m056121M17791L093381k732187r697231o406531M368438Q724909
$$ 8786047 4729926 5147717 8241098 5508911 -4188320 -10594851 -6226413 2498496
8051B498496K257640m010768j415360L697646K058856k768368j168253N153646
$$ 2498496 4756136 745368 -669992 3027654 5086510 2318142 1149889 6303535
8043F303535M944261l882089r440120l692765N133422N029139k332078n645064
$$ 6303535 11247796 7365707 -2074413 -5767178 -633756 4395383 2063305 -3581759
8035c581759j174984L937874M320699K672134K020385M03925l144456m505678
$$ -3581759 -4756743 -818869 3501830 6173964 8194349 8598274 5453818 948140
8027I48140j279256J918436M93321k254197n75232L625281L305335k282983n965331
$$ 948140 -331116 1587320 2080641 -173556 -748788 2876493 6181828 3898845 -2066486
8018b066486l526508K17223o82408m086525l090496L466509Q615208O267721o90330
$$ -2066486 -5592994 -5375771 -6058179 -10144704 -13235200 -9768691 -1153483 5114238 4423908
8009D423908m106636j216270K159987M67672l252986k125219L492000N749180
$$ 4423908 317272 -898998 1260989 1728661 -1524325 -3649544 -157544 5591636
8001E591636Q28462n331690n686525j369664J724392J588034N22815k25048j195498
$$ 5591636 6420098 1088408 -4598117 -5967781 -4243389 -2655355 -2132540 -2357588 -3553086
7992c553086j629828j02270K548298M192189M180552K651444o95994m391524m815379
$$ -3553086 -5182914 -5285184 -2736886 1455303 5635855 8287299 7591305 3199781 -1615598
7983a615598j466185Q44939q95096k648376l48198K264396j69834m343047k792918
$$ -1615598 -3081783 -2236844 -3131940 -5780316 -6128514 -3864118 -4033952 -8376999 -11169917
7974a1169917L446091N974733K287775j331958q73254M86553K42782N50561J616542
$$ -11169917 -7723826 -1749093 538682 -793276 -1666530 -1179977 -937195 -386634 1229908
7965A229908n08381n746357p241141j481884N234000N452534N02521k956509k084789
$$ 1229908 721527 -5024830 -12265971 -13747855 -8513855 -3061321 -2558800 -5515309 -7600098
7956g600098P38340K322901J132356j823584k713451J086886N949847N654880
$$ -7600098 -6861758 -4538857 -3406501 -5230085 -7943536 -6856650 -906803 4748077
7948D748077N26546k986589k335533j192842p79745K310195P156432O946491N35769
$$ 4748077 5274623 2288034 -47499 -1240341 -2020086 290109 7446541 14393032 14928801
7939A4928801l891052j947803j57232l427439n465359m05589N273909L148397
$$ 14928801 11037749 9089946 8932714 5505275 39916 -365673 4908236 8056633
7931H056633k502560k256564K265120K380486j783214k554809M13560l24002n700491
$$ 8056633 5554073 3297509 5562629 7943115 6159901 3605092 4018652 3694650 -2005841
7922b005841p615712k461740L400876M244028K174284J179250J547422K416480
$$ -2005841 -9621553 -12083293 -8682417 -4438389 -2264105 -1084855 462567 2879047
7914B879047L384145K379193j809719m761923j249877N207568N563635j391344
$$ 2879047 6263192 8642385 6832666 2070743 820866 6028434 11592069 10200725
7906A0200725p090038n832361j190215J901699L238654L215083N60356k928607
$$ 10200725 3110687 -2721674 -3911889 -2010190 1228464 4443547 5003903 2075296
7898B075296k728970N83828J087987k345095l506087L06171L037969j1599m354885
$$ 2075296 -653674 -69846 1018141 -1326954 -4833041 -4526870 -1488901 -1500500 -5855385
7889e855385l959889k92612J797388J629918P82497j249516m197313m447228l85181
$$ -5855385 -9815274 -10107886 -8310498 -6680580 -5898083 -7147599 -11344912 -15792140 -16177321
$$ [...]
##END NTUPLES=NMR SPECTRUM
##END=
