##TITLE=31Pdec_SR76x
 CDCl3, 124 sc
 23.08.2021
##JCAMPDX= 6.0         $$ Bruker NMR JCAMP-DX V2.0
##DATA TYPE= NMR SPECTRUM
##DATA CLASS= NTUPLES
##ORIGIN= UXNMR, Bruker Analytische Messtechnik GmbH
##OWNER= root
$$ XWIN-NMR		Version 3.5
$$ Mon Aug 23 12:52:19 2021 Russian Standard Time (UT+4h)  she@DPX200
##.OBSERVE FREQUENCY= 81.013821
##.OBSERVE NUCLEUS= ^31P
##.ACQUISITION MODE= SIMULTANEOUS
##.ACQUISITION SCHEME= undefined
##.AVERAGES= 124
##.DIGITISER RES= 16
##SPECTROMETER/DATA SYSTEM= spect
##.PULSE SEQUENCE= zgpg30
##.SOLVENT NAME= CDCl3
##.SHIFT REFERENCE= (INTERNAL, CDCl3, 0, 248.564)
##AUDIT TRAIL= $$ (NUMBER, WHEN, WHO, WHERE, WHAT)
$$ ##TITLE= Audit trail, XWIN-NMR		Version 3.5
$$ ##JCAMPDX= 5.01
$$ ##ORIGIN= Bruker BioSpin GmbH
$$ ##OWNER= she
$$ F:/spectra/data/she/nmr/P31/1/pdata/1/auditp.txt
$$ ##AUDIT TRAIL=  $$ (NUMBER, WHEN, WHO, WHERE, WHAT)
(   1,<2021-08-23 12:49:51.93 +0400>,<she>,<DPX200>,
      <continue with go, POWCHK disabled, PULCHK disabled
       configuration hash MD5:
       00 E9 B6 7A A2 85 ED C7 34 08 36 98 17 FE 4E 26
       data hash MD5: 32K
       A1 2B 01 DE 51 EC D1 49 5D 74 D6 45 17 D7 C1 6A>)
(   2,<2021-08-23 12:51:30.64 +0400>,<she>,<DPX200>,
      <Start of raw data processing
       efp BC_mod = 2 LB = 1 FT_mod = 6 PKNL = 1 PHC0 = -7396.52 PHC1 = 126.6746 SI = 64K 
       data hash MD5: 64K
       E2 7D 47 88 F6 1E 19 EB A9 4A 1A 9A 33 BE 43 CB>)
(   3,<2021-08-23 12:51:50.25 +0400>,<she>,<DPX200>,
      <pk PHC0 = -89.68574 PHC1 = 232.4 
       data hash MD5: 64K
       A1 29 CB E9 59 9E 4B BF F7 F8 AF 24 52 67 A8 55>)
(   4,<2021-08-23 12:51:53.76 +0400>,<she>,<DPX200>,
      <abs ABSG = 5 
       data hash MD5: 64K
       CA AA A8 5C 50 C3 FD 37 D3 59 E1 77 10 F3 14 A0>)
$$ ##END=
$$ 
$$ hash MD5
$$ E2 88 13 3B 02 1B FC 23 4C CB 9C 9C 13 C9 0E 94
##$RELAX= 
##$RELAX= 
##$RELAX= 
##$RELAX= 
##$RELAX= 
##$RELAX= 
##$RELAX= 
##$RELAX= 
$$ Bruker specific parameters
$$ --------------------------
##$DU= <F:/spectra>
##$EXPNO= 1
##$NAME= <P31>
##$PROCNO= 1
##$TYPE= <nmr>
##$USER= <she>
##$AMP= (0..31)
100 100 100 100 100 100 100 100 100 100 100 100 100 100 100 100 100 100 
100 100 100 100 100 100 100 100 100 100 100 100 100 100 
##$AQSEQ= 0
##$AQ_mod= 1
##$AUNM= <au_zg>
##$AUTOPOS= <>
##$BF1= 81.014009
##$BF2= 200.13
##$BF3= 200.13
##$BF4= 200.13
##$BF5= 200.13
##$BF6= 200.13
##$BF7= 200.13
##$BF8= 200.13
##$BYTORDA= 1
##$CFDGTYP= 0
##$CFRGTYP= 5
##$CHEMSTR= <none>
##$CNST= (0..31)
1 1 145 1 1 1 1 1 1 1 1 1 1 1 1 1 1 1 1 1 1 1 1 1 1 1 1 1 1 1 1 1 
##$CPDPRG= <waltz16>
##$CPDPRG1= <>
##$CPDPRG2= <waltz16>
##$CPDPRG3= <>
##$CPDPRG4= <mlev>
##$CPDPRG5= <mlev>
##$CPDPRG6= <mlev>
##$CPDPRG7= <mlev>
##$CPDPRG8= <mlev>
##$CPDPRGB= <>
##$CPDPRGT= <>
##$D= (0..31)
0 1 0 0 0 0 0 0 0 0 0 0.03 2e-05 3e-06 0 0 0 0 0 0 0 0 0 0 0 0 0 0 0 0 
0 0 
##$DATE= 1629708395
##$DBL= (0..7)
120 120 120 11 120 120 24 19 
##$DBP= (0..7)
150 150 150 150 150 150 150 150 
##$DBP07= 0
##$DBPNAM0= <>
##$DBPNAM1= <>
##$DBPNAM2= <>
$$ [...]
##$SUBNAM3= <"">
##$SUBNAM4= <"">
##$SUBNAM5= <"">
##$SUBNAM6= <"">
##$SUBNAM7= <"">
##$SUBNAM8= <"">
##$SUBNAM9= <"">
##$SW= 501.771253377433
##$SWIBOX= (0..15)
0 1 3 0 0 0 0 0 0 0 0 0 0 0 0 0 
##$SW_h= 40650.406504065
##$TD= 32768
##$TD0= 1
##$TE= 0
##$TE2= 300
##$TE3= 300
##$TEG= 300
##$TL= (0..7)
0 120 53 12 22 120 120 120 
##$TP= (0..7)
150 150 150 150 150 150 150 150 
##$TP07= 0
##$TPNAME0= <>
##$TPNAME1= <>
##$TPNAME2= <>
##$TPNAME3= <>
##$TPNAME4= <>
##$TPNAME5= <>
##$TPNAME6= <>
##$TPNAME7= <>
##$TPOAL= (0..7)
0.5 0.5 0.5 0.5 0.5 0.5 0.5 0.5 
##$TPOFFS= (0..7)
0 0 0 0 0 0 0 0 
##$TUNHIN= 0
##$TUNHOUT= 0
##$TUNXOUT= 0
##$USERA1= <user>
##$USERA2= <user>
##$USERA3= <user>
##$USERA4= <user>
##$USERA5= <user>
##$V9= 5
##$VALIST= <valist>
##$VCLIST= <CCCCCCCCCCCCCCC>
##$VD= 0
##$VDLIST= <DDDDDDDDDDDDDDD>
##$VPLIST= <PPPPPPPPPPPPPPP>
##$VTLIST= <TTTTTTTTTTTTTTT>
##$WBST= 1024
##$WBSW= 4
##$XGAIN= (0..3)
0 0 0 0 
##$XL= 0
##$YL= 0
##$YMAX_a= 2470
##$YMIN_a= -9212
##$ZGOPTNS= <>
##$ZL1= 120
##$ZL2= 120
##$ZL3= 120
##$ZL4= 120
##$ABSF1= 248.5645
##$ABSF2= -253.2056
##$ABSG= 5
##$ABSL= 3
##$ALPHA= 0
##$AQORDER= 0
##$ASSFAC= 0
##$ASSFACI= 0
##$ASSFACX= 0
##$ASSWID= 0
##$AUNMP= <proc_1d>
##$AZFE= 0.1
##$AZFW= 0.5
##$BCFW= 0
##$BC_mod= 2
##$BYTORDP= 0
##$COROFFS= 0
##$CY= -3
##$DATMOD= 1
##$DC= 0
##$DFILT= <>
##$DTYPP= 0
##$F1P= 0
##$F2P= 0
##$FCOR= 1
##$FTSIZE= 65536
##$FT_mod= 6
##$GAMMA= 0
##$GB= 0
##$INTBC= 1
##$INTSCL= 5.30512e-09
##$ISEN= 30
##$LB= 1
##$LEV0= 0
##$LPBIN= 0
##$MAXI= 10000
##$MC2= 0
##$MEAN= 0
##$ME_mod= 0
##$MI= 50
##$NCOEF= 0
##$NC_proc= -7
##$NLEV= 6
##$NOISF1= 182.463
##$NOISF2= 159.3651
##$NSP= 0
##$NTH_PI= 0
##$NZP= 0
##$OFFSET= 248.5645
##$PC= 4
##$PHC0= -7486.206
##$PHC1= 359.0746
##$PH_mod= 1
##$PKNL= yes
##$PPARMOD= 0
##$PSCAL= 0
##$PSIGN= 0
##$REVERSE= no
##$SF= 81.014009
##$SI= 65536
##$SIGF1= 159.3651
##$SIGF2= -187.1042
##$SINO= 113.3802
##$SIOLD= 16384
##$SREGLST= <1H.CDCl3>
##$SSB= 0
##$STSI= 65536
##$STSR= 0
##$SW_p= 40650.406504065
##$SYMM= 0
##$S_DEV= 0
##$TDeff= 32768
##$TDoff= 0
##$TI= <>
##$TILT= no
##$TM1= 0
##$TM2= 0
##$TOPLEV= 0
##$USERP1= <user>
##$USERP2= <user>
##$USERP3= <user>
##$USERP4= <user>
##$USERP5= <user>
##$WDW= 1
##$XDIM= 65536
##$YMAX_p= 337189628
##$YMIN_p= -23421535
$$ End of Bruker specific parameters
$$ ---------------------------------
##NTUPLES= NMR SPECTRUM
##VAR_NAME=  FREQUENCY,     SPECTRUM/REAL,   SPECTRUM/IMAG
##SYMBOL=    X,             R,               I
##VAR_TYPE=  INDEPENDENT,   DEPENDENT,       DEPENDENT
##VAR_FORM=  AFFN,          ASDF,            ASDF
##VAR_DIM=   65536,         65536,           65536
##UNITS=     HZ,            ARBITRARY UNITS, ARBITRARY UNITS
##FACTOR=    0.620285442955139, 1,           1
##FIRST=     20137.2065510759, 0,            0
##LAST=      -20513.1999529892, 0,           0
##MIN=       -20513.1999529892, -23421535,   0
##MAX=       20137.2065510759, 337189628,    0
$$ Real data points
##PAGE= N=1
##DATA TABLE= (X++(R..R)), XYDATA
$$ [...]
13032b544975J216383j443292J409452M129425J233979k018748L55941L638328
13024E976493J154856l419234l098920j69450p30745k363262J091060O491686
13016D932484N133345k404127o429053k984227J509253J377387j272327k392237
13008b529502j674510l05671J418418K526722J648837k83558j038543n73032k70675
12999a081514J36572J308591J683057J27622q51495R24326K387251m17979m986944
12990g70513n314299j012949K582939K795197J925236J263487q38993l809956
12982c179851l689797O22735M605216M220654J414077Q64606L302558M451329
12974A2611527M02850o780218r773859m107299M818369O880236P29450l378373
$$ plain form
13032 -2544975 -1328592 -2771884 -1362432 2766993 4000972 1982224 2338165 5976493
13024 5976493 7131349 3712115 613195 443745 -287000 -2650262 -1559202 4932484
13016 4932484 10065829 7661702 1232649 -1751578 -242325 1135062 -137265 -2529502
13008 -2529502 -4204012 -4509683 -3091265 -564543 1084294 800736 -237807 -810839 -1081514
12999 -1081514 -944942 363649 2046706 2174328 1322833 2247159 4634410 4216431 -770513
12990 -770513 -6084812 -7097761 -4514822 -1719625 205611 1469098 630105 -3179851
12982 -3179851 -6869648 -6246913 -1641697 2578957 3993034 4857640 8160198 12611527
12974 12611527 13014377 6234159 -3539700 -7646999 -2828630 4051606 4781056 1402683
12966A402683J857245R193943O863329l838837j0066641n504385K260256M013695
12958F181288L71197k562348k509089j337213l10137M79679L99562n19432m62961
12949b69454J413292K856965J700206l27606K23755L166775M275513R02240m021177
12940I920509n322190k161063J049952Q49332q96571r81267l87415j652117k773834
12931b354664K35478N220805N404790J97908l124110j067065J029325l32018j84932
12922E025517M278654N642602j613927q861449n272487L923955N159739j221719
12914G060885k394779L745656M179186o174922j3553463o475719N667835P104699
12906h40622p92902l997491J466117N192915K87486o418361n509241J783633O595223
$$ plain form
12966 1402683 3259928 12453871 19317200 15478363 5411722 -92663 2167593 6181288
12958 6181288 6552485 3990137 1481048 143835 -166302 313377 712939 193507 -269454
12949 -269454 1143838 4000803 5701009 5373403 5597158 8763933 13039446 13941686 9920509
12940 9920509 4598319 2437256 3487208 4336540 3439969 2458702 2071287 419170 -2354664
12931 -2354664 -2119186 3101619 8506409 8704317 5580207 4513142 5542467 5210449 5025517
12922 5025517 9304171 14946773 13332846 4471397 -801090 3122865 8282604 7060885
12914 7060885 4666106 8411762 12590948 6416026 -7137437 -13613156 -7945321 -840622
12906 -840622 -1633524 -5631015 -4164898 1028017 1315503 -5102858 -10612099 -8828466 -2233243
12897b233243M557724N6213q54068J744981K743024k22100l261597k146749J259844
12888A644029K247129Q23955Q07103K275696J197535k797575m749370k395640
12880i47138K91231K51486o2232J285912J072796l017449o789144n302718k78883
12871a3496139L278482M182207L857094J903289j526251k430692J656659N796224
12863C220873L882451j383665k112957K254320M015893m05527m838365l020724
12855A612299K286453M022512O40796l084624k997276J84554K780095K059626
12847G504435j474020m595822m504764j759934O63976J066010M19927K20762O92859
12838a766571J456805K331325K864440K311117O18855j405906k975456l480996
$$ plain form
12897 -2233243 2324481 2380694 1526626 3271607 6014631 5792531 2530934 384185 1644029
12888 1644029 3891158 4715113 5522216 7797912 8995447 6197872 1448502 -947138
12880 -947138 -655907 -404421 -466653 819259 1892055 -1125394 -7914538 -13217256 -13496139
12871 -13496139 -10217657 -6035450 -2178356 -275067 -1801318 -4232010 -2575351 3220873
12863 3220873 7103324 5719659 3606702 5861022 9876915 9471388 4633023 1612299
12855 1612299 3898752 7921264 8562060 5477436 2480160 2664714 5444809 7504435
12847 7504435 6030415 1434593 -3070171 -4830105 -4166129 -3100119 -2680192 -2459430 -1766571
12838 -1766571 -309766 2021559 4885999 7197116 7815971 6410065 3434609 -46387
12830d6387k203931O49087K885946K204341o10730k221992j079407N95660K16784
12821C89371j470534j848034n26649K85589m43438p26039J191369L357591K300891
12812B510117j602559l690347j142712K778025K965135n49748k964105j645240
12804c341434P83608J204839N72745J450960L233654K895629j68143k881448k595640
12795A154770m45451N57117m06785j375396r01437k10697r63432k030718p18579
12786e340608K693567M168196J166344l213689l632748Q55220N722125O184921
12778H603328J846668l460792n052036j349983M015779N075606J92113n405962
12770D464721n813779j618167J852632J915481N65993l5661j29639l11728m66449
$$ plain form
12830 -46387 -2250318 -1601231 1284715 3489056 2878326 656334 -423073 172587 389371
12821 389371 -1081163 -2929197 -3455846 -3170257 -3613695 -4339734 -3148365 209226 2510117
12812 2510117 907558 -2782789 -3925501 -1147476 1817659 1267911 -1696194 -3341434
12804 -3341434 -2557826 -1352987 -780242 670718 3904372 6800001 6631858 3750410 1154770
12795 1154770 709319 1266436 859651 -515745 -1417182 -1627879 -2591311 -4622029 -5340608
12786 -5340608 -2647041 1521155 2687499 -526190 -4158938 -3303718 2418407 8603328
12778 8603328 10449996 6989204 1937168 587185 4602964 9678570 9870683 4464721
12770 4464721 -1349058 -2967225 -1114593 800888 1366881 1331220 1201581 889853 423404
12761D23404j084997k529127k961393l55412L454037M435121K266971O25484J088458
12752E362546J031592j266449l591690l613440k185563j069096m21566J9187J53843
12743e580636Q67098L021848M591434K585526j611675l256104j439035k91124
12735a112668j721449k559998j098006n42872k614377l370116J88948M271995
12727h558543M025041R92828l23479J52216l93931j523063o41619J416155J266088
12718c588307j214943k492804q01913J454180J029248k398360n606770m380299
12710a7999968J813912P668166P499554K867994M08091J851312K244279o17233
12702E736107k431952j112731j188702m545068m904798J507396P336436M790318
$$ plain form
12761 423404 -661593 -3190720 -6152113 -6507525 -3053488 1381633 3648604 4274088 5362546
12752 5362546 6394138 5127689 1535999 -2077441 -4263004 -5332100 -5753666 -5734479 -5580636
12743 -5580636 -4713538 -1691690 2899744 5485270 3873595 617491 -821544 -1112668
12735 -1112668 -2834117 -5394115 -6492121 -7034993 -9649370 -13019486 -12830538 -8558543
12727 -8558543 -4533502 -3540674 -3864153 -3711937 -4105868 -5628931 -6270550 -4854395 -3588307
12718 -3588307 -4803250 -7296054 -8097967 -6643787 -5614539 -8012899 -13619669 -17999968
12710 -17999968 -16186056 -8517890 -1018336 1849658 2257749 4109061 6353340 5736107
12702 5736107 3304155 2191424 1002722 -3542346 -8447144 -6939748 396688 5187006
12694E187006j521743k401701O74057n21450n421605n482725N49695M354970K056746
12685b526750n80888O48898K037319K31288j836219j273157k03309n27456k9552
12676d059826K540761L950750J574510k372233m289900l131541L14659L975432
12668a497388M215700l2799l479474r14575L724061K661779k305899k017034L780109
12659D134480M586358k773878p055749p13282O662748L325167n555364o275918
12651c665438J868437O564158J651520n731531p449679l717435J357840N206476
12643c915652N749253J935547k517227j952542K654679L742241j806448p298433
12635c408582n516017J170037M566484J797130k162702k340916J67224J167603
$$ plain form
12694 5187006 3665263 1263562 1937619 1416169 -4005436 -9488161 -8938466 -4583496 -2526750
12685 -2526750 -3107638 -2458740 -421421 -190133 -2026352 -3299509 -3502818 -4030274 -4059826
12676 -4059826 -1519065 2431685 4006195 1633962 -2655938 -5787479 -5472820 -1497388
12668 -1497388 2718312 2685513 -793961 -1708536 2015525 4677304 2371405 354371 4134480
12659 4134480 8720838 5946960 -1108789 -1822071 4840677 8165844 2610480 -3665438
12651 -3665438 -1797001 4767157 6418677 687146 -6762533 -10479968 -9122128 -3915652
12643 -3915652 1833601 3769148 1251921 -700621 1954058 5696299 3889851 -3408582
12635 -3408582 -8924599 -7754562 -3188078 -1390948 -3553650 -5894566 -5727342 -4559739
12627d559739m57756j896041q71374J308508J857489K41327j433836j128000J074247
12618e865175L199149L111189Q85564k66667K576723P005449O853538P20089n043863
12609A3175996n257600l333514m445789n886195k230941L258884K702814k116807
12601d133152j282855O028265Q382362O24136o699839l954972K465704J554974
12593B984623m666246o469828k883674n77530o11393J293043L733963J267836
12585e929206l728060k932721L495043O111046J791105j400880J476922M223879
12577C107128J325704k238558l75121L149624J659691k605033k711146R29812
12569B242101J928971o73175j289406J906094L725551R57849k177670r28581K611575
$$ plain form
12627 -4559739 -5017495 -6913536 -7784910 -6476402 -4618913 -4377586 -5811422 -6939422 -5865175
12618 -5865175 -2666026 445163 1330727 1064060 3640783 10646232 17499770 18219859 13175996
12609 13175996 7918396 4584882 139093 -5747102 -7978043 -4719159 -2016345 -4133152
12601 -4133152 -5416007 612258 8994620 9618756 2918917 -1036055 1429649 2984623
12593 2984623 -1681623 -8151451 -11035125 -11612655 -12224048 -10931005 -7197042 -5929206
12585 -5929206 -9657266 -12589987 -9094944 -2983898 -1192793 -2593673 -1116751 3107128
12577 3107128 4432832 2194274 1819153 4968777 6628468 4023435 1312289 2242101
12569 2242101 4171072 3497897 2208491 4114585 7840136 8797985 6620315 5691734 8303309
12560H303309L057080m86754m172427n130860l747229j154516J888764L555747
12552B113114J877017j777690l100614m93080K289585J524314r10446q41948J142049
12543A822301O51542k821209m378973j382379K024331R26364l266716n130789
12535a1555528k493180J666398L340697J408874j450751p65922M775828R874377
12527D800793P666241o30402n832971k980315J945168J532765k273026k977327
12519A250926o16512k80097k216857j854762J053208J675501o65859n24014L981712
12510A803246O674095K435659m718141p267253m147223o10656l37193j690683
12502g858149j277975J415442L463950K134766j066883j455806K361510N394271
$$ plain form
12560 8303309 11360389 10873635 6701208 1570348 -2176881 -3331397 -1442633 2113114
12552 2113114 3990131 2212441 -888173 -1381253 908332 2432646 1522200 680252 1822301
12543 1822301 2473843 -347366 -4726339 -6108718 -4084387 -3158023 -6424739 -11555528
12535 -11555528 -14048708 -12382310 -9041613 -7632739 -9083490 -9849412 -5073584 4800793
12527 4800793 12467034 11836632 6003661 3023346 4968514 6501279 4228253 1250926
12519 1250926 634414 354317 -1862540 -3717302 -2664094 -988593 -1654452 -2178466 1803246
12510 1803246 8477341 10913000 6194859 -1072394 -5219617 -5830273 -6167466 -7858149
12502 -7858149 -9136124 -7720682 -4256732 -2121966 -3188849 -4644655 -2283145 3111126
12494C111126K838529k419130l652261l68749J395937j019750l149265j378346
12486d641909J347840J056541r07729j001211P08098J807371J904237J944023
12478B217261J172642j507381m185522l276499J561064N786386M157023l285345
12470B639629r599202p239878K435827Q614693L657308o115518p935907L80363
12462a3162685Q182866P422293K227558j30787j28111k105719n228618n257403
12454h180606k180835K84388J090586K266194L951305L884403J544262j019962
12446A639735k282144k222301q31025J695929L888420M263757K893610M87993
12438I533974k234815l225553l87395L951986L882164j756974o211329m223775
$$ plain form
12494 3111126 5949655 3530525 -121736 -490485 905452 -114298 -3263563 -4641909
12486 -4641909 -3294069 -2237528 -3145257 -4146468 -3438370 -1630999 273238 2217261
12478 2217261 3389903 1882522 -2303000 -5579499 -4018435 1767951 5924974 2639629
12470 2639629 -6959573 -14199451 -11763624 -3148931 508377 -5607141 -13543048 -13162685
12462 -13162685 -4979819 2442474 4670032 4539245 4411134 2305415 -2923203 -8180606
12454 -8180606 -10361441 -10077053 -8986467 -6720273 -2768968 1115435 2659697 1639735
12446 1639735 -642409 -2864710 -3695735 -1999806 1888614 6152371 9045981 9533974
12438 9533974 7299159 4073606 3686211 7638197 11520361 9763387 3552058 -671717
12430f71717j98094j038182m581399l049245L562111O294481P69524n868481n155569
12421i936571J265621N056360K544103k034029l309061q68409J849769K366634
12413c065583J478730J177235J522961R13272p47535j274640M27231K361564K493059
12404E286294J728664J599329R65511j970142n725552o804828m211287P035L838596
12395e286380O153691N526222J590843k772757l758731j185950J744320K786323
12387D797581K170669N59214j452187k276316r34684N61838n17073l307324m429739
12378d828021k948743q66912Q80768L038007M725582L805262J141918K96445J880085
12369G124391K308110k87248k871640k328104O7513J397568J232779M32591j344584
$$ plain form
12430 -671717 -869811 -1907993 -6489392 -9538637 -5976526 317955 1087479 -4781002 -9936571
12421 -9936571 -8670950 -3614590 -1070487 -3104516 -6413577 -7281986 -5432217 -3065583
12413 -3065583 -1586853 -409618 1113343 2026615 1279080 4440 431671 2793235 5286294
12404 5286294 7014958 8614287 9579798 7609656 1884104 -4920724 -9132011 -9124976 -5286380
12395 -5286380 867311 6393533 7984376 5211619 1452888 266938 2011258 4797581
12387 4797581 6968250 7527464 6075277 3798961 2864277 3426115 2909042 -398282 -4828021
12378 -4828021 -7776764 -8643676 -7762908 -4724901 681 3805943 4947861 5244306 7124391
12369 7124391 9432501 9145253 6273613 3945509 4013022 5410590 6643369 7075960 5731376
12360E731376l902100m495335r43786M358083O479507L595483j535869n195641
12352D091718n742711l422790N42155M046458M891869K771788Q5973l04728J502108
12343H461840K176594o16818m435145m618747p49543K257706Q04676k576398l426006
12334b721841j646366j95877L32357J590109L127319K663648M52370q21613o02545
12325B177561q66770j753388j096872R83983J405635p07780k330205j603026n47540
12316d338402p70014m84909J601356L098435J763757m36474m33429J074867J208601
12307B283788l20387j281444p57345K1243K07164K80325N35005M29495l91859
12298A005985j454927j862878r82902Q73411K358812K330973J077653l78622j546433
$$ plain form
12360 5731376 1829276 -2666059 -3609845 748238 7227745 10823228 9287359 4091718
12352 4091718 -1650993 -5073783 -4531628 -485170 4406699 7178487 7264460 6959732 8461840
12343 8461840 10638434 10021616 5586471 967724 218181 2475887 3280563 704165 -2721841
12334 -2721841 -4368207 -4564084 -4231727 -2641618 485701 3149349 3601719 2780106 2177561
12325 2177561 1310791 -442597 -1539469 -555486 850149 142369 -2187836 -3790862 -4338402
12316 -4338402 -5108416 -5593325 -3991969 -893534 870223 433749 320 1075187 2283788
12307 2283788 1963401 681957 -75388 -54145 153019 433344 968349 1397844 1005985
12298 1005985 -448942 -2311820 -3294722 -2421311 -62499 2268474 3346127 2967505 1421072
12289A421072k024487j016955R96511J527079o36965k883832k341361k56377P10897
12280d504418J484197M009672N514626J706475m838502o549299j870596K725093
12272b322752L190412K751533L778612K931467j265197l684296j206413P48108
12264D921474k903409p439893n570483N59218L102950J036060J89483K460108
12256c644492L577500J551431l41920L1246P02941K62118k510K44160n70504k221305
12246d11335k386074q43502O2922l59751m55858K984m81097j321163j08467K602460
12236c698881L127222N27203j335466N90572M037372M468147O06901m435225o305585
12227b417740l327660J653865L872987K144541K05269J082214K717262J824058
$$ plain form
12289 1421072 -603415 -1620370 -623859 903220 266255 -2617577 -4958938 -5215315 -4504418
12280 -4504418 -3020221 989451 6504077 8210552 3372050 -3177249 -5047845 -2322752
12272 -2322752 867660 3619193 7397805 10329272 9064075 5379779 4173366 4921474
12264 4921474 2018065 -5421828 -10992311 -10433093 -7330143 -6294083 -6104600 -3644492
12256 -3644492 -66992 1484439 1142519 1173765 1876706 2138824 2136314 2380474 1809970 -411335
12246 -411335 -2797409 -3640911 -3577989 -3937740 -4393598 -4390614 -4871711 -6192874 -6301341 -3698881
12236 -3698881 -571659 -44456 -1379922 -789350 3248022 7716169 8323070 3887845 -2417740
12227 -2417740 -5745400 -4091535 -218548 1925993 2131262 3213476 5930738 7754796
12219G754796p39797k103881k267821k605649j978527P86582K791865R10557k148849
12210C99276j524857J623784K054244n83773j683883j59069L54142q50822j88851
12201e59809K617826K926675o12852k992629p53928L014159M263520K982699K40364
12192A1126025l921079p106822n214676M41473K708343j105634m450914j320796
12184h844080M754961O491872K981834j124379k837158k312529j88124K046392
12176I68789J591880j830074m128163k196278J453094K482655M79432j920114
12168c098779k905515j979603N42598K442839J253260j413179j204127J981953
12160d380553L522170K158295K057986M189760L160326k939462p034117l463470
$$ plain form
12219 7754796 7014999 4911118 2643297 37648 -1940879 -1154297 1637568 2548125 399276
12210 399276 -1125581 498203 2552447 1968674 284791 125722 479864 -370958 -559809
12201 -559809 2058017 4984692 4371840 1379211 625283 3639442 7902962 10885661 11126025
12192 11126025 7204946 98124 -5116552 -4675079 -1966736 -3072370 -7523284 -8844080
12184 -8844080 -4089119 2402753 5384587 4260208 1423050 -889479 -1077603 968789
12176 968789 2560669 730595 -3397568 -5593846 -4140752 -1658097 -1178665 -3098779
12168 -3098779 -6004294 -7983897 -7441299 -4998460 -3745200 -5158379 -6362506 -4380553
12160 -4380553 -858383 1299912 3357898 7547658 10707984 7768522 734405 -2729065
12152b729065K715269L640990L820k697037l670460m713069l666070J317395N164979
12143d633248K612100j903337m33410N175055O044547O70910l453656k273186
12135A805775K69776O65902J37711m57107k079965k943896O390M335854M245155
12126E985595j8182k412069j126534l36463j424715j135543L80047j177408m965378
12117f230650m297575J838978N796246L484707L68314P51220N59227l093482m277098
12108e100113J676546P963460N610840k256661n180857j191584J826297l65988
12100B981940k572589L80533N254271N033183j347325p158201n622631J756036
12092a294783O238137K407084m566754n907358j528544Q26370j680185l059796
$$ plain form
12152 -2729065 -13796 3627194 3631014 933977 -2736483 -7449552 -11115622 -9798227 -4633248
12143 -4633248 -2021148 -3924485 -4357895 817160 6861707 7532617 4078961 1805775
12135 1805775 2075551 2741453 2879164 2422057 342092 -2601804 -2595414 1740440 5985595
12126 5985595 5967413 3555344 2428810 2092347 667632 -467911 -87864 -1265272 -6230650
12117 -6230650 -10528225 -8689247 -2893001 591706 960020 1711240 2270467 -823015 -5100113
12108 -5100113 -3423567 4539893 10150733 7894072 2713215 1521631 3347928 2981940
12100 2981940 409351 789884 6044155 11077338 9730013 2571812 -3050819 -1294783
12092 -1294783 4943354 7350438 2783684 -3123674 -4652218 -3825848 -5506033 -8565829
12084h565829N62633M252649K961789k29736l05103J231094M35751j467508j143349
12075b267609J87242n09091k108409k005644j234333j189778O83821N613413Q252330
12066E421942M050986k135255k921762j85474q59874m072212l006258J923511
12058a784396L002937j261517l605723r43025Q58941j476922k518618J456095
12050f272228N015607K818624j206613p85863K555194L201778O79406j473682
12042D532223k385184l130157k428476Q07703L091604N76601m004210m317695
12034g257591N50703N109594N007749J221473k859553m640643l055194M16166
12026e507296J969468k45438l066658k526590M95377K361893K499187K636915
$$ plain form
12084 -8565829 -8003196 -3750547 -788758 -1018494 -1323597 -92503 343248 -1124260 -2267609
12075 -2267609 -2080367 -2589458 -4697867 -6703511 -7937844 -9127622 -8443801 -2830388 5421942
12066 5421942 9472928 7337673 4415911 4230437 3370563 -701649 -3707907 -1784396
12058 -1784396 1218541 -42976 -3648699 -4591724 -3732783 -5209705 -7728323 -6272228
12050 -6272228 -1256621 1562003 355390 -430473 2124721 5326499 6005905 4532223
12042 4532223 2147039 -983118 -3411594 -2603891 487713 1064314 -2939896 -7257591
12034 -7257591 -6706888 -1597294 3410455 4631928 1772375 -2868268 -5923462 -5507296
12026 -5507296 -3537828 -3783266 -6849924 -9376514 -8881137 -6519244 -4020057 -1383142
12018a383142J900950j692748n395255l684380K781484O157412K003460m124037
12010c436256m274741J484736O324130N765023J428205k840003m552570k728526
12002b830002J773141N319876L878586k047982o627167m710244K060412O885724
11994C702344N540262P00268k291127k132796j718462k582789k804310j256668
11986b843278j85058j105105j423492J177995L645004J706707k450293k444425
11978c921945K449038N800748L799543N41939O34107J888244k24758m725333o540502
11969b98919l471896K180953O931564P798686L375328l220780n493907j767842
11961F033187J176040k285533p142073m913550K523563N066465k52075n258390
$$ plain form
12018 -1383142 517808 -1174940 -6570195 -10254575 -7473091 -1315679 687781 -3436256
12010 -3436256 -7710997 -6226261 97869 5862892 7291097 4451094 -101476 -2830002
12002 -2830002 -1056861 4263015 8141601 6093619 -533548 -5243792 -3183380 3702344
11994 3702344 9242606 9942874 7651747 5518951 3800489 1217700 -1586610 -2843278
11986 -2843278 -3028336 -4133441 -5556933 -4378938 -733934 972773 -1477520 -3921945
11978 -3921945 -1472907 4327841 8127384 8669323 9303430 11191674 10966916 6241583 -298919
11969 -298919 -3770815 -1589862 5341702 13140388 16515716 13294936 7801029 6033187
11961 6033187 7209227 4923694 -2218379 -7131929 -4608366 458099 206024 -5052366
11953e052366l606283R12576K287088Q94746p6856l99171m52595J317907M189392
11944A4438L779867o69229l218907m06656K367102k96670m222953k449016L082800
11935b019224N059014K668426J102941J377442k29999l431343l594532m66476
11927D66249J148320K71721J125725M178028M006329j305696o066785n485828
11919a661937j861363P62536K000192K191074J72680k747778k486627Q45541J662944
11910a122738j903227l963467m39471L691204K310795k171495l290532l01760
11902g190691K659503L574027K834314j52186m864134p081180l932072J162318
11894a2990101L544740L900355M542715L436853j270579m694615j421960M402210
$$ plain form
11953 -5052366 -8658649 -7746073 -5458985 -4564239 -4641095 -5040266 -5492861 -4174954 14438
11944 14438 3794305 3125076 -93831 -500487 1866615 1569945 -2653008 -5102024 -2019224
11935 -2019224 3039790 5708216 6811157 8188599 7958600 4527257 932725 466249
11927 466249 1614569 1886290 3012015 7190043 11196372 9890676 3823891 -1661937
11919 -1661937 -3523300 -2760764 -760572 1430502 1603182 -1144596 -3631223 -2785682 -1122738
11910 -1122738 -3025965 -6989432 -7428903 -3737699 -1426904 -3598399 -6888931 -7190691
11902 -7190691 -4531188 -957161 1877153 1724967 -3139167 -10220347 -14152419 -12990101
11894 -12990101 -9445361 -5545006 -1002291 2434562 1163983 -3530632 -4952592 -550382
11886e50382M099262j851350m495816q08003K187262l14416l441337j364949L674844
11877b864885N798785L811520O75643j561058k509096j936034n02863K12962K27034
11868A352008J163140K639367J882965j697264m878440n007869k894074l17006
11860g757173J815720K019942p48767l421135j095040M965817O866574Q49924
11852C495862o391211o478550l48458M449777M271706J760949k37404j478689
11844i56018j581107M07437L036460K966012m52875l887670m201673j779779R24449
11835e524764K242195K012431R75476K26548M85510J531361K663867L404846L375127
11826A1392597K243104M27090j008919j823015k885652m236137m259996k087207
$$ plain form
11886 -550382 3548880 1697530 -2798286 -3606289 -1419027 -1733443 -5174780 -6539729 -2864885
11877 -2864885 2933900 6745420 7421063 5860005 3350909 1414875 912012 1124974 1352008
11868 1352008 2515148 5154515 7037480 5340216 461776 -4546093 -7440167 -7757173
11860 -7757173 -5941453 -3921511 -4670278 -8091413 -9186453 -4220636 2645938 3495862
11852 3495862 -2895349 -9373899 -9722357 -5272580 -1000874 760075 522671 -956018
11844 -956018 -2537125 -2129688 906772 3872784 3419909 -467761 -4669434 -6449213 -5524764
11835 -5524764 -3282569 -1270138 -294662 -68114 417396 1948757 4612624 8017470 11392597
11826 11392597 13635701 14062791 13053872 11230857 8345205 4109068 -150928 -2238135
11818b238135N10796J336794Q86957J262274K543526K556918N20798j238066m61200
11809E680662J514029J293133j665118l677365j626947K246066K753022j151444
11801E366038m524983k940496J733032M274212K795467l29050k704544l799044
11793a29368l364200j248934J371373L188736M538266N443979L640820j513281
11785A1927391m978661j587031N039808N908979k07854m465827j330466L306148
11777A3612487K066747k672282m033579j874121j085595k119020j373108O43857
11769C165386l01588l718670m119265m66306J404544j560992m136436j070221
11761a0803548M328077N007737L73073l610759l070987j77906J521562J595553
$$ plain form
11818 -2238135 -1727339 -390545 496412 1758686 4302212 6859130 7379928 6141862 5680662
11809 5680662 7194691 8487824 6822706 3145341 1518394 3764460 6517482 5366038
11801 5366038 841055 -2099441 -366409 3907803 6703270 6374220 3669676 -129368
11793 -129368 -3493568 -4742502 -3371129 -182393 4355873 9799852 13440672 11927391
11785 11927391 6948730 5361699 10401507 16310486 16102632 11636805 10306339 13612487
11777 13612487 15679234 13006952 8973373 7099252 6013657 3894637 2521529 3165386
11769 3165386 2863798 -854872 -4974137 -5440443 -4035899 -5596891 -9733327 -10803548
11761 -10803548 -6475471 -1467734 -1094661 -4705420 -7776407 -7954313 -6432751 -4837198
11753d837198J305269O96633p02410j732938n40739K302323L562164J332321k005635
11744f20210k598462l04206J307706L61395p91380Q3951J056570p27284l578086
11735e810006k887433J956938N852196M290246j118668m900617l927157j49K911921
11726c632729K878781J435607J009107J341703q6737l447705m708151r08776M400562
11717a718338M834800n7553l923509k407823J450250K803708J937270J904638
11709D823443K255507J17657l638396m562652j529999J244245Q13942j62657J421287
11700G82377L355576J787865j758235k264366O12826J746609j175249l888709
11692h01306k513338M96404J143163O64601K455457M898339L297122j884751m780648
$$ plain form
11753 -4837198 -3531929 -2835296 -3537706 -5270644 -5811383 -3509060 53104 1385425 -620210
11744 -620210 -3218672 -3522878 -2215172 -1853777 -2645157 -2561206 -1504636 -2231920 -5810006
11735 -5810006 -8697439 -6740501 -888305 3401941 2283273 -2617344 -6544501 -6544650 -3632729
11726 -3632729 -753948 681659 1690766 3032469 2945732 -501973 -5210124 -6118900 -1718338
11717 -1718338 3116462 3058909 -864600 -3272423 -1822173 981535 2918805 4823443
11709 4823443 7078950 7196607 3558211 -1004441 -2534440 -1290195 -476253 -638910 782377
11700 782377 4137953 5925818 4167583 1903217 2516043 4262652 3087403 -801306
11692 -801306 -3314644 -2818240 -1675077 -1010476 1444981 6343320 9640442 7755691 2975043
11683B975043k832588k25485q25711k606905j856808J007464K973361K823980
11675A432351J107252j686189m161998l755401l11025K369563J426899r45111
11667d523659j285175j52303P4246J92525K327174M788400M013302R85394L03448
11658F723352K470059K569771j673357n498406l812188J324933L563932O31127
11650F299223l499898m056806o17653L107252L263552k42139l371594k344084
11642a462147J444812K768192l63060l485884j771627K731218L557501r54680
11634B464325m962770l068159K466012N355074L830497J543984Q41020q0315k257153
11625F132515k969900n93853J478062n2645k400356j029234K180820J446112l017512
$$ plain form
11683 2975043 142455 -83030 -908741 -3515646 -5372454 -4364990 -1391629 1432351
11675 1432351 2539603 853414 -3308584 -7063985 -7375010 -5005447 -3578548 -4523659
11667 -4523659 -5808834 -5961137 -5886891 -5694366 -3367192 1421208 5434510 6419904 6723352
11658 6723352 9193411 11763182 10089825 4591419 779231 2104164 5668096 6299223
11650 6299223 2799325 -1257481 -1875134 1232118 4495670 4253531 881937 -1462147
11642 -1462147 -17335 2750857 2387797 -1098087 -2869714 -138496 3419005 2464325
11634 2464325 -2498445 -5566604 -3100592 2254482 6084979 7628963 8469983 8389668 6132515
11625 6132515 3162615 2568762 4046824 3994179 1593823 564589 2745409 4191521 1174009
11616A174009m736593j584639O98547j679530m247192k121251J985190L128380
11608g383079K346987L177337M128083J674540k131947k291371O22212J497860
11600A640622p95571k567831k248331j580048m31675K691844N138824K498802
11592D346636k910240l639585J265658M090582N64660l687036k938928l04384
11584c212637j092386l085571n24876N585137Q120615L892186k277936l987813
11576C416719n63961K755356Q84906m810793p183866k308480L950186L064295
11568g95638l490954n593764N88461O989089O218792J832156O35006J794052P53873
11559H931073j500874j200133k0800k277960o150130n749256r73465K145154Q86619
$$ plain form
11616 1174009 -3562584 -5147223 -4448676 -6128206 -10375398 -12496649 -10511459 -7383079
11608 -7383079 -5036092 -1858755 2269328 3943868 1811921 -479450 142762 1640622
11600 1640622 845051 -1722780 -3971111 -5551159 -5982834 -3290990 1847834 4346636
11592 4346636 1436396 -2203189 -937531 3153051 3717711 30675 -2908253 -3212637
11584 -3212637 -4305023 -7390594 -7915470 -2330333 5790282 9682468 7404532 3416719
11576 3416719 2852758 5608114 6493020 1682227 -5501639 -7810119 -3859933 -795638
11568 -795638 -4286592 -9880356 -9291895 -2302806 3915986 5748142 6383148 8177200 8931073
11559 8931073 7430199 6230066 6209266 3931306 -2218824 -7968080 -8941545 -6796391 -5909772
11550e909772j011318k14370J925913K806687J699307r77345l645039l286469
11542h612406R37156M862459M249742R50780m10237J97115l07762j369787j07747
11533C89313K082070J306601j317124j277341Q26475L29885k121883j018539L391637
11524B591094M246264j11709k922421q37977N35171k567357n035853k574372K70291
11515f406869j078509k275105J742893O333949M258923j950448m283173j946789
11507e605128j25599P86850M369705Q232872N622125k453916o547328k394246
11499A885335L241520L274128n11652k551202j624887J52338J778108K878567
11491H522255K125576o01549k926902l165009k549435k558064k245900J22144
$$ plain form
11550 -5909772 -6921090 -7135460 -5209547 -2402860 -703553 -1680898 -5325937 -8612406
11542 -8612406 -7675250 -2812791 1436951 2387731 1977494 2174609 1866847 497060 389313
11533 389313 2471383 3777984 2460860 1183519 2009994 2339879 217996 -800543 2591094
11524 2591094 6837358 6725649 3803228 2965251 3500422 933065 -4102788 -6677160 -6406869
11515 -6406869 -7485378 -9760483 -8017590 -1683641 2575282 624834 -3658339 -5605128
11507 -5605128 -5730727 -4943877 -574172 7658700 13280825 10826909 4279581 1885335
11499 1885335 5126855 8400983 7889331 5338129 3713242 3865580 5643688 8522255
11491 8522255 10647831 10046282 7119380 3954371 1404936 -1153128 -3399028 -3276884
11483c276884M297548P709162O938343N55390p534009r658771l033546N009556
11475A006789N341303q81291m516475k044561O05878j055100l223209j283248
11467f049914K413432K905242J9768k929374m044631k790186J117005N235496
11459d123162M841803l82136m133063j960318K266657K923149J203710J327439
11451A964079K140811k30596l732221k390184L224666N132501n78481p473617
11443a943042p102070L15159O712523N722137r67820o216006n304827q19133J143260
11434h459819q61066k235803N9398K894922K772058J631312K217424J961625k044842
11425b064791n396902j860640N239638O353813O87241j937126L185156P716408
$$ plain form
11483 -3276884 1020664 8729826 15668169 16223559 8689550 -969221 -4002767 1006789
11475 1006789 6348092 5466801 950326 -1094235 -488357 -1543457 -4766666 -6049914
11467 -6049914 -3636482 -731240 -711472 -3640846 -7685477 -10475663 -9358658 -4123162
11459 -4123162 718641 336505 -3796558 -5756876 -3490219 -567070 636640 1964079
11451 1964079 4104890 3874294 142073 -2248111 976555 6109056 5530575 -1943042
11443 -1943042 -9045112 -8729953 -2017430 3704707 2736887 -3479119 -8783946 -9603079 -8459819
11434 -8459819 -9320885 -11556688 -11497290 -8602368 -5830310 -4198998 -1981574 -19949 -2064791
11425 -2064791 -7461693 -9322333 -4082695 2271118 2958359 1021233 4206389 11922797
11417A1922797L439919m885687p275753l165341J24028j88343l80393P21836l66480
11408e3417l683549l498004K469724P491684M436037l658406p081461k357104
11400e934496L570600L171497j883634l950298j89296M176784L702969j47279
11392B516847k103287o66711R26177L58980p18555J50770K562199L732938J425601
11383H184959l631815p206898m697573K991495Q229962M894695l081355n928554
11375b45084q52065M649043L731057j013129k953889r05124J393980K045801K093280
11366G943870J498277j020280m389643n494761l479218o55843J161888K450467
11358a985243L684286L882554K420081M44727n64259o09264p88878j567557j888358
$$ plain form
11417 11922797 15362716 10477029 3201276 35935 159963 -28380 -408773 313063 -53417
11408 -53417 -3736966 -7234970 -4765246 2726438 7162475 3504069 -3577392 -5934496
11400 -5934496 -2363896 807601 -1076033 -5026331 -5215627 -1038843 2664126 2516847
11392 2516847 413560 -253151 673026 1032006 313451 464221 3026420 6759358 8184959
11383 8184959 4553144 -2653754 -7351327 -4359832 3870130 8764825 5683470 -245084
11375 -245084 -1097149 3551894 7282951 6269822 3315933 2410809 3804789 5850590 7943870
11366 7943870 9442147 8421867 4032224 -1462537 -4941755 -5597598 -4435710 -1985243
11358 -1985243 1699043 5581597 8001678 8446405 7882146 7272882 6484004 4916447 3028089
11349C028089l49758K281217K568810j531573o269081n056903K646355Q759625
11341F076781O012228k435659o841511l251935K340685K661126j922664n063944
11333b424893k691207K751129N764465L903578j45317k216683j365282J31637
11325C707427P06249J029391J224260m17387l973432n671643k185828M130910
11317a450053P339393M838105k67618l479163l364284j691712r40002j913921
11309i29255k919820j734107J116466K561848J364636m0329K48271M37778j080138
11300i74650j705098J171398M266033K402222k474896k785728L090134P197627
11292A0187042L294432l624011m292051J546378M953321M38573o853732q608224
$$ plain form
11349 3028089 2678331 4959548 7528358 5996785 -272296 -5329199 -2682844 6076781
11341 6076781 12089009 9653350 2811839 -440096 1900589 4561715 2639051 -2424893
11333 -2424893 -5116100 -2364971 3399494 7303072 7157755 4941072 3575790 3707427
11325 3707427 4413676 5443067 6667327 6249940 2276508 -3395135 -5580963 -1450053
11317 -1450053 5889340 10727445 10459827 6980664 3616380 1924668 984666 -929255
11309 -929255 -3849075 -5583182 -4466716 -1904868 -540232 -580561 -332290 105488 -974650
11300 -974650 -2679748 -1508350 2757683 5159905 2685009 -100719 2989415 10187042
11292 10187042 13481474 9857463 5565412 7111790 12065111 12503684 5649952 -2958272
11284b958272l969811Q75433J813403J060933J742740K430436K01187l431230
11276b235181m041844j037893J669408K098340K461585L624685K638397j232499
11268C944998l246961m99316K141307o45556n117672l666134K651273N133166
11260F95105R41631k879066j038149K097043M76584l713377l699125J560221N968954
11251D09821M398656j248890m387727j063077N020698N745447j428955q654629
11243a208656o867597J723503O228282K075234l657858l733227j43738J844347
11235c739710K134140K706653J853082j823201m133103j277547K451587Q31533
11227i96566l147787j394894N037794N964193j816111q231224m580907L666940
$$ plain form
11284 -2958272 -6928083 -6052650 -4239247 -3178314 -1435574 994862 1196049 -2235181
11276 -2235181 -6277025 -7314918 -5645510 -3547170 -1085585 2539100 5177497 3944998
11268 3944998 698037 198721 2340028 1694472 -3423200 -7089334 -4438061 695105
11260 695105 1636736 -1242330 -2280479 -183436 293148 -3420229 -7119354 -5559133 409821
11251 409821 4808477 3559587 -828140 -1891217 3129481 8874928 7445973 -1208656
11243 -1208656 -8076253 -6352750 -124468 1950766 -1707092 -5440319 -5584057 -3739710
11235 -3739710 -1605570 1101083 2954165 1130964 -3002139 -4279686 -1828099 -996566
11227 -996566 -4144353 -5539247 -501453 5462740 3646629 -4584595 -9165502 -5498562
11219e498562N650749P78814k775320j941702j766162m510333m779495Q94347
11211a3947664O579723M964574j266738k906673K280131O375157K903582m179928
11203H02164o413053j939845L197213K963819k622248q111485p114402J922174
11195a7315663J2205125J3577904M208413n623019n704886J082865L782039r15714
11187E297064n708552n183836k595895j739937l12767L726415N849205J586862
11179I18559m836969n406809K57028M619611K801858j840180l293159j78124L761717
11170c196468M425369J695513o72773R8588J826953O47900k390833k477690N98998
11161E55557J040205l356133o211980j976047M771734N623395M14928l595028
$$ plain form
11219 -5498562 152187 931001 -1844319 -3786021 -5552183 -10062516 -14842011 -13947664
11211 -13947664 -7367941 -2403367 -3670105 -6576778 -4296647 2078510 4982092 802164
11203 802164 -5610889 -7550734 -4353521 -1389702 -4011950 -12123435 -19237837 -17315663
11195 -17315663 -5110538 8467366 12675779 7052760 1347874 2430739 6212778 5297064
11187 5297064 -411488 -5595324 -8191219 -9931156 -10243923 -6517508 -668303 918559
11179 918559 -3918410 -9325219 -9068191 -4448580 -1646722 -3486902 -6780061 -6958185 -3196468
11170 -3196468 1228901 2924414 2251641 2350229 4177182 4825082 2434249 -43441 555557
11161 555557 1595762 -1760371 -7972351 -9948398 -5176664 446731 861659 -2733369
11153b733369k420289J153475L467196L477226J166612k165511k870912O94042
11145b31530L967867J721347l546598m761583p53786K976025L354142K520366
11137E246250J519502j181490l898605k279646K342157K928934j969291m702611
11129a994800n09775M537746L370834r37200j176247J843949J567411k468567
11121D233351l630049Q55557N224893L596421k041614n178673l189635M39437
11113C09688J276767q24692k310728r64762J252260J346404m07727j665607k160786
11104d149183l131090l347017k53642M604042O221790L451690P65872R89273J492127
11095F643862L1587j156261m93138p97550l583948m858222j724447J707116Q76660
$$ plain form
11153 -2733369 -5153658 -4000183 -532987 2944239 4110851 1945340 -925572 -231530
11145 -231530 3736337 5457684 1911086 -2850497 -3604283 -628258 2725884 5246250
11137 5246250 6765752 5584262 1685657 -593989 1748168 4677102 2707811 -1994800
11129 -1994800 -2504575 2033171 5404005 4466805 3290558 5134507 6701918 4233351
11121 4233351 603302 1458859 6683752 10280173 8238559 3059886 -129749 309688
11113 309688 1586455 761763 -1548965 -2513727 -1261467 84937 -322790 -1988397 -4149183
11104 -4149183 -7280273 -10627290 -10880932 -6276890 -55100 3396590 4162462 5151735 6643862
11095 6643862 6675449 5519188 5026050 4228500 644552 -4213670 -5938117 -4231001 -3354341
11086c354341j333452M080K658514J273197k361553j663805L449275O083947L178734
11077G934596r29166k330032j838832p02575J263755K458823Q58738j024496O55523
11068F346334L025352j72879o707494o988820O68050O114985K906472k312131
11060B879869k003121K98300j641045m693034k547584K145149K233810j455564
11052d783220k348144q155L97662j062881J002597O527417Q621782M363881j163206
11043A1547733l210884k533773r00945J487636K677291L2983l798524k953389
11035B348128K029783M002535N69498k327076j093052k47964k940801m044565
11027a703514O57761N392084K617685m550231o701934k109532J934499P74768
$$ plain form
11086 -3354341 -4687793 -4683713 -2025199 -752002 -3113555 -4777360 -1328085 4755862 7934596
11077 7934596 7005430 4675398 2836566 2133991 3397746 5856569 6715307 5690811 6346334
11068 6346334 9371686 9198807 2491313 -4497507 -3829457 2285528 5192000 2879869
11060 2879869 876748 1175048 -465997 -5159031 -7706615 -5561466 -3327656 -4783220
11052 -4783220 -7131364 -7139519 -6741857 -7804738 -6802141 -274724 8347058 12710939 11547733
11043 11547733 8336849 5803076 4902131 6389767 9067058 9100041 5301517 2348128
11035 2348128 4377911 8380446 8949944 6622868 5529816 5281852 2341051 -1703514
11027 -1703514 -1045753 4346331 6964016 2413785 -4288149 -6397681 -4463182 -3688414
11019c688414k140902k206189o9028Q33183n33507j859756l26905L772092N903978
11010c15448J925405n199950p058502o97781O245168N352434j390520n360863
11002f500057l220691Q98517L153726L537843K396074l77476k305220j18773M385996
10993A849939N258237O23941m302129m253904m26378K123508J104578j006847
10985I70945n67757K649313M595689J648682l807552n393739j536556J823578
10977C82603J19901k934027k020158P25805k2564k820064j666974L447349O246931
10968A458802M026149K80168k344009m125542l488023J419443N915847K830285
10960E973120n147640p066313m28473M312268P00133l200499J199102Q208999
$$ plain form
11019 -3688414 -5829316 -8035505 -8104533 -7271350 -7804857 -9664613 -9991518 -6219426 -315448
11010 -315448 1609957 -3589993 -10648495 -11346276 -5101108 251326 -1139194 -6500057
11002 -6500057 -9720748 -8822231 -5668505 -2130662 265412 -112064 -2417284 -2536057 1849939
10993 1849939 7108176 7732117 3429988 -823916 -1250294 873214 1977792 970945
10985 970945 403188 3052501 7648190 9296872 5489320 95581 -1440975 382603
10977 382603 502504 -2431523 -4451681 -3725876 -3748440 -6568504 -8235478 -4788129 1458802
10968 1458802 5484951 5765119 3421110 -704432 -4192455 -2773012 3142835 5973120
10960 5973120 825480 -6240833 -6669306 -2357038 -1656905 -4857404 -3658302 4550697
10952D550697P133175p96385n851516n450126m946310n330306j778951N261079
10944g208643Q148323L769969j371515j330795J028059L04312k431075k270680
10936a362045J035095K679839L28541k338338j038252K796705L823167L59285
10928F283997l033932k109407R10132J223690p72728q41159R90968L52349k671691
10919C32219k220664K875706M981849o42719o836824m616117K886197N248545
10911B008192M44547l536231j855508J374728J653989N50532Q26136J276124q8498
10902B654011j946176j886867J8268J900642K154893m2268l722159n350614k284919
10893h505189K664667L896154R09061q18186J584621L619023N23031m708380n213045
$$ plain form
10952 4550697 11683872 10887487 5035971 -414155 -5360465 -10690771 -12469722 -7208643
10944 -7208643 939680 4709649 3338134 2007339 3035398 3339710 908635 -1362045
10936 -1362045 -326950 2352889 2681430 343092 -695160 2101545 5924712 6283997
10928 6283997 3250065 1140658 2050790 3274480 2501752 1660593 2651561 3003910 332219
10919 332219 -1888445 987261 5969110 5326391 -1510433 -6126550 -3240353 2008192
10911 2008192 2452739 -1083492 -2939000 -1564272 89717 640249 1466385 2742509 2654011
10902 2654011 707835 -1179032 -1160764 739878 2894771 2852503 -869656 -6220270 -8505189
10893 -8505189 -5840522 -1944368 -1035307 -1853493 -268872 3350151 3873182 -835198 -6048243
10884f048243l43098L359488J650369j648933p88796L399288N173502K619398
10876G372975j96640n13923j118420m283616o232185k935239J995442K072434
10868c839172j347740j162535L009044L691398j213519l831767M55100M430641
10860A91450P49110n557554n129993Q92497L765688J152531j441323j145722l68496
10851f891812P0916J749449K933683L99419l048782j274717M419655N873275R85123
10842E216209k638612N9545L847941K234704k555402m176571j888804j4804n65513
10833d81307j425693o96195P73685J031333m88553j932311n99597L254315N313841
10824D749518K484542j988128k488925P07341J902629j135426l860117k019681
$$ plain form
10884 -6048243 -6391341 -3031853 -1381484 -3030417 -3819213 -419925 4753577 7372975
10876 7372975 7176335 6662412 5543992 1260376 -4971809 -7907048 -5911606 -3839172
10868 -3839172 -5186912 -6349447 -3340403 350995 -862524 -4694291 -4239191 191450
10860 191450 940560 -4616994 -9746987 -8854490 -5088802 -3936271 -5377594 -6523316 -6891812
10851 -6891812 -6820896 -5071447 -2137764 -1738345 -4787127 -6061844 -1642189 4231086 5216209
10842 5216209 2577597 2637142 6485083 8719787 6164385 1987814 99010 84206 -481307
10833 -481307 -1907000 -2603195 -1829510 -798177 -1286730 -3219041 -3818638 -564323 4749518
10824 4749518 7234060 5245932 2757007 3464348 5366977 4231551 371434 -1648247
10816a648247K353632M307296K256226j092958k092178O16834M593548N352938
10808A4647091J409042l389512m754073l306057k015440r62983Q62900J261144
10800C752112j694112l940343l84770N479598M994528k259236o932942l761854
10792d747019J289811J310759j515982j152125K676959N559935N348782L246849
10784A2017969N19364k035381l207883k781694k236523k385043k215574j089575
10776c414340J74251J013147J549488J375707N60024R17891K866490K780643j680700
10767F142601n601878k738929L863451N140778j19179l496575n99717K651401
10759E241953Q53539k299377j271476K498488M445506L849282J942065j757048
$$ plain form
10816 -1648247 705385 5012681 7268907 6175949 4083771 4700605 9294153 14647091
10808 14647091 16056133 12666621 7912548 4606491 2591051 1628068 2490968 3752112
10800 3752112 2058000 -1882343 -2267113 3212485 8207013 5947777 -985165 -4747019
10792 -4747019 -3457208 -2146449 -3662431 -4814556 -2137597 3422338 8771120 12017969
10784 12017969 12537333 10501952 7294069 4512375 2275852 -109191 -2324765 -3414340
10776 -3414340 -3240089 -2226942 -677454 698253 1258277 2176168 5042658 7823301 6142601
10767 6142601 540723 -2198206 1665245 6806023 6686844 3190269 2590552 5241953
10759 5241953 6095492 3796115 2524639 5023127 9468633 13317915 15259980 13502932
10751A3502932o350216p629216m068639m02174o61274j907639M00079M701889
10743b414258N970366L210115o8279r54019L92376J735458P14830k120720k472009
10734C993860J802811N212964J235123o481921p807856j489288K891670M55951
10726a86686k110713N36855L396761J407920j152567N75205K595695N9046k976178
10717B145338j039492K174189L82247l782873l644640j70985Q72963m79439r3733
10708c636425J347583L52994j331037L87780L521623L023812j40345j135516R3863
10699B484332M10293P50272L263175M316708k91358n908271m865879M33127R73402
10690A565801l665404m937378k36069L373134K040189P14420K675907L555262
$$ plain form
10751 13502932 7152716 -476500 -4545139 -4947313 -5608587 -7516226 -7116147 -2414258
10743 -2414258 3556108 6766223 6697944 5743925 6136301 7871759 8586589 6465869 3993860
10734 3993860 5796671 11009635 12244758 5762837 -2045019 -3534307 -642637 -186686
10726 -186686 -2297399 -1760544 1636217 3044137 1891570 2466775 5062470 5121516 2145338
10717 2145338 1105846 3280035 3662282 -120591 -3765231 -3936216 -3063253 -3542692 -3636425
10708 -3636425 -2288842 -1935848 -3266885 -2879105 642518 3666330 3525985 2390469 2484332
10699 2484332 2894625 3644897 6908072 11224780 10933422 5025151 159272 592399 1565801
10690 1565801 -2099603 -7036981 -7273050 -3899916 -1859727 -1145307 1530600 5085862
10682E085862J82991l190023k400679L4401N69531N98488J985501K096882j589168
10673C373786n952540o066139j883108K542592M307439L321442P76772j615905
10665a195661k355441j712297j262543j214737j4767K818104N323053N218232
10657E603943K130333k296653n394274n173870k316010K90168Q82436L68973R033
10648e895921p9261O21108K810060M537243K604944j656162k766757O28211L323046
10639D126511K181274Q99020K184029K074927k300729n966437m097503p18955
10631a617863j413761k872961J042440P164338P021620L90764m874235n041258
10623b00916l410859k071914L61461L009451K807865M62417n37878k02751q06865
$$ plain form
10682 5085862 5268853 2078830 -321849 -287448 282083 880571 2866072 4962954 3373786
10673 3373786 -2578754 -8644893 -10528001 -7985409 -3677970 -356528 420244 -1195661
10665 -1195661 -3551102 -5263399 -6525942 -7740679 -7755446 -4937342 385711 5603943
10657 5603943 7734276 5437623 43349 -5130521 -7446531 -7156363 -6273927 -5904954 -5895921
10648 -5895921 -5975182 -5354074 -2544014 1993229 4598173 2942011 175254 803465 4126511
10639 4126511 6307785 7206805 9390834 11465761 9165032 3198595 -898908 -1617863
10631 -1617863 -3031624 -5904585 -4862145 2302193 9323813 9714577 4840342 -200916
10623 -200916 -3611775 -5683689 -5322228 -2312777 495088 957505 419627 216876 -589989
10614e89989r89706J800567M807847L501006k41295j319853o22246k455690m973152
10605a082511k841257K015816K667051n53080q66305J805736K44012n764851o556682
10596a0932071J715676R262599O717002j432855m431137k83459L782948K572303
10588F971006j370955k688976l01129J516858r05014m639016l549808J680800
10580c286234K887969k821585o778871j640370O308862O650925Q33304j987836
10572A66164o35673j407221m503868l635068J274056K997993m56197l054747j667021
10563a0921582K76487J117474L066317M786053J708516m608836o770975k957251
10555a4303797P35275R23883J221702L997796N999242M520412J295144j376752
$$ plain form
10614 -589989 -1579695 220872 5028719 8529725 8288430 6968577 6346331 3890641 -1082511
10605 -1082511 -3923768 -1907952 759099 206019 -660286 1145450 1389462 -4375389 -10932071
10596 -10932071 -9216395 46204 6763206 5330351 899214 615755 4398703 6971006
10588 6971006 5600051 2911075 2609946 4126804 3221790 -1417226 -4967034 -3286234
10580 -3286234 -398265 -3219850 -9998721 -11639091 -5330229 1320696 2154000 166164
10572 166164 -469509 -1876730 -6380598 -10015666 -8741610 -5743617 -6199814 -9254561 -10921582
10563 -10921582 -10645095 -9527621 -6461304 -1675251 33265 -4575571 -11346546 -14303797
10555 -14303797 -13568522 -12644639 -11422937 -7425141 -1425899 3094513 4389657 3012905
10547C012905k965282k927528j289392K11246J378597M244701O804707L143693
10539A1613647m813597n591224L581809Q534267j91107j0034874o205448L485042
10531C78515K687866n216252m885542L113574N498730J282245J37526J076098
10523D072760l388724p304897p22703O901483L77835j0193940l339776J3526840
10515g1122J2887737n311300j2573807o08679P756732K023918j161810M840486
10507G782155M357545n143799m987897N884308N024859q743773q886370P275589
10499B562617R306722p931841j0757545P943282J0458635j1408810j2349838J8206091
10491F029313K1927836j7343392j3020901Q5003883J65074067Q9518822q6815118
$$ plain form
10547 3012905 47623 -2879905 -4169297 -3958051 -2579454 1665247 8469954 11613647
10539 11613647 6800050 1208826 4790635 13324902 13133795 3098921 -3106527 378515
10531 378515 3066381 -2149871 -7035413 -3921839 1576891 2859136 2996662 4072760
10523 4072760 684036 -6620861 -7343564 -442081 -64246 -10258186 -13597962 -71122
10515 -71122 12816615 7505315 -5068492 -5677171 2079561 4103479 2941669 7782155
10507 7782155 12139700 6995901 2008004 7892312 12917171 4173398 -4712972 2562617
10499 2562617 11869339 3937498 -6820047 1123235 11581870 173060 -12176778 6029313
10491 6029313 27957149 10613757 -2407144 82596739 247670806 337189628 250374510
10484B50374510j69985270r1683993J4844877K5616499j8595193k2917016Q432299
10477c913287J4030712o831465r283703P842714Q719292p680854j0317968L489537
10469c945022P388842k836909n845559K836292O312375P13963j252817J906041
10461E277206j79717n834280l863396L571291M576482m44992j962866n59557k577151
10452a996980l765092K461787Q215961K929953n952054m541101L116961L160788
10444C630223k970895l117169K031507J700469l098043j782509M518290M227551
10436E139424l451900p288678l560298J04642K02647J166690L702684L174992
10428h09797l84347k300148j874199r35185K296626P679717P562417j627869r232299
$$ plain form
10484 250374510 80389240 -11294753 3550124 29166623 10571430 -12345586 -3913287
10477 -3913287 10117425 3285960 -5997743 1844971 10564263 2883409 -7434559 -3945022
10469 -3945022 3443820 606911 -5238648 -2402356 3910019 4623982 3371165 5277206
10461 5277206 5097489 -736791 -4600187 -1028896 3547586 3102594 1139728 580171 -1996980
10452 -1996980 -5762072 -3300285 4915676 7845629 1893575 -2647526 469435 3630223
10444 3630223 659328 -2457841 -426334 1274135 -1823908 -3606417 911873 5139424
10436 5139424 1687524 -5601154 -9161452 -9056810 -8854163 -7687473 -3984789 -809797
10428 -809797 -1194144 -3494292 -5368491 -6303676 -4007050 3672667 11235084 9607215 374916
10419C74916m961081L742995L682365k191807j753409L705234K734590m115943
10411A217860m830265K220180N460645M89932l592925j004092K426208J231458
10403C619001j942470l639518m073983k517716K218464O229642M578346P7848
10395D549614j001648M17622l24346j220651J885802M335933o19538p521246n669842
10386e168300K037913K940722l742417n679490J151949O427897M001218O98905
10378B668397J803294K249310j549403l889468o35647K981868K134441N58445
10370F321237K551661M889971K747512k741121p396796q864235n935854P82439
10362g645186N853707L638499k684477m171165P85183M616240K998044J29227
$$ plain form
10419 374916 -4586165 -843170 2839195 647388 -1106021 2599213 5333803 1217860
10411 1217860 -3612405 -1392225 4068420 4558352 965427 -38665 2387543 3619001
10403 3619001 1676531 -1962987 -6036970 -8554686 -6336222 -106580 4471766 4549614
10395 4549614 3547966 3965588 3641242 2420591 4306393 8642326 8022788 501542 -5168300
10386 -5168300 -3130387 -189665 -3932082 -9611572 -8459623 -2031726 1969492 2668397
10378 2668397 4471691 6721001 5171598 1282130 646483 3628351 5762792 6321237
10370 6321237 8872898 13762869 16510381 13769260 6372464 -2491771 -8427625 -7645186
10362 -7645186 -1791479 1847020 -837457 -5008622 -4223439 392801 3390845 3520072
10354C520072l46840o14410k099465k094280k0015O49607o76321l54767J888645
10345a47774J932584k65644L21656L976813M249370j069110n440279l753310O38185
10336D42491K598317J798784m58105l911646o010203l017454K962136N193455
10328d02225K575168Q96480K027192R29648l727603n649977j907340J355458n40022
10319d443221l003199p86323L177800L777761K056130J470260J415708L7572j412327
10310B290161j684046k169086k768924o83244L287724L660630p18842l494787
10302b280414j002726J566894n90046l687064k620455J29687j16339j491102M78724
10293i612841M505510O000087M387546J904476j340449n225961o149182j857430
$$ plain form
10354 3520072 3173232 2558822 459357 -1634923 -1654938 -1005331 -1681652 -2036419 -147774
10345 -147774 1784810 1519166 1840822 5817635 10067005 8997895 3557616 -195694 442491
10336 442491 3040808 4839592 4381487 469841 -5540362 -8557816 -5595680 -402225
10328 -402225 2172943 3069423 5096615 6026263 2298660 -3351317 -5258657 -3903199 -4443221
10319 -4443221 -7446420 -8232743 -5054943 -1277182 778948 2249208 3664916 3702488 2290161
10310 2290161 606115 -1562971 -4331895 -5015139 -1727415 1933215 1214373 -2280414
10302 -2280414 -3283140 -1716246 -2306292 -5993356 -8613811 -8484124 -8600463 -10091565 -9612841
10293 -9612841 -5107331 892756 5280302 7184778 5844329 618368 -5530814 -7388244
10285g388244L244697L529846K69245j283431l74972m60170k212705k584579l35843
10276g596156K029512J928040n23239k978158k580086J359849N524347N831098
10268B995207K927864R69072Q50366k78815k296670j497559J619249J357716l289162
10259C357268n401311j134194L626133L114555P74158J725711L106922J21825
10251I291067m026837l355286L9248k48673l234798k217337L134685N528395J317440
10242F227904m658955o679657m514857j147634J019913J029226N9526P36443K835921
10233e092170K266456j804181k990652K906593Q651680M506688n922886r121664
10225f600136j283471O101722L467752l674102m668170N72533L445565K38536
$$ plain form
10285 -7388244 -4143547 -613701 -344456 -1627887 -2002859 -2463029 -4675734 -7260313 -7596156
10276 -7596156 -5566644 -3638604 -4161843 -7140001 -9720087 -8360238 -2835891 2995207
10268 2995207 5923071 6892143 7742509 7463694 5167024 3669465 5288714 6646430 3357268
10259 3357268 -2044043 -3178237 447896 3562451 4336609 6062320 9169242 9291067
10251 9291067 5264230 1908944 1948192 1699519 -1535279 -3752616 -617931 4910464 6227904
10242 6227904 1568949 -5110708 -9625565 -10773199 -9753286 -8724060 -8664534 -7928091 -5092170
10233 -5092170 -2825714 -4629895 -7620547 -4713954 3937726 8444414 2521528 -6600136
10225 -6600136 -7883607 -1781885 1685867 -1988235 -6656405 -6083872 -2638307 -2399771
10217b399771l841342l430514K33468K526599J625281l76612p44815J085623L465909
10208a856174M250376K460066r51397l393875k492374J086752L320394J320154
10200C743922k307508k428170J226378L369513J035557j986400j145248K140806
10192C648850L268727J180344j433823k582911k099463j60374J913612J196570
10184D931532l025502o644438n373606m13107L731424N056174M180196J145858
10176C588531l383018n711606k979444J739743L075511J012870j37547P17397
10168b077563Q26119O8405J439433M104750K681596l859410q376954m637861L908059
10159e923426Q638752O241402O37062l611375n418862m991499j618465M288417
$$ plain form
10217 -2399771 -6241113 -9671627 -9438159 -6911560 -5286279 -5662891 -6407706 -5322083 -1856174
10208 -1856174 2394202 4854268 3902871 508996 -1983378 -896626 2423768 3743922
10200 3743922 1436414 -991756 234622 3604135 4639692 2653292 1508044 3648850
10192 3648850 6917577 8097921 6664098 4081187 1981724 1821350 3734962 4931532
10184 4931532 1906030 -4738408 -10112014 -10525121 -6793697 -1737523 2442673 3588531
10176 3588531 205513 -5506093 -8485537 -6745794 -3670283 -2657413 -2794960 -2077563
10168 -2077563 -1251444 -1183039 256394 4361144 7042740 3183330 -5193624 -9831485 -5923426
10159 -5923426 2715326 8956728 9593790 5982415 563553 -4427946 -6046411 -1757994
10151a757994Q808824P170701j82000o197180m686937J448627L367866j575684
10143F396223n804054k635691L601109M143700j149931m523508k457772O91055
10135a738869J368379J330372J652291k55333m178700m373066J776085P676922
10127C258081N830581j562897o143538m934839k357329j967516k092402k52916
10119a0222775K646563M041036K911418K87053j785607j658144J71596J323720
10111b285140Q37627P00552K197576K894849M04469k717107k037515J755515L582126
10102E332952J595089p92814j193266j420344k626526k389361L08040J763975
10094E77745p29701l630823k301225J603224L113166J894470J296420J149524
$$ plain form
10151 -1757994 7050830 14221531 14039531 7842351 3155414 4604041 7971907 6396223
10143 6396223 592169 -2043522 1557587 5701287 4551356 27848 -2429924 -1738869
10135 -1738869 -370490 959882 2612173 2356840 -1821860 -6194926 -4418841 3258081
10127 3258081 9088662 7525765 1382227 -3552612 -5909941 -7877457 -9969859 -10222775
10119 -10222775 -7576212 -3535176 -623758 -336705 -2122312 -3780456 -3608860 -2285140
10111 -2285140 -1447513 -746961 1450615 4345464 4749933 2032826 -4689 1750826 5332952
10102 5332952 6928041 6135227 4941961 3521617 895091 -1494270 -1186230 577745
10094 577745 -151956 -3782779 -6084004 -4480780 -1367614 526856 1823276 2972800
10086B972800j564137n124146l724853K642286O325196L306277n57852N76410
10078D851981K790937n48517o684931o931039l86704M288029J523416l914304
10070e011132m536000M52953N949503P244207L373584k719979n927712l641384
10062d815960P52144K113004Q77608J582861M314216L977067m90864l227491j057671
10053D024914R58088j376777l349936M32236N092537J999005o494041q918753
10045g632727j570407O084633N615434P64611n10904J607323J180548k625606
10037B912905m318197r82079L493959M201180J202884j888745k740884j980768
10029i9745j323980j278162n46069K103325M975900L967387j985252p268378n199744
$$ plain form
10086 2972800 1408663 -3715483 -7440336 -4798050 1527146 4833423 4275571 4851981
10078 4851981 7642918 7094401 409470 -6521569 -6908273 -2620244 -1096828 -5011132
10070 -5011132 -9547132 -9094179 -3144676 4099531 7473115 4753136 -1174576 -4815960
10062 -4815960 -4063816 -1950812 -1073204 509657 4823873 8800940 8310076 5082585 4024914
10053 4024914 4983002 3606225 256289 688525 5781062 7780067 1286026 -7632727
10045 -7632727 -9203134 -3118501 2496933 3261544 2750640 4357963 5538511 2912905
10037 2912905 -1405292 -2387371 1106588 5307768 6510652 4621907 1881023 -99745
10029 -99745 -1423725 -2701887 -3247956 -1144631 3831269 7798656 5813404 -1454974 -6654718
10020f654718K451449O101086Q55384n984451m515919L732654P850885K987436
10012F823806l485271l457336Q49663K039104r00297k369259N54493M517678N509751
10003A0082332L464848O20126j263999j374828j30358O34001l80005k173995l178265
9994F299857l304584k543049j10440K429171Q64376m692725o745321n96454O325717
9985b073452L962331m151111m957088L929722J0131600N672158j692875k428257
9977H393028K21689j608641o128179o105835j750761R40470J055848K122465L115761
9968B55845j9452m984931m835317O68090M178959K265286m75643n14201n16266
9959c977630k386399k528626J554172N578556M284797q93848m351411l726481
$$ plain form
10020 -6654718 -4203269 1897817 2753201 -3231250 -7747169 -4014515 3836370 6823806
10012 6823806 3338535 -118801 730862 2769966 1869669 -499590 54903 4572581 10082332
10003 10082332 13547180 14167306 12903307 11528479 11398121 12032122 11652117 9478122 6299857
9994 6299857 2995273 452224 341784 2770955 3635331 -1057394 -7802715 -8399169 -2073452
9985 -2073452 1888879 -2262232 -7219320 -3289598 6842002 12514160 10821285 8393028
9977 8393028 8614717 7006076 877897 -5227938 -6978699 -6038229 -4982381 -2859916 255845
9968 255845 236393 -4748538 -9583855 -8915765 -4736806 -2471520 -2947163 -3461364 -3977630
9959 -3977630 -6364029 -8892655 -7338483 -1759927 2524870 1631022 -2720389 -6446870
9951f446870r11610K158744M796058N669498L205802j663010n269767m771303
9943c232458j418012N32828j227363l661639j768407M179960P506505L379280
9935D290694m155425o700537j815356M684403O345399K782455j552613k807208
9927A071812j153794J65401q79488k065096q1469L512514L627314R8090p94693
9918C500591L421424N789097M26219o849402o521838j25671K507032j272712m482978
9909c608238l454811k546653l776000k105012M391358Q526641M324044l280093
9901a528764n420745j195274L293999M108751K285984N9527j213875j014281l67901
9892i92579p09011r19150R98693K726960k91412o086525o474389O60752O730699
$$ plain form
9951 -6446870 -7358480 -5199736 -403678 5265820 8471622 6808612 1538845 -3232458
9943 -3232458 -4650470 -4117642 -5345005 -9006644 -10775051 -6595091 911414 4290694
9935 4290694 135269 -6565268 -8380624 -3696221 2649178 5431633 3879020 1071812
9927 1071812 -81982 83419 -796069 -2861165 -2942634 569880 4197194 4295284 3500591
9918 3500591 6922015 12711112 13137331 6287929 -233909 -359580 2147452 874740 -3608238
9909 -3608238 -7063049 -9609702 -13385702 -15490714 -11099356 -2572715 1751329 -1528764
9901 -1528764 -6949509 -8144783 -4850784 -742033 1543951 1603478 389603 -624678 -992579
9892 -992579 -1701590 -2620740 -1622047 1104913 813501 -5273024 -11747413 -11086661 -4355962
9883d355962M768937q47992k890612k286970l221029l835016o19569L542422N262802
9874d482989R116449J8817551K4481565J2948343j0147481k3399149j7218035
9867A0116254m720971n29972k184293n28559L184365J933345k773809l188512
9859A307848J402496M004371J447632j954055k421007j374326j150651j438687
9851a76379j192783m24339N11808J005362K67915o59008Q37330M121103M158168
9842H449177r09142m933416k114891L345649L106089k385405n254549l241197
9834c937685j835890k752879m86814O415479J0309208O117568j30543j057221
9826A2641223P36098j218935n550529o249163l597501k572102k624310J190350
$$ plain form
9883 -4355962 412975 -435017 -3325629 -5612599 -8833628 -12668644 -13288213 -9745791 -4482989
9874 -4482989 4633460 23451011 47932576 60880919 50733438 27334289 10116254
9867 10116254 5395283 4865311 2681018 2152459 5336824 7270169 4496360 1307848
9859 1307848 2710344 6714715 8162347 6208292 3787285 2412959 1262308 -176379
9851 -176379 -1369162 -1793501 -1281693 -276331 -8416 -667424 169906 4291009 8449177
9842 8449177 7540035 2606619 491728 3837377 6943466 4558061 -696488 -3937685
9834 -3937685 -5773575 -8526454 -9013268 -2597789 7711419 13828987 13698444 12641223
9826 12641223 13377321 12158386 6607857 358694 -3238807 -5810909 -8435219 -7244869
9818g244869P181409O938240j462033q646490o414843J490826N810735L984491
9810A637466O74512n79162n70309m55717M02627J856625J743209r34785l465008
9801C09458k346278J578328L383209P39949k074877r1148M082113L211932l076706
9792E715980o439800k293230K716551J145046l553722l488273L56871R04402j734461
9783f670636o23815M687865O311389J486204k539116p95533J855640M21257j812934
9774B320321p38953N47868j598467l260387N47953O309702P020755L043698O9076
9765A4261566q62902l208042o380379n418359M21275N291783M421437l79256m065756
9756D081367m002249j430625P02115J032975J216945K746698L105378p93336n391059
$$ plain form
9818 -7244869 -63460 6874780 5412747 -3233743 -9648586 -8157760 -2347025 1637466
9810 1637466 2311978 1732816 1162507 706790 1109417 2966042 4709251 3774466 309458
9801 309458 -2036820 -458492 2924717 3664666 1589789 1498641 5580754 8792686 5715980
9792 5715980 -723820 -3017050 -300499 844547 -2709175 -6197448 -5840577 -4936175 -6670636
9783 -6670636 -7294451 -2606586 3704803 5191007 2651891 1856358 3711998 4133255 2320321
9774 2320321 1581368 2129236 530769 -2729618 -2181665 4128037 11148792 14192490 14261566
9765 14261566 13398664 10190622 3810243 -1608116 -1186841 4104942 8526379 8147123 4081367
9756 4081367 79118 -1351507 -649392 383583 1600528 4347226 7452604 6659268 1268209
9747A268209l253305M846002Q157165Q16311q725877r425822k420713L268512
9739e469518M108334K774943L35170l083427l387446K296030Q099026O294223
9731A1967335n01164l343682j133684n99137l304331l646095l89240N49326k939507
9722c340179n064242k135102J650564J819533k5601o10833K07856J469154K759172
9713c269678K619750L10200j047880J283090L743592J782324j249950N22731L635089
9704H329268J72868o783325o152859J884893M510650k385378o804858r01945O170495
9695a960191M612306k94611J85363K547172m77942n193545l937878M58773L87922
9686c672631k148204n3212M408487L119970k544772l060704L226801P506990M650752
$$ plain form
9747 1268209 -1985096 2860906 11018071 11834382 3108505 -6317317 -8738030 -5469518
9739 -5469518 -1361184 1413759 1748929 -1334498 -4721944 -2425914 5673112 11967335
9731 11967335 11466171 8122489 6988805 6389668 3085337 -560758 -949998 -400672 -3340179
9722 -3340179 -8404421 -10539523 -8888959 -7069426 -7095027 -7705860 -7498004 -6028850 -3269678
9713 -3269678 -649928 -339728 -1387608 -104518 3639074 5421398 4171448 4694179 8329268
9704 8329268 8502136 1718811 -4434048 -2549155 1961495 -423883 -7228741 -8130686 -1960191
9695 -1960191 2652115 2357504 2542867 5090039 4612097 -581448 -4519326 -4060553 -3672631
9686 -3672631 -5820835 -5874047 -1465560 1654410 -890362 -3951066 -724265 6782725 11433477
9677A1433477p13709l624458m689376m656054j684619L276975N283097K128123
9669F753456k845949n907577o122921l241208K184796O200385M429623j400905
9661D9700m526776j600511L629959N405821J720174m420190p016362k348691N160276
9652c946600N972183j946578q366749m335157M633800O849263J710394j280459
9644g09903J396414L214301K49695k618568j185497J203679N75963p14507J143288
9635B554865M307652L846884q88311m874700k996994L834309Q232072L943570
9627A7959347n260135q536485k471342L282846K59764n461497k987186N506648
9619B291960Q155656K177873l239700k857966j644478k947407k581841J030840
$$ plain form
9677 11433477 10719768 7095310 2405934 -2250120 -3934739 -657764 4625333 6753456
9669 6753456 3907507 -2000070 -8122991 -11364199 -9179403 -2979018 1450605 49700
9661 49700 -4477076 -6077587 -2447628 2958193 4678367 258177 -6758185 -9106876 -3946600
9652 -3946600 2025583 79005 -8287744 -12622901 -7989101 -1139838 570556 -709903
9644 -709903 686511 3900812 4150507 1531939 346442 1550121 2126084 1411577 2554865
9635 2554865 6862517 10709401 9821090 4946390 1949396 5783705 14015777 17959347
9627 17959347 12699212 4162727 1691385 4974231 5233995 -227502 -3214688 2291960
9619 2291960 10447616 12625489 9385789 6527823 4883345 1935938 -645903 384937
9611C84937J895257k629350n540266j454578M000364L213155j605783k915758
9603d652022P46967M433338M348092O59989m124315o065700k806134J882881J549580
9594d027324k922725l492579K074149N665577J901643k879807j428505K637096
9586b472475K277957n26217M88170L746606K833843j429173k132167J669961L398740
9577G855245k44372m735015m972392j103392L389020M804317J252836m188383
9569B057864m674576J212011N133973L68820o657613n081124L368243O997274
9561B724872K707799l25482K660827M091310j926437q428102o405680R71612L913320
9552a5961R30212q14078K005509M325662J384231m130798o049243k721697J363522
$$ plain form
9611 384937 2280194 -349156 -5889422 -7344000 -3343636 -130481 -1736264 -4652022
9603 -4652022 -3905055 528283 4876375 5536364 1412049 -4653651 -7459785 -5576904 -4027324
9594 -4027324 -6950049 -10442628 -8368479 -2702902 -801259 -3681066 -5109571 -2472475
9586 -2472475 -194518 -720735 -232565 3514041 6347884 4918711 2786544 4456505 7855245
9577 7855245 7610873 2875858 -2096534 -3199926 189094 4993411 6246247 2057864
9569 2057864 -2616712 -1404701 3729272 4098092 -2559521 -7640645 -4272402 2724872
9561 2724872 5432671 5107189 7768016 11859326 9932889 1504787 -4900893 -3929281 -15961
9552 -15961 914251 100173 2105682 6431344 7815575 3684777 -2364466 -5086163 -3722641
9543c722641J379088j841368k925888O17901M567865M071690J033377P68502K956026
9534F904552K325779j716667l583808j394496n63773l792743n141330P6049O163181
9525g23256N351657J18267j399493J210161J268002k506514l903352m32350K376638
9516A359760M99137k420322k040786q1980O8863o50592K41064K005675K760289
9507A741108K894367K753434M28784m140490o254192k414297L279023L719065
9499B006802j622556o364125n739211j274544K731325L702966J772516p59204
9491e546031j083821Q65030J986585Q97795O44057L211567M636613R00446m058243
9482B453998l266137J784979K840160j569574l398764J335905N305795J633058
$$ plain form
9543 -3722641 -2343553 -4184921 -7110809 -6492908 -1925043 2146647 3180024 3948526 6904552
9534 6904552 9230331 7513664 3929856 2535360 1971587 -1821156 -6962486 -6886437 -723256
9525 -723256 4628401 4746668 3347175 4557336 5825338 3318824 -584528 -1016878 1359760
9516 1359760 1858897 -561425 -2602211 -2684191 -2615328 -3265920 -3024856 -1019181 1741108
9507 1741108 4635475 7388909 7817693 3677203 -2576989 -4991286 -1712263 2006802
9499 2006802 384246 -5979879 -11719090 -12993634 -10262309 -6559343 -4786827 -5546031
9491 -5546031 -6629852 -5764822 -3778237 -2880442 -2236385 975182 5611795 6512241 2453998
9482 2453998 -812139 972840 3813000 2243426 -1155338 180567 5486362 7119420
9474G119420m754127m922240M33324L429580J612246m17103m60224j366207l709372
9465c034703l388178J226974N573364N110587J033522k600171l843759k798238
9457b720602P11K655168K264679j119040l225043r59930K897662L436282O15616
9448C845503j121672l8405J17765l594271p377224m921417L298540R380566Q003359
9439G592744K960283O30290P71219r17559l717647k754382J274616J413567m156661
9430C096470p943699m680963L44228N38530j174105J290501N465029M557121m2702
9421A450410p57176L100462M483734R73127j967503j387202q47540j825621o87403
9412B535288K540326J889109l674243o376219k207797J704933o81892l436339
$$ plain form
9474 7119420 2365293 -2556947 -2123623 1305957 2918203 2501100 2040876 674669 -3034703
9465 -3034703 -6422881 -5195907 377457 5488044 6521566 3921395 77636 -2720602
9457 -2720602 -2719891 -64723 2199956 1080916 -2144127 -3104057 -206395 3229887 3845503
9448 3845503 2723831 2685426 2803191 -791080 -8168304 -13089721 -9791181 -410615 7592744
9439 7592744 10553027 11183317 11954536 11036977 7319330 4564948 5839564 7253131 3096470
9430 3096470 -4847229 -9528192 -9183964 -8645434 -9819539 -8529038 -3064009 1493112 1450410
9421 1450410 693234 3793696 8277430 9250557 7283054 5895852 5048312 3222691 2535288
9412 2535288 5075614 6964723 3290480 -3085739 -5293536 -3588603 -4270495 -7706834
9404g706834J002267P916021P520724J016228k084570J72277P19915k723765l887644
9395A944619J87649L692491J922031j804721l072577k896162k954548j005807
9387c987025L663723N851504J576834m531141n209877r75738J734249Q30285K24174
9378h23012J668057J837675p89949k219294M35954L150423N53486n274630o899114
9369h360404k041557L045119K303837k052763l263133O67947N158066N793757
9361A250869L245990P80110k33684p04293j413825j950340j535777n3725J516522
9352I01847J721623L79938p23739j78849N61576r04618l675140l863231P3444
9343e707149M786346O089553L541359k49022k842134l061430q82807J964027K815438
$$ plain form
9404 -7706834 -6704567 1211454 8732178 9748406 7663836 7836113 8556028 5832263 1944619
9395 1944619 2132268 5824759 7746790 5942069 2869492 -26670 -2981218 -3987025
9387 -3987025 -323302 5528202 7105036 2573895 -2635982 -3611720 -1877471 -1047186 -823012
9378 -823012 845045 2682720 1892771 -326523 109431 3259854 3813340 -1461290 -8360404
9369 -8360404 -10401961 -7356842 -5053005 -7105768 -10368901 -9700954 -4542888 1250869
9361 1250869 4496859 5276969 5043285 4338992 2925167 974827 -560950 -614675 901847
9352 901847 2623470 3003408 2279669 2100820 2662396 1757778 -1917362 -5780593 -5707149
9343 -5707149 -920803 5168750 8710109 8461087 5618953 2557523 1674716 3638743 6454181
9334F454181J073936j022692j775237k133983k958028k625454K28275L558903
9326G99901M206479J926670j277341m204531o105148n035719j53029N236944O521601
9317A915827L408978m47926k897992m591196n034989k075272L252047N791535
9309f78988L073518l79420O86372M105354L190725k863757o775154l220916L333578
9300D71312M807780P72130j912956k37192O33050l156856o341223k226172N430769
9291a759358O267294j247272o525985j931707O015034N978906k395374q714667
9283d313129n972859J737568N966539L710016r98506k654285Q345L194901K854454
9274C533044l637p44948J949803M047919K587261M8732o11752j146898l912846
$$ plain form
9334 6454181 7528117 6505425 4730188 2596205 -361823 -2987277 -2759002 799901
9326 799901 5006380 6933050 5655709 1451178 -4653970 -9689689 -9842718 -4605774 1915827
9317 1915827 5324805 4876879 1978887 -2612309 -7647298 -9722570 -6470523 -678988
9309 -678988 2394530 2015110 2701482 6806836 9997561 7133804 358650 -2862266 471312
9300 471312 5279092 6051222 4138266 3901074 4534124 1377268 -4963955 -7190127 -1759358
9291 -1759358 4507936 3260664 -3265321 -5197028 818006 6796912 4401538 -4313129
9283 -4313129 -10285988 -8548420 -2581881 1128135 129629 -2524656 -2516311 678590 3533044
9274 3533044 3529407 2784459 4734262 8782181 11369442 11418174 10806422 9659524 5746678
9265E746678o227823m293096j15113J337994o4785p08270l50074j334318j912731
9256g921538J812214P197746O674005l13926n212075l105170N23142Q874j396316
9247a733044J222467M756093L278797j645642l748547k132287q36629l72759K268848
9238A057297N732854M507048j654115n654422l117147J319437J354429j834906
9230A710475k152778K305489O937478O779592J963218l287558n399779m418759
9222D437378k584889q31848J759837M569751M101635j190486o467345n117031
9214a322998K124490O896048L514291m051742p804286n416162j307757J51879
9206g216237q11067j352483P194K070376K600445Q91727j235793j492204j7321
$$ plain form
9265 5746678 -481145 -4774241 -4889354 -3551360 -3616145 -4324415 -4674489 -6008807 -7921538
9256 -7921538 -6109324 1088422 7762427 7448501 2236426 -868744 -345602 -336728 -1733044
9247 -1733044 -510577 4245516 7524313 5878671 2130124 -2163 -838792 -1211551 1057297
9238 1057297 6790151 11297199 9643084 3988662 871515 2190952 3545381 1710475
9230 1710475 -442303 1863186 8800664 15580256 17543474 14255916 8856137 4437378
9222 4437378 1852489 1020641 2780478 7350229 11451864 10261378 3794033 -1322998
9214 -1322998 801492 7697540 11211831 7160089 -644197 -6060359 -7368116 -7216237
9206 -7216237 -8027304 -9379787 -9372593 -7302217 -4701772 -3810045 -5045838 -6538042 -6555363
9197f555363J012613O98346M89616J424815K403923K253672J432910L98533j434796
9188B124269l395368k798545R16962L691566J970652j495839j228319K530840
9180B316218L765452m18698n444862n610185j200314L003502L751159J714518
9172A876790k85826J95969K944715M542489K193150j673917k017540Q84419Q71375
9163I531624m359275q175210m292919L154846N116604N41301l298332k416870
9155d198231m79382n98044k10790K751825M849196K806205m59612o06437P23530
9146D578260j063762n004063n189888l5927M553874L268632j321621k529974J562837
9137a181632O092001N780901Q79232l819734m361316j084220K452879K893319
$$ plain form
9197 -6555363 -5542750 -4844404 -4354788 -2929973 -526050 1727622 3160532 3559065 2124269
9188 2124269 -1271099 -4069644 -3152682 538884 2509536 1013697 -214622 2316218
9180 2316218 6081670 5662972 218110 -5392075 -6592389 -3588887 162272 1876790
9172 1876790 1590964 1786933 4731648 9274137 11467287 9793370 7775830 8660249 9531624
9163 9531624 5172349 -3002861 -7295780 -4140934 975670 1516971 -1781361 -4198231
9155 -4198231 -4677613 -5275657 -5486447 -2734622 2114574 4920779 4461167 3854730 4578260
9146 4578260 3514498 -1489565 -6679453 -6715380 -2161506 1107126 -214495 -2744469 -1181632
9137 -1181632 4910369 10691270 11570502 7750768 3389452 2305232 4758111 7651430
9129G651430k22964m025200m561905o92408M002165M503633R0024m591194m931972
9120b778391j336532K211316K890541J011617j135026j004470J837824L862101
9112E558980Q19675n427123p223951j562376M225771K592101k502824j693730
9104e213477M557291O455599O65343m522645k592681J971554K529771K26070o95373
9095C381452n98348j166746m30765K369714K548615k444514o593545m093923O78433
9086f349627O51837j503614J170632N994361M497236j511641j227166O533507
9078H255525R591914J693155o985553n734577Q55296K101658j871152k961091
9070D945175L18669J790915r94211l854288m127771l626238k994423m15710K911207
$$ plain form
9129 7651430 7428466 3403266 -1158639 -1851047 2151118 6654751 6744775 2153581 -2778391
9120 -2778391 -4114923 -1903607 986934 1998551 863525 -140945 1696879 5558980
9112 5558980 6378655 951532 -6272419 -7834795 -3609024 -1016923 -3519747 -5213477
9104 -5213477 -656186 5799413 6464756 1942111 -650570 1320984 3850755 4076825 3381452
9095 3381452 2783104 1616358 1185593 3555307 6103922 3659408 -2934137 -7028060 -6349627
9086 -6349627 -5697790 -7201404 -6030772 -36411 4460825 2949184 1722018 8255525
9078 8255525 17847439 19540594 12555041 6820464 7675760 9777418 7906266 4945175
9070 4945175 5263844 7054759 6060548 2206260 -1921511 -5547749 -8542172 -8957882 -6046675
9061f046675K769978o26105j405836K844954O374198L731305j727717l089707
9053B824395m73487m3652l406477m699825j00283N421934M917948n66325l899958
9044b5730k141545N01142K33066j052740j17529K289311L563587L546748L196554
9035I992864J463442k513620n798043m647573n21441J180470j266185l445739
9027e555825j186198L678380N801498K873152j942088l663530r97142K083751
9019A091998J164022k454108l083285R40258M047271J546396k928567k902513
9011b578528R41466K409102l1371j548054L41463J999128L73977k179870k331085
9002b603772n84352Q00044J149159O93256l44704p62662L52429R79513j298485
$$ plain form
9061 -6046675 -3276697 -3902802 -5308638 -2463684 3910514 7641819 5914102 2824395
9053 2824395 2350908 2307256 -1099221 -5799046 -5899329 -477395 4440553 3874228 -25730
9044 -25730 -2167275 -1666133 -1433067 -2485807 -2603336 -314025 3249562 6796310 9992864
9035 9992864 11456306 8942686 3144643 -1502930 -2024371 -843901 -2110086 -5555825
9027 -5555825 -6742023 -3063643 2737855 5611007 3668919 5389 -991753 1091998
9019 1091998 2256020 -198088 -3281373 -2341115 1706156 3252552 323985 -2578528
9011 -2578528 -1637062 772040 740669 -807385 -465922 1533206 1907183 -272687 -2603772
9002 -2603772 -3188124 -2388080 -1238921 -545665 -890369 -1653031 -1300602 -321089 -1619574
8993a619574m095212k636629K178484M072847R84951k017024j394665P3479J5910
8984d437433Q49466L380148L069903j989902n809800l311905J446615K482115
8976d320793J618279L348163N207671K390734j893962p46100L846092L186323
8968A2636407l554677p280807l412627J091352q81424n853296n778701J82293
8960a2851480N413968N134815J706583Q05349M255182P530928N279204r87662
8952A6286887m058876j277328J319039j171795m195206j733725K511332R80827
8944H661155m184315m204223J119817K911716j325692l774131o08961J713568
8936C08934o95930j569114L341816P018129K885401l137976k300271K463195K420360
$$ plain form
8993 -1619574 -5714786 -8351415 -6172931 -2100084 -1115133 -3132157 -4526822 -4453343 -4437433
8984 -4437433 -3587967 -207819 2862084 872182 -4937618 -8249523 -6802908 -4320793
8976 -4320793 -2702514 645649 5853320 8244054 6350092 5603992 9450084 12636407
8968 12636407 9081730 1800923 -1611704 -520352 -1401776 -7255072 -13033773 -12851480
8960 -12851480 -7437512 -2302697 -596114 209235 4464417 11995345 17274549 16286887
8952 16286887 12228011 10950683 12269722 11097927 6902721 5168996 7680328 8661155
8944 8661155 4476840 272617 1392434 4304150 2978458 -795673 -1404634 308934
8936 308934 -386996 -1956110 1385706 8403835 11289236 8151260 5850989 8314184 10734544
8927A0734544k054381l713928j842005k051338m586908l818635P95851L228039
8919c308761J176225r60834n00621K32167K32910J687304M064391L672361N95071
8910F890213j016232p66111k506489n558304l900540L124420P701761N090442
8902I059160M83522k72555O54148q41807k943130k449923j366572k444262l182476
8893c303895p16326K026697J572333O58775K847830M937615K360559k044611k902228
8884E436749j975529l740205m889753P66314Q931040Q587709m45557o066246k492616
8875D111906J870011j71725l109845k7504M626559L010917k620402m376440j657837
8866A655640J86767N34782K756899M793471Q80899o916427q748995j305907O176319
$$ plain form
8927 10734544 8680163 4966235 3124230 1072892 -3514016 -7332651 -6536800 -3308761
8919 -3308761 -2132536 -3093370 -3593991 -3361824 -3128914 -1441610 2622781 6295142 6890213
8910 6890213 5873981 5107870 2601381 -2956923 -6857463 -3733043 3968718 9059160
8902 9059160 9542682 9270127 9924275 9082468 6139338 3689415 2322843 -121419 -3303895
8893 -3303895 -4020221 -1993524 -421191 237584 3085414 8023029 10383588 8338977 5436749
8884 5436749 3461220 -278985 -5168738 -4402424 4528616 13116325 12670768 6604522 4111906
8875 4111906 5981917 5810192 2700347 2672843 7299402 10310319 7689917 3313477 1655640
8866 1655640 1842407 2377189 5134088 9927559 10808458 3892031 -4856964 -6162871 13448
8857A3448M608499k624256n523695j444519K990203K451011m11189j57025L447589
8848C350066N630207L493304m86534k596414k811413l243405l617897j993670
8840b275756O68211J009441j062520j694321M70488J808277m348j986661j371130
8831d438319l37592j004699m67617L607654O702285L595235k434888m171690j894268
8822h43899j763203m012107k406189L545733N698409Q5988o007338m878671P86880
8813i794397L786369L172471K569538K239547n8656l037917l447204k097305k200975
8804h868529k787456K8156N360938P308548L557738j165828k235018r74145o66602
8795d42198r00229K41375J313261m11312l223064k352412K310617M637344R53688
$$ plain form
8857 13448 4621947 1997691 -3526004 -4970523 -1980320 470691 59502 -97523 3350066
8848 3350066 8980273 12473577 11987043 9390629 6579216 3335811 -282086 -2275756
8840 -2275756 -1607545 -598104 -1660624 -3354945 -2884457 -1076180 -1080528 -3067189 -4438319
8831 -4438319 -4775911 -5780610 -6248227 -2640573 4061712 7656947 5222059 1050369 -843899
8822 -843899 -2607102 -6619209 -9025398 -5479665 218744 304732 -5702606 -10581277 -9794397
8813 -9794397 -6008028 -2835557 -266019 1973528 1914872 -1123045 -4570249 -6667554 -8868529
8804 -8868529 -11655985 -11627829 -6266891 1041657 4599395 3433567 1198549 224404 -442198
8795 -442198 -1342427 -1101052 212209 -199103 -3422167 -5774579 -3463962 1173382 2127070
8786B127070l578818j695380N004214P498859K024226m509103m425217L08718
8778B754569K069655j331264m983254m839486j968326J059631L159179L380031
8770f99265R24800k171021k113660J321124L738716K035590j485592k628973n17857
8761a596138K373795L436613J798358j328618l206815k092988K95508O27278j574336
8752a267343l482645l060898j095619J006740K703095L246452J900038k64621
8744c14801j224297q47611n72596o97505o32191q58159j482434m06462L056507
8735c979549M816087J575554k438741j240635K328134O68569m663841m015600
8727f950022L720708P412740J301779n260505l031572K575777J767114l334681
$$ plain form
8786 2127070 -1451748 -3147128 1857086 9355945 11380171 6871068 2445851 2754569
8778 2754569 4824224 3492960 -1490294 -6329780 -8298106 -7238475 -4079296 -699265
8770 -699265 225535 -1945486 -4059146 -2738022 1000694 3036284 1550692 -1078281 -1596138
8761 -1596138 777657 4214270 6012628 4684010 1477195 -615793 -320285 306993 -1267343
8752 -1267343 -4749988 -7810886 -8906505 -7899765 -5196670 -1950218 -50180 -314801
8744 -314801 -1539098 -2386709 -2959305 -3656810 -4289001 -5147160 -6629594 -7036056 -3979549
8735 -3979549 836538 2412092 -26649 -1267284 1060850 1729419 -2934422 -6950022
8727 -6950022 -3229314 4183426 5485205 224700 -2806872 -231095 1536019 -1798662
8719a798662l842060N06820K711908J413740J190841K224699M07528l157025k779769
8710c121980J557070L553100Q30094k222292k549027j972951j905365j278666
8702g110017k45561K00974J820171N888104P773329K545528n215869o256180q44643
8693a444164J835524r64751j902317K317842M636653M81040l549006p94436M271908
8684D888293L879115p27027k914327j530725k75651N28R52146J467834m45139
8675E295047k559595j378746J439770J297239j928940l872137k249951J025438
8667b931875L490011L988568J969405j467473l138341j788717o82879k497312
8659c058613m025077q69546M390171M670556j109042n747029l471116K647665
$$ plain form
8719 -1798662 -5640722 -5133902 -2421994 -1008254 182587 2407286 2814814 -342211 -3121980
8710 -3121980 -1564910 1988190 2818284 595992 -1953035 -3925986 -5831351 -7110017
8702 -7110017 -7355578 -7154604 -5334433 553671 8327000 10872528 5656659 -599521 -1444164
8693 -1444164 391360 -573391 -2475708 -157866 4478787 4959827 1410821 616385 4888293
8684 4888293 8767408 8040381 5126054 3595329 3319678 3320206 4272352 5740186 5295047
8675 5295047 2735452 1356706 2796476 4093715 2164775 -1707362 -3957313 -2931875
8667 -2931875 558136 4546704 6516109 5048636 1910295 121578 -561301 -3058613
8659 -3058613 -7083690 -7953236 -3563065 1107491 -1551 -5748580 -9219696 -6572031
8651f572031N346038K175514k619652l683024j19646M099676M539925J059296
8643D226096k284322k265862m4966J267744R36320O73993J467247K225663J217614
8634G419527k124061o021406o671701j837464N069502P371655L286534j479710
8626E012876j794624j61838j722326n351172n373236p45478L438259L776087K365860
8617e55592J676090P93933j054215j689317L53830K644157K334377L21570p93994
8608D030839o43877k51937N99252K127564K476122J83928k613481k843242j220062
8599A845106o18433p34282J042380L634487K639464j905354l734674M64264N082499
8590G715457L493823k072374m456299k605963j774606l768877m432870j728664
$$ plain form
8651 -6572031 -1225993 949521 -1670131 -5353155 -5472801 -1373125 3166800 4226096
8643 4226096 1941774 -324088 -369054 898690 1835010 2509003 3976250 6201913 7419527
8634 7419527 5295466 -725940 -7397641 -9235105 -4165603 3206052 6492586 5012876
8626 5012876 3218252 3056414 1334088 -4017084 -9390320 -10135798 -6697539 -2921452 -555592
8617 -555592 1120498 1914431 860216 -829101 -475271 2168886 4503263 4824833 4030839
8608 4030839 3386962 3135025 3734277 5861841 8337963 8521891 5908410 3065168 1845106
8599 1845106 1226673 492391 1534771 5169258 7808722 5903368 2168694 2632958 7715457
8590 7715457 11209280 9136906 4680607 2074644 300038 -3468839 -7901709 -9630373
8582i630373P81628Q65406J502667M392385N553980K014862k188205k092337K57461
8573A457474p1365k175095j448420J568495J657380j973260l776075n10627L592933
8564a678560K789920k457254o012709k903742N094684J0132298N915628m158665
8556F721600r368630m530040L312599M903455J029411j260270o17616j247825
8548a057316l040002j385919L061854L855673k58932k615831K62124L076942J103856
8539C002449k380273k583786o02365L98835O53387R24410l29959k579449j721390
8530e218141K502084L727238j019667m815736j051020N504662N760141M6905l791483
8521A644983l092948k157882k546811n28527M733469P905981M953050j120760
$$ plain form
8582 -9630373 -8848745 -7983339 -6480672 -2088287 3465693 5480555 3292350 1200013 1457474
8573 1457474 1386109 -788986 -2237406 -668911 988469 -984791 -4760866 -5271493 -1678560
8564 -1678560 1111360 -1345894 -7358603 -10262345 -5167661 4964637 10880265 6721600
8556 6721600 -2647030 -7177070 -3864471 1038984 2068395 808125 190509 -1057316
8548 -1057316 -4097318 -5483237 -2421383 1434290 1175358 -1440473 -1178349 1898593 3002449
8539 3002449 622176 -1961610 -2563975 -2165140 -1511753 -587343 -917302 -3496751 -5218141
8530 -5218141 -2716057 1011181 -8486 -4824222 -5875242 -370580 5389561 5436466 1644983
8521 1644983 -1447965 -3605847 -6152658 -6681185 -1947716 5958265 10911315 9790555
8513I790555m353378k508971J665167L663952J324925k769984l802536q76036
8505B133694J623143O03711j307764r38654j08739j475642k622680j14217L415964
8496A208816K775667r84784k080680M49223J443767j753659n483344n689347k599794
8487a2714135J459036M421949M095572l9246m037127k992983J989753M744345
8479c072836K644204k87688K0324K353518L144497J194548k101448m475188l852817
8470d432886k85615K948706K819402O89657o3109M55005m22584k390663k443594
8461c125681m68603N25072R14M87263K033874J613954q54013j625594l230k16845
8451a632889l792737n774045k368106K543592L175220M13060l81507K156969M025588
$$ plain form
8513 9790555 5437177 2928206 4593373 8257325 9582250 6812266 3009730 2133694
8505 2133694 3756837 4360548 3052784 2114130 2005391 529749 -2092931 -2207148 1208816
8496 1208816 3984483 2999699 919019 1368242 2812009 1058350 -4424994 -10114341 -12714135
8487 -12714135 -11255099 -6833150 -2737578 -2776824 -6813951 -9806934 -7817181 -3072836
8479 -3072836 -428632 -716320 -695996 1657522 4802019 5996567 3895119 -580069 -4432886
8470 -4432886 -4718501 -1769795 1049607 1739264 1676155 2131160 1708576 -682087 -3125681
8461 -3125681 -3594284 -3069212 -3068298 -2581035 -547161 1066793 212780 -1412814 -1416044 -1632889
8451 -1632889 -5425626 -11199671 -13567777 -11024185 -7848965 -7435905 -7817412 -5660443 -1634855
8442a634855K242110j317305k899247j372910R25241J101669q11524j943027q77842
8433f587690j09529j759141k851262O32174N946782N812431n61447m897428j242402
8424e617512N522726O948183K604775r65608n04419M61341j658350m905678m778721
8415b893263o47740L087533K483085p03628j296820J711452L245075l8488l920420
8406A026786l134676k30624j152757m234738k395784L811678N377309m09395m559253
8397e901454q53748L921607J781376k867663j388563L568420K370965m885688
8389d254748p861213k081658N105496O440943L389557K56375k017210k759095
8381c781553K19591N091622N282872r22871n885716l182911K464953K395639k682336
$$ plain form
8442 -1634855 607255 -710050 -3609297 -4982207 -4056966 -2955297 -3766821 -5709848 -6587690
8433 -6587690 -6697219 -8456360 -11307622 -10675448 -4728666 1083765 522318 -4375110 -5617512
8424 -5617512 -94786 6853397 9458172 8492564 7988145 8449486 6791136 1885458 -2893263
8415 -2893263 -3541003 -453470 2029615 1325987 29167 1740619 4985694 4947206 1026786
8406 1026786 -2107890 -2338514 -3491271 -7726009 -10121793 -6310115 -932806 -1342201 -5901454
8397 -5901454 -6755202 -2833595 -1052219 -3919882 -5308445 -1740025 630940 -4254748
8389 -4254748 -12115961 -14197619 -9092123 -2651180 738377 994752 -1022458 -3781553
8381 -3781553 -3561962 1529660 6812532 5889661 3945 -3178966 -714013 1681626 -1000710
8372a000710m153696J252601P115016O950268K033243k398633l961568l475938
8364B360583j979784l23661L71227K20764R14696K687970K865234l06845m130344
8355B679840m578601j771893P21321J323594J752302K909305L137853J523788
8347G697509m06529j688451l387237n240865m232694O63837N219480M933308J144652
8338D703010j454677j572663j573006k344945k294358r48441M36072J532898K530522
8329i85588J917104j011768k452668J604714P664891P714729Q85517m633726l591881
8320G111324o82673j754656m551807l766974j51547J902517K225141L569945M823949
8311H725219K344006k836268n354357l100746Q00576L563610N077785M458697
$$ plain form
8372 -1000710 -5154406 -3901805 3213211 10163479 12196722 9798089 5836521 2360583
8364 2360583 380799 57138 428365 649129 1563825 4251795 7117029 6810184 2679840
8355 2679840 -1898761 -3670654 -2949333 -1625739 126563 3035868 6173721 7697509
8347 7697509 7290980 5602529 2215292 -3025573 -7258267 -6594430 -1374950 3558358 4703010
8338 4703010 3248333 1675670 102664 -2242281 -4536639 -5485080 -5049008 -3516110 -985588
8329 -985588 931516 -80252 -2532920 -928206 6736685 14451414 15336931 10703205 7111324
8320 7111324 6428651 4673995 122188 -3644786 -3796333 -1893816 331325 3901270 8725219
8311 8725219 11069225 8232957 2878600 -222146 578430 4142040 9219825 13678522
8303A3678522p3131o312138q142501l210734L102986M187197R1384l689358l431395
8294c799168n56494J396128J010531j18148Q7888J401848J737756M48391m69298
8285A139434L30915R07804r72208l628844l336769K37922L648063M523141L566717
8276F416175J630561j486034m349997l766639M73586L597921J433010l710219
8268B38364n554452j603846M036855N732462K433681j980082l457847j707291
8260a862156P07216J893207J719868L5533l281325n593146k458763N609547J0474820
8251G244801N495090m328879p542633j676885L533349P11936m651515l601027
8243d815763K287233M237187N23570j676284J205852L604750Q73517k624733q36513
$$ plain form
8303 13678522 13605391 7293253 -849248 -4059982 -956996 3230201 3321585 -367773 -3799168
8294 -3799168 -4355662 -2959534 -1949003 -2067151 -1979263 -577415 1160341 1608732 1139434
8285 1139434 1470349 2378153 1405945 -2222899 -5559668 -5321746 -1673683 2849458 6416175
8276 6416175 8046736 6560702 2210705 -1555934 -1082348 2515573 3948583 238364
8268 238364 -5316088 -6919934 -2883079 2849383 5283064 3302982 -154865 -1862156
8260 -1862156 -1154940 738267 2458135 2493668 -787657 -6380803 -8839566 -3230019 7244801
8251 7244801 12739891 8411012 868379 -808506 2724843 3436779 -1214736 -4815763
8243 -4815763 -2528530 1708657 2232227 555943 1761795 5366545 6240062 3615329 2778816
8234B778816L836106M217832p21896n179311n546215l839657k075102N61784L448751
8225b518892L201706n84946l095328j234367J422464O76742j281869k20462J900628
8216a734324k55804n549075o533932n78086N698845N875907K298934J257271L469793
8207C949529M195257J088648k609176l055313r29717j09348k190991l902894j295243
8198d859248L847095M894165k94739m571102q71242O361426O463711j371495o268234
8189C330337k180808L200435J519887k952573j709411K844295J639146m781755
8181I09553o065135J215615P426062M143781l967957o909088l021758J013581
8173e255346N45719k128861k294344J386136N806569O649973K755656k592783
$$ plain form
8234 2778816 6614922 10832754 10110858 4931547 -614668 -4454325 -6529427 -5967643 -2518892
8225 -2518892 682814 97868 -2997460 -4231827 -2809363 -2132621 -3414490 -3634952 -1734324
8216 -1734324 -1990128 -7539203 -14073135 -14651221 -8952376 -3076469 -777535 479736 3949529
8207 3949529 8144786 9233434 6624258 3568945 2639228 2529880 338889 -3564005 -4859248
8198 -4859248 -1012153 3882012 3587273 -983829 -1855071 4506355 10970066 9598571 3330337
8189 3330337 1149529 4349964 5869851 2917278 1207867 4052162 5691308 909553
8181 909553 -5155582 -3939967 3486095 7629876 3661919 -3247169 -6268927 -5255346
8173 -5255346 -4709627 -6838488 -9132832 -7746696 -1940127 4709846 7465502 4872719
8165D872719n312752m503635j517063K776409O831146O902853J420919m571640
8157F898956m864263j078980L8499k232820j957365K043832L122358j555937n175579
8148d761299k552269Q76437j270982m574625j005867O828578Q755365K277948
8140D573286m732501o145764l788618j109898J372702K878721J587357j116931
8132f481646j368523J030006K602473K579853L036651K686245j794754p440227
8124e149922o658626O42407N607229M192809K586303M394744L422892l355706
8116E682130o630687N38715Q246602L803512o640288o800321L052624O271222
8108G523509k523988q654301k085660O211844L016568n777854n977760K141452
$$ plain form
8165 4872719 -440033 -4943668 -6460731 -3684322 3146824 10049677 11470596 6898956
8157 6898956 2034693 955713 994212 -1238608 -3195973 -1152141 1970217 414280 -4761299
8148 -4761299 -7313568 -6437131 -7708113 -12282738 -13288605 -6460027 2295338 4573286
8140 4573286 -159215 -6304979 -10093597 -11203495 -9830793 -6952072 -5364715 -6481646
8132 -6481646 -7850169 -6820163 -4217690 -1637837 1398814 4085059 2290305 -5149922
8124 -5149922 -11808548 -11166141 -5558912 -1366103 1220200 5614944 9037836 5682130
8116 5682130 -948557 -409842 7836760 11640272 4999984 -1800337 1252287 7523509
8108 7523509 4999521 -3654780 -5740440 471404 3487972 -2289882 -8267642 -6126190
8100f126190O396224K779949j066032n81376K11476j462473k503894j053424M01471
8091c004269R02322K420127L887772J456786l485814m406899l48603J411522k695306
8082c862362n746501j242330N823018O206532L30651l025979N4873M299612M243028
8073G080542J173025n95588K10109J734242K097447N64050k640374n972008o923307
8064c271862m166040N60033L429296K197532r48035j369213K170350N154950L091642
8055F848653j773700l230549p8600K451653J134583o62301O04461K572682J351165
8046I218047j830543k962523j444180O01837K671299M735937M185355n13795m898788
8037I762646l465844J391903K090655k474953n166685j959040K216614K115167
$$ plain form
8100 -6126190 270034 3049983 1983951 1402575 1614051 151578 -2352316 -3405740 -3004269
8091 -3004269 -2101947 318180 4205952 5662738 2176924 -2229975 -2578578 -1167056 -3862362
8082 -3862362 -9608863 -10851193 -5028175 1178357 1509008 -1516971 -1462098 2837514 7080542
8073 7080542 8253567 7657979 7868088 9602330 11699777 12263827 9623453 3651445 -3271862
8064 -3271862 -7437902 -6877869 -3448573 -1251041 -2199076 -3568289 -1397939 3757011 6848653
8055 6848653 5074953 1844404 1765804 4217457 5352040 4689739 5294200 7866882 9218047
8046 9218047 7387504 4424981 2980801 3582638 6253937 10989874 15175229 14661434 9762646
8037 9762646 6296802 7688705 9779360 7304407 2137722 178682 2395296 4510463
8029D510463q279J87541J490477N00672j669098k116505k257717m705817o494600
8020a0562863k678676M365385O883107L408498P50498K491728L489721k80802
8012G866596m037452k485665N70561j066582m372773j879811M377386M641488
8004C613748k348817o131659r89060M973253L396028j189930n83340K439150r2290
7995C087083n804099m937605K628812O151428J453500k541728R44927N608115
7987F590433L147265l320935n150864j389064K262927L412334L576319J749405
7979A0877820m066359r925102q618447j68144O909794O425558J338564j994686
7971G78998j805294p13268p99672j539967j306574N24084K527507K464097K86210
$$ plain form
8029 4510463 4502184 4689725 6180202 6680874 5011776 2895271 637554 -4068263 -10562863
8020 -10562863 -13241539 -8876154 -1993047 1415451 2165949 4657677 8147398 7866596
8012 7866596 3829144 1343479 1914040 847458 -3525315 -5405126 -1027740 3613748
8004 3613748 1264931 -4866728 -5855788 -882535 2513493 1323563 740223 3179373 3087083
7995 3087083 -2717016 -7654621 -5025809 1125619 2579119 37391 982318 6590433
7987 6590433 9737698 6416763 1265899 -123165 2139762 5552096 9128415 10877820
7979 10877820 6811461 -3113641 -11732088 -11900232 -4990438 1435120 2773684 778998
7971 778998 -1026296 -1739564 -2539236 -4079203 -5385777 -4861693 -2334186 129911 416121
7962D16121j257878l67299J166970J056641K70503Q94827K004147J018555k004091
7953C198496m615767n372013m055411l39853M229172N164471O55532l689155j532036
7944f356564L988868L721548l537041q169754l428257M871483O805609J408238
7936f95870l910504l752163N32006M711161N846400L332552p42119k567271m91530
7927B262662K514361K386612p78017l261156k949269j509200j141494j423829
7919c899330n77406J290287J806619m55376l381092l318751K10093L473171L228918
7910a622867Q19900k46984O12015R45133n45284k481404l255548k433083K9379
7901h178743L250660M457049J812720j820325j718725J635347K651849p64392
$$ plain form
7962 416121 -841757 -1209056 -42086 1014555 1285058 2179885 4184032 5202587 3198496
7953 3198496 -1417271 -6789284 -10844695 -11184548 -6955376 -1790905 -1135373 -4824528 -6356564
7944 -6356564 -2367696 1353852 -2183189 -10352943 -13781200 -8909717 -2104108 -695870
7936 -695870 -4606374 -8358537 -7826531 -3115370 2731030 6063582 5321463 2754192 2262662
7927 2262662 4777023 7163635 6385618 3124462 175193 -1334007 -2475501 -3899330
7919 -3899330 -4476736 -3186449 -1379830 -1835206 -5216298 -8535049 -8324956 -4851785 -1622867
7910 -1622867 -802967 -1049951 -437936 507197 -38087 -2519491 -5775039 -8208122 -8178743
7901 -8178743 -4928083 -471034 1341686 -478639 -2197364 -562017 2089832 1325440
7893A325440l397830n86166M132348L824128j701095n610791l464260J641137
$$ plain form
7893 1325440 -2072390 -2658556 1473792 5297920 3596825 -2013966 -5478226 -3837089
$$ [...]
##END NTUPLES=NMR SPECTRUM
##END=
