##TITLE=31Pdec_SR75h-1
 aceton-d6
  24 sc
 21.11.2023
##JCAMPDX= 6.0         $$ Bruker NMR JCAMP-DX V2.0
##DATA TYPE= NMR SPECTRUM
##DATA CLASS= NTUPLES
##ORIGIN= UXNMR, Bruker Analytische Messtechnik GmbH
##OWNER= root
$$ XWIN-NMR		Version 3.5
$$ Tue Nov 21 16:01:16 2023 Russian Standard Time (UT+4h)  she@DPX200
##.OBSERVE FREQUENCY= 81.013821
##.OBSERVE NUCLEUS= ^31P
##.ACQUISITION MODE= SIMULTANEOUS
##.ACQUISITION SCHEME= undefined
##.AVERAGES= 64
##.DIGITISER RES= 16
##SPECTROMETER/DATA SYSTEM= spect
##.PULSE SEQUENCE= zgpg30
##.SOLVENT NAME= Acetone
##.SHIFT REFERENCE= (INTERNAL, Acetone, 0, 248.564)
##AUDIT TRAIL= $$ (NUMBER, WHEN, WHO, WHERE, WHAT)
$$ ##TITLE= Audit trail, XWIN-NMR		Version 3.5
$$ ##JCAMPDX= 5.01
$$ ##ORIGIN= Bruker BioSpin GmbH
$$ ##OWNER= she
$$ F:/spectra/data/she/nmr/P31/1/pdata/1/auditp.txt
$$ ##AUDIT TRAIL=  $$ (NUMBER, WHEN, WHO, WHERE, WHAT)
(   1,<2023-11-21 16:00:25.56 +0400>,<she>,<DPX200>,
      <created by zg, POWCHK disabled, PULCHK disabled
       configuration hash MD5:
       00 E9 B6 7A A2 85 ED C7 34 08 36 98 17 FE 4E 26
       data hash MD5: 32K
       E8 91 7B 9E 40 74 29 29 08 72 26 F0 E3 C9 E0 D0>)
(   2,<2023-11-21 16:00:28.31 +0400>,<she>,<DPX200>,
      <Start of raw data processing
       efp BC_mod = 2 LB = 5 FT_mod = 6 PKNL = 1 PHC0 = -11780.16 PHC1 = 1302.094 SI = 64K 
       data hash MD5: 64K
       1F 7F 96 EE 55 93 62 1A 6F 39 31 20 53 A9 94 CC>)
(   3,<2023-11-21 16:00:41.17 +0400>,<she>,<DPX200>,
      <pk PHC0 = -3.965448 PHC1 = 0 
       data hash MD5: 64K
       43 FD 6E D8 37 7B 47 7E 9F E4 C2 00 F9 48 6E D2>)
$$ ##END=
$$ 
$$ hash MD5
$$ EF 24 05 64 A2 21 1F 3F EE E1 77 FC CF 62 B9 85
##$RELAX= 
##$RELAX= 
##$RELAX= 
##$RELAX= 
##$RELAX= 
##$RELAX= 
##$RELAX= 
##$RELAX= 
##$RELAX= 
$$ Bruker specific parameters
$$ --------------------------
##$DU= <F:/spectra>
##$EXPNO= 1
##$NAME= <P31>
##$PROCNO= 1
##$TYPE= <nmr>
##$USER= <she>
##$AMP= (0..31)
100 100 100 100 100 100 100 100 100 100 100 100 100 100 100 100 100 100 
100 100 100 100 100 100 100 100 100 100 100 100 100 100 
##$AQSEQ= 0
##$AQ_mod= 1
##$AUNM= <au_zg>
##$AUTOPOS= <>
##$BF1= 81.014009
##$BF2= 200.13
##$BF3= 200.13
##$BF4= 200.13
##$BF5= 200.13
##$BF6= 200.13
##$BF7= 200.13
##$BF8= 200.13
##$BYTORDA= 1
##$CFDGTYP= 0
##$CFRGTYP= 5
##$CHEMSTR= <none>
##$CNST= (0..31)
1 1 145 1 1 1 1 1 1 1 1 1 1 1 1 1 1 1 1 1 1 1 1 1 1 1 1 1 1 1 1 1 
##$CPDPRG= <waltz16>
##$CPDPRG1= <>
##$CPDPRG2= <waltz16>
##$CPDPRG3= <>
##$CPDPRG4= <mlev>
##$CPDPRG5= <mlev>
##$CPDPRG6= <mlev>
##$CPDPRG7= <mlev>
##$CPDPRG8= <mlev>
##$CPDPRGB= <>
##$CPDPRGT= <>
##$D= (0..31)
0 1 0 0 0 0 0 0 0 0 0 0.03 2e-05 3e-06 0 0 0 0 0 0 0 0 0 0 0 0 0 0 0 0 
0 0 
##$DATE= 1700568025
##$DBL= (0..7)
120 120 120 11 120 120 24 19 
##$DBP= (0..7)
150 150 150 150 150 150 150 150 
##$DBP07= 0
##$DBPNAM0= <>
##$DBPNAM1= <>
##$DBPNAM2= <>
##$DBPNAM3= <>
##$DBPNAM4= <>
##$DBPNAM5= <>
##$DBPNAM6= <>
##$DBPNAM7= <>
##$DBPOAL= (0..7)
0.5 0.5 0.5 0.5 0.5 0.5 0.5 0.5 
$$ [...]
##$SUBNAM2= <"">
##$SUBNAM3= <"">
##$SUBNAM4= <"">
##$SUBNAM5= <"">
##$SUBNAM6= <"">
##$SUBNAM7= <"">
##$SUBNAM8= <"">
##$SUBNAM9= <"">
##$SW= 501.771253377433
##$SWIBOX= (0..15)
0 1 3 0 0 0 0 0 0 0 0 0 0 0 0 0 
##$SW_h= 40650.406504065
##$TD= 32768
##$TD0= 1
##$TE= 0
##$TE2= 300
##$TE3= 300
##$TEG= 300
##$TL= (0..7)
0 120 53 12 22 120 120 120 
##$TP= (0..7)
150 150 150 150 150 150 150 150 
##$TP07= 0
##$TPNAME0= <>
##$TPNAME1= <>
##$TPNAME2= <>
##$TPNAME3= <>
##$TPNAME4= <>
##$TPNAME5= <>
##$TPNAME6= <>
##$TPNAME7= <>
##$TPOAL= (0..7)
0.5 0.5 0.5 0.5 0.5 0.5 0.5 0.5 
##$TPOFFS= (0..7)
0 0 0 0 0 0 0 0 
##$TUNHIN= 0
##$TUNHOUT= 0
##$TUNXOUT= 0
##$USERA1= <user>
##$USERA2= <user>
##$USERA3= <user>
##$USERA4= <user>
##$USERA5= <user>
##$V9= 5
##$VALIST= <valist>
##$VCLIST= <CCCCCCCCCCCCCCC>
##$VD= 0
##$VDLIST= <DDDDDDDDDDDDDDD>
##$VPLIST= <PPPPPPPPPPPPPPP>
##$VTLIST= <TTTTTTTTTTTTTTT>
##$WBST= 1024
##$WBSW= 4
##$XGAIN= (0..3)
0 0 0 0 
##$XL= 0
##$YL= 0
##$YMAX_a= 337
##$YMIN_a= -444
##$ZGOPTNS= <>
##$ZL1= 120
##$ZL2= 120
##$ZL3= 120
##$ZL4= 120
##$ABSF1= 0
##$ABSF2= 0
##$ABSG= 0
##$ABSL= 0
##$ALPHA= 0
##$AQORDER= 0
##$ASSFAC= 0
##$ASSFACI= 0
##$ASSFACX= 0
##$ASSWID= 0
##$AUNMP= <proc_1d>
##$AZFE= 0.1
##$AZFW= 0.5
##$BCFW= 0
##$BC_mod= 2
##$BYTORDP= 0
##$COROFFS= 0
##$CY= -3
##$DATMOD= 1
##$DC= 0
##$DFILT= <>
##$DTYPP= 0
##$F1P= 0
##$F2P= 0
##$FCOR= 1
##$FTSIZE= 65536
##$FT_mod= 6
##$GAMMA= 0
##$GB= 0
##$INTBC= 1
##$INTSCL= 6.047779e-11
##$ISEN= 30
##$LB= 5
##$LEV0= 0
##$LPBIN= 0
##$MAXI= 10000
##$MC2= 0
##$MEAN= 0
##$ME_mod= 0
##$MI= 50
##$NCOEF= 0
##$NC_proc= -14
##$NLEV= 6
##$NOISF1= 182.463
##$NOISF2= 159.3651
##$NSP= 0
##$NTH_PI= 0
##$NZP= 0
##$OFFSET= 248.5645
##$PC= 4
##$PHC0= -11784.13
##$PHC1= 1302.094
##$PH_mod= 1
##$PKNL= yes
##$PPARMOD= 0
##$PSCAL= 0
##$PSIGN= 0
##$REVERSE= no
##$SF= 81.0140089999694
##$SI= 65536
##$SIGF1= 159.3651
##$SIGF2= -187.1042
##$SINO= 113.3802
##$SIOLD= 16384
##$SREGLST= <1H.CDCl3>
##$SSB= 0
##$STSI= 65536
##$STSR= 0
##$SW_p= 40650.406504065
##$SYMM= 0
##$S_DEV= 0
##$TDeff= 32768
##$TDoff= 0
##$TI= <>
##$TILT= no
##$TM1= 0
##$TM2= 0
##$TOPLEV= 0
##$USERP1= <user>
##$USERP2= <user>
##$USERP3= <user>
##$USERP4= <user>
##$USERP5= <user>
##$WDW= 1
##$XDIM= 65536
##$YMAX_p= 386014651
##$YMIN_p= -115273887
$$ End of Bruker specific parameters
$$ ---------------------------------
##NTUPLES= NMR SPECTRUM
##VAR_NAME=  FREQUENCY,     SPECTRUM/REAL,   SPECTRUM/IMAG
##SYMBOL=    X,             R,               I
##VAR_TYPE=  INDEPENDENT,   DEPENDENT,       DEPENDENT
##VAR_FORM=  AFFN,          ASDF,            ASDF
##VAR_DIM=   65536,         65536,           65536
##UNITS=     HZ,            ARBITRARY UNITS, ARBITRARY UNITS
##FACTOR=    0.620285442955139, 1,           1
##FIRST=     20137.2065510682, 0,            0
##LAST=      -20513.1999529968, 0,           0
##MIN=       -20513.1999529968, -115273887,  0
##MAX=       20137.2065510682, 386014651,    0
$$ Real data points
##PAGE= N=1
##DATA TABLE= (X++(R..R)), XYDATA
$$ [...]
42756H790406K86473Q38112J479727J790536J770009J711977J882362K341430
42748B0891032K904977L219330K987387K191637J103454J16416m68586o74689
42740C2270958q99276j488690k166410k204830j408144o31787r43893k398562
42732B0129366l952577m468765l506340j331725J356004L704707N147821N709154
42724B2787645N677139N041049L574947J458210n72094j824179k234644k372301
42716C1535772l025277m575721o408035p108569n780839l139517p91366N38422
42708A244870J443781K471983L136350K687651J228078m80930j867746k675810
42700G188227k652832j783854o60061j4143Q5332J27380L14530L05031j67909
$$ y = [8790406, 9076879, 9914991, 11394718, 13185254, 14955263, 16667240, 18549602, 20891032, 23796009, 27015339, 30002726, 32194363, 33297817, 33414233, 32945647, 32270958, 31371682, 29882992, 27716582, 25511752, 24103608, 23471821, 22527928, 20129366, 16176789, 11708024, 8201684, 6869959, 8225963, 11930670, 17078491, 22787645, 28464784, 33505833, 37080780, 38538990, 37966896, 36142717, 33908073, 31535772, 28510495, 23934774, 17526739, 10418170, 4637331, 1497814, 706448, 1244870, 2688651, 5160634, 8296984, 10984635, 12212713, 11731783, 9864037, 7188227, 4535395, 2751541, 2091480, 2077337, 2162669, 2290049, 2604579, 2909610, 2741701]
42691B741701q44897j250155j205100r48148q87214j196976j509246j131565J85977
42682f045623J813630K838875L001968K763406K567611K394756J982858J128872
42674A2446353k18744j813165l048117l409985l050328k580646k248475j668023
42666e591130m57306J202006K759896L730386L823393L032817J818208Q79701
42658A1197971M79781K14937l16672q71843q51448j3497J385433K944675M245505
42649A8414842M752105M048916K331520M49798o89874p77993k60835L9077m22755
42640B7884801j438368k244921k309178j836917j385578j127008p32409R5364
42632A6905786J238400K290552K830845K594594J658657N27131k05389l95103
$$ y = [2741701, 1896804, 646649, -558451, -1506599, -2393813, -3590789, -5100035, -6231600, -6045623, -4231993, -1393118, 1608850, 4372256, 6939867, 9334623, 11317481, 12446353, 12227609, 10414444, 7366327, 3956342, 906014, -1674632, -3923107, -5591130, -6048436, -4846430, -2086534, 1643852, 5467245, 8500062, 10318270, 11197971, 11677752, 11892689, 11576017, 10704174, 9852726, 9839229, 11224662, 14169337, 18414842, 23166947, 27215863, 29547383, 29997181, 29307307, 28529314, 28268479, 28307556, 27884801, 26446433, 24201512, 21892334, 20055417, 18669839, 17542831, 16810422, 16905786, 18144186, 20434738, 23265583, 25860177, 27518834, 28045965, 27840576, 27445473]
42624B7445473m14247o38023j052729j416651j564200j415517r04322j18677N91285
42615B0512392Q49232N87780P3142l20282k93305K39795R85377J322848P60362
42606B4717341o03567k153760l256247l606255l228187k382127j450456o57207
42598G379535J67027J319379K632524L390369L036908J816238M87735m81846j185135
42589A8562734j813447k296023k512088k541764k434012j919240p29582P85421
42581E101999J714839J453105L34875p61533j280588j255314q93162k97763L42286
42572D458744O55425M33288p8492m33727m38133k29870p6495k62007r55133j867059
42562A206541k181306j270498M49034J742831J779597Q57885j50161o70842n36744
$$ y = [27445473, 27031226, 26393203, 25340474, 23923823, 22359623, 20944106, 20039784, 19921107, 20512392, 21361624, 21949404, 22022546, 21702264, 21408959, 21648754, 22634131, 23956979, 24717341, 24113774, 21960014, 18703767, 15097512, 11869325, 9487198, 8036742, 7379535, 7546562, 8865941, 11498465, 14888834, 17925742, 19741980, 20229715, 19747869, 18562734, 16749287, 14453264, 11941176, 9399412, 6965400, 5046160, 4316578, 5101999, 6816838, 8269943, 8604818, 7843285, 6562697, 5307383, 4414221, 4116458, 4458744, 5114169, 5547457, 5468965, 5035238, 4597105, 4367235, 4290740, 4028733, 3073600, 1206541, -974765, -2245263, -1796229, -53398, 1726199, 2584084, 2433923, 1763081, 1226337]
42553A226337K98440J615562K681757K721369J758527O62062K44988N38309R63565
42544A2710916R24973J69157j105469k298221k781806k432621j677162r34841
42536B574926k37307M57951Q59520N81696l07626j281744j876890j960803j511917
42527b702194n04507P94737J678938J500327L43780r94277j764135j877426j717928
42518e242685j514184j105648l12580O69894J375666J511499J238483J057981
42510b321574J416842K277251K991407K756050J368904n26849k066968k905679
42502B989384l166794k882584j928665n63209M08333L11461p00697j797546k179834
42493i510151j536913n5548J737925L236243M115255M465264M451827L938510
$$ y = [1226337, 1524777, 3140339, 5822096, 8543465, 10301992, 10964054, 11209042, 11747351, 12710916, 13635889, 13805046, 12699577, 10401356, 7619550, 5186929, 3509767, 2574926, 2337619, 2795570, 3655090, 4236786, 3929160, 2647416, 770526, -1190277, -2702194, -3206701, -2411964, -733026, 767301, 1111081, 116804, -1647331, -3524757, -5242685, -6756869, -7862517, -8175097, -7505203, -6129537, -4618038, -3379555, -2321574, -904732, 1372519, 4363926, 7119976, 8488880, 7962031, 5895063, 2989384, -177410, -3059994, -4988659, -5551868, -5143535, -4832074, -5532771, -7330317, -9510151, -11047064, -11102612, -9364687, -6128444, -2013189, 2452075, 6903902, 10842412]
42485A0842412K645117O64522j350197k560068k474398j251626L38989J335357
42477H190108J268417N79286K09736O04120J136661O75281j183262l467536m552427
42468C460384l638348j491655L38028R39928N88310J00438N2464O29015J753558
42459B732122L049593L944692M168662M041749M014367M043923L692337K732255
42451C2419700J367410q0338j403097k436848l035863l175446k924099k334828
42443A8396591j504120o34704J51276R10654J532302J506055N05701q55912j399390
42434A8608453o77578M94476R94302N34760l25297r30603r85839n56578j2241
42425A7143855J17838m67262j559245k626976l185344k926385j726067K32104
$$ y = [10842412, 13487529, 14152051, 12801854, 10241786, 7767388, 6515762, 6854751, 8190108, 9458525, 10037811, 10247547, 10851667, 11988328, 12663609, 11480347, 8012811, 3460384, -177964, -1669619, -1331591, -391663, 196647, 297085, 349549, 978564, 2732122, 5781715, 9726407, 13895069, 17936818, 21951185, 25995108, 29687445, 32419700, 33787110, 33706772, 32303675, 29866827, 26830964, 23655518, 20731419, 18396591, 16892471, 16257767, 16409043, 17319697, 18851999, 20358054, 20863755, 20007843, 18608453, 17930875, 18425351, 19419653, 19954413, 19629116, 18698513, 17712674, 17156096, 17143855, 17261693, 16794431, 15235186, 12608210, 9422866, 6496481, 4770414, 5002518]
42417E002518K394245M039057M563079L690915J708984m65384j822437k095522
42409A7015455j834075j540731j137649n30859j96121o27280j453313j733107
42401G962320j098338p5627P49411J371704K058209K864557L641115M137331L926296
42392B5536978K635204N46829j325655k097530j812661j209203r07596j030794
42384B0335572j343376j409197p70117O37552K237613L244060L336722K744733
42376B9013562J811032Q03634P1132p3255K34362M37309J66597m53212j240571
42367C0770590k302659l579463m339756l726215j880941p8700N15392K026n33183
42358A4847091k78635N54257J151893J022629M26718k5898j09942k15196p65120
$$ y = [5002518, 7396763, 11435820, 15998899, 19689814, 21398798, 20933414, 19110977, 17015455, 15181380, 13640649, 12503000, 11972141, 11776020, 11148740, 9695427, 7962320, 6863982, 6788355, 7537766, 8909470, 10967679, 13832236, 17473351, 21610682, 25536978, 28172182, 28719011, 27393356, 25295826, 23483165, 22273962, 21366366, 20335572, 18992196, 17582999, 16812882, 17450434, 19688047, 22932107, 26268829, 29013562, 30824594, 31628228, 31699360, 31626105, 31860467, 32297776, 32464373, 32011161, 30770590, 28467931, 24888468, 20548712, 16822497, 14941556, 14862856, 15378248, 15380274, 14847091, 14568456, 15122713, 16274606, 17297235, 17723953, 17698055, 17588113, 17372917, 16607797]
42349A6607797j536295j849177j474001r94719j047019j486406j659754j298613
42341E261813p04626j35215M91334J189491J654511J615741J102279J94029j073303
42332I596054k250937k338724o66030K163297M625417N594493N064570L724202
42324B5512342K274664J173337N38490M6356p79449j923587k737649k696644k134061
42315A9273799j913464k388147k956170k754110j639974l31148M07379N47128
42307H245293O38446R44077J010965L04732q95248j586627j102499J87626J384847
42298I131612K039701K365442K602359K544839J858608O62910m74405j152315
42290A9578751j555524k108208k802814l116392k666950j719020q02580L8252
$$ y = [16607797, 15071502, 13222325, 11748324, 10753605, 9706586, 8220180, 6560426, 5261813, 4557187, 4421972, 4913306, 6102797, 7757308, 9373049, 10475328, 10669357, 9596054, 7345117, 5006393, 4340363, 6503660, 11129077, 16723570, 21788140, 25512342, 27787006, 28960343, 29498833, 29545189, 28765740, 26842153, 24104504, 21407860, 19273799, 17360335, 14972188, 12016018, 9261908, 7621934, 7290786, 7698165, 8245293, 8883739, 9827816, 10838781, 11143513, 10248265, 8661638, 7559139, 7746765, 9131612, 11171313, 13536755, 16139114, 18683953, 20542561, 21205471, 20731066, 19578751, 18023227, 15915019, 13112205, 9995813, 7328863, 5609843, 4807263, 4845515]
42282D845515J258512K986066M480119M680686L233027Q10785j497808k938758
42274A7858144l297876k696993j451515r4052P12846N39663m28032j434613j726101
42265G981471j167712k95673K40963K51908M3994J0189K65116O25778Q31061P54984
42255I542079M77334J94864L6199p4271l52919r05475j521940j777127j406703
42246D212041n84692K21460O57579O72451L49318k29600q17358r01442j00864
42237C478893J286171K380500K518273J827456R18471J77843m36234j026581j502944
42228I621848j766160j897457j967003j773110j021233J89436J237103J481285
42220D104709Q57372j15047q58649j148232j047927o91956k80649j29840m41439
$$ y = [4845515, 6104027, 9090093, 13570212, 18250898, 21483925, 22294710, 20796902, 17858144, 14560268, 11863275, 10411760, 10317708, 11030554, 11570217, 11142185, 9707572, 7981471, 6813759, 6518086, 6759049, 7010957, 7054951, 7065140, 7330256, 7956034, 8787095, 9542079, 10019413, 10214277, 10250476, 10176205, 9823286, 8917811, 7395871, 5618744, 4212041, 3627349, 3848809, 4506388, 5178839, 5528157, 5298557, 4481199, 3579757, 3478893, 4765064, 7145564, 9663837, 11491293, 12409764, 12587607, 12151373, 11124792, 9621848, 7855688, 5958231, 3991228, 2218118, 1196885, 1386321, 2623424, 4104709, 4962081, 4847034, 3988385, 2840153, 1792226, 1100270, 819621, 689781, 248342]
42211B48342r76388j152802o06021M12485J267849J510474J161467N45259j7976
42202B392689l97174o95794j143716j801428k313493k126543j123144O2741O06192
42193f539670L78680K4726N5056J49270l48147j399370k148542j892055q53156
42184a2573208J66003O53013P01501O68287Q15875J256104K003315K989666M050918
42175G31474M849280M841755L605046J412820o91987j703692j499168p07498Q5339
42166A0923369O83782J007301R94613Q59862R64573J228783J094857L80337k17027
42157A7920450Q0182J040701J633183J272418L92585k88763o28524r38177j325048
42148A9159007j523096j316732q51290m60020l39550m72582p67703j155274j541266
$$ y = [248342, -728046, -1880848, -2486869, -2074384, -806535, 703939, 1865406, 2410665, 2392689, 1995515, 1299721, 156005, -1645423, -3958916, -6085459, -7208603, -7145862, -6539670, -6160990, -6136264, -6081208, -5931938, -6280085, -7679455, -9827997, -11720052, -12573208, -12407205, -11754192, -11052691, -10384404, -9568529, -8312425, -6309110, -3319444, 731474, 5580754, 10422509, 14027555, 15440375, 14748388, 13044696, 11545528, 10838030, 10923369, 11607151, 12614452, 13609065, 14468927, 15433500, 16662283, 17757140, 18137477, 17920450, 18000632, 19041333, 20674516, 21946934, 22339519, 22050756, 21422232, 20484055, 19159007, 17635911, 16319179, 15467889, 15007869, 14668319, 14195737, 13428034, 12272760, 10731494]
42139A0731494j745755j563023r27508m5122O57575Q12039M52685O6792J31062
42130H570239N09889M82676m16416j654487k061731j021531Q61469K354504K710825
42121A0335437K121516J247031N10254j50107r43570j740579k043958j567233
42113G768791p42922l85783q05762j513658j896308j878140j710493j405799p44501
42104c314575K96250J478981K616214L615839M247274M239434L707832L167135
42096B0054384K949915K841099K464603J844662J367072J271061J354917J148955
42088C5296668K70292j316747l213246m720822n191085m398815k693008q27352
42080A3205885M56531Q69008P03805N02137N47585O89126O04789J54880m97458
$$ y = [10731494, 8985739, 7422716, 6495208, 6450086, 7107661, 7919700, 8372385, 8439177, 8570239, 9080128, 9562804, 9146388, 7491901, 5430170, 4408639, 5270108, 7624612, 10335437, 12456953, 13703984, 14214238, 14064131, 13120561, 11379982, 9336024, 7768791, 7025869, 6640086, 5834324, 4320666, 2424358, 546218, -1164275, -2570074, -3314575, -3018325, -1539344, 1076870, 4692709, 8939983, 13179417, 16887249, 20054384, 23004299, 25845398, 28310001, 30154663, 31521735, 32792796, 34147713, 35296668, 35566960, 34250213, 31036967, 26316145, 21125060, 16726245, 14033237, 13205885, 13662416, 14531424, 15235229, 15737366, 16284951, 16974077, 17578866, 17733746, 17236288]
42071A7236288j017847j173934j080019j124085j501851j868671j683062r21292
42063F865527j82315M8775M41K65106J032669J948202K629887L001424L091826
42054A8701542K841144K292603J760247J528725J437452J029147K01167m91203
42046B9300824l88449M74385J342130J557182J186380O90853J96282n63843j607257
42037C2188487k399429k407683j738544r65567m27634N4850Q02733J852816K925497
42028B9885526L596422L440184K243779K84955j693230k997065l512356l618647
42020B7629568l565729l086617j762359K79671K198272L052501K538350J117680
42012B8401337m13886j354139j288536k61667J110238J975033J956051J446903
$$ y = [17236288, 16218441, 15044507, 13964488, 12840403, 11338552, 9469881, 7786819, 6865527, 6683212, 6731987, 6732428, 6997534, 8030203, 9978405, 12608292, 15609716, 18701542, 21542686, 23835289, 25595536, 27124261, 28561713, 29590860, 29792027, 29300824, 28912375, 29386760, 30728890, 32286072, 33472452, 34163305, 34359587, 33795744, 32188487, 29789058, 27381375, 25642831, 24677264, 24249630, 24304480, 25107213, 26960029, 29885526, 33481948, 36922132, 39165911, 39450866, 37757636, 34760571, 31248215, 27629568, 24063839, 20977222, 19214863, 19494534, 21692806, 24745307, 27283657, 28401337, 27987451, 26633312, 25344776, 25083109, 26193347, 28168380, 30124431, 31571334]
42004C1571334J050335Q77682O27083J91732j90820l97343o34730j047002j433730
41995C0614541j606896j783218k299950l061947l594126l621441l316021k947376
41987H383566k555915k048439j362278l84623J078563L003947M880831N968046
41979A6963698N912080N053352M081519L407561K896618K225022J459416J149509
41971D3148775J717859K799041L339721K405264j32725l543957o597880q053391
41963C5082707p307415m937797k444192j113814j086983j571179j746745j274720
41955A3599862k23916J028950J883279J946897J467186J004665O60091M4802q91300
41946B0520516j517447j321887o55047k56613l17369m82758o27770j097164k124087
$$ y = [31571334, 32621669, 33499351, 34126434, 34318166, 34127346, 33730003, 33095273, 32048271, 30614541, 29007645, 27224427, 24924477, 21862530, 18268404, 14646963, 11330942, 8383566, 5827651, 3779212, 2416934, 2032311, 3110874, 6114821, 10995652, 16963698, 22875778, 27929130, 32010649, 35418210, 38314828, 40539850, 41999266, 43148775, 44866634, 47665675, 51005396, 53410660, 53277935, 49733978, 43136098, 35082707, 27775292, 22837495, 20393303, 19279489, 18192506, 16621327, 14874582, 13599862, 13375946, 14404896, 16288175, 18235072, 19702258, 20706923, 21367014, 21411816, 20520516, 19003069, 17681182, 17026135, 16769522, 16452153, 15969395, 15341625, 14244461, 12120374]
41937A2120374l415175m434750m832069m540671l766059k972911k574410k450621
41929a6866292j998923q46136O72732J926412K696883L230354L684206L832993
41921c667771L423145K646165K069763K050531K289493K098958J164269p4179
41913A2000374r20609j196288j303108j580067j901898j990436j829020j579412
41905c00464j297072r41509n09335O7930J025813K500764M206654N594051O299678
41896A6646510O255828N449571L879882J800039k45907j740590k438623k337231
41888B7269479j647427q21820l18395j83222o3494K38749M34619J21989p15379
41879B4315099j760031k690511l225521l084122k289863j409569j077626j271435
$$ y = [12120374, 8705199, 4270449, -561620, -5102291, -8868350, -11841261, -14415671, -16866292, -18865215, -19711351, -19038619, -17112207, -14415324, -11184970, -7500764, -3667771, -244626, 2401539, 4471302, 6521833, 8811326, 10910284, 12074553, 12000374, 11079765, 9883477, 8580369, 7000302, 5098404, 3107968, 1278948, -300464, -1597536, -2539045, -3048380, -2980450, -1954637, 546127, 4752781, 10346832, 16646510, 22902338, 28351909, 32231791, 34031830, 33785923, 32045333, 29606710, 27269479, 25622052, 24800232, 24481837, 24298615, 24235121, 24473870, 24908489, 25030478, 24315099, 22555068, 19864557, 16639036, 13554914, 11265051, 9855482, 8777856, 7506421]
41871G506421j426977j295411j236866j494040j609346r15902O51679K580486
41863B760044M404004N904777O803262O697806N428097L256497O55172j858498
41855C4051161l708466m456645m181307l434033k676965j937144j091130k19017
41847A2346454N08663J066730J461178J555020J278921R03473Q10467J018512
41839B0949418J194758J164723J184595J617087K455991L212744L197076J980895
41831C6957287j90081k386370l596317l517945k744494k130462k031663k186584
41823A8173371k224993k159792k351291l026662l891276m296554l847078k795657
41815f419932j764405j105037o17168J17709J216906K334499K978051K992967
$$ y = [7506421, 6079444, 4784033, 3547167, 2053127, 443781, -472121, 179558, 2760044, 7164048, 13068825, 19872087, 26569893, 31997990, 35254487, 35909659, 34051161, 30342695, 25886050, 21704743, 18270710, 15593745, 13656601, 12565471, 12346454, 12855117, 13921847, 15383025, 16938045, 18216966, 19120439, 19930906, 20949418, 22144176, 23308899, 24493494, 26110581, 28566572, 31779316, 34976392, 36957287, 36767206, 34380836, 30784519, 27266574, 24522080, 22391618, 20359955, 18173371, 15948378, 13788586, 11437295, 8410633, 4519357, 222803, -3624275, -6419932, -8184337, -9289374, -9906542, -9788833, -8571927, -6237428, -3259377, -266410]
41807b66410K747997K776733L187317L519699L285518K554729J844150J468788
41799B1118521J207297O72718j30549p54641q19804n23430n37922j273003k258440
41790A6700747k484187j478704J38935J343315J720126J548427J116639M36881
41782A9042179l86269j007581j258858j378378j610183j824249j725754j216413
41774H634494l72975O70961J566077J704494P19211r84922k454778k993957k656421
41765C832184k024847j646713j602693j435860n23126J311634L485684M981406
41757F377669M995289L400932Q70822j344347k066914j006188J030630K856025
41749A5113918L797136L887707L485984K974072K619448K342144J667616K61682
$$ y = [-266410, 2481587, 5258320, 8445637, 11965336, 15250854, 17805583, 19649733, 21118521, 22325818, 22998536, 22867987, 22113346, 21293542, 20770112, 20232190, 18959187, 16700747, 14216560, 12737856, 12876791, 14220106, 15940232, 17488659, 18605298, 19042179, 18655910, 17648329, 16389471, 15011093, 13400910, 11576661, 9850907, 8634494, 8261519, 8932480, 10498557, 12203051, 12922262, 11937340, 9482562, 6488605, 3832184, 1807337, 160624, -1442069, -2877929, -3401055, -2089421, 1396263, 6377669, 11372958, 14773890, 15644712, 14300365, 12233451, 11227263, 12257893, 15113918, 18911054, 22798761, 26284745, 29258817, 31878265, 34220409, 35888025, 36149707]
41741C6149707j472095k652412k844261k439319k030508j706127j154602k67152
41733B1583231O03240R58011O39998M0079j95402K03037P77733P94036P7375p85856
41723B4695482j140941r36172n83483l85503l32830l20393k80001j28152J59460
41714B0747467L66433J27820o93389j842793k960020l879355m506048m532566
41706B827549l575705j688626M64688K122539L019939L325963L134506K327354
41698A1958207R57169n56691j767969k498823k637670j944035m01104J396036
41690D505120K610080K937087K719308K306392J692124Q97661L08033K74725N41635
41681A8792165M13303m55547j619887k263598j970690j020945J5732Q29462J411392
$$ y = [36149707, 34677612, 32025200, 29180939, 26741620, 24711112, 23004985, 21850383, 21583231, 22186471, 23144482, 23784480, 23824559, 23629157, 23832194, 24609927, 25403963, 25481338, 24695482, 23554541, 22618369, 22034886, 21649383, 21316553, 20996160, 20716159, 20588007, 20747467, 21113900, 21241720, 20548331, 18705538, 15745518, 11866163, 7360115, 2827549, -748156, -2436782, -1972094, 150445, 3170384, 6496347, 9630853, 11958207, 12915376, 12358685, 10590716, 8091893, 5454223, 3510188, 3109084, 4505120, 7115200, 10052287, 12771595, 15077987, 16770111, 17667772, 17975805, 18250530, 18792165, 19205468, 18749921, 17130034, 14866436, 12895746, 11874801, 11890533, 12719995, 14131387]
41672A4131387J670304J344698M55888m45267q41361r23235j300273k082509k726125
41663I283507k894304k963757l348060l690019l199197j684700J24240J310268
41655g062022J621300J630781K192807L629203N284989O015078N305374L787009
41647B2404519K468948J690805J133531O11261L19550L13122K55307j53866q78294
41638B8164883j801636k857813l688494l630980k496130j093943m70673o83233
41630A1441981p93000j33974Q44760J210612P03547n8648l92592k23689J04181
41621A2703178M04281P57578J070535Q03319n86889k907845n145104o280720o144347
41612e326014n332770m375788l230402j666771R8137J437118J984613K067209
$$ y = [14131387, 15801691, 17146389, 17602277, 17157010, 16315649, 15392414, 14092141, 12009632, 9283507, 6389203, 3425446, 77386, -3612633, -6811830, -8496530, -8372290, -7062022, -5440722, -3809941, -1617134, 2012069, 7297058, 13312136, 18617510, 22404519, 24873467, 26564272, 27697803, 28309064, 28628614, 28941736, 29197043, 29043177, 28164883, 26363247, 23505434, 19816940, 16185960, 13689830, 12595887, 12125214, 11441981, 10648981, 10515007, 11359767, 12570379, 13273926, 13215278, 12822686, 12598997, 12703178, 13107459, 13865037, 14935572, 15738891, 15152002, 12244157, 7099053, 818333, -5326014, -10658784, -15034572, -18264974, -19931745, -19833608, -18396490, -16411877, -14344668]
41604a4344668K355211L164978M177475M765183M494471L376518J808076L23866
41596A0121110p25704j378574j914516k425994k567414j836280j48334J885471
41588A009765L278155L343252K232175R12483M91372J327968K722766L526486
41580A8844422L063147J487984n23254k179536k816494k214223q95320J58735
41572A4925461L59792P60k08150J13154Q69713J772896K410878K268704J196967
41563B3710175j29524o77910j12646R49871J806259K345892K677549K551626J586096
41554C4707388j56455k173907l928062m947605m816812l570054j998478j054047
41546A2061968r00072r40173p63819n58373m96930k91171L20481J054111J454165
$$ y = [-14344668, -11989457, -8824479, -4647004, 118179, 4612650, 7989168, 9797244, 10121110, 9395406, 8016832, 6102316, 3676322, 1108908, -727372, -875706, 1009765, 4287920, 7631172, 9863347, 10775830, 11267202, 12595170, 15317936, 18844422, 21907569, 23395553, 22872299, 20692763, 17876269, 15662046, 14766726, 14925461, 15285253, 15286013, 15077863, 15191017, 16060730, 17833626, 20244504, 22513208, 23710175, 23580651, 22902741, 22790095, 23739966, 25546225, 27892117, 30569666, 33121292, 34707388, 34550933, 32377026, 28448964, 23501359, 18684547, 15114493, 13116015, 12061968, 11161896, 10221723, 9457904, 8899531, 8402601, 8111430, 8431911, 9486022, 10940187]
41537A0940187J539347J706134K143028K651475K922002K720042J947782Q17924
41529B7387921j60933o78271r89956j475210j946793j812844r11762K27090J030800
41520B0670042J411950J519426J328814P37321j50521j063403j764337k074619
41512B0614673j868799j221966m41607J95324O37737R07008R33436P12600M64139
41503B0932545M07863M48440K66708l05156j103319j728648j718746q27790N83233
41494A6955130J526654J113007n72912k465332l437387l136144k001229p62465
41486G219322j1669J2789n00506j089990j358663j142807l64863J059245K971540
41477F794398M740901N548386N011129L481173J753184N41645J30430K93356N00281
$$ y = [10940187, 12479534, 14185668, 16328696, 18980171, 21902173, 24622215, 26569997, 27387921, 27226988, 26548717, 25558761, 24083551, 22136758, 20323914, 19412152, 19639242, 20670042, 22081992, 23601418, 24930232, 25667553, 25517032, 24453629, 22689292, 20614673, 18745874, 17523908, 17082301, 17277625, 17915362, 18822370, 19755806, 20468406, 20932545, 21340408, 21788848, 22055556, 21750400, 20647081, 18918433, 17199687, 16371897, 16955130, 18481784, 19594791, 19021879, 16556547, 13119160, 9983016, 7981787, 7219322, 7207653, 7220442, 6719936, 5629946, 4271283, 3128476, 2763613, 3822858, 6794398, 11535299, 17083685, 22094814, 25575987, 27329171, 27870816, 28001246, 28294602, 28794883]
41468B8794883L85772J31974K75545J042657K003550K504655K292182J519288
41460C8950506L07045j315811k995813l983579l781706k712933j602524r87663
41452B1877522q35445q91501r70574r25166p10301o34185j235616k628831m125981
41443H919922m814799m490208l762542l220990k772856j991942r30732k61441
41435a3325588n37151j520366k411078k639985k242691j502046n26270O51504
41427b4053671J774116K472277K656713K536332K192006J394850L1086j458183
41419a2454474k322113k203907j458003p48172m51102m81307n35913l36736L28464
41410b0663263J558473L130725M414630M770086M184793L372530L051061L195195
$$ y = [28794883, 29180655, 29312629, 29588174, 30630831, 32634381, 35139036, 37431218, 38950506, 39257551, 37941740, 34945927, 30962348, 27180642, 24467709, 22865185, 21877522, 21042077, 20150576, 19180002, 18254836, 17544535, 16910350, 15674734, 13045903, 8919922, 4105123, -385085, -4147627, -7368617, -10141473, -12133415, -13064147, -13325588, -13862739, -15383105, -17794183, -20434168, -22676859, -24178905, -24705175, -24053671, -22279555, -19807278, -17150565, -14614233, -12422227, -11027377, -10996291, -12454474, -14776587, -16980494, -18438497, -19186669, -19637771, -20119078, -20654991, -20991727, -20663263, -19104790, -15974065, -11559435, -6789349, -2604556, 767974, 3819035, 7014230]
41402G014230L197152K698906J979675J474026J229655J057709R73435J128452
41394B0753240J364128J210721M81949l66134o85357l40706K18209N08116L90261
41385B3534427j09832j046879k363381l568655l922573l070857j414813J79262
41377H216699R64481O90381l16670j306250j533894p84332N23077J798342K735317
41368A0987151L250183L234283K671781J909468J475819J549763J782550J671405
41360B8532403R58869k95306j778444k986138l437522k999796j975972q70892
41352A5147202j25290M1443k33547m68540j99860N96081J537810K222654K399841
41343B0917794J910128Q31854l07233q59912p22883l54540n5361L49979R21261
$$ y = [7014230, 10211382, 12910288, 14889963, 16363989, 17593644, 18651353, 19624788, 20753240, 22117368, 23328089, 23810038, 23443904, 22758547, 22417841, 22636050, 23144166, 23534427, 23424595, 22377716, 20014335, 16445680, 12523107, 9452250, 8037437, 8216699, 9181180, 9871561, 9554891, 8248641, 6714747, 5930415, 6453492, 8251834, 10987151, 14237334, 17471617, 20143398, 22052866, 23528685, 25078448, 26860998, 28532403, 29491272, 29195966, 27417522, 24431384, 20993862, 17994066, 16018094, 15147202, 15021912, 15063355, 14829808, 14361268, 14161408, 14757489, 16295299, 18517953, 20917794, 22827922, 23659776, 23352543, 22492631, 21769748, 21415208, 21359847, 21709826, 22631087]
41334B2631087J155098N52427n99902j411630j258123k12550J210649K414844
41326B4481900K946933K742917K200639J811733J718273J726598J603768J174066
41318D0406827L07191q92352j976639k523932k585875k542466k574207k508847
41310B5109700k124842j365949l26682P01807J221987Q92960k0984p92331r23986
41301B2371680o02604m54121r23927j818211k349951j773781j51115J617929K652379
41292A8568278K789534K289676J233310l27153j844207k516884k128149j215167
41284A6849238l42567L97929J099926J690692K058008K223379K214903J983430
41276B8174938J539049R75463L66666r6164N4087J123522K579448L266367K515212
$$ y = [22631087, 23786185, 24338612, 23738710, 22327080, 21068957, 20856407, 22067056, 24481900, 27428833, 30171750, 32372389, 34184122, 35902395, 37628993, 39232761, 40406827, 40714018, 39821666, 37845027, 35321095, 32735220, 30192754, 27618547, 25109700, 22984858, 21618909, 21292227, 21994034, 23216021, 24108981, 24087997, 23295666, 22371680, 21769076, 21314955, 20391028, 18572817, 16222866, 14449085, 14297970, 15915899, 18568278, 21357812, 23647488, 24880798, 24553645, 22709438, 20192554, 18064405, 16849238, 16506671, 16904600, 18004526, 19695218, 21753226, 23976605, 26191508, 28174938, 29713987, 30689450, 31056116, 30959952, 31014039, 32137561, 34717009, 37983376, 40498588]
41267D0498588P34458j191848k670552l422239l286660k426045j404950o65841
41259B6164911j02260N87095J371208J990991K311497K241673J580273L56905
41251C6502293q65877j471930j487660j436365j605408j843065j979640j980114
41243B3832234j669146q01164M01308J141629P62307n83595k121298l156287l465919
41234A4340069l206656k715014k376788k420186k639296k379495j029091J309611
41226a116846L711282N157673N360475M723546L618820K084606L12452j040242
41218B2811766j435633j173224j132562j809094k856325l542632l400058k438885
41210E023353j024645L26596J199437J492501J420904J348244J615929K357343
$$ y = [40498588, 41233046, 40041198, 37370646, 33948407, 30661747, 28235702, 26830752, 26164911, 26062651, 26649746, 28020954, 30011945, 32323442, 34565115, 36145388, 36502293, 35636416, 34164486, 32676826, 31240461, 29635053, 27791988, 25812348, 23832234, 22163088, 21361924, 21763232, 22904861, 23667168, 23083573, 20962275, 17805988, 14340069, 11133413, 8418399, 6041611, 3621425, 982129, -1397366, -2426457, -1116846, 2594436, 7752109, 13112584, 17836130, 21454950, 23539556, 23852008, 22811766, 21376133, 20202909, 19070347, 17261253, 14404928, 10862296, 7462238, 5023353, 3998708, 4325304, 5524741, 7017242, 8438146, 9786390, 11402319, 13759662]
41202A3759662L286142L733699L114780J441814o33774k230617k705876j992438
41194A7773392p17818J53525J09986m39014o44465j27583P62222J505936J937540
41185B0313721K169123K263362K145021J733447J048022J98434p15218j698683
41177B7457229k767426l664162l800538k720513o75574J385819K477078K267801
41169A9959714J285787N45536P94310J841349K640662K262229Q30468o26121j225066
41160B8308868r66207m85521l55687p09356j316741j835194k040006j942774j719098
41151A6938284j520111j364281j185028r61312q35792j070968j731146k378954
41143E890692k335966j432152l19722J78694j06849p25520j231416j405654j007979
$$ y = [13759662, 17045804, 20779503, 23894283, 25336097, 24702323, 22471706, 19765830, 17773392, 17055574, 17209099, 17319085, 16880071, 16235606, 16108023, 16870245, 18376181, 20313721, 22482844, 24746206, 26891227, 28624674, 29672696, 29871130, 29155912, 27457229, 24689803, 21025641, 17225103, 14504590, 13829016, 15214835, 17691913, 19959714, 21245501, 21791037, 22585347, 24426696, 27067358, 29329587, 30160055, 29533934, 28308868, 27342661, 26857140, 26501453, 25792097, 24475356, 22640162, 20600156, 18657382, 16938284, 15418173, 14053892, 12868864, 11907552, 11071760, 10000792, 8269646, 5890692, 3554726, 2122574, 1802852, 1981546, 1874697, 1149177, -82239, -1487893, -2495872]
41134b495872J59927J823057L273489M062190M395020M669624M869136M629410
41126B5385981L718454K225796M16351j358020k656978l111340k700677j832883
41118B0086684j088713q07217q32549o89738j14065O04268R11882N97640n2412
41109A8615780o87127j241175j760924k094937j969096j304997k89827Q80793
41101A0148490K196201L674230N044049N724301N267441L828023K036028L48973
41093C8267736j295854l065118m657840n395529m844608l213341j230698K27136
41085A4791884N76193j05203j165433k006416k507146k674130k211653r34523
41077C763573N52748J238311R10310M72592Q07301J707885K217057J737460N56546
$$ y = [-2495872, -2335945, -512888, 2760601, 6822791, 11217811, 15887435, 20756571, 25385981, 29104435, 31330231, 31746582, 30388562, 27731584, 24620244, 21919567, 20086684, 18997971, 18190754, 17358205, 16668467, 16554402, 17158670, 18070552, 18668192, 18615780, 17928653, 16687478, 14926554, 12831617, 10862521, 9557524, 9267697, 10148490, 12344691, 16018921, 21062970, 26787271, 32054712, 35882735, 37918763, 38267736, 36971882, 33906764, 29248924, 23853395, 19008787, 15795446, 14564748, 14791884, 15368077, 15262874, 14097441, 12091025, 9583879, 6909749, 4698096, 3763573, 4316321, 5554632, 6464942, 6937534, 7744835, 9452720, 11669777, 13407237, 13963783]
41068A3963783m92543o68555J46664J300653J892248J611120R38993M85043M17096
41059A9594502O62398J268595K218264L106862L370140K797429J649859L81563
41051C5049612o19007j186424j468347j748615k083291k282047k295882k320520
41043B1045479k400200k302729j999100j852544j973602j743578m51593J790022
41035A0112155M163600N962304O862490O632056N201482L077579J213752L02886
41027D3528304L73221R57937J340206P99372q60686k947209m386219m635671l872195
41018C0297060k494158r48736P7507J1649q57920j514249j329346o32229j8182
41009B2591396L60615N21078K17934o88091j718308k108463j532735k24534J363593
$$ y = [13963783, 13471240, 12802685, 12949349, 14250002, 16142250, 17753370, 18692363, 19177406, 19594502, 20256900, 21525495, 23743759, 26850621, 30220761, 33018190, 34668049, 35049612, 34430605, 33244181, 31775834, 30027219, 27943928, 25661881, 23365999, 21045479, 18645279, 16342550, 14343450, 12490906, 10517304, 8773726, 8322133, 10112155, 14275755, 20238059, 27100549, 33732605, 38934087, 42011666, 43225418, 43528304, 43901525, 44859462, 46199668, 46999040, 46138354, 43191145, 38804926, 34169255, 30297060, 27802902, 26854166, 26931673, 26943322, 26085402, 24571153, 23241807, 22609578, 22591396, 22952011, 23473089, 23691023, 23002932, 21284624, 19176161, 17643426, 17418892, 18782485]
41000A8782485K668248L068637K367014J180603M39926M60679P90214R11516P46106
40991C1415428M59497J46372j54488l79678n11987n90870o07806n46992n43285
40982B8686191q11127j390396k151344l046811m073018m893298m849564l667405
40974C803228j997987q96375o98403o44356K67763K181139M212061N247736M787195
40965A6262001L137200J086751n07122j064839n46553N72651J742776K786570
40957B3469435L768378M429674M072157K285846l07670k351015k894152k117365
40949C0355288r10893L0611N51907P05103M63607j06102o18678n97060K9383P83623
40939C0686789J062368O47450j93150r69663j261137r16665k10050K21248j45379
$$ y = [18782485, 21450733, 24519370, 26886384, 28066987, 28506913, 28967592, 29757806, 30669322, 31415428, 31874925, 32021297, 31866809, 31487131, 30975144, 30384274, 29776468, 29229476, 28686191, 27875064, 26484668, 24333324, 21286513, 17213495, 12320197, 7470633, 3803228, 1805241, 908866, 210463, -433893, -166130, 2015009, 6227070, 11474806, 16262001, 19399201, 20485952, 19978830, 18913991, 18367438, 18940089, 20682865, 23469435, 27237813, 31667487, 35739644, 38025490, 37717820, 35366805, 32472653, 30355288, 29444395, 29475006, 30026913, 30732016, 31195623, 31089521, 30470843, 29873783, 29903166, 30686789, 31749157, 32396607, 32203457, 31233794, 29972657, 29055992, 28845942, 29067190, 28921811]
40930B8921811j135624j886976j614584l72166J036766J880445K119759K204493
40922C1153924K405599K510595K185678J481471Q12660M36737J25696n09624j445306
40913C9157430k167265k199788j604672r19510o78852j000474j521304j694290
40905B7371275j270941n76259k10157l85634o62446m63294K24107Q18725P90049
40896B5635425J77617n26068q50648o83246l08336k01184o29636j327507j674668
40887A9611749j353366p26966l70304l15926r3482M30613O59362M7855r47963
40878A6941572j188379j64896J405395K468826K750300K665330K412509J680663
40870B8971320K87433j327898k465603k792664k446618j727343r03703j85009
$$ y = [28921811, 27786187, 25899211, 24284627, 23912461, 24949227, 26829672, 28949431, 31153924, 33559523, 36070118, 38255796, 39737267, 40549927, 40986664, 41112360, 40602736, 39157430, 36990165, 34790377, 33185705, 32266195, 31587343, 30586869, 29065565, 27371275, 26100334, 25524075, 25313918, 24928284, 24265838, 23802544, 24026651, 24845376, 25635425, 25813042, 25286974, 24436326, 23753080, 23444744, 23243560, 22613924, 21286417, 19611749, 18258383, 17531417, 17161113, 16845187, 16751705, 17182318, 17841680, 17889535, 16941572, 15753193, 15588297, 16993692, 19462518, 22212818, 24878148, 27290657, 28971320, 29258753, 27930855, 25465252, 22672588, 20225970, 18498627, 17594924, 17409915]
40862A7409915L74737R38998J693820K590876L390257L907121M067274L759425
40854C8132423K857297J496353K09608l63757L9263J074586J985071K059451J055259
40845D8545554o79156k449122l629904l989332l791301l638556m035785m901695
40837B1430703n541073n259880m004527k278113n26209J121450K520916L335155
40829A0798422L425832L151873K950268K766245K242558J399931P34759N65712
40821B8035600O18328M18166j55928q82062j518125j864766j662233p31098P59172
40812B3017054K322416L470657L927237L630162K709003J450648J40460j092439
40804C9575198k201785l032003l316457k899213j931526q55693j43484R3535K34482
$$ y = [17409915, 17784652, 18723650, 20417470, 23008346, 26398603, 30305724, 34372998, 38132423, 40989720, 42486073, 42695681, 42331924, 42371187, 43445773, 45430844, 47490295, 48545554, 47866398, 45417276, 41787372, 37798040, 34006739, 30368183, 26332398, 21430703, 15889630, 10629750, 6625223, 4347110, 3820901, 4942351, 7463267, 10798422, 14224254, 17376127, 20326395, 23092640, 25335198, 26735129, 27469888, 28035600, 28653928, 29072094, 28916166, 28034104, 26515979, 24651213, 22988980, 22257882, 23017054, 25339470, 28810127, 32737364, 36367526, 39076529, 40527177, 40667637, 39575198, 37373413, 34341410, 31024953, 28125740, 26194214, 25338521, 25195037, 25288572, 25523054]
40795B5523054O84871J260256J367699R44435P67295J419064K319021K408285
40787C6693980J617653R13948Q51925Q68124L06344n77412j154124j404631j687078
40778C6428729j864363j424797m20254L84273M44507L9279k52662l19050n25038
40769C2490624j159011k049181k656158k508973j652488o51626l8246J90737L98109
40760B2363787P54786J078364J120545P64849K7097q54566j402440j296560p53326
40751B1802536j82677M62170J546247K936788L838670L655481K611626J296544
40743C7967385P563j142015j874872k015061j909315k093977k573018k813880
40735B3552810k463626j709169q67231L4373J079409K085265K642173K515169
$$ y = [25523054, 26207925, 27468181, 28835880, 29780315, 30547610, 31966674, 34285695, 36693980, 38311633, 39225581, 40077506, 40945630, 41251974, 40674562, 39520438, 38115807, 36428729, 34564366, 33139569, 32719315, 33103588, 33548095, 33587374, 33334712, 33015662, 32490624, 31331613, 29282432, 26626274, 24117301, 22464813, 21813187, 21774941, 21965678, 22363787, 23118573, 24196937, 25317482, 26082331, 26109428, 25254862, 23852422, 22555862, 21802536, 21619859, 22082029, 23628276, 26565064, 30403734, 34059215, 36670841, 37967385, 37974948, 36832933, 34958061, 32943000, 31033685, 28939708, 26366690, 23552810, 21089184, 19380015, 18512784, 18547157, 19626566, 21711831, 24354004, 26869173]
40727B6869173J908022J318262J137511J352574J607431J554124J142124O09884
40719C7499105K78049L32727O64287Q60318M94105m66670j599843k415525k682968
40710C2963585k344530j359511J32606J623199K492673K495009J860110R77487
40702C8840628J63011l30022l76105j67195j13439l57037m90853K2882J130306
40693C8322176K035092J883069N92590j025879j956563j778358q88472r7696l0229
40684C7055730p33582j682408k179874j884267r73224J99595J433573K515034
40676C3750577K944279K257758O94893q06876j476148j347509r04071l81447K86222
40667C5017678J038449J593741J774235J651543J349001R25900M96704K50798
$$ y = [26869173, 28777195, 30095457, 31232968, 32585542, 34192973, 35747097, 36889221, 37499105, 37777154, 38109881, 38774168, 39634486, 40128591, 39661921, 38062078, 35646553, 32963585, 30619055, 29259544, 29392150, 31015349, 33508022, 36003031, 37863141, 38840628, 39003639, 38673617, 38297512, 38130317, 38016878, 37659841, 37168988, 37191870, 38322176, 40357268, 42240337, 42832927, 41807048, 39850485, 38072127, 37183655, 37085959, 37055730, 36322148, 34639740, 32459866, 30575599, 29602375, 29801970, 31235543, 33750577, 36694856, 38952614, 39647507, 38840631, 37364483, 36016974, 35112903, 34731456, 35017678, 36056127, 37649868, 39424103, 41075646, 42424647, 43350547, 43847251, 44098049]
40659D4098049K43530K85446J49055j31017j98253L57730J589850L002906L865653
40650E3262949L804795L039129J995883Q47253m60283j882488l195732m161386
40642E3250120m574239m209052k961879j103894P35698J902306K061932J398048
40634D6499040O08380N08376J318972K362398K699033K043954Q42540m47458j754800
40625E4680435l039608l969358m193646l697108k682824j350496k9503P15524
40617C6433416N15375k68214p22291j91164J189619K705072L614152L522974K493847
40608D9292786R83009l81539j091309r25128K2283J305046K156279J861339L73668
40599E3596434j498732k776214l248556l540252m125874m525199l818780j926323
$$ y = [44098049, 44341579, 44627025, 44776080, 44645063, 44446810, 44804540, 46394390, 49397296, 53262949, 57067744, 60106873, 62102756, 62950009, 62489726, 60607238, 57411506, 53250120, 48675881, 44466829, 41504950, 40401056, 41136754, 43039060, 45100992, 46499040, 47107420, 47615796, 48934768, 51297166, 53996199, 56040153, 56882693, 56435235, 54680435, 51640827, 47671469, 43477823, 39780715, 37097891, 35747395, 35717892, 36433416, 36948791, 36680577, 35958286, 35767122, 36956741, 39661813, 43275965, 46798939, 49292786, 50275795, 49894256, 48802947, 47877819, 47900102, 49205148, 51361427, 53222766, 53596434, 52097702, 49321488, 46072932, 42532680, 38406806, 33881607, 30062827, 28136504]
40591B8136504J2794P19632J368j274523k136745k089826r67286J171469L775284
40582B7348671N818227O454758N619641L895522J996271N31315k1849M61453J550002
40573E3654011K541691K982815K749314J766486Q2843j694500k506121j771609
40565E7804930n0497J536423K431844K886501L208549L239583K696441J638662
40557G5392436L40790j015444k204919k729819k162267p32648P53597J677312
40549F9319038K063092K242508K347616K281361J961286J391487O28813j48958
40541H2086243o64738q34702r72314j486592k351887l028105k978561k212735
40533F7556609j280783p53515p28470q55747q15578o52468n70401n63819m75653
$$ y = [28136504, 28149298, 28868930, 28870298, 27595775, 25459030, 23369204, 22401918, 23573387, 27348671, 33166898, 39621656, 45241297, 49136819, 51133090, 51664405, 51642556, 52104009, 53654011, 56195702, 59178517, 61927831, 63694317, 63777160, 62082660, 59576539, 57804930, 57754433, 59290856, 61722700, 64609201, 67817750, 71057333, 73753774, 75392436, 75733226, 74717782, 72512863, 69783044, 67620777, 66888129, 67641726, 69319038, 71382130, 73624638, 75972254, 78253615, 80214901, 81606388, 82235201, 82086243, 81421505, 80586803, 79614489, 78127897, 75776010, 72747905, 69769344, 67556609, 66275826, 65522311, 64793841, 63938094, 63122516, 62470048, 61899647, 61335828, 60860175]
40524F0860175l22676k40376j02421M23184J305993K017023K204158K160281K269852
40515G0575193K288154J684083O17273N8693P67123K381715L609953L188189P90280
40506H5960656k655076n499100o523863n727298l948155j908351R7252J787367
40498F1583432K767763K954330K686306K240012J616359R89132Q86618J525758
40490G7249710K285189K317695J550935O64464J63500o1420j94738K9478J006451
40481H5011264K583176L977187M404035L696923K332901R79436O8179l25917m25333
40472A02301851o43094j313627k291070k901761k565358j477418m41503O409N8974
40463I0733403J78915M95355Q39960J134961J474260J905269K300420K377532
$$ y = [60860175, 60537499, 60297123, 60194702, 60617886, 61923879, 63940902, 66145060, 68305341, 70575193, 72863347, 74547430, 75164703, 75223396, 75990519, 78372234, 81982187, 85170376, 85960656, 83305580, 77806480, 71282617, 65555319, 61607164, 59698813, 59796065, 61583432, 64351195, 67305525, 69991831, 72231843, 73848202, 74837334, 75723952, 77249710, 79534899, 81852594, 83403529, 84067993, 84231493, 84170073, 83975335, 84004813, 85011264, 87594440, 91571627, 95975662, 99672585, 102005486, 102984922, 103053101, 102727184, 102301851, 101658757, 100345130, 98054060, 95152299, 92586941, 91109523, 90668020, 90674429, 90733403, 90912318, 91407673, 92247633, 93382594, 94856854, 96762123, 99062543, 101440075]
40455A01440075J787126L88128j403117k749930l132441k831551k466952k194966
40447H8836372j640393n49007P76230J699731J733996Q70017l31994j040097q37488
40438H9517367j49922K51924J95549K80254J054309K334833L516712M277642M686298
40429A05964966M772968M370636L458558K409736J702407J447186J341557J098673
40421A26566687Q03664P80773J198087J923095K709900L338806L559834L166599
40413A44047445K321973J636337J637536K185231K628838K527930J988197J306879
40405A60280366O20483K8004k70038k51086k79103o48507r74625m70218R99616
40396A59034892K453346K686178J513680j13859j138796j256147q15928k90612
$$ y = [101440075, 103227201, 103615329, 102212212, 99462282, 96329841, 93498290, 91031338, 88836372, 87195979, 86646972, 87423202, 89122933, 90856929, 91726946, 91394952, 90354855, 89517367, 89367445, 89619369, 89814918, 90095172, 91149481, 93484314, 97001026, 101278668, 105964966, 110737934, 115108570, 118567128, 120976864, 122679271, 124126457, 125468014, 126566687, 127370351, 128151124, 129349211, 131272306, 133982206, 137321012, 140880846, 144047445, 146369418, 148005755, 149643291, 151828522, 154457360, 156985290, 158973487, 160280366, 160900849, 160928853, 160658815, 160407729, 160128626, 159480119, 158505494, 158035276, 159034892, 161488238, 164174416, 165688096, 165574237, 164435441, 163179294, 162363366, 162072754]
40388A62072754j7196j27667l90701k70652N28893J648344K508452L109535L997146
40379A73058908N336432O404202O262888M735414K510990M91970p31845r78040
40371A97090919m34768M38347J207912J736221K079946K209788K003620J465806
40363B07797791P70800J04783l98211o22289n39767k56848J86129R68271K188876
40354B10199535L465430M141301L944965L186539K276819J379105O18233K13970
40346B29425897J18741j47352q80072j582664j438525l85115P14897J090766Q81699
40337B27798272P36773R22297J162603J197353J114715J116227J247661J463024
40329B36758925J752352K082695K340037K441256K435749K446880K595414K984043
$$ y = [162072754, 162055558, 161927891, 161537190, 161266538, 161795431, 163443775, 165952227, 169061762, 173058908, 178395340, 184799542, 191062430, 195797844, 198308834, 198800804, 198068959, 197090919, 196656151, 197094498, 198302410, 200038631, 202118577, 204328365, 206331985, 207797791, 208568591, 208673374, 208275163, 207652874, 207113107, 206856259, 207042388, 208010659, 210199535, 213664965, 217806266, 221751231, 224937770, 227214589, 228593694, 229211927, 229425897, 229544638, 229397286, 228517214, 226934550, 225496025, 225110910, 225825807, 226916573, 227798272, 228535045, 229457342, 230619945, 231817298, 232932013, 234048240, 235295901, 236758925, 238511277, 240593972, 242934009, 245375265, 247811014, 250257894, 252853308, 255837351]
40321B55837351L590542M114845M123380L482366K513543J624475R94225P74226
40313B77054953J283449K599144M092973M848650M608785L960533L536606L417992
40305C05403085L423256L522395L657072L490816K748988J675070Q34683N48545
40297C25303910P53206J279176J948302K453751K479413K033067J498009J311429
40289C39060263J660497K385168L001704K933166K008405P73505J02788M32452
40281C52357948J485565K716239L821006M765992N490870N723817N089869L435594
40273C84886900J127751j006556k179033k170503j409044n91016k10903k98925
40265C78148671n11849n61543n85903r42261j610222k080323j982899j533311
$$ y = [255837351, 259427893, 263542738, 267666118, 271148484, 273662027, 275286502, 276280727, 277054953, 278338402, 280937546, 285030519, 289879169, 294487954, 298448487, 301985093, 305403085, 308826341, 312348736, 316005808, 319496624, 322245612, 323920682, 324755365, 325303910, 326057116, 327336292, 329284594, 331738345, 334217758, 336250825, 337748834, 339060263, 340720760, 343105928, 346107632, 349040798, 351049203, 351822708, 351925496, 352357948, 353843513, 356559752, 360380758, 365146750, 370637620, 376361437, 381451306, 384886900, 386014651, 385008095, 382829062, 380658559, 379249515, 378658499, 378447596, 378148671, 377636822, 377075279, 376489376, 375547115, 373936893, 371856570, 369873671, 368340360]
40257C68340360j115701p35789k64645K1482l37741j269749k127251k399878k086139
40248C58024949j339233j94540J181804K326829K809104K572318J874941J083453
40240C68339625N52556M36634N17573M24216P4222l03425n64471p78179r58683
40231C67740068j006943r72555j043007j233110j453773j906110k900410m137980
40223C53086180m722867m197273l099228k144316j331155l34777O32400R88530
40215C38877494O18658k7068n62807q67466p41450M1630J235712K141682K288129
40206C43004514J771790Q58819l50828j693716k741384l137413l011463k864172
40198C31836147l074009l557311l828812l410111k317290j130793m34891k38910
$$ y = [368340360, 367224659, 366488870, 366224225, 366245707, 365907966, 364638217, 362510966, 360111088, 358024949, 356685716, 356491176, 357672980, 359999809, 362808913, 365381231, 367256172, 368339625, 368892181, 369328815, 369846388, 370270604, 370344826, 370041401, 369476930, 368698751, 367740068, 366733125, 365760570, 364717563, 363484453, 362030680, 360124570, 357224160, 353086180, 348363313, 344166040, 341066812, 338922496, 337591341, 337256564, 337888964, 338877494, 339496152, 339469084, 338906277, 338038811, 337297361, 337338991, 338574703, 340716385, 343004514, 344776304, 345635123, 345284295, 343590579, 340849195, 337711782, 334700319, 331836147, 328762138, 325204827, 321376015, 317965904, 315648614, 314517821, 314082930, 313844020]
40190C13844020j47677j3152p1936l92606n65791j83638N81605J128950J087287
40181C15267062O63215L76522N55220J053735J395692J211478N35945l83221j510967
40172C19164681l056764n002473o762987p500512o799147n001098k906725j143091
40164B80991884K47842J642381L250893M737157N471973N100927L769895J901861
40156C07114813j7315j444088j884061j244270m3015Q77490R37205K17162o23828
40147C03890093q88501m65076Q8209K44979K67875R77402K648099M413649N044578
40138C16221307M200680K670046J457358R29818Q57104R25067R57071P90420K48519
40129C29257390o72136j706907k491958k786241k510776j665588l15572J336397
$$ y = [313844020, 313696343, 313683191, 313611255, 313218649, 312652858, 312469220, 313050825, 314179775, 315267062, 315930277, 316306799, 316862019, 317915754, 319311446, 320522924, 321058869, 320675648, 319164681, 316107917, 311105444, 304342457, 296841945, 290042798, 285041700, 282134975, 280991884, 281239726, 282882107, 286133000, 290870157, 296342130, 301443057, 305212952, 307114813, 307097498, 305653410, 303769349, 302525079, 302482064, 303359554, 304296759, 304513921, 303890093, 303001592, 302536516, 302624725, 302869704, 303137579, 304114981, 306763080, 311176729, 316221307, 320421987, 323092033, 324549391, 325479209, 326336313, 327261380, 328218451, 329008871, 329257390, 328585254, 326878347, 324386389, 321600148, 319089372, 317423784, 317108212, 318444609]
40121C18444609K926661M038306M399400M065312L411792K820908K292079J476012
40113C43875079J98349j202249k243962k839068l149211l057245k315691j285356
40105C27980646q87181j415555j888087j177587M69768J684275J629835P53774
40097C27149888j25918p34706j068052q88406p5941Q53550J130771N19669o43620
40088C26117235k016461l407498m467894m757059m284731l666064l539244l970998
40080B96007286m503248m612995m069936l039761j953039j160362o66783l32062
40072B75669100l09814r90290k348233l621413l982282l469714k945427l087720
40064B54914207l714035m224880m426310m588282m802217m705083m025136l136999
$$ y = [318444609, 321371270, 325409576, 329808976, 333874288, 337286080, 340106988, 342399067, 343875079, 344073428, 342871179, 340627217, 337788149, 334638938, 331581693, 329266002, 327980646, 327093465, 325677910, 323789823, 322612236, 323082004, 324766279, 326396114, 327149888, 327023970, 326289264, 325221212, 324332806, 324256865, 325110415, 326241186, 326760855, 326117235, 324100774, 320693276, 316225382, 311468323, 307183592, 303517528, 299978284, 296007286, 291504038, 286891043, 282821107, 279781346, 277828307, 276667945, 276001162, 275669100, 275359286, 274368996, 272020763, 268399350, 264417068, 260947354, 258001927, 254914207, 251200172, 246975292, 242548982, 237960700, 233158483, 228453400, 224428264, 221291265]
40056B21291265k751580l080935l560642l472517k681215j684427j101452j244577
40048B01713920k045532l143680m009033m192581l654813k849275k358285k355577
40040A77105144k439364k068585j207338m92876o74772j845482l250686l893713
40032A61232328l363181k150865j242296j347105k352254l414907l657731k897318
40024A40806671j725371q67672n11917l01559J06661O44272J025385J205192J485277
40015A41866939K112696K845573L036535K221739O03544j114022k348263k999969
40007A46224772l206742k958245k194680j250011q90437j660467l228441m579290
39999A26256459m934764m389370l579757k857275j980195o38541R19493J992305
$$ y = [221291265, 218539685, 215458750, 211898108, 208425591, 205744376, 204059949, 202958497, 201713920, 199668388, 196524708, 192515675, 188323094, 184668281, 181819006, 179460721, 177105144, 174665780, 172597195, 171389857, 170896981, 170222209, 168376727, 165126041, 161232328, 157869147, 155718282, 154475986, 153128881, 150776627, 147361720, 143703989, 140806671, 139081300, 138213628, 137701711, 137400152, 137506813, 138151085, 139176470, 140381662, 141866939, 143979635, 146825208, 149861743, 152083482, 152687026, 151573004, 149224741, 146224772, 143018030, 140059785, 137865105, 136615094, 135724657, 134064190, 130835749, 126256459, 121321695, 116932325, 113352568, 110495293, 108515098, 107876557, 108796050, 110788355]
39991A10788355K165924J790644J583965J802822J982434J571280O51644k13440
39983A22123628q05035j566089k894343m397315n249882n225218m943114m990285
39975I2052347n181635m927812m024218k760133j484934m59218R801k40614q60024
39966G2123560j204857j053055p94003q08714j023181j281784j801819k858294
39958F1297853m155153m874466m367736k614866j14724K364821L959068M047266
39950E5542063K706559P45758q54630j539226j292207m23456N89178J215260J128879
39941E7818178M23629n65973j698874l119723m785602o032085n903778m067830
39933C2067942j300080J077396K230087K241594J667053R23100J72748m30824
$$ y = [110788355, 112954279, 114744923, 116328888, 118131710, 120114144, 121685424, 122337068, 122123628, 121318593, 119752504, 116858161, 112460846, 107210964, 101985746, 97042632, 92052347, 86870712, 81942900, 77918682, 75158549, 73673615, 73214397, 73224198, 72983584, 72123560, 70918703, 69865648, 69071645, 68262931, 67239750, 65957966, 64156147, 61297853, 57142700, 52268234, 47900498, 45285632, 45170908, 47535729, 51494797, 55542063, 58248622, 58994380, 58139750, 56600524, 55308317, 54884861, 55474039, 56689299, 57818178, 58241807, 57675834, 55976960, 52857237, 48071635, 42039550, 36135772, 32067942, 30767862, 31845258, 34075345, 36316939, 37983992, 38907092, 39079840, 38649016]
39925C8649016o30848j99055R12722K512095M150804N208939N167397L921153
39917E9692223J850778l93814k174921l052879k904319j980187p98307J44989
39909E0383563O54836R05086J272525K056774L223014M315819M676620L908014
39901G1396251K247080M83730n66671o07760Q630O06661O59691R2048p50472j450987
39891G2118201j949647k618825l799102n250262o211375o091630n002799l527872
39883C7666689k084799o75529P85293K073636K681669K254644J033493j85508
39875D3549588p14743o67538p76252j366694j781553j192720J42369R31372K92932
39866C8416761j218082k266414k162583j370381p67979p15660q39038n10325N10462
$$ y = [38649016, 38018168, 37819113, 38731835, 41243930, 45394734, 50603673, 55771070, 59692223, 61543001, 61149187, 58974266, 55921387, 53017068, 51036881, 50238574, 50383563, 51038399, 51943485, 53216010, 55272784, 58495798, 62811617, 67488237, 71396251, 73643331, 74127061, 73560390, 72952630, 72961260, 73567921, 74227612, 74319660, 73569188, 72118201, 70168554, 67549729, 63750627, 58500365, 52288990, 46197360, 41194561, 37666689, 35581890, 34906361, 35691654, 37765290, 40446959, 42701603, 43735096, 43549588, 42834845, 42167307, 41391055, 40024361, 38242808, 37050088, 37192457, 38123829, 38416761, 37198679, 34932265, 32769682, 31399301, 30631322, 29915662, 29076624, 28566299, 29076761]
39857B9076761J808651K662047K689775K119182J407578P58246J27649m46890
39849D0202999p87048q61223r27562j250179j725116j913070j498679o53695J68117
39840C0754544P73906J359428J997000K275364J778345P60731j05922o50421j352156
39831C7590819k420617l248058l141986k218165j140198k72157M31655R32278
39823B6513571J084069J045396J157414J344234J108546K61388p32500j291134
39815C0490984j288053r87741p24427p26953r03875o81627N63423K718340M887541
39806C3347612O254926O595990N819616L668951M18265k610463m032592l879192
39798D5583113l500949l931421m832674n168343m453786l113926j943227j467556
$$ y = [29076761, 30885412, 33547459, 36237234, 38356416, 39763994, 40522240, 40649889, 40202999, 39415951, 38554728, 37627166, 36376987, 34651871, 32738801, 31240122, 30586427, 30754544, 31528450, 32887878, 34884878, 37160242, 38938587, 39699318, 39593396, 38942975, 37590819, 35170202, 31922144, 28780158, 26561993, 25421795, 25149638, 25581293, 26513571, 27597640, 28643036, 29800450, 31144684, 32253230, 32514618, 31782118, 30490984, 29202931, 28215190, 27490763, 26763810, 25859935, 25178308, 25741731, 28460071, 33347612, 39602538, 46198528, 52018144, 55687095, 56105360, 53494897, 49462305, 45583113, 42082164, 38150743, 33318069, 28149726, 23695940, 20582014, 18638787, 17171231]
39790A7171231j613511j759488j235199K3344J326194J794754J058498n03334
39782A6262489j989290k475650j635136m9182J272350J832570J987627K305629
39774A7511407K855988L303553L427409L220366K621811J532530J26978j131183
39766C3468859j884732k140755k106050j937842j696344j365040q48738j22022
39758B1367336N25029N74355j81196j245218j754774j247077K219J376987K464244
39749B1881905L108763L135201K354615R35175n02300j425843j935496k490254
39741B5061766l118639l248525k460849j108756O6426P23426J045797J275719
39733A8236365J505732J840459K323591K655338K400042J627165R83449R20272
$$ y = [17171231, 15557720, 13798232, 12563033, 12586377, 13912571, 15707325, 16765823, 16262489, 14273199, 11797549, 10162413, 10113231, 11385581, 13218151, 15205778, 17511407, 20367395, 23670948, 27098357, 30318723, 32940534, 34473064, 34600042, 33468859, 31584127, 29443372, 27337322, 25399480, 23703136, 22338096, 21489358, 21367336, 21892365, 22466720, 22285524, 21040306, 19285532, 18038455, 18040674, 19417661, 21881905, 24990668, 28125869, 30480484, 31415659, 30913359, 29487516, 27552020, 25061766, 21943127, 18694602, 16233753, 15124997, 15191423, 15914849, 16960646, 18236365, 19742097, 21582556, 23906147, 26561485, 28961527, 30588692, 31572141, 32492413]
39725C2492413J181908J334611J493516K117989L236318M287448M724672M443332
39717E5312207L574222K170624K63739j922307l954303n389117o012006n920361
39709C8122698n320549m250723k710934j137005l75626q21757j802532k288573
39701A9414999k136489k124961k736078l456043l500403k767504j753069q78244
39693F2208k71150N1498J98713M77351J101722J882600K449037K679184K669005
39684A1300168K413281J833476J041009K45118n65809j518714k418942k749739
39676I579848k196543r19135P42114K515424M031497M746150M336087L061315
39668B5896757J523860J39732r96048j835124k217125k024412j349715m48793
$$ y = [32492413, 33674321, 35008932, 36502448, 38620437, 41856755, 46144203, 50868875, 55312207, 58886429, 61057053, 61320792, 59398485, 55444182, 50055065, 44043059, 38122698, 32802149, 28551426, 25840492, 24703487, 24327861, 23506104, 21703572, 19414999, 17278510, 15153549, 12417471, 8961428, 5461025, 2693521, 940452, 62208, -208942, -157444, 41269, 518620, 1620342, 3502942, 5951979, 8631163, 11300168, 13713449, 15546925, 16587934, 16833052, 16267243, 14748529, 12329587, 9579848, 7383305, 6464170, 7206284, 9721708, 13753205, 18499355, 22835442, 25896757, 27420617, 27560349, 26564301, 24729177, 22512052, 20487640, 19137925, 18689132]
39660A8689132M08971J027645J307532J248822R25280M29439j52667p03898j047796
39651B2132460j044037p71344n44677o01195p48561m92803L65968J380568J862871
39642B1539250J601827J032017P02105P10547O78292J69039q76130k022953k645800
39633B0888194k426815j574970n38985L85143J054200J257352Q20888r938n50664
39624A9304405k09546J030754K666101M008671M422371L527173J479200r96094
39616C5233035l055525m246773m514452l874694k380351m37295J138679J641197
39608A9503821J061518Q0572n18209m15327J49715O85273Q21284N07412l0952
39599B1845107n20083q67204j167520j471213j606899j341493p20594j37426J5091
$$ y = [18689132, 19098103, 20125748, 21433280, 22682102, 23607382, 24036821, 23884154, 23180256, 22132460, 21088423, 20317079, 19772402, 19171207, 18422646, 17929843, 18295811, 19676379, 21539250, 23141077, 24173094, 24875199, 25585746, 26264038, 26433077, 25556947, 23533994, 20888194, 18461379, 16886409, 16347424, 16732567, 17786767, 19044119, 19865007, 19855069, 19304405, 19094859, 20125613, 22791714, 26800385, 31222756, 34749929, 36229129, 35233035, 32177510, 27930737, 23416285, 19541591, 17161240, 16723945, 17862624, 19503821, 20565339, 20645911, 20127702, 19712375, 19862090, 20547363, 21368647, 21876059, 21845107, 21325024, 20457820, 19290300, 17819087, 16212188, 14870695, 14150101, 14012675, 14027766]
39590A4027766k71072o10526n54116P4955J051573J853706J973261J292625K37433
39581A9075605m75340l33431N85988J619362J981025J429407N20398M0500J43762
39572B4587276K41013j99511j026080j751485k209989k497621k451169j687602
39564A3004832k25407J318452K300309K562341K292276J693801R92185N03373
39556B4442162M05066N29645N82992M95336L94562L22913J83335n6350k99505
39547B7000156n13094q46414j445342k183725k693609k724227k393334j937617
39539A2262794j243564R5106K072529L857232M444416L698945K449313J527007
39531B9163778J008777M53145m65719j728478l068639m040494m183887l398924
$$ y = [14027766, 13756694, 13146168, 12592052, 12667007, 13718580, 15572286, 17545547, 18838172, 19075605, 18600265, 18266834, 18852822, 20472184, 22453209, 23882616, 24403014, 24443514, 24587276, 24828289, 24628778, 23602698, 21851213, 19641224, 17143603, 14692434, 13004832, 12779425, 14097877, 16398186, 18960527, 21252803, 22946604, 23938789, 24442162, 24847228, 25376873, 25959865, 26455201, 26849763, 27172676, 27356011, 27299661, 27000156, 26487062, 25640648, 24195306, 22011581, 19317972, 16593745, 14200411, 12262794, 11019230, 11114336, 13186865, 17044097, 21488513, 25187458, 27636771, 29163778, 30172555, 30625700, 30159981, 28431503, 25362864, 21322370, 17138483, 13739559]
39523A3739559k096123q15776K15944J046051J685760K045502K079892J818746
39515A9719555J328200P80207M46249M33749M90503K32977m66880j410424k264893
39506A9289243k692151k437782j526042l23386P66458J633984K369345K944295
39498B0023964L168272K875864J981962M78563j356336k827688l257990k657490
39490A8429121j734685j133698q35186m18816K31485O42401J65554j340112l197573
39481A0808491m324688m088014k790300j283109j73137M91513R03558J189411
39473G33725J486934K036321K917532L731290L751534K544008M78806j400673
39465A6279477k126964j551678l89337M66800O21507J96066o00022j655492k729666
$$ y = [13739559, 11643436, 10827660, 11043604, 12089655, 13775415, 15820917, 17900809, 19719555, 21047755, 21827962, 22274211, 22707960, 23198463, 23431440, 22964560, 21554136, 19289243, 16597092, 14159310, 12633268, 12309882, 13076340, 14710324, 17079669, 20023964, 23192236, 26068100, 28050062, 28528625, 27172289, 24344601, 21086611, 18429121, 16694436, 15560738, 14725552, 14306736, 14538221, 15180622, 15346176, 14006064, 10808491, 6483803, 2395789, -394511, -1677620, -1850757, -1359244, -455686, 733725, 2220659, 4256980, 7174512, 10905802, 14657336, 17201344, 17680150, 16279477, 14152513, 12600835, 12211498, 12678298, 13299805, 13495871, 12895849, 11240357, 8510691]
39456H510691l321623l016065j981100r78394p18650j158194j542604j248767
39448e454706m56766K24644O76660J390443K552141L439022L103326J471265n60517
39439F385512j997123k442514k110892j536100j215530j187986r71942k19432
39431e296007O36479P68072k2538j081938j775041k145879k543545k988967l200480
39422a7649844k995932k401864j525534n19251M66907J435214K475027L437476
39414a7277801L914024L725392L223351K884778K759334K529829K005210J381192
39406E145309J114893J642008L016953M663176N681653N631504M868237L957753
39398C5721486L004267J819576M99425n92959j331047j910962k423750k697424
$$ y = [8510691, 5189068, 2173003, 191903, -786491, -1505141, -2663335, -4205939, -5454706, -5911472, -5686828, -5010168, -3619725, -1067584, 2371438, 5474764, 6946029, 6385512, 4388389, 1945875, -165017, -1701117, -2916647, -4104633, -5076575, -5296007, -4659528, -3891456, -3913994, -4995932, -6770973, -8916852, -11460397, -14449364, -17649844, -20645776, -23047640, -24573174, -25092425, -24625518, -23190304, -20715277, -17277801, -13363777, -9638385, -6415034, -3530256, -770922, 1758907, 3764117, 5145309, 6260202, 7902210, 10919163, 15582339, 21263992, 26895496, 31763733, 35721486, 38725753, 40545329, 41044754, 40451795, 39120748, 37209786, 34786036, 32088612]
39390C2088612k642126k453483k339113k239982j933008j270205k52244R93910
39382A9952361K229135L166166L549242L164117J918526Q4020j664890k725947
39374B9672730l080701l134407l126492l005045k840557k913948l214471l224965
39366E132144k521037j359351l51400K89429Q16204J336005J558201J311515J006334
39357G218044J277538K228802L256082L650265L225770K324073J391933P18621
39349B5291128M58082O22836R88307J211817J166738J003206P78666K67505o20904
39340C1167381j434876j569849j016739l33179J67020P51228J588649K147714
39332C1467349J700281K69272j309164k228728k324949j919614j437199j232007
$$ y = [32088612, 29446486, 26993003, 24653890, 22413908, 20480900, 19210695, 18958451, 19952361, 22181496, 25347662, 28896904, 32061021, 33979547, 34063567, 32398677, 29672730, 26592029, 23457622, 20331130, 17326085, 14485528, 11571580, 8357109, 5132144, 2611107, 1251756, 900356, 1189785, 2005989, 3341994, 4900195, 6211710, 7218044, 8495582, 10724384, 13980466, 17630731, 20856501, 23180574, 24572507, 25291128, 25749210, 26372046, 27360353, 28572170, 29738908, 30742114, 31520780, 31788285, 31167381, 29732505, 28162656, 27145917, 26812738, 26979758, 27730986, 29319635, 31467349, 33167630, 33436902, 32127738, 29899010, 27574061, 25654447, 24217248, 22985241]
39324B2985241j428006j740667j703651j244024p80719n32647k2937J297734L043039
39315A9873363M015487L487048J975627N22894m51123j208935j878001k134282
39307B4202078j760152j056819m71435j09515J43216K68395K02720J28094L19126
39298B1865708P11545R16988P19541L27876P7128R0941L02665N88943P73180P10222
39288B7084737N32404O27857J138643J567664J129217m75411k745648m793905
39280B4065558n906991n763863m430054k371304l59468R23648J352528J402561
39272H912615J647915K185855K569323K289102J265913j29855j421641k283675
39264A5035552k560654k277211j720760j354172j468859j917157k218684j865207
$$ y = [22985241, 21557235, 19816568, 18112917, 16868893, 16088174, 15555527, 15532590, 16830324, 19873363, 23888850, 27375898, 29351525, 29874419, 29423296, 28214361, 26336360, 24202078, 22441926, 21385107, 20913672, 20804157, 20947373, 21215768, 21418488, 21546582, 21865708, 22577253, 23494241, 24213782, 24541658, 24618786, 24709727, 25012392, 25601335, 26374515, 27084737, 27617141, 28244998, 29383641, 30951305, 32080522, 31605111, 28859463, 24065558, 18158567, 12394704, 7964650, 5593346, 5233878, 6157526, 7510054, 8912615, 10560530, 12746385, 15315708, 17604810, 18870723, 18740868, 17319227, 15035552, 12474898, 10197687, 8476927, 7122755, 5653896, 3736739, 1518055, -347152]
39256c47152n27942J793365M587010O891966P853112P331201N853588L977708
39248C7412856J918970j63274j859323k808582l180005l487785l837719l630773
39240B0364365k252511K6908K066660K830724K238530R93332k86081j551751k939610
39231B1490566m158686m552237l796071k336044r96999k38899Q3140K83072L42794
39222F120636p2535j135801k446325l154097k601069r16041J067732K535857L262775
39213B661132L416911L011984J873947J60837j436024k244891k204518j698084
39205C541294r64233P365J044186J664157J602010J244172J257413J823925K452982
39196A3673271K562389K066744J332998P20765L08526j2778l64864q35527j449655
$$ y = [-347152, -875094, 918271, 5505281, 12397247, 20250359, 27581560, 33435148, 37412856, 39331826, 39168552, 37309229, 34500647, 31320642, 27832857, 23995138, 20364365, 18111854, 18138762, 20205422, 23036146, 25274676, 26268008, 25981927, 24430176, 21490566, 17331880, 12779643, 8983572, 6647528, 5650529, 5411630, 5494770, 5777842, 6120636, 6048101, 4912300, 2465975, -688122, -3289191, -4205232, -3137500, -601643, 2661132, 6078043, 9090027, 10963974, 11124811, 9688787, 7443896, 5239378, 3541294, 2577061, 2584426, 3628612, 5292769, 6894779, 8138951, 9396364, 11220289, 13673271, 16235660, 18302404, 19635402, 20356167, 20664693, 20651915, 20287051, 19451524, 18001869]
39187A8001869k045411k227829j630174l46989R39275J413870Q25428k58478r29126
39178A3742435p04176J38599Q99009J025933L96622p32176j833883k280821j774666
39169H876876p82014k60548o01356r49571o219K368413M684895N198365L565229
39160B2094070R43014j297270k586942l044456k920176k446604j985023j951042
39152F805571k488706l277907l720058l404016k485196j549290r66057m39893
39144a1525552N85622K092787L338807L629532K986094J907931P74261k35799
39136C553683q65456q72118m19359k8849j1412j67828j70119k8388J3177o2990
39126I40341J07358R37083K461050M211356N449072N563021M386310K263889j18315
$$ y = [18001869, 15956458, 13728629, 12098455, 11751466, 12690741, 14104611, 14930039, 14671561, 13742435, 13038259, 13176858, 14075867, 15101800, 15498422, 14766246, 12932363, 10651542, 8876876, 8094862, 7834314, 7232958, 6283387, 6277168, 8645581, 13330476, 18528841, 22094070, 23037084, 21739814, 19152872, 16108416, 13188240, 10741636, 8756613, 6805571, 4316865, 1038958, -2681100, -6085116, -8570312, -10119602, -11085659, -11525552, -10939930, -8847143, -5508336, -1878804, 1107290, 3015221, 3789482, 3553683, 2688227, 1816109, 1396750, 1367901, 1356489, 1188661, 1018542, 990154, 1003331, 940341, 1047699, 1984782, 4445832, 8657188, 14106260, 19669281, 24055591, 26319480, 26201165]
39117B6201165k022288k973593k998866k581805k261744k209273k241823k232715
39109F679058k342409k752020l294962l528863l160433k257038j021239M61996
39101a1215910K086348L400284L682969K551777M75472j475794k472774k492337
39093e459965k088368j766584j636202j467939q93708L26219J966856L294608
39085g725083L639828L082324K340926J924408J671860J242720O79875J57105
39077G013963n27047j674829k971484l571159l030193j733778k38338J334605
39069e398260K921619L987515L968020L095372K215991J764878J425205Q94801
39061A4875141M36091L57145L81912p243q19918j572154j914086j817736j208024
$$ y = [26201165, 24178877, 21205284, 18206418, 15624613, 13362869, 11153596, 8911773, 6679058, 4336649, 1584629, -1710333, -5239196, -8399629, -10656667, -11677906, -11215910, -9129562, -5729278, -2046309, 505468, 980940, -494854, -2967628, -5459965, -7548333, -9314917, -10951119, -12419058, -13312766, -12986547, -11019691, -7725083, -4085255, -1002931, 1337995, 3262403, 4934263, 6176983, 6856858, 7013963, 6486916, 4812087, 1840603, -1730556, -4760749, -6494527, -6732865, -5398260, -2476641, 1510874, 5478894, 8574266, 10790257, 12555135, 13980340, 14875141, 15311232, 15668377, 16050289, 16043046, 15223128, 13650974, 11736888, 9919152, 8711128]
39052H711128Q9384J867184L364137L846689L244381K108555J121614P41828J070664
39043B6165564J800913K380464K442997K074333J567649J032785M20089j65076
39035C7719718m37118k87843j6484j18119r06026k347905m141879n856424p050927
39026A6556993p383236o700996n107030k970984q26588Q27102J667384J556454
39018b380901N73869q21502j767292j442318K49533K473088M069939M429056L786496
39009I169968K791145J928263J355817J084903J091204J222293J157913O28046
39001B0429552k83586j096568j261224o04699M97512J422433J837531J923107
38993B2864058J984368J900732J177822l58451k118663l222084l349385k936364
$$ y = [8711128, 8800512, 10667696, 14031833, 17878522, 21122903, 23231458, 24353072, 25094900, 26165564, 27966477, 30346941, 32789938, 34864271, 36431920, 37464705, 37884794, 37719718, 37282600, 36994757, 36978273, 36860154, 35954128, 33606223, 29464344, 23607920, 16556993, 9173757, 2472761, -2634269, -5605253, -6431841, -5604739, -3937355, -2380901, -1807032, -2628534, -4395826, -5838144, -5588611, -3115523, 954416, 5383472, 9169968, 11961113, 13889376, 15245193, 16330096, 17421300, 18643593, 19801506, 20429552, 20145966, 19049398, 17788174, 17183475, 17680987, 19103420, 20940951, 22864058, 24848426, 26749158, 27926980, 27568529, 25449866, 22227782, 18878397, 15942033]
38985A5942033k555062k304537j842766q61810N20987J758736K287033K055365
38977A4999979J584312J347027J229620Q88789N10151O95733J471021J922987
38969B4649619J218366l13400j518639j654649q92422K53256J457422K437593
38961B5637146K710897J859156N302k117480l628171m102055l798257l271836
38953A3294702k760815k082753j131644j66693N85191J308401K228010L071937
38945A4346336L336264K983023K424154J859084J130081K78554l11095n30392
38937B5516009p97516j333232j583643q42891P09376J980155J929421L63182k041707
38928B3899154m167184n016403m262655k414216l63308J217933K045412K099487
$$ y = [15942033, 13386971, 11082434, 9239668, 8377858, 8898845, 10657581, 12944614, 14999979, 16584291, 17931318, 19160938, 20049727, 20559878, 21255611, 22726632, 24649619, 25867985, 25554585, 24035946, 22381297, 21488875, 21742131, 23199553, 25637146, 28348043, 30207199, 30212501, 28095021, 24466850, 20364795, 16566538, 13294702, 10533887, 8451134, 7319490, 7152797, 7737988, 9046389, 11274399, 14346336, 17682600, 20665623, 23089777, 24948861, 26078942, 26357496, 26046401, 25516009, 24718493, 23385261, 21801618, 20958727, 21668103, 23648258, 25577679, 25940861, 23899154, 19731970, 14715567, 10452912, 8038696, 7675388, 8893321, 10938733, 13038220]
38920A3038220J664312J372070J812979K963925M139207M537423L785165K117429
38912C5430730K80203q50626r26449n01257n14026j304936k319952k808476k556012
38903B3929199j854673j063953m28349j05351n0079Q9085P11395J852444L146537
38894B6226255M158087M579796M140188K624129K15411k285877l852399l956286
38886C1849304k870687j270676L18016J620942K388224K379906J656398P04180
38878C6775607J19201J78876P35873J422259J894265J988170J754626J319710
38870D6188587P13321k7580n70908m06291M86620J283634J028334k95179j733601
38861D6666937k444888k438881k128013j607012p81862P4643M63893L79489M05756
$$ y = [13038220, 14702532, 16074602, 17887581, 20851506, 24990713, 29528136, 33313301, 35430730, 35710933, 34860307, 33933858, 33432601, 32918575, 31613639, 29293687, 26485211, 23929199, 22074526, 21010573, 20582224, 20476873, 20426794, 20515879, 21227274, 23079718, 26226255, 30384342, 34964138, 39104326, 41728455, 41943866, 39657989, 35805590, 31849304, 28978617, 27707941, 28025957, 29646899, 32035123, 34415029, 36071427, 36775607, 36894808, 37073684, 37809557, 39231816, 41126081, 43114251, 44868877, 46188587, 46901908, 46874328, 46303420, 45897129, 46383749, 47667383, 48695717, 48400538, 46666937, 44222049, 41783168, 39655155, 38048143, 37266281, 37340924, 37804817, 38184306, 38590062]
38852C8590062Q93958J372238J073815j07614j462023k188266k024647j174751
38844C4972772J06040J670339L322191M686660N344691N141184M343087L403406
38836F2990370K527637J595504O27783J74659R27015K870285N051520O321914
38828H3086687O187930M906102L044928J195829j21961o99066q35464j047722
38820I5717263j509248j942555k037505j720498r95126J43969J460710K406430
38812I1523440K568150K067236J309595M86172m04615j134714j235587n59365
38804I4620312L81209Q54802O32013J17667j96529k36886k47004l40914l68153
38795I5216517k39019j60387l52525o27197n01961K20602J188477J902162K209825
$$ y = [38590062, 39484020, 40856258, 41930073, 41822459, 40360436, 38172170, 36147523, 34972772, 35078812, 36749151, 40071342, 44758002, 50102693, 55243877, 59586964, 62990370, 65518007, 67113511, 67741294, 67915953, 68842968, 71713253, 76764773, 83086687, 89274617, 94180719, 97225647, 98421476, 98299515, 97600449, 96764985, 95717263, 94208015, 92265460, 90227955, 88507457, 87512331, 87656300, 89117010, 91523440, 94091590, 96158826, 97468421, 97954593, 97549978, 96415264, 95179677, 94620312, 95001521, 95856323, 96488336, 96606003, 96409474, 96172588, 95925584, 95584670, 95216517, 94977498, 94817111, 94464586, 93837389, 93335428, 93556030, 94744507, 96646669, 98856494]
38786I8856494K297440K374693K555377K901018L319178L451188K913612J720241
38778A20389241L10253q83639j744059k317012k571647k480181k213945k038994
38770A06450017j998959j846095j340504n36041K54034O72624M69902l83445j560511
38761A00181022k463861k709777k548106k559484k889384l095352k900970k703394
38753G8310694k936328l232391k836247j803301j114773j376875j974792j901542
38745F1134445r83510J77240J093067J596381J359491l0432k325282m454641n399153
38736E2167606m963368l554524j577577O37916K561720L557335L361576K347560
38728E4538244J286572Q78786J398781K588890L783712M181170L180355P42661
$$ y = [98856494, 101153934, 103528627, 106084004, 108985022, 112304200, 115755388, 118669000, 120389241, 120699494, 119815855, 118071796, 115754784, 113183137, 110702956, 108489011, 106450017, 104451058, 102604963, 101264459, 100728418, 100982452, 101655076, 102124978, 101741533, 100181022, 97717161, 95007384, 92459278, 89899794, 87010410, 83915058, 81014088, 78310694, 75374366, 72141975, 69305728, 67502427, 66387654, 65010779, 63035987, 61134445, 60150935, 60328175, 61421242, 63017623, 64377114, 64346682, 62021400, 57566759, 52167606, 47204238, 43649714, 42072137, 42710053, 45271773, 48829108, 52190684, 54538244, 55824816, 56703602, 58102383, 60691273, 64474985, 68656155, 71836510, 72579171]
38720G2579171k389017m938115n848662m961600k969755p87313R46300J897976
38712E3528985J926707J110100k05815j489187k204980k061212j230512k43941
38704D9130145N29997J234331K128610K946971L048644K302476J447823J319560
38696F4088557J923225K510377K423662J661299P30926J60327Q5807J52633j29710
38687G3607103q21629j436302j497834j067986n53076j77724L2858j64875j218641
38678F6701894l118935m989620n676018m801466l099779j649488r00312n51288
38670D1914988k37472j1303l0664q4121J91094O83855Q02826K19643o79753j262310
38660D1506783j321583j076424p18823k52443L27224R60358J582954K036839J973926
$$ y = [72579171, 70190154, 65252039, 59403377, 54441777, 51472022, 50684709, 51631009, 53528985, 55455692, 56565792, 56359977, 54870790, 52665810, 50604598, 49374086, 49130145, 49660142, 50894473, 53023083, 55970054, 59018698, 61321174, 62768997, 64088557, 66011782, 68522159, 70945821, 72607120, 73338046, 73498373, 73584180, 73736813, 73607103, 72785474, 71349172, 69851338, 68783352, 68230276, 68052552, 68085410, 67920535, 66701894, 63582959, 58593339, 52917321, 48115855, 45016076, 43366588, 42466276, 41914988, 41677516, 41666213, 41635549, 41551428, 41742522, 42426377, 43229203, 43448846, 42769093, 41506783, 40185200, 39108776, 38389953, 38137510, 38464734, 39425092, 41008046, 43044885, 45018811]
38651D5018811J112363l66783j854152k784197k963985k486774j553609m73800
38643C3647874L10891L89696l28540j436529k194762k084871j326162o99379o90107
38634B5588111r14274n68618O53481K285408L596497M119335L779225K860785
38626D1399950J883298J198362O14305l33054j646246k639910k563631j273894
38618C6639180P47603K767175M095916M358374L747574K853241K035435J124551
38610E8369049r6402j356088k128306k230327j862911j173569j82511Q23241J205396
38601E1367572N19283r75102k471501l249226l166976k664843k314913k292606
38593C4751688k299306k049864j694659j576632j700233j747302j600417j519223
$$ y = [45018811, 46131174, 45764391, 43910239, 41126042, 38162057, 35675283, 34121674, 33647874, 33958765, 34348461, 34019921, 32583392, 30388630, 28303759, 26977597, 26278218, 25588111, 24673837, 24105219, 24758700, 27044108, 30640605, 34759940, 38539165, 41399950, 43283248, 44481610, 45095915, 44762861, 43116615, 40476705, 37913074, 36639180, 37386783, 40153958, 44249874, 48608248, 52355822, 55209063, 57244498, 58369049, 58272647, 56916559, 54788253, 52557926, 50695015, 49521446, 49338935, 50162176, 51367572, 51886855, 50911753, 48440252, 45191026, 42024050, 39359207, 37044294, 34751688, 32452382, 30402518, 28707859, 27131227, 25430994, 23683692, 22083275, 20564052]
38585B0564052j714222k037134k214039k110003j623813o39774O59478J697787
38577A2582332K065919K026394K127715K428538K469734J966801J126207K12970
38569B7006610q01899j965538k997898l474458l220412k357770j100825L16523
38561A1404333J615743K570250L118941L312274L227122L010363K877979K928829
38553C4065834L029891K986973K728922K221720J367691K10682q51397j326519
38545D4433797j132669o65646l52416l19319n25926r88349j686605k334097k432935
38536C3995835j673706l11977Q93957J247533P21401k9456l18298k7816M83646
38527C4981119R10968J228829J441560J339068O08995q22488k503085l491689
$$ y = [20564052, 18849830, 16812696, 14598657, 12488654, 10864841, 10225067, 10884545, 12582332, 14648251, 16674645, 18802360, 21230898, 23700632, 25667433, 26793640, 27006610, 26204711, 24239173, 21241275, 17766817, 14546405, 12188635, 11087810, 11404333, 13020076, 15590326, 18709267, 22021541, 25248663, 28259026, 31137005, 34065834, 37095725, 40082698, 42811620, 45033340, 46401031, 46611713, 45760316, 44433797, 43301128, 42635482, 42283066, 41963747, 41437821, 40449472, 38762867, 36428770, 33995835, 32322129, 32010152, 32904109, 34151642, 34873043, 34843587, 34525289, 34497473, 34981119, 35892087, 37120916, 38562476, 39901544, 40510539, 39688051, 37184966, 33693277]
38519C3693277k936917q99853J499078L031489L399077L089347K422797J294648
38511D4592943j37051j179348j364780j021028o90235l83745R6261M35116P9320
38502D0427453q38374j476093j300028o26331J76M68289Q56379R61220N47241
38493C9019932r7193k93875K80251J215729J761013J420951K08954j422928k795107
38484C9297727l350629l028990k288747j631943j097471l31389Q37144K056227
38476C0461929K790476K852595K404139J539933K03584j423253k791795l485148
38468C2552460l622950l494947k991210j800711j28343J239910J764467J748107
38460B5266783J893068K470114L151010L505951L381077K807284J798158L70049
$$ y = [33693277, 30756360, 29856507, 31355585, 34387074, 37786151, 40875498, 43298295, 44592943, 44455892, 43276544, 41911764, 40890736, 40200501, 39816756, 39913017, 40348133, 40427453, 39589079, 38112986, 36812958, 36186627, 36186803, 36655092, 37511471, 38472691, 39019932, 38922739, 38628864, 38909115, 40124844, 41885857, 43306808, 43515762, 42092834, 39297727, 35947098, 32918108, 30629361, 28997418, 27899947, 27568558, 28405702, 30461929, 33252405, 36105000, 38509139, 40049072, 40252656, 38829403, 36037608, 32552460, 28929510, 25434563, 22443353, 20642642, 20514299, 21754209, 23518676, 25266783, 27159851, 29629965, 32780975, 36286926, 39668003, 42475287, 44273445, 44643494]
38452D4643494j317241k930421m085987m516373m161442l151941j756752l50872
38444B2372465O75292J118795J078932P63262J97463p00188j711580k208065j670799
38435A9915577k87581J130346J851290J763547J249891O87404J66445l70401q60093
38426B5246425j081967q87714m11535O781J29409M4347P0321M18781R37841J228852
38416B5701541J060779N98873Q8730o22136j944001l783244n212851n254124l892572
38407F740995j999075l28468R85718J943303K268370J838135J140007Q19313R04500
38398A4312798Q84254M81271n8951m54655p29647r09410p22334J26446J555264
38389A4485036L173703M571333N321447M913688L129812N85884j432409j974191
$$ y = [44643494, 43326253, 40395832, 36309845, 31793472, 27632030, 24480089, 22723337, 22372465, 23047757, 24166552, 25245484, 26008746, 26206209, 25506021, 23794441, 21586376, 19915577, 19627996, 20758342, 22609632, 24373179, 25623070, 26310474, 26476919, 26106518, 25246425, 24164458, 23276744, 22865209, 22871990, 23001399, 23045746, 23116067, 23534848, 24472689, 25701541, 26762320, 27361193, 27449923, 26827787, 24883786, 21100542, 15887691, 10633567, 6740995, 4741920, 4413452, 5399170, 7342473, 9610843, 11448978, 12588985, 13408298, 14312798, 15197052, 15678323, 15619372, 15164717, 14435070, 13525660, 12803326, 12929772, 14485036, 17658739, 22230072, 27551519, 32465207, 35595019, 36180903, 34748494, 32774303]
38381C2774303j240574k73669J18914p876j33837n0262p2126n74802j525461k499865
38371B6514745k991739k621430j228264R69136L261899M717933M788574L721977
38363C7132831K355192J474930J316742J544263J597631J101169R9232r75499
38355D5646491j580473j437593p63731j71610k50268j074190k034491k246326
38347C6087809j303375L00441J564267J829695J195100J50514r49782j926841
38339C6947828k576001k829233l082348l908224n210185n952773n084935k674093
38331E630036Q9357J935151K360345J595727J63622j361880k412800k562013j722454
38322C715091k45079J191869J951581J907639J555647J522885J958641K485752
$$ y = [32774303, 31533729, 31260060, 31378974, 31371098, 31237261, 31186999, 31114873, 30540071, 29014610, 26514745, 23523006, 20901576, 19673312, 20642448, 23904347, 28622280, 33410854, 37132831, 39488023, 40962953, 42279695, 43823958, 45421589, 46522758, 46621990, 45646491, 44066018, 42628425, 41864694, 41693084, 41442816, 40368626, 38334135, 36087809, 34784434, 35084875, 36649142, 38478837, 39673937, 39824451, 38874669, 36947828, 34371827, 31542594, 28460246, 24552022, 19341837, 13389064, 8304129, 5630036, 5719393, 7654544, 10014889, 11610616, 11774238, 10412358, 7999558, 5437545, 3715091, 3470012, 4661881, 6613462, 8521101, 10076748, 11599633, 13558274, 16044026]
38314A6044026K650237K250987J361731L34595k62275p2568O14003J169219J423758
38305B5513713J766523K312015K448014J596862J12675j035879j329715j041818
38297C0342390o19056j62475M20159J067844J490782J313427L61871r86625j853897
38288C1374420j578505l83105R09073J749973K178010K389701K463484K531800
38280D1634851K741817K878240K437653J296033n9733j194843k236814l400067
38272D4097137m360135m576864m065235l373150k829777k225661j282563q8280
38264B1295472J052396J930291K428701K372348J593522K16796j144523j621836
38256B8123167q14476N77901J105893j00472k362248m003689l824145j898821
$$ y = [16044026, 18694263, 20945250, 22306981, 22641576, 22379301, 22306733, 22920736, 24089955, 25513713, 27280236, 29592251, 32040265, 33637127, 33749802, 32713923, 31384208, 30342390, 29723334, 29560859, 29981018, 31048862, 32539644, 33853071, 34214942, 33228317, 31374420, 29795915, 29412810, 30321883, 32071856, 34249866, 36639567, 39103051, 41634851, 44376668, 47254908, 49692561, 50988594, 50928861, 49734018, 47497204, 44097137, 39737002, 35160138, 31094903, 27721753, 24891976, 22666315, 21383752, 21295472, 22347868, 24278159, 26706860, 29079208, 30672730, 30889526, 29745003, 28123167, 27308691, 27886592, 28992485, 28892013, 26529765, 22526076, 18701931, 16803110]
38248A6803110Q10198L178930M318192L852777K192394L26949r45844j581678
38240B8955028k026964k564341l064395l264660l110774k821180k686032k791781
38232F624901k931094k810055k301744j453522l94729N87661J052951Q29651L73712
38223d22268K95112M94758K46055o96508j561203j462732m37806Q18066J858189
38214h68337K591389K795028K253753J359966Q91105J016839J074684N52985k05286
38205A1462126n86139n61961n72874q53283j286647j736384k116295k222859j863114
38196c37430j156657m62373j2048K11506L31374N39687J086726J983633K735785
38187D920203K703629J816565O88571m5591k68409j77596J45245P05221J294691
$$ y = [16803110, 17613308, 20792238, 25110430, 28963207, 31155601, 31482550, 30536706, 28955028, 26928064, 24363723, 21299328, 18034668, 14923894, 12102714, 9416682, 6624901, 3693807, 883752, -1417992, -2871514, -3266243, -2678582, -1625631, -795980, -422268, -127156, 367602, 613657, -82851, -1644054, -3106786, -3544592, -2726526, -868337, 1723052, 4518080, 6771833, 8131799, 9022904, 10039743, 11114427, 11667412, 11462126, 10875987, 10314026, 9741152, 8887869, 7601222, 5864838, 3748543, 1525684, -337430, -1494087, -1956460, -1968508, -1757002, -1425628, -885941, 200785, 2184418, 4920203, 7623832, 9440397, 10128968, 10083377, 9814968, 9637372, 9782617, 10487838, 11782529]
38178A1782529J551226J392476J222599J552644K402713L158313L106927K128349
38170B8297776P75458l45877j129631j799988k370678k554172k191841j501701
38162A7179346q27385l84357l62239r78865k115835l025297k794449j262254O97964
38153F126629J966083K183255J879318J681796J597804J168608K19653p34243
38145A6088903r13661n3058J308802K316236K555834K336485K222287K315960
38137B8177788K113250J161972k51395j327765j696850j843358k413516l335265
38129B0584861l917718l682179k754228j490855j21968J128840J905705J935769
38121A3588227J237472J9615j394038k404173k238786o46513J540205K881469
$$ y = [11782529, 13333755, 14726231, 15948830, 17501474, 19904187, 23062500, 26169427, 28297776, 29073234, 28727357, 27597726, 25797738, 23427060, 20872888, 18681047, 17179346, 16351961, 15967604, 15605365, 14626500, 12510665, 9485368, 6690919, 5428665, 6126629, 8092712, 10275967, 12155285, 13837081, 15434885, 16603493, 16823146, 16088903, 15175242, 15122184, 16430986, 18747222, 21303056, 23639541, 25861828, 28177788, 30291038, 31453010, 31201615, 29873850, 28177000, 26333642, 23920126, 20584861, 16667143, 12984964, 10230736, 8739881, 8617913, 9746753, 11652458, 13588227, 14825699, 14845314, 13451276, 11047103, 8808317, 8161804, 9702009, 12583478]
38113A2583478K519687Q01009j254284k866741l811046m094945l678979k594380
38105b396201j144529K00244J106161J497566J449353J142882R24008J135900
38097C915384J732684K257974K408227K410963K551743K537843J820209N21395
38089B0156422n01280o95748m48480m01272n67874n49886l08662j78396k15573
38080A6289251n0559N35327J256664J672775J639324J308745Q73539M17936o4035
38071B3878967n33162p66813n01117J55258O53886O27183M09118N62737R92873
38062B5478930J009883L25640n07135q59920q28081r67010j516561k195786k553333
38053A7386627k220537j022346P62030K291084K677906J737689Q7083j470853
$$ y = [12583478, 15103165, 15904174, 14649890, 11783149, 7972103, 3877158, 198179, -2396201, -3540730, -3340486, -2234325, -736759, 712594, 1855476, 2779484, 3915384, 5648068, 7906042, 10314269, 12725232, 15276975, 17814818, 19635027, 20156422, 19655142, 18959394, 18510914, 18109642, 17541768, 16991882, 16683220, 16504824, 16289251, 16238692, 16774019, 18030683, 19703458, 21342782, 22651527, 23525066, 23943002, 23878967, 23345805, 22578992, 22077875, 22233133, 22887019, 23514202, 23923320, 24486057, 25478930, 26488813, 26814453, 26307318, 25447398, 24619317, 23652307, 22135746, 19939960, 17386627, 15166090, 14143744, 14905774, 17196858, 19874764, 21612453, 21699536, 20228683]
38045B0228683k470910k753310k249276j009193O65861K296373L454504L898761
38037B2061493L543631K407663O57573j314997k963327l859942l953041l523005
38029A3056048k890987k218312j535686p98452J37371J417394K916016M156682
38021A4240074M667591M373385L491812K129040K83206j629558k560085j591117
38013B3404348R59484L503537M569439M162564L468831L246924K954557J700801
38005D7970485l34228j954965k341444j877545j470592j468147j521361j257573
37997C5744630p60288m37912n99211j127128j510528j318142o96428k17171j62459
37988B8915363k26565r0610J1715l69368j186187j896180k112744j906816j477048
$$ y = [20228683, 17757773, 15004463, 12755187, 11745994, 12411855, 14708228, 18162732, 22061493, 25605124, 28012787, 28670360, 27355363, 24392036, 20532094, 16579053, 13056048, 10165061, 7946749, 6411063, 5612611, 5749982, 7167376, 10083392, 14240074, 18907665, 23281050, 26772862, 28901902, 29185108, 27555550, 24995465, 23404348, 24363832, 27867369, 32436808, 36599372, 40068203, 43315127, 46269684, 47970485, 47636257, 45681292, 43339848, 41462303, 39991711, 38523564, 37002203, 35744630, 34984342, 34546430, 33947219, 32820091, 31309563, 29991421, 29294993, 29077822, 28915363, 28688798, 28598188, 28609903, 28240535, 27054348, 25158168, 23045424, 21138608, 19661560]
37979A9661560q81680j89995L89171O79048O72851M47754J44606Q1059O03870
37970B1608244J636392K545159K670510J930783P76761l51126j340784k224719
37962B7251220k889723l097974k760368k081311j359299o84148L8487P45331J114494
37953A6276709R91942P53893R20958J418016J538559P48620p31154k251327l335608
37944A6330608l749675l301418k039426o09819K3780n63731j829276k791050k866909
37935a396916k140438j019726J21362J001908J405249J303825R98319R55375J360933
37926B589891J865975J916242J365378O35793K25249K21635M24114P31557J099952
37917A1075786J192981N22424q20328j839851j431218M58807K654494L761217
$$ y = [19661560, 18779880, 18589885, 18979056, 19658104, 20330955, 20778709, 20923315, 21004374, 21608244, 23244636, 25789795, 28460305, 30391088, 31167849, 30816723, 29475939, 27251220, 24361497, 21263523, 18503155, 16421844, 15062545, 14378397, 14416884, 15162215, 16276709, 17268651, 18022544, 18943502, 20361518, 21900077, 22648697, 21917543, 19666216, 16330608, 12580933, 9279515, 7240089, 6630270, 6654050, 6090319, 4261043, 1469993, -1396916, -3537354, -4557080, -4435718, -3433810, -2028561, -724736, 273583, 1228958, 2589891, 4455866, 6372108, 7737486, 8373279, 8598528, 8820163, 9244277, 9975834, 11075786, 12268767, 12791191, 11970863, 10131012, 8699794, 9158601, 11813095, 15574312]
37909A5574312L225494J463071p31015k687792l966301m311417l689557k332403
37901B544392o78561P79974J700076K053986K105984K161214K326025K535845
37893A5528935K747414K976804L140669K991875K312806J165355p5012r47388
37885B9841458j243611j199665j283101j655394j899593j484609m97784L45401
37877B0923102N22139K79450K03269M27550N47345K01610n34870j276992j577815
37868A9714788j108065P9764J411243K198336K277009J991844J503453N07427
37860B8575799j093455k559938k829244j652929R7893J320783J636677J408717
37852B4904303J104013Q79488O77697M27333L7111o26312j523998k225589k162710
$$ y = [15574312, 18799806, 20262877, 19531862, 16844070, 12877769, 8566352, 4876795, 2544392, 1865831, 2645805, 4345881, 6399867, 8505851, 10667065, 12993090, 15528935, 18276349, 21253153, 24393822, 27385697, 29698503, 30863858, 30788846, 29841458, 28597847, 27398182, 26115081, 24459687, 22560094, 21075485, 20577701, 20923102, 21445241, 21724691, 21927960, 22355510, 22902855, 23104465, 22569595, 21292603, 19714788, 18606723, 18686487, 20097730, 22296066, 24573075, 26564919, 28068372, 28575799, 27482344, 24922406, 22093162, 20440233, 20538126, 21858909, 23495586, 24904303, 26008316, 26887804, 27565501, 27992834, 28029945, 27403633, 25879635, 23654046, 21491336]
37843B1491336j268066k04764K76802J30701j06892j81610m50198j175481j870407
37834A6641421j744748o85548N52648J122818P95357n8378q55813j090881n29467
37825A4147409O48889J970932L027192L664026L849566L552870K851671J986998
37817C5699553J149158L08170n78157j241421j180858j43826J525565L051488
37809C8589672L722562L257881J814900j90227k185259l503403l660642k787571
$$ y = [21491336, 20223270, 20018506, 20295308, 20426009, 20319117, 20137507, 19687309, 18511828, 16641421, 14896673, 14211125, 14763773, 15886591, 16681948, 16623570, 15767757, 14676876, 14147409, 14796298, 16767230, 19794422, 23458448, 27308014, 30860884, 33712555, 35699553, 36848711, 37156881, 36578724, 35337303, 34156445, 34012619, 35538184, 38589672, 42312234, 45570115, 47385015, 47194788, 45009529, 41506126, 37845484, 35057913]
$$ [...]
##END NTUPLES=NMR SPECTRUM
##END=
