##TITLE=31Pdec_SR75-TFAAkw3
 CDCl3, 24 sc
 25.8.2022
##JCAMPDX= 6.0         $$ Bruker NMR JCAMP-DX V2.0
##DATA TYPE= NMR SPECTRUM
##DATA CLASS= NTUPLES
##ORIGIN= UXNMR, Bruker Analytische Messtechnik GmbH
##OWNER= root
$$ XWIN-NMR		Version 3.5
$$ Thu Aug 25 12:11:24 2022 Russian Standard Time (UT+4h)  she@DPX200
##.OBSERVE FREQUENCY= 81.013821
##.OBSERVE NUCLEUS= ^31P
##.ACQUISITION MODE= SIMULTANEOUS
##.ACQUISITION SCHEME= undefined
##.AVERAGES= 24
##.DIGITISER RES= 16
##SPECTROMETER/DATA SYSTEM= spect
##.PULSE SEQUENCE= zgpg30
##.SOLVENT NAME= DMSO
##.SHIFT REFERENCE= (INTERNAL, DMSO, 0, 248.564)
##AUDIT TRAIL= $$ (NUMBER, WHEN, WHO, WHERE, WHAT)
$$ ##TITLE= Audit trail, XWIN-NMR		Version 3.5
$$ ##JCAMPDX= 5.01
$$ ##ORIGIN= Bruker BioSpin GmbH
$$ ##OWNER= she
$$ F:/spectra/data/she/nmr/P31/1/pdata/1/auditp.txt
$$ ##AUDIT TRAIL=  $$ (NUMBER, WHEN, WHO, WHERE, WHAT)
(   1,<2022-08-25 12:10:30.64 +0400>,<she>,<DPX200>,
      <created by zg, POWCHK disabled, PULCHK disabled
       configuration hash MD5:
       00 E9 B6 7A A2 85 ED C7 34 08 36 98 17 FE 4E 26
       data hash MD5: 32K
       41 33 D2 D2 83 F7 52 A0 24 C4 9F AC 2C 2A E4 64>)
(   2,<2022-08-25 12:10:37.43 +0400>,<she>,<DPX200>,
      <Start of raw data processing
       efp BC_mod = 2 LB = 1 FT_mod = 6 PKNL = 1 PHC0 = -10264.37 PHC1 = 88.85633 SI = 64K 
       data hash MD5: 64K
       83 A2 4C 3B D5 D3 E9 48 90 58 83 C1 FC 3D ED D8>)
(   3,<2022-08-25 12:10:53.73 +0400>,<she>,<DPX200>,
      <pk PHC0 = -4.45741 PHC1 = 0 
       data hash MD5: 64K
       F3 A8 E8 48 6C 4C 7D F3 B7 1C C3 A3 09 2D D7 D9>)
(   4,<2022-08-25 12:10:57.87 +0400>,<she>,<DPX200>,
      <abs ABSG = 5 
       data hash MD5: 64K
       68 38 48 57 72 16 D8 6D EF C1 6A 82 CB 95 5F 97>)
$$ ##END=
$$ 
$$ hash MD5
$$ CB 7A D7 7D 35 6C BD 75 B9 15 D5 CA 17 A0 ED CC
##$RELAX= 
##$RELAX= 
##$RELAX= 
##$RELAX= 
##$RELAX= 
##$RELAX= 
##$RELAX= 
##$RELAX= 
$$ Bruker specific parameters
$$ --------------------------
##$DU= <F:/spectra>
##$EXPNO= 1
##$NAME= <P31>
##$PROCNO= 1
##$TYPE= <nmr>
##$USER= <she>
##$AMP= (0..31)
100 100 100 100 100 100 100 100 100 100 100 100 100 100 100 100 100 100 
100 100 100 100 100 100 100 100 100 100 100 100 100 100 
##$AQSEQ= 0
##$AQ_mod= 1
##$AUNM= <au_zg>
##$AUTOPOS= <>
##$BF1= 81.014009
##$BF2= 200.13
##$BF3= 200.13
##$BF4= 200.13
##$BF5= 200.13
##$BF6= 200.13
##$BF7= 200.13
##$BF8= 200.13
##$BYTORDA= 1
##$CFDGTYP= 0
##$CFRGTYP= 5
##$CHEMSTR= <none>
##$CNST= (0..31)
1 1 145 1 1 1 1 1 1 1 1 1 1 1 1 1 1 1 1 1 1 1 1 1 1 1 1 1 1 1 1 1 
##$CPDPRG= <waltz16>
##$CPDPRG1= <>
##$CPDPRG2= <waltz16>
##$CPDPRG3= <>
##$CPDPRG4= <mlev>
##$CPDPRG5= <mlev>
##$CPDPRG6= <mlev>
##$CPDPRG7= <mlev>
##$CPDPRG8= <mlev>
##$CPDPRGB= <>
##$CPDPRGT= <>
##$D= (0..31)
0 1 0 0 0 0 0 0 0 0 0 0.03 2e-05 3e-06 0 0 0 0 0 0 0 0 0 0 0 0 0 0 0 0 
0 0 
##$DATE= 1661415030
##$DBL= (0..7)
120 120 120 11 120 120 24 19 
##$DBP= (0..7)
150 150 150 150 150 150 150 150 
##$DBP07= 0
##$DBPNAM0= <>
##$DBPNAM1= <>
##$DBPNAM2= <>
$$ [...]
##$SUBNAM3= <"">
##$SUBNAM4= <"">
##$SUBNAM5= <"">
##$SUBNAM6= <"">
##$SUBNAM7= <"">
##$SUBNAM8= <"">
##$SUBNAM9= <"">
##$SW= 501.771253377433
##$SWIBOX= (0..15)
0 1 3 0 0 0 0 0 0 0 0 0 0 0 0 0 
##$SW_h= 40650.406504065
##$TD= 32768
##$TD0= 1
##$TE= 0
##$TE2= 300
##$TE3= 300
##$TEG= 300
##$TL= (0..7)
0 120 53 12 22 120 120 120 
##$TP= (0..7)
150 150 150 150 150 150 150 150 
##$TP07= 0
##$TPNAME0= <>
##$TPNAME1= <>
##$TPNAME2= <>
##$TPNAME3= <>
##$TPNAME4= <>
##$TPNAME5= <>
##$TPNAME6= <>
##$TPNAME7= <>
##$TPOAL= (0..7)
0.5 0.5 0.5 0.5 0.5 0.5 0.5 0.5 
##$TPOFFS= (0..7)
0 0 0 0 0 0 0 0 
##$TUNHIN= 0
##$TUNHOUT= 0
##$TUNXOUT= 0
##$USERA1= <user>
##$USERA2= <user>
##$USERA3= <user>
##$USERA4= <user>
##$USERA5= <user>
##$V9= 5
##$VALIST= <valist>
##$VCLIST= <CCCCCCCCCCCCCCC>
##$VD= 0
##$VDLIST= <DDDDDDDDDDDDDDD>
##$VPLIST= <PPPPPPPPPPPPPPP>
##$VTLIST= <TTTTTTTTTTTTTTT>
##$WBST= 1024
##$WBSW= 4
##$XGAIN= (0..3)
0 0 0 0 
##$XL= 0
##$YL= 0
##$YMAX_a= 2225
##$YMIN_a= -2421
##$ZGOPTNS= <>
##$ZL1= 120
##$ZL2= 120
##$ZL3= 120
##$ZL4= 120
##$ABSF1= 248.5645
##$ABSF2= -253.2056
##$ABSG= 5
##$ABSL= 3
##$ALPHA= 0
##$AQORDER= 0
##$ASSFAC= 0
##$ASSFACI= 0
##$ASSFACX= 0
##$ASSWID= 0
##$AUNMP= <proc_1d>
##$AZFE= 0.1
##$AZFW= 0.5
##$BCFW= 0
##$BC_mod= 2
##$BYTORDP= 0
##$COROFFS= 0
##$CY= -3
##$DATMOD= 1
##$DC= 0
##$DFILT= <>
##$DTYPP= 0
##$F1P= 0
##$F2P= 0
##$FCOR= 1
##$FTSIZE= 65536
##$FT_mod= 6
##$GAMMA= 0
##$GB= 0
##$INTBC= 1
##$INTSCL= 5.30512e-09
##$ISEN= 30
##$LB= 1
##$LEV0= 0
##$LPBIN= 0
##$MAXI= 10000
##$MC2= 0
##$MEAN= 0
##$ME_mod= 0
##$MI= 50
##$NCOEF= 0
##$NC_proc= -9
##$NLEV= 6
##$NOISF1= 182.463
##$NOISF2= 159.3651
##$NSP= 0
##$NTH_PI= 0
##$NZP= 0
##$OFFSET= 248.5645
##$PC= 4
##$PHC0= -10268.83
##$PHC1= 88.85633
##$PH_mod= 1
##$PKNL= yes
##$PPARMOD= 0
##$PSCAL= 0
##$PSIGN= 0
##$REVERSE= no
##$SF= 81.0140089999908
##$SI= 65536
##$SIGF1= 159.3651
##$SIGF2= -187.1042
##$SINO= 113.3802
##$SIOLD= 16384
##$SREGLST= <1H.CDCl3>
##$SSB= 0
##$STSI= 65536
##$STSR= 0
##$SW_p= 40650.406504065
##$SYMM= 0
##$S_DEV= 0
##$TDeff= 32768
##$TDoff= 0
##$TI= <>
##$TILT= no
##$TM1= 0
##$TM2= 0
##$TOPLEV= 0
##$USERP1= <user>
##$USERP2= <user>
##$USERP3= <user>
##$USERP4= <user>
##$USERP5= <user>
##$WDW= 1
##$XDIM= 65536
##$YMAX_p= 305076835
##$YMIN_p= -148557702
$$ End of Bruker specific parameters
$$ ---------------------------------
##NTUPLES= NMR SPECTRUM
##VAR_NAME=  FREQUENCY,     SPECTRUM/REAL,   SPECTRUM/IMAG
##SYMBOL=    X,             R,               I
##VAR_TYPE=  INDEPENDENT,   DEPENDENT,       DEPENDENT
##VAR_FORM=  AFFN,          ASDF,            ASDF
##VAR_DIM=   65536,         65536,           65536
##UNITS=     HZ,            ARBITRARY UNITS, ARBITRARY UNITS
##FACTOR=    0.620285442955139, 1,           1
##FIRST=     20137.2065510736, 0,            0
##LAST=      -20513.1999529914, 0,           0
##MIN=       -20513.1999529914, -148557702,  0
##MAX=       20137.2065510736, 305076835,    0
$$ Real data points
##PAGE= N=1
##DATA TABLE= (X++(R..R)), XYDATA
$$ [...]
$$ plain form
12939 -294078 1330996 3812733 3029622 1611271 2622368 4568812 5014308 5252167 7627112
12930 7627112 9890846 6794055 -1375509 -5756734 1299030 14780732 20853868 13411781
12922 13411781 1352427 -3874746 -2533530 -2729247 -6710633 -9331190 -8678558 -9193099
12914 -9193099 -12506531 -13119015 -7135472 420418 1652428 -4196359 -10418112 -10393885 -3392941
12905 -3392941 4853911 6271256 -1713435 -11428143 -11898607 -1973790 7462504 6127544
12897 6127544 -4758468 -15925194 -20081772 -16235849 -8280578 -2301067 -2171958 -5559175
12889 -5559175 -6996414 -5578100 -5323540 -7442986 -8354863 -7053556 -7451757 -10372258 -10629090
12880 -10629090 -6529291 -4707264 -9358512 -13812104 -10594400 -3611417 -1070524 -1428232
$$ packed form
12939b94078J625074K481737p83111j418351J011097J946444M45496K37859K374945
12930G627112K263734l096791q169564m381225P055764J3481702O073136p442087
12922A3411781j2059354n227173J341216j95717l981386k620557O52632n14541
12914i193099l313432o12484N983543P555890J232010n848787o221753K4227P000944
12905c392941Q246852J417345p984691r714708m70464R924817R436294j334960
12897F127544j0886012j1166726m156578L845923P955271N979511J29109l387217
12889e559175j437239J418314K54560k119446r11877J301307l98201k920501k56832
12880a0629090M099799J822027m651248m453592L217704O982983K540893l57708
$$ plain form
12872 -1428232 2565815 8675380 6322299 -6098105 -15944773 -12175415 1360606 12469648
12864 12469648 14417008 9272322 2326655 -2450900 -3936606 -4026585 -5262027 -7358113
12856 -7358113 -7622345 -4768545 -373046 2730579 1368086 -6620509 -18304283 -25139938
12848 -25139938 -21642423 -13107164 -8884764 -9159172 -5640998 4441901 13363645 14504097
12840 14504097 11253034 9874180 9908750 7497254 3577498 2269999 3696722 4547530
12832 4547530 4740703 7942575 14889584 20357669 18417416 8909223 -2001958 -6881147
12824 -6881147 -3050269 5351091 11536925 12482128 10310690 8008836 6489509 6086184
12816 6086184 7286629 8525660 6908058 3275504 2693027 6841375 9977730 7004829
$$ packed form
12872a428232L994047O109565k353081j2420404r846668L769358J3536021J1109042
12864A2469648J947360n144686o945667m777555j485706q9979j235442k096086
12856g358113k64232K853800M395499L103625j362493p988595j1683774o835655
12848b5139938L497515Q535259M222400k74408L518174J0082899Q921744J140452
12840A4504097l251063j378854L4570k411496l919756j307499J426723Q50808
12832D547530J93173L201872O947009N468085j940253r508193j0911181m879189
12824f881147L830878Q401360O185834R45203k171438k301854j519327m03325
12816F086184J200445J239031j617602l632554n82477M148348L136355k972901
$$ plain form
12808 7004829 2088146 3259764 10549130 16275376 16562070 15239441 14986345 11942882
12800 11942882 2973734 -7269919 -11487277 -8565105 -3086691 1153878 3199858 3190781
12792 3190781 2642361 4018089 6212873 3791638 -4418145 -9989469 -5328303 3759042
12784 3759042 5258916 -898767 -3313779 1282135 2254005 -5711250 -10873094 -2173278
12776 -2173278 11928405 15792870 10488806 9997335 17399758 21447518 17034393 12705077
12768 12705077 14077927 14911282 10794556 7751115 9033894 6483782 -4293928 -11882304
12760 -11882304 -5437794 6316219 7769525 1252308 1922667 11245379 14440864 5926961
12752 5926961 -1217545 2244392 5962191 -2437081 -16282684 -19942094 -12819531 -9182626
$$ packed form
12808G004829m916683J171618P289366N726246K86694j322629k53096l043463
12800A1942882q969148j0243653m217358K922172N478414M240569K045980r077
12792C190781n48420J375728K194784k421235q209783n571324M661166R087345
12784C759042J499874o157683k415012M595914R71870p965255n161844Q699816
12776b173278J4101683L864465n304064m91471P402423M047760m413125m329316
12768A2705077J372850Q33355m116726l043441J282779k550112j0777710p588376
12760a1882304O444510J1754013J453306o517217O70359R322712L195485q513903
12752E926961p144506L461937L717799q399272j3845603l659410P122563L636905
$$ plain form
12744 -9182626 -16258324 -25140682 -25018868 -16394433 -6573624 298580 3720011 2667712
12736 2667712 -3004000 -9100998 -10175833 -5878353 -571154 3110605 6192193 8343997
12728 8343997 6164920 -379518 -4487079 -1147975 3744949 392456 -9599617 -13716043
12720 -13716043 -6442091 2434535 2607565 -2043631 -1661964 3263783 4455711 1241696
12712 1241696 1607753 7744047 11550744 7398028 134616 -3726677 -4937412 -6534753
12704 -6534753 -6463137 -1351839 6550667 12066358 14243515 15957379 17876837 16954058 10647129
12695 10647129 267434 -9682121 -14657861 -13401918 -8279880 -1672629 6015150 12734512
12687 12734512 13074807 5504774 -2014463 -1334783 3290838 1505819 -5661765 -6923740
$$ packed form
12744i182626p075698q882358J21814Q624435R820809O872204L421431j052299
12736B667712n671712o096998j074835M297480N307199L681759L081588K151804
12728H343997k179077o544438m107561L339104M892924l352493r992073m116426
12720a3716043P273952Q876626J73030m651196L81667M925747J191928l214015
12712A241696L66057O136294L806697m152716p263412l861293j210735j597341
12704f534753P1616N111298P902506N515691K177157J713864J919458r22779o306929
12695A0647129j0379695r949555m975740J255943N122038O607251P687779O719362
12687A2734512L40295p570033p519237O79680M625621j785019p167584j261975
$$ plain form
12679 -6923740 -476746 1944820 -3983860 -5320008 7000004 20591593 19196413 7628727
12671 7628727 2898413 7330174 8441880 2505654 -496684 3077754 2991161 -6835089
12663 -6835089 -16866746 -15910231 -6017620 3394452 7683945 7088888 2476404 -2927271
12655 -2927271 -3973742 -775976 455502 -2844372 -6221429 -7517034 -10200351 -13066460
12647 -13066460 -7755744 5853667 12673880 1849305 -15229887 -18935136 -7484061
12640 -7484061 4123005 7008098 5806512 4415599 -695553 -9833999 -15026274 -10903041
12632 -10903041 -1996603 5196903 9855401 12537880 10725654 3732192 -3709886 -7495551
12624 -7495551 -8986593 -9934829 -7859490 -1232007 5321820 6383574 3131491 530008
$$ packed form
12679f923740O446994K421566n928680j336148J2320012J3591589j395180j1567686
12671G628727m730314M431761J111706n936226l002338L574438q6593r826250
12663f835089j0031657R56515R892611R412072M289493n95057m612484n403675
12655b927271j046471L197766J231478l299874l377057j295605k683317k866109
12647a3066460N310716J3609411O820213j0824575j7079192l705249J1451075
12640g484061J1607066K885093j201586j390913n111152r138446n192275M123233
12632a0903041Q906438P193506M658498K682479j812226o993462p442078l785665
12624g495551j491042r48236K075339O627483O553827J061754l252083k601483
$$ plain form
12616 530008 -132299 -1078038 -2578671 -2658859 -1290627 -487611 -420367 858792 3425284
12607 3425284 4174984 669893 -5022447 -7222920 -1688169 9538757 18758112 19886708
12599 19886708 15043105 11575586 12538441 13409551 9150052 903171 -6185751 -8513677
12591 -8513677 -5195305 2749293 10996418 12508339 3949196 -9169841 -17056522 -15408494
12583 -15408494 -8732795 -4391895 -5051995 -6986690 -5337907 -1304439 -2501627 -13113174
12575 -13113174 -25139884 -25621142 -13841595 -4219807 -7933745 -18507869 -22506696 -18818981
12567 -18818981 -17429614 -21566953 -22608557 -14987178 -6210305 -6312642 -13831615 -18896927
12559 -18896927 -16531019 -10248759 -4033236 2537312 9830072 14127730 11894753 5949016
$$ packed form
12616E30008o62307r45739j500633q0188J368232Q03016O7244J279159K566492
12607C425284P49700l505091n692340k200473N534751J1226926R219355J128596
12599A9886708m843603l467519R62855Q71110m259499q246881p088922k327926
12591h513677L318372P944598Q247125J511921q559143j3119037p886681J648028
12583a5408494O675699M340900o60100j934695J648783M033468j197188j0611547
12575a3113174j2026710m81258J1779547R621788l713938j0574124l998827L687715
12567a8818981J389367m137339j041604P621379Q776873j02337p518973n065312
12559a8896927K365908O282260O215523O570548P292760M297658k232977n945737
$$ plain form
12551 5949016 3379850 7011083 11973429 12027769 6525923 -1071733 -8436692 -13806751
12543 -13806751 -12629439 -1672674 13088568 20052689 16348806 11884977 14816708 19775943
12535 19775943 17044795 7624090 746367 343590 3206121 7905202 15071333 19513318
12527 19513318 13551247 539286 -5809500 -398613 4683224 -2351041 -14957305 -17334403
12519 -17334403 -7081014 1793620 -1318797 -9683861 -9098948 3196220 14987856 14232570
12511 14232570 3335982 -5233890 -5891965 -6214033 -13505421 -21664440 -19259011 -7459492
12503 -7459492 26753 -4465547 -13450937 -16546358 -13192246 -8774336 -5753051 -4236420
12495 -4236420 -5047554 -6457436 -3433371 4347909 9525186 7864790 5529049 8350623
$$ packed form
12551E949016k569166L631233M962346N4340n501846p597656p364959n370059
12543a3806751J177312J0956765J4761242O964121l703883m463829K931731M959235
12535A9775943k731148r420705o877723m02777K862531M699081P166131M441985
12527A9513318n962071j3011961o348786N410887N081837p034265j2606264k377098
12519a7334403J0253389Q874634l112417q365064N84913J2295168J1791636p55286
12511A4232570j0896588q569872o58075l22068p291388q159019K405429J1799519
12503g459492P486245m492300q985390l095421L354112M417910L021285J516631
12495d236420q11134j409882L024065P781280N177277j660396k335741K821574
$$ plain form
12487 8350623 10631044 4268110 -6332100 -9882038 -5607942 -2939180 -4908348 -4471237
12479 -4471237 1049739 4004988 -805658 -7450372 -8331206 -4226294 350917 4346251
12471 4346251 7059850 4797080 -2757773 -8365361 -6051104 561174 5011914 8053388
12463 8053388 13271760 16907456 11527392 -1444790 -11680756 -12854148 -8019863 -1464345
12455 -1464345 6743717 15596072 20023724 17438791 12201676 9151998 6917219 2127780
12447 2127780 -3535298 -5847774 -5090086 -5080363 -6455439 -6296887 -4199475 -3531013 -5785550
12438 -5785550 -8164240 -8270849 -7496877 -8131191 -10406291 -13862400 -18009144 -19697530 -13863062
12429 -13863062 -285821 13308850 18594055 15186671 8992259 4767561 4151828 8216345
$$ packed form
12487H350623K280421o362934j0600210l549938M274096K668762j969168M37111
12479d471237N520976K955249m810646o644714q80834M104912M577211L995334
12471D346251K713599k262770p554853n607588K314257O612278M450740L041474
12463H053388N218372L635696n380064j2972182j0235966j173392M834285O555518
12455a464345Q208062Q852355M427652k584933n237115l049678k234779m789439
12447B127780n663078k312476P57688R723j375076J58552K097412O68462k254537
12438e785550k378690j06609P73972o34314k275100l456109m146744j688386N834468
12429a3863062J3577241J3594671N285205l407384o194412m224698o15733M064517
$$ plain form
12421 8216345 16212633 22511186 20333133 9591010 -2503469 -8798933 -7137525 570971
12413 570971 9286339 11771457 4775455 -5076692 -7435438 -1154711 5137288 6303138
12405 6303138 6649296 9897386 12023201 9755505 8240386 12182174 15579683 10041709
12397 10041709 -650408 -5038052 -1687413 -1488975 -10658717 -21147560 -22021478 -13169525
12389 -13169525 -3123422 1323361 -1144921 -8440109 -15830053 -17360593 -11104442 -1847764
12381 -1847764 4366282 6803291 8421067 9536273 6931204 -658635 -9106741 -12376861
12373 -12376861 -8731166 -2746620 -826360 -4546896 -9226822 -9999626 -8036643 -8271043
12365 -8271043 -11453672 -12305820 -7436002 -1977087 -4397310 -15148175 -24386680 -23174335
$$ packed form
12421H216345P996288O298553k178053j0742123j2094479o295464J661408P708496
12413E70971Q715368K485118o996002r852147k358746O280727O291999J165850
12405F303138L46158L248090K125815k267696j515119L941788L397509n537974
12397A0041709j0692117m387644L350639J98438r169742j0488843q73918Q851953
12389a3169525J0046103M446783k468282p295188p389944j530540O256151R256678
12381a847764O214046K437009J617776J115206k605069p589839q448106l270120
12373a2376861L645695N984546J920260l720536m679926p72804J962983k34400
12365h271043l182629q52148M869818N458915k420223j0750865r238505J212345
$$ plain form
12357 -23174335 -14771356 -11093738 -17636130 -25961532 -24247309 -12308775 -870088 2973359
12349 2973359 2617800 2770530 1335320 -3922019 -6879482 -119760 11946185 16401660
12341 16401660 9209889 960532 2042344 9021256 11058285 5283142 -701552 -234585
12333 -234585 4399374 6776925 5153779 3193614 3083327 1844022 -3335455 -8703098
12325 -8703098 -7500731 147263 6273644 6098579 4387126 6466197 8334339 2840263
12317 2840263 -7734030 -13775588 -11856358 -7583953 -4781526 -842811 5160594 8753098
12309 8753098 8352214 9177667 13801855 16336343 12429309 8154959 10783118 16110578
12301 16110578 14665524 7354946 4371865 8874599 12186918 7909858 1793863 2325021
$$ packed form
12357b3174335Q402979L677618o542392q325402J714223J1938534J1438687L843447
12349B973359l55559J52730j435210n257339k957463O759722J2065945M455475
12341A6401660p191771q249357J081812O978912K037029n775143n984694M66967
12333b34585M633959K377551j623146j960165j10287j239305n179477n367643
12325h703098J202367P647994O126381j75065j711453K079071J868142n494076
12317B840263j0574293o041558J919230M272405K802427L938715O003405L592504
12309H753098m00884Q25453M624188K534488l907034m274350K628159N327460
12301A6110578j445054p310578k983081M502734L312319m277060o115995N31158
$$ plain form
12293 2325021 7793227 9190556 2941199 -4974382 -6696615 -53944 11369908 22183614
12285 22183614 28248311 28041165 22735016 15133092 8429435 5349793 6792646 10402592
12277 10402592 11752563 8303410 1560892 -5498929 -11727776 -16946808 -19512498 -18017773
12269 -18017773 -15114481 -15720169 -19911095 -21052069 -13869552 -2033170 5594846 4625663
12261 4625663 -2264242 -10464598 -16374906 -16226648 -8165989 3018461 8687007 6459602
12253 6459602 2983194 3955128 6344838 4347158 -1733306 -7688780 -12493447 -17024299
12245 -17024299 -18573247 -13665643 -5463704 -1883983 -5848491 -12352380 -15334553 -12903810
12237 -12903810 -6055227 2878246 10336829 14370518 16870182 18880727 16017372 5177581
$$ packed form
12293B325021N468206J397329o249357p915581j722233O642671J1423852J0813706
12285B2183614O064697k07146n306149p601924o703657l079642J442853L609946
12277A0402592J349971l449153o742518p059821o228847n219032k565690J494725
12269a8017773K903292o05688m190926j140974P182517J1836382P628016r69183
12261D625663o889905q200356n910308J48258Q060659J1184450N668546k227405
12253F459602l476408R71934K389710j997680o080464n955474m804667m530852
12245a7024299j548948M907604Q201939L579721l964508o503889k982173K430743
12237a2903810O848583Q933473P458583M033689K499664K010545k863355j0839791
$$ plain form
12229 5177581 -5985501 -5535512 5586350 12105559 3841939 -11246039 -18261964 -12903450
12221 -12903450 -2241339 6223155 9634855 7834931 3094247 94243 1070197 2232580
12213 2232580 -1153342 -7885635 -12598061 -12513286 -8989688 -4342524 -695284 -183654 -2641924
12204 -2641924 -4376594 -2451635 1048536 2039603 549609 696843 4773510 9422505
12196 9422505 8080426 -2508734 -16855061 -23046064 -14489071 774812 7707009 2315463
12188 2315463 -3961411 -356738 9498325 14719470 12043246 6804419 2973912 -389064
12180 -389064 -4219117 -7270088 -8740999 -8739608 -6708644 -2872125 20165 -272529 -2295845
12171 -2295845 -3761927 -5184909 -7173012 -6906478 -1729625 5876043 11200633 13240798
$$ packed form
12229E177581j1163082M49989J1121862O519209q263620j5087978p015925N358514
12221a2903450J0662111Q464494L411700j799924m740684l000004R75954J162383
12213B232580l385922o732293m712426Q4775L523598M647164L647240N11630k458270
12204b641924j734670J924959L500171R91067j489994J47234M076667M648995
12196I422505j342079j0589160j4346327o191003Q556993J5263883O932197n391546
12188B315463o276874L604673R855063N221145k676224n238827l830507l362976
12180c89064l830053l050971j470911J391K030964L836519K892290k92694k023316
12171b295845j466082j422982j988103K66534N176853P605668N324590K040165
$$ plain form
12163 13240798 13675992 12225293 7752355 2510160 855605 4331809 10672049 16067937
12155 16067937 16885109 12822422 10074221 15429594 24306584 22932651 8401774 -2704709
12147 -2704709 4187370 19408395 21847972 9127761 -796704 2560578 9059354 6429771
12139 6429771 -2287675 -7033080 -6019646 -4521099 -5004280 -5539641 -4079812 293609
12131 293609 7171334 13561838 16515698 17432430 18762899 17454701 9273310 -1089798
12123 -1089798 -4187223 -924428 -2206428 -10897613 -16476376 -12714497 -8218823 -11675752
12115 -11675752 -17900136 -18009264 -13637018 -10618763 -7285893 -434147 4585916 1934665
12107 1934665 -2669551 -387992 5397205 4992543 -657826 -2442752 637586 1793785
$$ packed form
12163A3240798M35194j450699m472938n242195j654555L476204O340240N395888
12155A6067937Q17172m062687k748201N355373Q876990j373933j4530877j1106483
12147b704709O892079J5221025K439577j2720211r924465L357282O498776k629583
12139F429771q717446m745405J013434J498547m83181n35361J459829M373421
12131B93609O877725O390504K953860R16732J330469j308198q181391j0363108
12123a089798l097425L262795j282000q691185n578763L761879M495674l456929
12115a1675752o224384j09128M372246L018255L332870O851746N020063k651251
12107A934665m604216K281559N785197m04662n650369j784926L080338J156199
$$ plain form
12099 1793785 1243073 5973876 14828641 18660103 16810813 18487673 24776767 24698896 14427195
12090 14427195 5211054 4452022 3586791 -4473988 -9166442 2046986 21059108 28044797
12082 28044797 18362207 5732185 540019 -795218 -3862160 -6759919 -6708224 -6187361
12074 -6187361 -7046696 -5491926 1422902 8834275 9065408 1868348 -4213168 -1039086
12066 -1039086 9792839 17500269 13233004 686820 -7451624 -4877743 1324507 2422655
12058 2422655 774014 3787763 9888013 10505971 4532318 275737 2173135 5681547
12050 5681547 7366777 9321495 9906246 1983366 -12493205 -17468422 -3387485 15696566
12042 15696566 18858915 6736292 -1326828 3862023 11278197 10373901 6034897 6030153
$$ packed form
12099A793785n50712M730803Q854765L831462j849290J676860O289094p7871j0271701
12090A4427195r216141p59032q65231q060779m692454J1213428J9012122O985689
12082B8044797r682590j2630022n192166j335237l066942k897759N1695N20863
12074f187361q59335J554770O914828P411373K31133p197060o081516L174082
12066a039086J0831925P707430m267265j2546184q138444K573881O202250J098148
12058B422655j648641L013749O100250O17958n973653m256581J897398L508412
12050E681547J685230J954718N84751p922880j4476571m975217J4080937J9084051
12042A5696566L162349j2122623q063120N188851P416174r04296m339004m744
$$ plain form
12034 6030153 6703179 1584633 -4908254 -4250658 1023438 674742 -7086375 -13827562 -14907261
12025 -14907261 -14563948 -15253039 -12247519 -3424703 4252282 4611372 2107697 4131799
12017 4131799 8299754 6517405 -585559 -3338595 1911308 7113979 5833980 3613321
12009 3613321 8002826 14552601 12231580 332546 -9635224 -9345923 -2051613 6577468
12001 6577468 16822992 28619346 34428757 27011360 10939591 -1698599 -5835788 -6460526
11993 -6460526 -7694175 -6799923 -1158710 5501142 7759343 5216105 1239642 -1620003
11985 -1620003 -1992427 1243350 6718413 9867526 8107833 5064272 6086210 10493700
11977 10493700 11679125 4991761 -6852362 -16368485 -17771276 -11361248 -3246333 -367557
$$ packed form
12034F030153O73026n118546o492887O57596N274096l48696p761117o741187j079699
12025a4907261L43313o89091L005520Q822816P676985L59090k503675K024102
12017D131799M167955j782349p102964k753036N249903N202671j279999k220659
12009C613321M389505O549775k321021j1899034r967770K89301P294310Q629081
12001F577468J0245524J1796354N809411p417397j6071769j2638190m137189o24738
11993f460526j233649Q94252N641213O659852K258201k543238l976463k859645
11985a620003l72424L235777N475063L149113j759693l043561J021938M407490
11977A0493700J185425o687364j1844123r516123j402791O410028Q114915K878776
$$ plain form
11969 -367557 -4121587 -9056737 -9140564 -4670309 -1196278 -2073135 -4620805 -4548760 -1993287
11960 -1993287 -759498 -1986737 -1366996 5381814 15592175 21235628 18040513 10252409
11952 10252409 4613028 2230337 -504479 -4657110 -6569463 -3252547 3202840 7695801
11944 7695801 6982885 2348168 -1282721 154361 4471174 4266480 -3550765 -11489823
11936 -11489823 -9716796 449628 7262034 3453244 -5444152 -9699806 -7070040 -2873830
11928 -2873830 -2385404 -6264865 -10909276 -11364833 -6359122 -1092504 -1495759 -5604806 -5793897
11919 -5793897 -192348 4851762 5893549 8403260 16948116 25906866 26404037 18127706
11911 18127706 8073617 872251 -3746416 -6472263 -7101519 -6345766 -4999472 -3079604
$$ packed form
11969c67557l754030m935150q3827M470255L474031q76857k547670P2045K555473
11960a993287J233789j227239O19741O748810J0210361N643453l195115p788104
11952A0252409n639381k382691k734816m152631j912353L316916O455387M492961
11944G695801p12916m634717l630889J437082M316813k04694p817245p939058
11936a1489823J773027J0166424O812406l808790q897396m255654K629766M196210
11928b873830M88426l879461m644411m55557N005711N266618m03255m109047j89091
11919e793897N601549N044110J041787K509711Q544856Q958750M97171q276331
11911A8127706j0054089p201366m618667k725847o29256P55753J346294J919868
$$ plain form
11903 -3079604 -2274361 -5426422 -10511442 -10348634 -2973338 3046065 -304186 -8797191
11895 -8797191 -12126591 -7662509 -888672 4263083 7849532 9555187 9541912 11347759
11887 11347759 16740247 20330119 16813870 10615686 9866477 13359177 12749137 5958511
11879 5958511 -1209965 -5657575 -9207270 -10687106 -6173227 2013106 6303594 5054579
11871 5054579 3331304 1716149 -5060500 -15996417 -21058090 -14982287 -5159124 -1328901
11863 -1328901 -4598477 -9940958 -12449362 -8532441 1656803 10878180 11657848 7663173
11855 7663173 9073223 15828856 17205728 10361923 5636282 8228865 8822979 822369
11847 822369 -6362772 -2449816 6311537 7551916 2036809 -748890 30427 -2945804
$$ packed form
11903c079604Q05243l152061n085020J62808P375296O019403l350251q493005
11895h797191l329400M464082O773837N151755L586449J705655j3275J805847
11887A1347759N392488L589872l516249o198184p49209L492700o10040o790626
11879E958511p168476m447610l549695j479836M513879Q186333M290488j249015
11871E054579j723275j615155o776649j0935917n061673O075803R823163L830223
11863a328901l269576n342481k508404L916921J0189244R221377P79668l994675
11855G663173J410050O755633J376872o843805m725641K592583N94114q000610
11847H22369p185141L912956Q761353J240379n515107k785699P79317k976231
$$ plain form
11839 -2945804 -10784766 -16365088 -14812834 -6822225 5435782 17081501 19454138 9995311
11831 9995311 -594097 -1035861 4419159 3142313 -6164804 -12890084 -11786596 -8503012
11823 -8503012 -7583449 -6287366 -2211412 2214053 4596423 4410384 -231613 -9962743
11815 -9962743 -18842869 -19670569 -13737980 -7363755 -1212776 6933945 11550298 4571547
11807 4571547 -9052897 -14851239 -9773831 -5928700 -10099355 -13711799 -8932012 -1410563
11799 -1410563 590635 -1946528 -5589782 -11502096 -17064024 -12547430 2700506 11928580
11791 11928580 2551905 -12977005 -13412088 633158 9307716 3696692 -4268807 -3064560
11783 -3064560 3666549 8023824 9772483 11190617 10990819 9813361 12569541 19090161
$$ packed form
11839b945804p838962n580322J552254P990609J2258007J1645719K372637r458827
11831I995311j0589408m41764N455020j276846r307117o725280J103488L283584
11823h503012R19563J296083M075954M425465K382370j86039m641997r731130
11815i962743q880126q27700N932589O374225O150979Q146721M616353o978751
11807D571547j3624444n798342N077408L845131m170655l612444M779787P521449
11799a410563K001198k537163l643254n912314n561928M516594J5247936R228074
11791A1928580r376675j5528910m35083J4045246Q674558n611024p965499J204247
11783c064560O731109M357275J748659J418134j99798j177458K756180O520620
$$ plain form
11775 19090161 20945891 14048351 6228417 5002018 5741628 930366 -5782119 -5701834
11767 -5701834 -634007 -191132 -5133707 -5548314 2682992 10371252 8179185 -804254
11759 -804254 -6476857 -3898435 4000180 10888011 10851397 2834412 -5476272 -3668636 7847155
11750 7847155 16173892 12220531 2381038 -1791914 869377 3694381 4695472 6680130
11742 6680130 7982646 3477003 -5673592 -12209650 -12774636 -10043869 -5932780 -1159659
11734 -1159659 -36426 -5450445 -9978623 -4066017 6408361 4579477 -12294257 -26757989
11726 -26757989 -26039805 -18258394 -15103484 -13141047 -5255773 1899531 -1629761 -9369071
11718 -9369071 -6297354 7790975 18634794 18829389 13957037 8783109 1996934 -5003769
$$ packed form
11775A9090161J855730o897540p819934j226399P39610m811262o712485Q0285
11767e701834N067827M42875m942575m14607Q231306P688260k192067q983439
11759h04254n672603K578422P898615O887831l6614q016985q310684J807636J1515791
11750G847155Q326737l953361r839493m172952K661291K825004J001091J984658
11742F680130J302516m505643r150595o536058n64986K730767M111089M773121
11734a159659J123233n414019m528178N912606J0474378j828884j6873734j4463732
11726b6757989P18184P781411L154910J962437P885274P155304l529292p739310
11718i369071L071717J4088329J0843819J94595m872352n173928o786175p000703
$$ plain form
11710 -5003769 -7618838 -7233640 -8678892 -8879938 -1467046 7825415 6205129 -4298374
11702 -4298374 -7217852 2120392 8798185 3716721 -1680344 2833199 7132107 -1198299
11694 -1198299 -13619528 -13659133 -3497580 1477610 -1416470 -1126759 4698599 5471094
11686 5471094 -2339819 -7969308 -3806889 3765471 6552539 5978934 6437841 7054790 6135299
11677 6135299 5624593 5730769 2755471 -2768065 -3813157 1698922 5387569 1107907
11669 1107907 -4825506 -4544823 -2554670 -8110147 -18556484 -22186252 -15866152 -8070317
11661 -8070317 -3844094 1727866 11831766 20143790 20650549 17323596 16807978 17020312
11653 17020312 11004235 -684587 -9137235 -8441315 -2015895 3157507 4181992 2863498
$$ packed form
11710e003769k615069L85198j445252k01046P412892R292461j620286j0503503
11702d298374k919478R338244O677793n081464n397065M513543M298908q330406
11694a198299j2421229l9605J0161553M975190k894080K89711N825358P72495
11686E471094p810913n629489M162419P572360K787068n73605M58907O16949r19491
11677F135299n10706J06176k975298n523536j045092N512079L688647m279662
11669A107907n933413K80683J990153n555477j0446337l629768O320100P795835
11661h070317M226223N571960J0103900Q312024N06759l326953n15618K12334
11653A7020312o016077j1688822q452648O95920O425420N173402J024485j318494
$$ plain form
11645 2863498 1818876 1549151 431384 -2190442 -2604431 4674704 18322516 27496684
11637 27496684 22783132 8391449 -2000984 -1063476 6253936 12545485 16435269 18614088
11629 18614088 16415913 8253097 -280799 -1054414 6462158 14114576 14464634 8299117
11621 8299117 2006278 -597071 -2073493 -6344974 -10990103 -8280679 3794538 15705437
11613 15705437 17183911 11018812 8312726 11282983 10677813 1731407 -8117961 -11747999
11605 -11747999 -12063569 -12749213 -9776908 -1433338 2524154 -6144167 -18686203 -20084889
11597 -20084889 -10865227 -4515068 -5847147 -6557061 -2266356 580871 -2453731 -6899472
11589 -6899472 -8990348 -10765202 -12035468 -8766890 -3477659 -5129263 -13177299 -14048287
$$ packed form
11645B863498j044622k69725j117767k621826m13989P279135J3647812R174168
11637B7496684m713552j4391683j0392433R37508P317412O291549L889784K178819
11629A8614088k198175q162816q533896p73615P516572P652418L50058o165517
11621H299117o292839k603349j476422m271481m645129K709424J2075217J1910899
11613A5705437J478474o165099k706086K970257o05170q946406r849368l630038
11605a1747999l15570o85644K972305Q343570L957492q668321j2542036j398686
11597b0084889R219662O350159j332079p09914M290705K847227l034602m445741
11589f899472k090876j774854j270266L268578N289231j651604q048036q70988
$$ plain form
11581 -14048287 -1091682 13420687 15452079 8127621 3141529 2493674 773381 -1783906
11573 -1783906 -1593111 -1801516 -6906164 -11166134 -6109188 2737950 1397991 -10001133
11565 -10001133 -15384810 -7027597 2869423 2129251 -2584387 2000764 13365683 16596373
11557 16596373 7417928 -959147 3602312 16382931 23813487 21085718 15031650 12180237
11549 12180237 11345393 9249445 7258990 8263928 10535709 10149139 8054116 8905389
11541 8905389 12465649 12094005 4349739 -4611105 -6027202 865751 8512729 9353390
11533 9353390 1990100 -8670479 -14771609 -11057784 103362 10420758 13924641 11624140
11525 11624140 7217811 2158865 -2544079 -3877758 -649538 2720154 638649 -6651028
$$ packed form
11581a4048287J2956605J4512369K031392p324458m986092o47855j720293k557287
11573a783906J90795k08405n104648m259970N056946Q847138j339959j1399124
11565a0001133n383677Q357213R897020p40172m713638M585151J1364919L230690
11557A6596373r178445q377075M561459J2780619P430556k727769o054068k851413
11549A2180237q34844k095948j990455J004938K271781l86570k095023Q51273
11541H905389L560260l71644p744266q960844j416097O892953P646978Q40661
11533I353390p363290j0660579o101130L713825J1161146J0317396L503883k300501
11525A1624140m406329n058946m702944j333679L228220L369692k081505p289677
$$ plain form
11517 -6651028 -13792192 -16594566 -14617743 -9273724 -2738339 2392758 5258506 7715727
11509 7715727 11342199 15029416 17025801 17048192 15046302 11093679 7934224 9319527
11501 9319527 13664787 14343140 9142960 3766463 2200073 159115 -6409356 -12841694
11493 -12841694 -12959710 -9031145 -6460243 -3863562 2324606 8174337 7909848 5563254
11485 5563254 9091334 15168675 13038367 3446661 -59148 8462970 18402408 18754205
11477 18754205 11948665 5822913 1967482 -1002613 -979266 3417842 8271021 9980486
11469 9980486 9924225 9165856 5407580 -49383 -67191 7559540 14429196 13186020 7639419
11460 7639419 4212296 1030253 -5533090 -10326106 -6161892 3389500 8374294 6502265
$$ packed form
11517f651028p141164k802374J976823N344019O535385N131097K865748K457221
11509G715727L626472L687217J996385K2391k001890l952623l159455J385303
11501I319527M345260O78353n200180n376497j566390k040958o568471o432338
11493a2841694j18016L928565K570902K596681O188168N849731k64489k346594
11485E563254L528080O077341k130308r591706l505809Q522118R939438L51797
11477A8754205o805540o125752l855431k970095K3347M397108M853179J709465
11469I980486n6261p58369l758276n456963j7808P626731O869656j243176n546601
11460G639419l427123l182043o563343m793016M164214R551392M984794j872029
$$ plain form
11452 6502265 3191596 728546 -2419258 -3965106 -436016 3622184 57214 -8998283
11444 -8998283 -12327422 -6150350 816863 1368942 -845603 189192 3648756 6011580
11436 6011580 7569562 9804288 11220903 9821275 6071048 1355712 -2586091 -2399957
11428 -2399957 3086009 7919624 5311774 -713162 1059324 12138772 21149952 20636098
11420 20636098 16080023 13327775 8958402 943341 -2732814 3101114 9236109 5983395
11412 5983395 332177 4641688 14449184 14175575 2249742 -6331173 -2977025 4893514
11404 4893514 9550293 12673739 14794902 9884335 -2238437 -10677997 -8891826 -4608732
11396 -4608732 -6129179 -9199636 -7012064 -3575147 -5889101 -10465469 -9504593 -4720774
$$ packed form
11452F502265l310669k463050l147804j545848L529090M058200l564970r055497
11444h998283l329139O177072O967213N52079k214545J034795L459564K362824
11436F011580J557982K234726J416615j399628l750227m715336l941803J86134
11428b399957N485966M833615k607850o024936J772486J1079448R011180n13854
11420B0636098m556075k752248m369373q015061l676155N833928O134995l252714
11412E983395n651218M309511R807496k73609j1925833q580915L354148P870539
11404D893514M656779L123446K121163m910567j2122772q439560J786171M283094
11396d608732j520447l070457K187572L436917k313954m576368R60876M783819
$$ plain form
11388 -4720774 -3189997 -4045703 -1522424 1964557 -1524565 -10739656 -15096893 -9906465
11380 -9906465 -1474044 3692411 5028430 2714619 -3432117 -8358939 -5212844 3104340
11372 3104340 5361531 -2145790 -10536146 -12203961 -9710484 -6651225 -411915 9178503
11364 9178503 13654254 7357201 -2020693 -3507955 1905958 4977379 2604907 -723467
11356 -723467 -2543495 -3965854 -3398467 1971779 8595772 8949822 2521253 -2887183 -2192087
11347 -2192087 1415935 3912581 6911732 13096275 19794065 21300746 15664162 6595457
11339 6595457 -280708 -2060898 -796129 -1406225 -5892867 -10155557 -8867508 -2907413
11331 -2907413 1267836 -143133 -4010793 -5317050 -3529208 -1878394 -2016522 -2017489 -159632
$$ packed form
11388d720774J530777q55706K523279L486981l489122r215091m357237N190428
11380i906465Q432421N166455J336019k313811o146736m926822L146095Q317184
11372C104340K257191p507321q390356j667815K493477L059259O239310R590418
11364I178503M475751o297053r377894j487262N413913L071421k372472l328374
11356g23467j820028j422359N67387N370246O623993L54050o428569n408436O95096
11347b192087L608022K496646K999151O184543O697790J506681n636584r068705
11339F595457o876165j780190J264769o10096m486642m262690J288049N960095
11331b907413M175249j410969l867660j306257J787842J650814j38128r67J857857
$$ plain form
11322 -159632 886557 -3900199 -14284487 -21456914 -16633876 -3091580 5611262 1795447
11314 1795447 -7049799 -9189443 -3862848 793867 1274112 1349474 1839973 -2658985 -13364356
11305 -13364356 -21238399 -17466724 -5860366 1500568 -682160 -6123027 -7356358 -5172589
11297 -5172589 -4703791 -6264013 -5652107 -2823618 -4012699 -12301506 -21056765 -22086016
11289 -22086016 -16984039 -13330247 -11478453 -4422898 8014334 15207570 11022187 3998442
11281 3998442 4573750 9641051 9646265 5536575 6889735 15482563 22686167 23803758 23977300
11272 23977300 27190097 29092971 24966182 17163583 10385337 5892040 4033855 6124411
11264 6124411 9843717 9036195 2638404 -2009172 252048 4089701 1889595 -4515351
$$ packed form
11322a59632J046189m786756j0384288p172427M823038J3542296Q702842l815815
11314A795447q845246k139644N326595M656715M80245P5362M90499m498958j0705371
11305a3364356p874043L771675J1606358P360934k182728n440867j233331K183769
11297e172589M68798j560222O11906K828489j189081q288807q755259j029251
11289b2086016N101977L653792J851794P055555J2437232P193236m185383p023745
11281C998442N75308N067301N214m109690J353160Q592828P203604J117591J73542
11272B3977300L212797J902874m126789p802599o778246m493297j858185K090556
11264F124411L719306q07522o397791m647576K261220L837653k200106o404946
$$ plain form
11256 -4515351 -7270709 -4490511 -1633299 -2298648 -4390836 -5638049 -7123525 -9729440
11248 -9729440 -11205304 -8997822 -3827709 1257976 4364402 6030350 7128481 6519463
11240 6519463 2410699 -3500981 -5888888 -2455472 1580136 -39194 -5216347 -6225564
11232 -6225564 -1287837 3339556 3779844 3689411 6422089 9340432 9809120 9727831 9230085
11223 9230085 3386402 -8032811 -14814806 -9652409 -1613089 -4997883 -17798531 -23533501
11215 -23533501 -14473621 -887484 5436925 5377861 4993761 4065488 196884 -2752274
11207 -2752274 312237 5784132 5054717 -2979420 -10423405 -11553873 -8980044 -7123277
11199 -7123277 -5090003 700269 9931906 17793978 20051382 16873414 12136765 9925752
$$ packed form
11256d515351k755358K780198K857212o65349k092188j247213j485476k605915
11248i729440j475864K207482N170113N085685L106426J665948J098131o09018
11240F519463m108764n911680k387907L433416M035608j619330n177153j009217
11232f225564M937727M627393M40288r0433K732678K918343M68688q1289m97746
11223I230085n843683j1419213o781995N162397Q039320l384794j2800648n734970
11215b3533501R059880J3586137O324409n9064l84100r28273l868604k949158
11207b752274L064511N471895p29415q034137p443985j130468K573829J856767
11199g123277K033274N790272R231637P862072K257404l177968m736649k211013
$$ plain form
11191 9925752 11151596 12962084 11955239 8089054 4465308 3167240 2877349 1374244
11183 1374244 -1205035 -3093300 -3812496 -4551261 -6053610 -7745474 -8698236 -7993938 -4703248
11174 -4703248 519303 4359263 4061002 1633103 1599974 4237803 5215100 3301838 3278565
11165 3278565 7652114 10328510 4272701 -7607425 -15654199 -15855286 -12568932 -9974897
11157 -9974897 -8074436 -7308495 -9352845 -11608800 -8481793 -963094 2481177 -1550090
11149 -1550090 -5285964 -1367297 6419299 10505613 11264412 13279105 15112811 12429490
11141 12429490 8165910 9370326 15000763 16945160 13575186 12132644 15465649 16415825
11133 16415825 9898982 1818841 -303175 1356762 205143 -3361361 -3833265 -846060
$$ packed form
11191I925752J225844J810488j006845l866185l623746j298068k89891j503105
11183A374244k579279j888265p19196p38765j502349j691864r52762P04298L290690
11174d703248N222551L839960k98261k427899l3129K637829R77297j913262k3273
11165C278565M373549K676396o055809j1880126q046774k01087L286354K594035
11157i974897J900461P65941k044350k255955L127007P518699L444271m031267
11149a550090l735874L918667P786596M086314P58799K014693J833706k683321
11141A2429490m263580J204416N630437J944397l369974j442542L333005R50176
11133A6415825o516843q080141k122016J659937j151619l566504m71904K987205
$$ plain form
11125 -846060 501999 -1291531 -2116369 -74734 1028616 -1846420 -5993636 -7371138
11117 -7371138 -6466834 -6556565 -8389713 -9945362 -10564842 -12305101 -16724376 -22133583 -24778525
11108 -24778525 -21878524 -13252085 -1159887 10478163 17496759 17902373 13705886 9688867
11100 9688867 9617012 13781488 20012380 25546531 27099130 21409981 8963105 -3270779
11092 -3270779 -6619713 45147 8359453 9720003 4329184 -1250571 -3134985 -2970872
11084 -2970872 -3134404 -3715597 -4502546 -5405798 -3755082 3949556 15052834 20523478 16267466
11075 16267466 10407631 12676688 19249464 16875480 2699534 -9311170 -6251609 6825252
11067 6825252 14973564 13410930 10526669 12106201 12085590 2842554 -11410014 -17729187
$$ packed form
11125h46060J348059j793530q24838K041635J103350k875036m147216j377502
11117g371138R04304q9731j833148j555649o19480j740259m419275n409207k644942
11108b4778525K900001Q626439J2092198J1638050P018596M05614m196487m017019
11100I688867p1855M164476O230892N534151J552599n689149j2446876j2233884
11092c270779l348934O664860Q314306J360550n390819n579755j884414J64113
11084b970872j63532n81193p86949r03252J650716P704638J1103278N470644m256012
11075A6267466n859835K269057O572776k373984j4175946j2010704L059561J3076861
11067F825252Q148312j562634k884261J579532k0611r243036j4252568o319173
$$ plain form
11059 -17729187 -9861126 3988387 10379496 5458638 -2163330 -3327304 539403 1509421
11051 1509421 -2335638 -5007668 -3692298 -4007436 -9958815 -15270201 -11600505 -1028270
11043 -1028270 7257697 9699619 9670438 8301938 3708669 -498580 3977160 17516414
11035 17516414 28788976 27952419 17982232 9298465 8120485 13108975 18553488 17900676
11027 17900676 8634892 -3847303 -11235136 -11953665 -10585072 -8301493 -2532961 2929951
11019 2929951 -1277175 -14755401 -23739375 -19626377 -10929855 -8419552 -8462288 -2276632
11011 -2276632 6621085 7571830 293168 -5747342 -6394067 -5203217 -3264835 1437495
11003 1437495 6143630 6345091 5297729 9066134 13836754 10809481 2475947 -144597
$$ packed form
11059a7729187P868061J3849513O391109m920858p621968j163974L866707R70018
11051A509421l845059k672030J315370l15138n951379n311386L669696J0572235
11043a028270Q285967K441922k9181j368500m593269m207249M475740J3539254
11035A7516414J1272562q36557r970187q683767j177980M988490N444513o52812
11027A7900676r265784j2482195p387833p18529J368593K283579N768532N462912
11019B929951m207126j3478226q983974M112998Q696522K510303m2736O185656
11011b276632Q897717R50745p278662o040510o46725J190850J938382M702330
11003A437495M706135K01461j047362L768405M770620l027273q333534k620544
$$ plain form
10995 -144597 3249416 1041947 -9890053 -18227545 -17298348 -14637505 -15685023 -13016389
10987 -13016389 -1223840 10949630 14346119 13414127 14727552 12856284 1713173 -9627144
10979 -9627144 -8723299 -979378 -2091590 -12590816 -16945695 -8045018 3384669 6491613
10971 6491613 3380447 280627 -1937353 -2912776 856799 8409433 11781901 7389633
10963 7389633 2147311 1710984 230462 -9797208 -23130421 -26927631 -17966339 -5985229
10955 -5985229 -32790 919221 2255982 5034324 6485632 5502123 3859546 3096102 2736782
10946 2736782 1654093 -211199 -1896171 -2576544 -2228623 -1335628 -536474 -753153 -2902638
10937 -2902638 -6687750 -10134767 -11389598 -10906408 -10871122 -12316129 -13694686 -12714147 -9068715
$$ packed form
10995a44597L394013k207469j0932000q337492R29197K660843j047518K668634
10987a3016389J1792549J2173470L396489r31992J313425j871268j1143111j1340317
10979i627144R03845P743921j112212j0499226m354879Q900677J1429687L106944
10971F491613l111166l099820k217980r75423L769575P552634L372468m392268
10963G389633n242322m36327j480522j0027670j3333213l797210Q961292J1981110
10955e985229N952439R52011J336761K778342J451308r83509j642577p63444l59320
10946B736782j082689j865292j684972o80373L47921Q92995P99154k16679k149485
10937b902638l785112l447017j254831M83190L5286j445007j378557R80539L645432
$$ plain form
10928 -9068715 -4996703 -3350147 -5307060 -9824887 -14879318 -18671294 -19803875 -17688780
10920 -17688780 -13714642 -10770277 -10221056 -10646629 -11149445 -13552949 -17976480 -18734429 -10635355
10911 -10635355 1137515 4750180 -2462786 -8835252 -3260059 10601338 20324529 20032313
10903 20032313 13646579 7049484 3919982 6199111 11311253 11259360 2173029 -7217311
10895 -7217311 -5299869 5380727 10796482 5788633 728015 4372174 10990291 11350108
10887 11350108 7389439 6538250 7530260 2582628 -8590191 -16754336 -15551333 -8258206
10879 -8258206 -1243523 2395328 1042601 -6642485 -17313699 -22300886 -16209433 -3735468
10871 -3735468 5830506 8829303 8196496 6319831 2612914 -1433173 -1005946 4506194
$$ packed form
10928i068715M072012J646556j956913m517827n054431l791976j132581K115095
10920a7688780L974138K944365N49221m25573n02816k403504m423531p57949Q099074
10911a0635355J1772870L612665p212966o372466N575193J3861397R723191k92216
10903B0032313o385734o597095l129502K279129N112142n1893r086331r390340
10895g217311J917442J0680596N415755n007849n060618L644159O618117L59817
10887A1350108l960669q51189R92010m947632j1172819q164145J203003P293127
10879h258206P014683L638851j352727p685086j0671214m987187O091453J2473965
10871c735468R565974K998797o32807j876665l706917m046087M27227N512140
$$ plain form
10863 4506194 7427409 1352232 -7582154 -6829680 4510958 12480605 7476213 -1348648
10855 -1348648 1023672 13834297 22498667 19935268 14095801 12846389 13055003 9635563
10847 9635563 5396824 4579789 4282941 478853 -3480518 -3030593 -2065843 -6845781 -13822627
10838 -13822627 -14168490 -8950570 -8724088 -16936088 -24093581 -21631066 -12746674 -5263741
10830 -5263741 -1414268 217929 -865446 -4727956 -7704632 -6952959 -4783454 -3890500
10822 -3890500 -2090773 3209053 8826018 9615873 5909544 1935767 -783901 -3193375
10814 -3193375 -4325374 -3196216 -3195325 -7952946 -13874487 -13817428 -7925637 -3221302 -1818074
10805 -1818074 1730239 8628477 10729865 3361998 -4414889 -1077666 10605959 17646859
$$ packed form
10863D506194K921215o075177q934386P52474J1340638P969647n004392q824861
10855a348648K372320J2810625Q664370k563399n839467j249412K08614l419440
10847I635563m238739q17035k96848l804088l959371M49925R64750m779938o976846
10838a3822627l45863N217920K26482q212000p157493K462515Q884392P482933
10830e263741L849473J632197j083375l862510k976676P51673K169505Q92954
10822c890500J799727N299826N616965P89855l706329l973777k719668k409474
10814c193375j131999J129158Q91m757621n921541N7059N891791M704335J403228
10805a818074L548313O898238K101388p367867p776887L337223J1683625P040900
$$ plain form
10797 17646859 15229197 10784805 9528261 6811245 -942361 -7095001 -4402544 1954144
10789 1954144 229445 -10597972 -18082142 -12613646 296667 8012186 6845441 4872010
10781 4872010 9430189 16574080 16021562 5541700 -3522522 1449985 17522320 26873319
10773 26873319 17144992 -3068237 -14298950 -9270373 1080101 4518199 2334650 3455713
10765 3455713 10088781 15652192 14352225 7151631 -1036781 -5881735 -5767843 -2736941
10757 -2736941 -931256 -1767504 -2105018 303552 2221329 -79803 -3682845 -2596288
10749 -2596288 2602997 4974931 1358696 -4012115 -7401053 -10537126 -14639057 -15454147
10741 -15454147 -9197122 466865 6439701 6703136 4191897 292430 -6083814 -13269835
$$ packed form
10797A7646859k417662m444392j256544k717016p753606o152640K692457O356688
10789A954144j724699j0827417p484170N468496J2910313P715519j166745j973431
10781D872010M558179P143891n52518j0479862r064222M972507J6072335R350999
10773B6873319r728327k0213229j1230713N028577J0350474L438098k183549J121063
10765C455713O633068N563411j299967p200594q188412m844954J13892L030902
10757b736941J805685q36248l37514K408570J917777k301132l603042J086557
10749b596288N199285K371934l616235n370811l388938l136073m101931q15090
10741a5454147O257025R663987N972836K63435k511239l899467o376244p186021
$$ plain form
10733 -13269835 -16042106 -12222395 -6963924 -7374589 -13332258 -16129626 -8027862 7579157
10725 7579157 18545479 17960544 12377628 12169321 16585776 15373385 5123280 -4403775
10717 -4403775 -4043308 1798403 2388758 -3676370 -7673145 -4006968 2786175 5085543
10709 5085543 1096634 -4896121 -7950222 -6713755 -3865732 -2678576 -2654041 -403029
10701 -403029 3875289 4228919 -3186288 -12916533 -15822274 -10445186 -3762530 -1465848
10693 -1465848 -3034458 -6621990 -12581845 -19466073 -21289665 -13136250 2067163 15358848
10685 15358848 20003420 16544662 10271268 5234145 1360189 -2990637 -7051082 -7887156
10677 -7887156 -4277374 1800705 7665187 11355888 10621061 4572584 -2428443 -3266847
$$ packed form
10733a3269835k772271L819711N258471m10665n957669k797368Q101764J5607019
10725G579157J0966322n84935n582916k08307M416455j212391j0250105r527055
10717d403775L60467N841711N90355o065128l996775L666177O793143K299368
10709E085543l988909n992755l054101J236467K848023J187156K4535K251012
10701d03029M278318L53630p415207r730245k905741N377088O682656K296682
10693a465848j568610l587532n959855o884228j823592Q153415J5203413J3291685
10685A5358848M644572l458758o273394n037123l873956m350826m060445q36074
10677g887156L609782O078079N864482L690701p34827o048477p001027q38404
$$ plain form
10669 -3266847 2846368 8136121 6243802 -204843 -5827911 -10884495 -17674152 -23192759
10661 -23192759 -22569520 -16947888 -11291006 -7095153 -3790343 -3796900 -8241458 -10910681 -5673804
10652 -5673804 2655817 5098884 3980953 9314549 19796524 21264005 7805398 -8295850
10644 -8295850 -13844603 -11207635 -10303643 -13360848 -15859047 -15447600 -11757154 -3070746
10636 -3070746 8996641 16195942 12518445 2849521 -3651714 -5307341 -6891517 -10258612
10628 -10258612 -12691137 -12842682 -12716913 -14246768 -17056370 -18433811 -14475102 -4739210
10620 -4739210 3547776 1750396 -7889836 -13184402 -8147881 -403362 1710468 639482
10612 639482 1740696 2387037 -2030907 -7390780 -5843601 2147864 9203780 11553706
$$ packed form
10669c266847O113215N289753j892319o448645n623068n056584o789657n518607
10661b3192759O23239N621632N656882M195853L304810o557m444558k669223N236877
10652e673804Q329621K443067j117931N333596J0481975J467481j3458607j6101248
10644h295850n548753K636968R03992l057205k498199M11447L690446Q686408
10636c070746J2067387P199301l677497r668924o501235j655627j584176l367095
10628a0258612k432525j51545J25769j529855k809602j377441L958709R735892
10620d739210Q286986j797380r640232n294566N036521P744519K113830j070986
10612F39482J101214O46341m417944n359873J547179P991465P055916K349926
$$ plain form
10604 11553706 10930081 9027044 6820528 6311453 7019496 4693969 -890827 -2331311
10596 -2331311 4609485 12762595 13893086 10835365 10318368 10384573 5809548 63404 -539662
10587 -539662 126644 -5796561 -14476455 -15240650 -9093728 -7429460 -12529862 -14649069 -10162575
10578 -10162575 -7238194 -9544441 -9098172 -1584724 4400127 1409056 -4557413 -4646265
10570 -4646265 -1200372 -1964302 -6798163 -9212060 -6901073 -2796103 1654742 7309855
10562 7309855 12674730 13974010 10131543 4464616 898700 -249492 -2276165 -7298512
10554 -7298512 -11754651 -9860818 -2955671 -493790 -7729468 -17274916 -18568862 -11228836
10546 -11228836 -2443459 4056152 8171395 6954043 -2155705 -14008638 -20880108 -22792197
$$ packed form
10604A1553706o23625j903037k206516n09075P08043k325527n584796j440484
10596b331311O940796Q153110J130491l057721n16997O6205m575025n746144o03066
10587e39662O66306n923205q679894p64195O146922J664268n100402k119207M486494
10578a0162575K924381k306247M46269P513448N984851k991071n966469q8852
10570d646265L445893p63930m833861k413897K310987M104970M450845N655113
10562G309855N364875J299280l842467n666927l565916j148192k026673n022347
10554g298512m456139J893833O905147K461881p235678r545448j293946P340026
10546a1228836Q785377O499611M115243j217352r109748j1852933o871470j912089
$$ plain form
10538 -22792197 -24232189 -24133486 -19101739 -13168034 -13183108 -17186965 -18529218 -18447502 -22480156
10529 -22480156 -27625587 -26307315 -20238062 -16603634 -13904341 -6904055 -2042603 -10124492
10521 -10124492 -25653328 -32174308 -27350279 -23596705 -24565973 -21755309 -14713689 -12772240
10513 -12772240 -15549898 -14112071 -12093443 -21014422 -33958361 -31904951 -18280859 -16098109
10505 -16098109 -27072021 -28563320 -17525298 -18161417 -35037418 -41347720 -29605538 -27905184
10497 -27905184 -44679357 -47940324 -28101592 -25683775 -57035546 -73414285 -49640149
10490 -49640149 -48360281 -112456573 -148557702 -33533607 182570425 305076835 243429704
10483 243429704 116396327 68487542 89904511 88569876 51029616 34529202 50151839
$$ packed form
10538b2792197j439992R8703N031747N933705j5074m003857j342253Q1716m032654
10529b2480156n145431J318272O069253L634428K699293P000286M861452q081889
10521a0124492j5528836o520980M824029L753574r69268K810664P041620J941449
10513a2772240k777658J437827K018628q920979j2943939K053410J3624092K182750
10505a6098109j0973912j491299J1038022o36119j6876001o310302J1742182J700354
10497b7905184j6774173l260967J9838732K417817l1351771j6378739K3774136
10490d9640149J279868o4096292l6101129J15024095K16104032J22506410o1647131
10483B43429704j27033377m7908785K1416969j334635l7540260j6500414J5622637
$$ plain form
10476 50151839 52387891 27605498 10933989 17265970 22580859 17823476 23571109 42500066
10468 42500066 47485241 29599272 15352073 21666586 30102225 21706704 6697381 2589446
10460 2589446 7480403 11086203 12748057 14547150 12508714 6188185 3649575 8267212
10452 8267212 12699301 11741244 8684263 5157519 -1318408 -6283760 -324016 13619584
10444 13619584 20738137 17081441 15361916 21928676 25289863 16760045 6443687 6938236
10436 6938236 14462163 18551133 19036937 20202067 17556621 4883807 -11219692 -17103802
10428 -17103802 -9684786 2017380 10464137 15430479 18135649 18163307 15905494 11968308
10420 11968308 5335622 -2717086 -5438524 2178586 14324463 18953464 11697204 289682
$$ packed form
10476E0151839K236052k4782393j6671509O331981N314889m757383N747633J8928957
10468D2500066M985175j7885969j4247199O314513Q435639q395521j5009323m107935
10460B589446M890957L605800J661854J799093k038436o320529k538610M617637
10452H267212M432089r58057l056981l526744o475927m965352N959744J3943600
10444A3619584P118553l656696j719525O566760L361187q529818j0316358M94549
10436F938236P523927M088970M85804J165130k645446j2672814j6103499n884110
10428a7103802P419016J1702166Q446757M966342K705170K7658k257813l937186
10420A1968308o632686q052708k721438P617110J2145877M629001p256260j1407522
$$ plain form
10412 289682 -5339608 -3324465 516260 119195 -4987265 -9774916 -9049627 -2936741 3794928
10403 3794928 7947661 11132122 15538670 18924548 16583860 7694275 -2482602 -7318853
10395 -7318853 -5118777 -302543 1868543 1227478 2003660 6361474 11282162 12868106
10387 12868106 10688390 6197257 593991 -3211890 -1142716 5469411 8861562 6046160
10379 6046160 5389073 13468431 20582642 12065250 -7407329 -15602763 -2587902 14845775
10371 14845775 16262382 3725004 -5606446 -4416479 175361 2605029 5776045 11418067
10363 11418067 15076556 14357332 13696892 16431538 18676639 16235875 12435862 12817435
10355 12817435 15117566 11576850 1002764 -7842885 -7024882 1084319 8109758 9723612
$$ packed form
10412B89682n629290K015143L840725l97065n106460m787651P25289O112886O731669
10403C794928M152733L184461M406548L385878k340688q889585j0176877m836251
10395g318853K200076M816234K171086o41065P76182M357814M920688J585944
10387A2868106k179716m491133n603266l805881K069174O612127L392151k815402
10379F046160o57087Q079358P114211q517392j9472579q195434J3014861J7433677
10371A4845775J416607j2537378r331450J189967M591840K429668L171016N642022
10363A1418067L658489p19224o60440K734646K245101k440764l800013L81573
10355A2817435K300131l540716j0574086q845649Q18003Q109201P025439J613854
$$ plain form
10347 9723612 7484414 3729175 190195 476134 7513440 17344024 21294302 16862616
10339 16862616 11196195 10311054 10205580 4118340 -5513132 -9446209 -4485877 2749413
10331 2749413 5229124 3189741 1378468 3079408 8305009 14700655 19144074 20585109
10323 20585109 21074316 21701581 19024621 9383812 -4171382 -13708928 -15078703 -10765473
10315 -10765473 -4524105 2112930 7736780 10505961 11221886 13101417 16977365 19696162
10307 19696162 18123149 12100670 3573399 -4059363 -6392751 -1964829 4366344 5979622
10299 5979622 2090655 -3029010 -6785897 -8729020 -6028459 3736685 14986894 17473971
10291 17473971 9224977 -1036552 -6243379 -7853565 -8002334 -4171787 3253708 6766847
$$ packed form
10347I723612k239198l755239l538980K85939P037306R830584L950278m431686
10339A6862616n666421q85141j05474o087240r631472l933077M960332P235290
10331B749413K479711k039383j811273J700940N225601O395646M443419J441035
10323B0585109M89207O27265k676960r640809j3555194r537546j369775M313230
10315a0765473O241368O637035N623850K769181P15925J879531L875948K718797
10307A9696162j573013o022479q527271p632762k333388M427922O331173J613278
10299E979622l888967n119665l756887j943123K700561R765144J1250209K487077
10291A7473971q248994j0261529n206827j610186j48769L830547P425495L513139
$$ plain form
10283 6766847 2092309 -4082625 -4025911 -450508 -172940 -1941742 195427 5553567 8679589
10274 8679589 9874463 13646939 17753232 14278179 2859263 -6649500 -7467089 -3849410
10266 -3849410 -2522730 -3335857 -2558482 358620 3636157 6146233 5878672 170868 -8546788
10257 -8546788 -12045948 -6365034 1486756 2522001 -2160400 -5136385 -5624000 -9569157
10249 -9569157 -16479880 -16181525 -3718554 10022260 10446614 -1694377 -11527833 -9234724
10241 -9234724 77596 6773668 8850928 9625788 9849615 8458186 7223344 7910821 7017025
10232 7017025 270857 -8445534 -9973579 -2795545 3658241 1289015 -6784211 -12231515
10224 -12231515 -12613063 -11801475 -12496232 -13364526 -12509432 -9840067 -6201611 -2795340 -1269228
$$ packed form
10283F766847m674538o174934N6714L575403K77568j768802K137169N358140L126022
10274H679589J194874L772476M106293l475053j1418916r508763q17589L617679
10266c849410J326680q13127P77375K917102L277537K510076k67561n707804q717656
10257h546788l499160N680914P851790J035245m682401k975985m87615l945157
10249i569157o910723K98355J2462971J3740814M24354j2140991r833456K293109
10241i234724R312320O696072K077260P74860K23827j391429j234842O87477q93796
10232G017025o746168q716391j528045P178034O453786k369226q073226n447304
10224a2231515l81548Q11588o94757q68294Q55094K669365L638456L406271J526112
$$ plain form
10215 -1269228 -2544698 -5733312 -8964125 -10353929 -8117135 -2079686 4359550 6889574
10207 6889574 6089038 6976678 11006402 12907449 8777575 2934579 1689662 3733340
10199 3733340 3113407 -127085 243508 5709182 9322794 6266536 2276788 6124210
10191 6124210 16707362 23656452 20726739 13286771 10094491 11512730 10559256 4438147
10183 4438147 -948349 -544906 903756 -4568456 -14764795 -18141037 -9652955 1117058
10175 1117058 2253223 -4964675 -9115960 -4905715 650156 -666806 -6718022 -8372862
10167 -8372862 -2055507 5253642 4540576 -4091475 -11506903 -10634901 -4142450 1090273
10159 1090273 3850649 8049568 13575575 14019112 5469977 -7096011 -14856738 -13298458
$$ packed form
10215a269228j275470l188614l230813j389804K236794O037449O439236K530024
10207F889574q00536Q87640M029724J901047m129874n842996j244917K043678
10199C733340o19933l240492L70593N465674L613612l056258l989748L847422
10191F124210J0583152O949090k929713p439968l192280J418239r53474o121109
10183D438147n386496M03443J448662n472212j0196339l376242Q488082J0770013
10175A117058J136165p217898m151285M210245N555871j316962o051216j654840
10167h372862O317355P309149p13066q632051p415428Q72002O492451N232723
10159A090273K760376M198919N526007M43537q549135j2565988p760727J558280
$$ plain form
10151 -13298458 -3784397 8744566 17214050 15911304 6190206 -3997869 -8598850 -8411953
10143 -8411953 -6413548 -3624223 -2413449 -7453623 -18099281 -25112227 -21249876 -11064266
10135 -11064266 -4036451 -1998820 -199324 2846522 4440751 4247496 4041421 2546502
10127 2546502 -2178938 -6774547 -6408807 -3267485 -3824251 -8859359 -13514136 -15606434
10119 -15606434 -16000522 -12888730 -5058896 966863 -2177350 -9634610 -10055125 -4246725
10111 -4246725 -4407202 -12976067 -17605229 -12265760 -7733179 -12390027 -17155786 -11562047
10103 -11562047 -2571859 -2726960 -8510229 -6615227 3343305 8345091 2632639 -5357504
10095 -5357504 -7415251 -4866155 -1871600 275695 170446 -3711098 -8366535 -9068864
$$ packed form
10151a3298458R514061J2528963Q469484j302746r721098j0188075m600981J86897
10143h411953J998405K789325J210774n040174j0645658p012946L862351J0185610
10135a1064266P027815K037631J799496L045846J594229j93255k06075j494919
10127B546502m725440m595609L65740L141322n56766n035108m654777k092298
10119a5606434l94088L111792P829834O025759l144213p457260m20515N808400
10111d246725j60477q568865m629162N339469M532581m656848m765759N593739
10103a1562047Q990188j55101n783269J895002R958532N001786n712452p990143
10095e357504k057747K549096K994555K147295j05249l881544m655437p02329
$$ plain form
10087 -9068864 -7278676 -8050876 -9771042 -5559340 4234287 10430076 8295890 3821507
10079 3821507 3813737 7616963 11709897 14852342 15293808 10313047 2347060 -1295656 1530565
10070 1530565 4867721 4929317 5303058 7670110 6228068 -2117185 -10041458 -10209991 -6470874
10061 -6470874 -5982580 -6713438 -3210662 535261 -3401907 -11025813 -9616190 2226046
10053 2226046 10721186 7192451 609699 2939558 11241898 13676159 7673446 2048643
10045 2048643 2808762 5886523 5282834 1727808 349189 3722959 9963732 15354363
10037 15354363 16789715 13424675 8001952 5523159 8604855 14250733 16563315 12887354
10029 12887354 6492119 2942356 4299519 7111399 5882765 -1441529 -11035884 -16154204
$$ packed form
10087i068864J790188p72200j720166M211702R793627O195789k134186m474383
10079C821507p770L803226M092934L142445M41466m980761p965987l642716K826221
10070A530565L337156O1596L73741K367052j442042q345253p924273j68533L739117
10061f470874M88294p30858L502776L745923l937168p623906J409623J1842236
10053B226046Q495140l528735o582752K329859Q302340K434261o002713n624803
10045B048643P60119L077761o03689l555026j378619L373770O240773N390631
10037A5354363J435352l365040n422723k478793L081696N645878K312582l675961
10029A2887354o395235l549763J357163K811880j228634p324294r594355n118320
$$ plain form
10021 -16154204 -13011503 -4082107 4384671 7752386 5601314 151975 -5703876 -8646668
10013 -8646668 -6111622 619806 6251432 6846580 4039475 1342963 -1661442 -6894397
10005 -6894397 -10814466 -6800856 3649135 9352993 4277072 -1983586 3444368 17388574
9997 17388574 23861736 16832638 8757410 11593452 19081882 17215329 6180158 -273870
9989 -273870 3736805 7926974 2926787 -4923819 -3768428 5922002 13600702 15081963
9981 15081963 15971108 18897021 18067495 10051470 1175638 -1385309 734308 2398298
9973 2398298 4102867 8462609 12207856 10534369 6878488 8797394 14561425 13892375
9965 13892375 4360422 -2357160 4284840 19146237 28163050 24973650 14846546 5321113
$$ packed form
10021a6154204L142701Q929396Q466778L367715k151072n449339n855851k942792
10013h646668K535046O731428N631626N95148k807105k696512l004405n232955
10005f894397l920069M013610J0449991N703858n075921o260658N427954J3944206
9997A7388574O473162p029098q075228K836042P488430j866553j1035171o454028
9989b73870M010675M190169n000187p850606J155391R690430P678700J481261
9981A5081963Q89145K925913q29526q016025q875832k560947K119617J663990
9973B398298J704569M359742L745247j673487l655881J918906N764031o69050
9965A3892375r531953o717582O642000J4861397R016813l189400j0127104r525433
$$ plain form
9957 5321113 -914792 -4954733 -8394998 -11482464 -12342165 -8850625 -2403349 2517521
9949 2517521 3817106 3538609 2687459 -924588 -6704438 -8441318 -2425050 5752901 7986332
9940 7986332 3626930 -2980335 -10796509 -20412111 -27121753 -24682822 -15404553 -8159545
9932 -8159545 -6023133 -3874046 1130488 5567920 8432721 14747217 25786517 32952842
9924 32952842 27379678 11147145 -5683411 -15218477 -15391617 -8529460 -853999 1006609
9916 1006609 -2162031 -1799150 6275262 13851625 10627347 -992163 -8432318 -4521791
9908 -4521791 6156898 15657252 20777874 22194536 21317876 19937944 19267634 18105888
9900 18105888 14787164 10991376 10066734 11397208 10530051 5970969 1947282 2420757 5526912
$$ packed form
9957E321113o235905m039941l440265l087466q59701L491540O447276M920870
9949B517521J299585k78497q51150l612047n779850j736880O016268Q177951K233431
9940G986332m359402o607265p816174r615602o709642K438931R278269P245008
9932h159545K136412K149087N004534M437432K864801O314496J1039300P166325
9924C2952842n573164j6232533j6830556r535066j73140O862157P675461J860608
9916A006609l168640L62881Q074412P576363l224278j1619510p440155L910527
9908d521791J0678689R500354N120622J416662q76660j379932o70310j161746
9900A8105888l318724l795788r24642J330474q67157m559082m023687M73475L106155
$$ plain form
9891 5526912 6622038 4652728 2277203 478111 -3312378 -10180764 -15447258 -13226151
9883 -13226151 -5380675 -1543763 -7319904 -16138456 -17790110 -12284375 -8092798 -7714011
9875 -7714011 -4251068 5504371 14231718 15613183 13981046 14808492 13302584 2930778
9867 2930778 -9929763 -12279970 -3996355 956271 -5725077 -16258198 -19232968 -13319972
9859 -13319972 -4179150 4434175 10690959 11404323 5009800 -4504396 -10723504 -10672588 -6141359
9850 -6141359 -1465803 -573903 -3128653 -3514494 2517065 10659840 12581006 7286684 1740555
9841 1740555 19175 -789836 -2853735 -4050840 -4388115 -7079915 -9700266 -3870452 10537916
9832 10537916 20277717 15744572 5091662 2067500 6559832 7933473 2783860 -2219856
$$ packed form
9891E526912J095126j969310k375525j799092l790489o868386n266494K221107
9883a3226151P845476L836912n776141q818552j651654N505735M191577L78787
9875g714011L462943R755439Q727347J381465j632137Q27446j505908j0371806
9867B930778j2860541k350207Q283615M952626o681348j0533121k974770N912996
9859a3319972R140822Q613325O256784P13364o394523r514196o219108N0916M531229
9850f141359M675556Q91900k554750l85841O031559Q142775J921166n294322n546129
9841A740555j721380q09011k063899j197105l37275k691800k620351N829814J4408368
9832A0537916R739801m533145j0652910l024162M492332J373641n149613n003716
$$ plain form
9824 -2219856 -2677806 -671336 2205201 5814442 6163070 -629177 -8992934 -9002113 -1782960
9815 -1782960 1034940 -4417225 -8059017 -2897869 2723005 -1800091 -12062094 -14478147
9807 -14478147 -5317075 5398653 7902619 3082127 -1720857 -1787892 1688881 4353331
9799 4353331 3477265 847303 213046 1582692 897745 -2980274 -4683247 477053 8396660
9790 8396660 10281739 4079569 -3248062 -5787412 -6367571 -11235379 -19975076 -25198078
9782 -25198078 -22330327 -15636231 -11970273 -11344401 -8313456 -1988584 1615818 -104419
9774 -104419 167789 9579134 22317464 25307555 16034735 5913630 3836098 5007315
9766 5007315 1259686 -4841633 -4459154 2562241 6255076 546164 -8566839 -11683092
$$ packed form
9824b219856m57950K006470K876537L609241L48628o792247q363757r179P219153
9815a782960K817900n452165l641792N161148N620874m523096j0262003k416053
9807a4478147R161072J0715728K503966m820492m802984o7035L476773K664450
9799D353331q76066k629962o34257J369646o84947l878019j702973N160300P919607
9790H396660J885079o202170p327631k539350n80159m867808q739697n223002
9782b5198078K867751O694096L665958O25872L030945O324872L604402j720237
9774a04419K72208R411345J2738330K990091r272820j0121105k077532J171217
9766E007315l747629o101319L82479P021395L692835n708912r113003l116253
$$ plain form
9758 -11683092 -7742524 -2953443 -833691 1537124 6920615 11944685 11082267 4855721
9750 4855721 -296253 -1034122 -1576876 -6281368 -11613843 -10613872 -3498248 2014035 1049125
9741 1049125 -3088722 -4990379 -3714150 -1622137 -874188 -2832824 -7095903 -9645253
9733 -9645253 -6083952 1752854 6783753 5707682 2031756 -1349979 -5984394 -11226613
9725 -11226613 -11148697 -3586541 3984605 4225030 136123 -1862344 -3678814 -10821983 -19489368
9716 -19489368 -19517233 -9881206 -815513 1097184 333224 2043271 3495466 971622 -2292602
9707 -2292602 -1620235 681343 -827172 -5247780 -6032482 -425982 6587628 8152680 2326894
9698 2326894 -7180710 -14737169 -16917507 -14570172 -11512890 -10863644 -12474769 -13615085
$$ packed form
9758a1683092L940568M789081K119752K370815N383491N024070q62418o226546
9750D855721n151974p37869n42754m704492n332475R99971P115624N512283r64910
9741A049125m137847j901657J276229K092013P47949j958636m263079k549350
9733i645253L561301P836806N030899j076071l675926l381735m634415n242219
9725a1226613P7916P562156P571146K40425m088907j998467j816470p143169q667385
9716a9489368k7865R636027R065693J912697p63960J710047J452195k523844l264224
9707b292602O72367K301578j508515m420608p84702N606500P013610J565052n825786
9698B326894r507604p556459k180338K347335L057282O49246j611125j140316
$$ plain form
9690 -13615085 -11773397 -7381540 -4193324 -5498502 -8958033 -7628149 1351101 11370767
9682 11370767 13400607 6877309 -791772 -4586439 -6563898 -9937987 -13672467 -14740375
9674 -14740375 -12072569 -6872391 -2136043 -2440783 -10438284 -22533572 -31377873 -33200150
9666 -33200150 -29390236 -21572808 -10484348 -57649 3785716 788310 -2363222 -836656
9658 -836656 2837404 3905753 1094418 -4439724 -10133324 -10317202 -580517 13230351
9650 13230351 18064739 10061373 126754 -2119528 -1117823 -4156259 -6204404 1988362
9642 1988362 15838747 20545297 11904577 1359275 -1235670 819747 51642 -3465202
9634 -3465202 -4164973 788679 9054290 15246909 14026769 4990957 -5045250 -8989576
$$ packed form
9690a3615085J841688M391857L188216j305178l459531J329884Q979250J0019666
9682A1370767K029840o523298p669081l794667j977459l374089l734480j067908
9674a4740375K667806N200178M736348l04740p997501j2095288q844301j822277
9666c3200150L809914P817428J1088460J0426699L843365k997406l151532J526566
9658h36656L674060J068349k811335n534142n693600j83878R736685J3810868
9650A3230351M834388q003366r934619k246282J001705l038436k048145Q192766
9642A988362J3850385M706550q640720j0545302k594945K055417p68105l516844
9634c465202o99771M953652Q265611O192619j220140r035812j0036207l944326
$$ plain form
9626 -8989576 -8215042 -8997416 -11377576 -9275007 -2103756 2630026 1275615 344826 6029320
9617 6029320 14008412 15528182 9245918 1786499 -534631 3246194 8949584 9583624
9609 9583624 1112951 -11251355 -16626918 -11365067 -3870366 -3087337 -7378953 -9847847
9601 -9847847 -9908468 -12665036 -19125860 -23727422 -21590709 -13886334 -6108494 -3767321 -8348341
9592 -8348341 -14775685 -14912843 -6405455 4446185 11178854 14425429 16718435 15126136
9584 15126136 6110454 -5445036 -10404371 -7890433 -5860729 -8753849 -12208898 -11805960
9576 -11805960 -9646222 -8923238 -8414450 -6926574 -8018857 -14674875 -22481035 -23762924
9568 -23762924 -17199710 -8811930 -4315312 -4700673 -8714073 -14813555 -19601731 -18638848
$$ packed form
9626h989576P74534p82374k380160K102569P171251M733782j354411r30789N684494
9617F029320P979092J519770o282264p459419k321130L780825N703390O34040
9609I583624q470673j2364306n375563N261851P494701P83029m291616k468894
9601i847847o0621k756568o460824m601562K136713P704375P777840K341173m581020
9592h348341o427344j37158Q507388J0851640O732669L246575K293006j592299
9584A5126136r015682j1555490m959335K513938K029704k893120l455049M02938
9576a1805960K159738P22984N08788J487876j092283o656018p806160j281889
9568b3762924O563214Q387780M496618l85361m013400o099482m788176R62883
$$ plain form
9560 -18638848 -11489987 -3403021 744750 2372809 6084672 11853593 14252835 10071046
9552 10071046 3069366 -822911 -295072 1897091 3891320 5657876 6376474 4742604
9544 4742604 1620516 -903566 -2666779 -4054288 -2328708 5416013 15105478 17637258
9536 17637258 10726968 3284942 3764701 8909035 9816303 5766036 4673371 10278553
9528 10278553 15976369 13898883 5299583 -1883387 -3358095 -2303608 -2979076 -4203937
9520 -4203937 -1794648 4174704 8627559 8924399 8876620 12224225 15660903 13071303 4133952
9511 4133952 -6587516 -16242895 -22434593 -18637771 -1547511 17641615 22115374 12358119
9503 12358119 6718336 13560424 17716901 5130602 -13080106 -16950866 -7787244 -3003814
$$ packed form
9560a8638848P148861Q086966M147771J628059L711863N768921K399242m181789
9552A0071046p001680l892277N27839K192163J994229J766556P18598j633870
9544D742604l122088k524082j763213j387509J725580P744721R689465K531780
9536A7637258o910290p442026M79759N144334R07268m050267j092665N605182
9528A0278553N697816k077486q599300p182970j474708J054487o75468j224861
9520d203937K409289N969352M452855K96840m7779L347605L436678k589600q937351
9511D133952j0721468r655379o191698L796822J7090260J9189126M473759r757255
9503A2358119n639783O842088M156477j2586299j8210708l870760R163622M783430
$$ plain form
9495 -3003814 -6606253 -5636547 4188223 9702533 2148166 -9378420 -13726348 -12667406
9487 -12667406 -11879427 -9700906 -4435858 -2040162 -5920611 -7736417 645092 12743553
9479 12743553 15990684 9614985 3262236 1511842 720051 -591923 982484 5408174
9471 5408174 7092274 3057472 -3306244 -8087707 -10762119 -11128284 -8024889 -3166150
9463 -3166150 -1633288 -5919424 -12475471 -16215337 -16178989 -15021254 -14683308 -14462594 -12833728
9454 -12833728 -9854590 -7106396 -5180143 -2138690 4131859 12324772 18174314 18580601
9446 18580601 13851308 6486238 -178698 -3137604 -2572670 -2728854 -6522035 -10554647
9438 -10554647 -10022309 -7097916 -8101046 -12881068 -14773489 -12165293 -11597396 -16390949
$$ packed form
9495c003814l602439R69706R824770N514310p554367j1526586m347928J058942
9487a2667406P87979K178521N265048K395696l880449j815806Q381509J2098461
9479A2743553L247131o375699o352749j750394p91791j311974J574407M425690
9471E408174J684100m034802o363716m781463k674412l66165L103395M858739
9463c166150J532862m286136o556047l739866L6348J157735L37946K20714J628866
9454a2833728K979138K748194J926253L041453O270549Q192913N849542M06287
9446A8580601m729293p365070o664936k958906N64934j56184l793181m032612
9438a0554647N32338K924393j003130m780022j892421K608196N67897m793553
$$ plain form
9430 -16390949 -20564405 -18736856 -14554141 -13619085 -14639224 -13581659 -10540343 -6347099
9422 -6347099 1453025 12342018 18584134 15213439 9087802 9495141 14319833 14745099
9414 14745099 9866457 6445815 6375281 4853733 760915 -789832 2551710 6733095
9406 6733095 8016055 6876806 4590897 1943635 1361550 4281390 6636296 3092197
9398 3092197 -4524964 -9077115 -7865817 -4583581 -2551707 -2344769 -4789821 -9270043
9390 -9270043 -10240343 -3012823 7801234 13182504 11900971 9774065 8356683 4027165
9382 4027165 -2372506 -5622048 -6339833 -10179022 -15503230 -13496299 -3438922 3704465
9374 3704465 1233869 -4712940 -7439696 -9490641 -13832675 -15663630 -10830096 -3835159
$$ packed form
9430a6390949m173456J827549M182715R35056j020139J057565L041316M193244
9422f347099P800124J0888993O242116l370695o125637M07339M824692M25266
9414A4745099m878642l420642p0534j521548m092818j550747L341542M181385
9406F733095J282960j139249k285909k647262n82085K919840K354906l544099
9398C092197p617161m552151J211298L282236K031874K06938k445052m480222
9390i270043r70300P227520J0814057N381270j281533k126906j417382m329518
9382D027165o399671l249542p17785l839189n324208K006931J0057377P143387
9374C704465k470596n946809k726756k050945m342034j830955M833534O994937
$$ plain form
9366 -3835159 -2849 2342754 4986756 3999686 -1242278 -2373295 4858758 10171526
9358 10171526 2874124 -10375996 -14571615 -8345699 -3632059 -5621915 -6441666 162148
9350 162148 9145838 12172330 7302152 -1727560 -9821609 -12779465 -10334038 -7345492
9342 -7345492 -7890319 -9766450 -9398986 -8684273 -10420623 -11033733 -6802568 -3811095 -10159042
9333 -10159042 -19644614 -16665315 352608 13688833 10036966 -2214293 -7147756 -2573156
9325 -2573156 2939526 6253606 10345556 12755401 6532687 -6548626 -14727921 -11440233
9317 -11440233 -3184987 1643798 3708116 6621752 6997635 -288481 -10279963 -11539077
9309 -11539077 -2127699 7118036 8034075 5139423 4988985 3784987 -5369395 -17982704
$$ packed form
9366c835159L832310K345603K644002r87070n241964j131017P232053N312768
9358A0171526p297402j3250120m195619O225916M713640j989856q19751O603814
9350A62148Q983690L026492m870178r029712q094049k957856K445427K988546
9342g345492n44827j876131L67464P14713j736350o13110M231165K991473o347947
9333a0159042r485572K979299J7017923J3336225l651867j2251259m933463M574600
9325b573156N512682L314080M091950K409845o222714j3081313q179295L287688
9317a1440233Q255246M828785K064318K913636L75883p286116r991482j259114
9309a1539077R411378R245735R16039k894652j50438j203998r154382j2613309
$$ plain form
9301 -17982704 -21872172 -14180101 -4483146 -48323 2078625 5402910 5987400 -198221
9293 -198221 -8829212 -12255025 -8507120 -828773 7035165 10910184 6950574 -2502804
9285 -2502804 -8457250 -5790671 52413 1578808 -588885 -1561326 -1038659 -1654895 -2547700
9276 -2547700 -1114883 2374807 7629696 16945991 28288382 31407849 19965175 3497268
9268 3497268 -2502895 4079856 11956066 13405730 11248498 10170785 11353492 15730996
9260 15730996 22975868 26749777 20180205 6970139 -1486761 -689901 3512842 5764979
9252 5764979 6156840 4359132 -910709 -5583449 -3698599 1589037 1121821 -4886434 -6536823
9243 -6536823 -1518462 639799 -3998889 -5743246 2331367 12353621 14370364 9927636
$$ packed form
9301a7982704l889468P692071R696955M434823K126948L324285N84490o185621
9293a98221q630991l425813L747905P678347P863938L875019l959610r453378
9285b502804n954446K666579N843084J526395k167693r72441N22667o16236q92805
9276b547700J432817L489690N254889R316295J1342391L119467j1442674j6467907
9268C497268o000163O582751P876210J449664k157232j077713J182707M377504
9260A5730996P244872L773909o569572j3210066q456900P96860M202743K252137
9252E764979L91861j797708n269841m672740J884850N287636m67216o008255j650389
9243f536823N018361K158261m638688j744357Q074613J0022254K016743m442728
$$ plain form
9235 9927636 4138254 -4730847 -17243485 -24360881 -19093435 -8964915 -5274703 -6869393
9227 -6869393 -6183526 -4307439 -6677572 -9346487 -4207257 4951017 5848711 -3446436 -11714366
9218 -11714366 -10794738 -3469160 4510666 9222040 6132078 -5069665 -13110235 -5464510
9210 -5464510 12333849 20605034 11621307 -1234774 -4683855 -2288958 -2759984 -4333554
9202 -4333554 -1673095 958248 -4058558 -13143512 -14748787 -5654099 5051873 8180785
9194 8180785 3629585 -3096977 -8011384 -10825446 -12756120 -12987666 -7624092 5008767
9186 5008767 17850423 19520121 8126040 -4920616 -9249040 -8157063 -10871817 -17254465
9178 -17254465 -18812351 -12885126 -6851615 -6971586 -10008450 -8736509 -1339442 7359737
$$ packed form
9235I927636n789382q869101j2512638p117396N267446J0128520L690212j594690
9227f869393O85867J876087k370133k668915N139230R158274Q97694r295147q267930
9218a1714366R19628P325578P979826M711374l089962j1201743q040570P645725
9210e464510J7798359Q271185q983727j2856081l449081K394897m71026j573570
9202d333554K660459K631343n016806r084954j605275R094688J0705972L128912
9194H180785m551200o726562m914407k814062j930674k31546N363574J2632859
9186E008767J2841656J669698j1394081j3046656m328424J091977k714754o382648
9178a7254465j557886N927225O033511j19971l036864J271941P397067Q699179
$$ plain form
9170 7359737 11586782 9916624 6188224 5241634 6769395 5056557 -3166661 -13028264
9162 -13028264 -16912949 -13253814 -6012091 2003232 9791899 13957226 10773902 2919131
9154 2919131 -1976254 -760529 2475869 3864063 4149410 4296462 2963560 630954 137423
9145 137423 469938 -3342100 -10573570 -12372657 -4569833 3916461 2940760 -4235382 -7070684
9136 -7070684 -4344180 -4289475 -9795177 -14067208 -12069851 -6977376 -2962466 260984 2917224
9127 2917224 2795798 731932 1370057 4687021 3709940 -4577269 -12463109 -11441994 -3846251
9118 -3846251 1417579 739625 -2335949 -3730550 -1752003 3690294 9462631 9351465 889152
9109 889152 -10132145 -16197645 -16380909 -14300322 -11867156 -10008729 -11270340 -15713475
$$ packed form
9170G359737M227045j670158l728400r46590J527761j712838q223218r861603
9162a3028264l884685L659135P241723Q015323P788667M165327l183324p854771
9154B919131m895385J215725L236398J388194K85347J47052j332902k332606m93531
9145A37423L32515l812038p231470j799087P802824Q486294r75701p176142k835302
9136g070684K726504N4705n505702m272031J997357N092475M014910L223450K656240
9127B917224j21426k063866O38125L316964r77081q287209p885840J021115P595743
9118c846251N263830o77954l075574j394601J978547N442297N772337j11166q462313
9109H89152j1021297o065500j83264K080587K433166J858427j261611m443135
$$ plain form
9101 -15713475 -18192995 -15780236 -13157654 -13680267 -11172016 -598611 8642913 3500864
9093 3500864 -11226803 -17055524 -8140021 1785048 2301985 565854 5028171 8905510
9085 8905510 1731738 -12051670 -18953794 -15682955 -10737875 -9409849 -8074325 -3371882
9077 -3371882 2078573 5201494 7291824 10493040 13151535 11492615 5040598 -1267634
9069 -1267634 -1814074 2374859 3830404 -999225 -5267827 -1437547 5969462 6309666 -322778
9060 -322778 -3688260 -1475040 -3348842 -12726939 -18150013 -10632168 2344909 9514320
9052 9514320 11367425 12132558 6971979 -8888181 -26051709 -30713891 -23533805 -15328632
9044 -15328632 -9102980 -983284 5207455 939464 -10299086 -14967111 -9399759 -3783397
$$ packed form
9101a5713475k479520K412759K622582n22613K508251J0573405R241524n142049
9093C500864j4727667n828721Q915503R925069N16937j736131M462317L877339
9085H905510p173772j3783408o902124L270839M945080J328026J335524M702443
9077c371882N450455L122921K090330L201216K658495j658920o452017o308232
9069a267634n46440M188933J455545m829629m268602L830280P407009L40204o632444
9060c22778l365482K213220j873802r378097n423074P517845J2977077P169411
9052I514320J853105P65133n160579j5860160j7163528m662182P180086Q205173
9044a5328632O225652Q119696O190739m267991j1238550m668025N567352N616362
$$ plain form
9036 -3783397 -4752437 -7778123 -9209525 -12273646 -17298312 -18313385 -13658370 -8948596
9028 -8948596 -6017594 -255145 7565855 8953595 1918798 -4164871 -3293070 -1181806
9020 -1181806 -3320304 -6041746 -5676398 -5151052 -4704035 1953423 14052362 18698908 9829748
9011 9829748 826642 5776322 17983760 21304110 15122811 12317605 16822055 19248111
9003 19248111 14201698 7674606 5079240 3330708 -1828144 -8885241 -13783974 -14214498
8995 -14214498 -9546565 -1753863 3454781 1540510 -5028745 -10097979 -11355086 -10014066
8987 -10014066 -5945817 642522 5060653 2657347 -3797050 -7650622 -7903896 -8770190
8979 -8770190 -11204673 -11912832 -10146240 -8695324 -8242531 -6916863 -5258252 -5630237 -6891158
$$ packed form
9036c783397r69040l025686j431402l064121n024666j015073M655015M709774
9028h948596K931002N762449P821000J387740p034797o083669Q71801K111264
9020a181806k138498k721442L65348N25346M47017O657458J2098939M646546q869160
9011I829748r003106M949680J2207438L320350o181299k805206M504450K426056
9003A9248111n046413o527092k595366j748532n158852p057097m898733m30524
8995a4214498M667933P792702N208644j914271o569255n069234j257107J341020
8987a0014066M068249O588339M418131k403306o454397l853572k53274q66294
8979h770190k434483p08159J766592J450916M52793J325668J658611l71985j260921
$$ plain form
8970 -6891158 -5497124 -1832251 21238 -1395532 -3859148 -5929133 -7465899 -7082178
8962 -7082178 -4357914 -2652229 -3946041 -3507353 3436829 12604251 16528234 16801771 20281659
8953 20281659 24636558 19874225 5684399 -5065718 -4479035 -398554 -3008361 -9998965
8945 -9998965 -12571344 -9086225 -4734582 -2461132 -1639032 -2462928 -4996474 -6079874 -3136479
8936 -3136479 210668 -2463451 -11463046 -19160677 -17585364 -6022377 8650978 17951230
8928 17951230 18395647 12688870 4888105 -3214219 -9537225 -9714500 -2464721 5982704
8920 5982704 8998368 8933231 12265144 17371935 16443833 9399896 5242951 7105653 6573462
8911 6573462 -2257048 -12658865 -15666227 -12469451 -9283436 -6942910 -3499275 -1200361
$$ packed form
8970f891158J394034L664873J853489j416770k463616k069985j536766L83721
8962g082178K724264J705685j293812M38688O944182R167422L923983K73537L479888
8953B0281659M354899m762333j4189826j0750117N86683M080481k609807o990604
8945i998965k572379L485119M351643K273450Q22100q23896k533546j083400K943395
8936c136479L347147k674119q999595p697631J575313J1562987J4673355R300252
8928A7951230M44417n706777p800765q102324o323006j77275P249779Q447425
8920E982704L015664o5137L331913N106791r28102p043937m156945J862702n32191
8911F573462q830510j0401817l007362L196776L186015K340526L443635K298914
$$ plain form
8903 -1200361 -2316876 -2477061 3283498 11029936 12689545 7978644 3672650 2526387
8895 2526387 715443 -4008556 -8703043 -10663827 -11132091 -12618683 -16036062 -20181848
8887 -20181848 -21367115 -15773542 -5749841 -487675 -5242142 -12965042 -13181586 -6845558
8879 -6845558 -4555898 -10587116 -16908951 -14850187 -5747060 3105829 7709541 8651087
8871 8651087 6555188 529046 -9000591 -17777942 -19463950 -11831099 -1568506 661735
8863 661735 -7513672 -16370126 -16097696 -8791669 -3454301 -2895972 -2699593 -827270 -32485
8854 -32485 -1080092 -1482532 -1663728 -4696445 -8510706 -6236348 2908537 10220648 8580201
8845 8580201 798616 -6383599 -10186960 -9778171 -3318509 7111005 13312362 10492973
$$ packed form
8903a200361j116515j60185N760559P746438J659609m710901m305994j146263
8895B526387j810944m723999m694487j960784m68264j486592l417379m145786
8887b0181848j185267N593573J0023701N262166m754467p722900k16544O336028
8879f845558K289660o031218o321835K058764R103127Q852889M603712R41546
8871H651087k095899o026142r529637q777351j686008P632851J0262593K230241
8863F61735q175407q856454K72430P306027N337368N58329J96379J872323P94785
8854c2485j047607m02440j81196l032717l814261K274358R144885P312111j640447
8845H580201p781585p182215l803361M08789O459662J0429514O201357k819389
$$ plain form
8837 10492973 4789759 4471828 7321227 4564643 -4938511 -12985099 -14367285 -12737890
8829 -12737890 -12287813 -10816064 -4974683 2668042 6518104 5410043 3327004 3705867
8821 3705867 5703802 5884101 2306034 -2792455 -4407910 -224267 5704996 7329800
8813 7329800 4714865 3935846 7496876 9584537 4806445 -2231811 -2337973 4744063 9329909
8804 9329909 5529199 -786772 -1326991 3003524 5477550 4800786 6012451 11088925 15220219
8795 15220219 13582888 6814481 -1484987 -7984561 -9077043 -2619836 6948029 10402574
8787 10402574 4818607 -1472735 12426 5706835 5314979 -3147106 -11218055 -12619983
8779 -12619983 -10391189 -9683147 -10592744 -11689781 -14264997 -17620099 -15192637 -2882628
$$ packed form
8837A0492973n703214l17931K849399k756584r503154q046588j382186J629395
8829a2737890M50077J471749N841381P642725L850062j108061k083039L78863
8821C705867J997935J80299l578067n098489j615455M183643N929263J624804
8813G329800k614935p79019L561030K087661m778092p038256j06162P082036M585846
8804I329909l800710o315971n40219M330515K474026o76764J211665N076474M131294
8795A5220219j637331o768407q299468o499574j092482O457207R567865L454545
8787A0402574n583967o291342J485161N694409l91856q462085q070949j401928
8779a2619983K228794P08042r09597j097037k575216l355102K427462J2310009
$$ plain form
8771 -2882628 10982778 12230511 -1366224 -15663121 -16755210 -6893656 567716 -1726872
8763 -1726872 -8948606 -13354131 -13090834 -10315544 -6134072 -1224884 1693140 352177
8755 352177 -3154120 -4367519 -2011671 1207365 2909752 3118213 1927248 -1579401 -6651451
8746 -6651451 -9560847 -7231962 -1382426 2772894 2252199 -256347 236859 4252611 6471331
8737 6471331 3087551 -1583324 -371401 5659448 8069503 4528514 3148690 8353907
8729 8353907 11067850 2208003 -10797212 -13325460 -5623112 -1517107 -5902953 -8779724
8721 -8779724 -4391601 -769070 -3701707 -5382070 1558844 10538304 12246545 9346364
8713 9346364 8641247 7744620 2243778 -1684749 4083690 13951111 15661946 8934368 3375899
$$ packed form
8771b882628J3865406J247733j3596735j4296897j092089R861554P461372k294588
8763a726872p221734m405525K63297K775290M181472M909188K918024j340963
8755C52177l506297j213399K355848L219036J702387K08461j190965l506649n072050
8746f651451k909396K328885N849536M155320n20695k508546M93206M015752K218720
8737F471331l383780m670875J211923O030849K410055l540989j379824N205217
8729H353907K713943q859847j3005215k528248P702348M106005m385846k876771
8721h779724M388123L622531k932637j680363O940914Q979460J708241k900181
8713I346364p05117q96627n500842l928527N768439R867421J710835o727578n558469
$$ plain form
8704 3375899 1755886 -114808 -315699 6060014 12409636 6716481 -7183996 -12187268
8696 -12187268 -4369964 1448939 -2473054 -4513328 3890194 11491887 5848192 -5758975
8688 -5758975 -8600561 -2682070 1979496 3295353 5318795 5375029 -1701245 -10617321 -11267879
8679 -11267879 -5058977 -2753769 -7628015 -12718310 -13593169 -12304801 -9484834 -3924039
8671 -3924039 251243 -2827235 -9805501 -11605594 -7973651 -6937296 -9141668 -5847267
8663 -5847267 4404083 10318071 4917541 -3325710 -3653299 2477991 8014765 12659917
8655 12659917 19243545 24419273 22892428 16668787 11112046 5279524 -4785474 -15580013
8647 -15580013 -18350478 -11398797 -2055275 3858092 6937113 8010786 5197425 -308869
$$ packed form
8704C375899j620013j870694k00891O375713O349622n693155j3900477n003272
8696a2187268P817304N818903l921993k040274Q403522P601693n643695j1607167
8688e758975k841586N918491M661566J315857K023442N6234p076274q916076o50558
8679a1267879O208902K305208m874246n090295q74859J288368K819967N560795
8671c924039M175282l078478o978266j800093L631943J036355k204372L294401
8663e847267J0251350N913988n400530q243251l27589O131290N536774M645152
8655A2659917O583628N175728j526845o223641n556741n832522j0064998j0794539
8647a5580013k770465O951681R343522N913367L079021J073673k813361n506294
$$ plain form
8639 -308869 -2726380 -49878 1649468 -3038963 -10160846 -11742085 -7034096 -2765033
8631 -2765033 -3131161 -4873448 -3165993 1820692 6334592 8414983 9293604 10208262 9917977
8622 9917977 6360165 525622 -2676189 528681 6692249 7296529 -580228 -8742629
8614 -8742629 -7678732 -133570 1750924 -6414312 -14589823 -12779816 -5241505 -3168023
8606 -3168023 -7927889 -10633338 -6669836 -1218983 603073 200697 -745283 -4715042 -11747938
8597 -11747938 -15289485 -10807304 -3536371 -1246948 -3231419 -3162798 193619 2429596
8589 2429596 1833653 714143 -1208827 -7104045 -15356189 -18483637 -12629864 -2863322
8581 -2863322 4089835 7816389 11291845 13896859 12201365 6206998 790210 858444 6997612
$$ packed form
8639c08869k417511K676502J699346m688431p121883j581239M707989M269063
8631b765033l66128j742287J707455M986685M513900K080391Q78621R14658k90285
8622I917977l557812n834543l201811L204870O163568O04280p876757q162401
8614h742629J063897P545162J884494q165236q175511J810007P538311K073482
8606c168023m759866k705449L963502N450853J822056m02376r45980l969759p032896
8597a1747938l541547M482181P270933K289423j984471O8621L356417K235977
8589B429596n95943j119510j922970n895218q252144l127448N853773R766542
8581b863322O953157L726554L475456K605014j695494n994367n416788O8234O139168
$$ plain form
8572 6997612 15173068 19215636 15314049 6669285 2434037 8489728 19168876 21827362
8564 21827362 11439326 -2267619 -5465583 3366226 11777709 8802791 -1989426 -7950510
8556 -7950510 -3193530 5646573 9180662 6143220 2669845 4015125 9758190 15633591
8548 15633591 17734193 15429789 11389986 8303335 5702908 1863570 -1453610 117899
8540 117899 6465120 10836725 8154814 2529499 2170311 8438210 14482959 14351583 9169017
8531 9169017 3631885 64373 -2380847 -4887160 -7030390 -6961354 -3368984 1878468 3943083
8522 3943083 -109907 -7137653 -10977317 -9486344 -5925648 -3384863 -1406654 503565
8514 503565 -154531 -4798022 -8953336 -6592729 581629 3595075 -1309402 -5649849 -1667
$$ packed form
8572F997612Q175456M042568l901587q644764m235248O055691J0679148K658486
8564B1827362j0388036j3706945l197964Q831809Q411483k974918j0792217n961084
8556g950510M756980Q840103L534089l037442l473375J345280N743065N875401
8548A5633591K100602k304404m039803l086651k600427l839338l317180J571509
8540A17899O347221M371605k681911n625315l59188O267899O044749j31376n182566
8531I169017n537132l567512k445220k506313k143230O9036L592370N247452K064615
8522C943083m052990p027746l839664J490973L560696K540785J978209J910219
8514E03565o58096m643491m155314K360607P174358L013446m904477m340447N648182
$$ plain form
8505 -1667 10831745 12566608 1787274 -8239071 -6513936 586960 1751435 -26234
8497 -26234 6128193 17564853 19303330 8131386 -488810 3850971 9930956 2780482
8489 2780482 -12291525 -16816695 -4864831 11021920 17582752 13742302 6025409 221425
8481 221425 -1130249 679024 1669151 829910 2589608 9121932 14196216 11462339 4971374
8472 4971374 2974477 4431483 1755140 -4746880 -6535068 -1723498 887389 -4096624
8464 -4096624 -10206108 -9305893 -2387654 4644155 9305280 11638944 10569317 6422776
8456 6422776 3159890 3590184 5371293 5299292 4604399 6441545 10343186 12620956 11582322
8447 11582322 10051125 11962086 16411392 16422797 7033269 -5310135 -7665175 1985779
$$ packed form
8505a667J0833412J734863j0779334j0026345J725135P100896J164475j777669
8497b6234O154427J1436660J738477j1171944q620196M339781O079985p150474
8489B780482j5072007m525170J1951864J5886751O560832l840450p716893n803984
8481B21425j351674J809273R90127q39241J759698O532324N074284k733877o490965
8472D971374j996897J457006k676343o502020j788188M811570K610887m984013
8464d096624o109484R00215O918239P031809M661125K333664j069627m146541
8456F422776l262886M30294J781109p2001o94893J837146L901641K277770j038634
8447A1582322j531197J910961M449306J1405r389528j2343404k355040R650954
$$ plain form
8439 1985779 9664498 4091919 -7058214 -9147762 -2209252 1984113 -27770 -941072
8431 -941072 1533458 1963708 741836 4509847 10759069 8112915 -4116540 -13058454
8423 -13058454 -13903698 -16426683 -22727763 -18722679 -298660 11824093 1417231 -15581077
8415 -15581077 -14479561 -94682 3449079 -6864625 -10400071 503872 8784768 3067647
8407 3067647 -4504460 -1317636 4890725 1889812 -5809528 -6988716 -4144332 -7681934
8399 -7681934 -15790012 -15935213 -5241307 4184197 2654845 -4788066 -7939870 -5742222
8391 -5742222 -4623437 -6324959 -4674482 4424723 14916910 16416650 6249714 -8178303
8383 -8178303 -18272628 -21021060 -16711731 -5881082 8155328 18250904 19563172 14643800
$$ packed form
8439A985779P678719n572579j1150133k089548O938510M193365k011883r13302
8431i41072K474530M30250j221872L768011O249222k646154j2229455q941914
8423a3058454q45244k522985o301080M005084J8424019J2122753j0406862j6998308
8415a5581077J101516J4384879L543761j0313704l535446J0903943Q280896n717121
8407C067647p572107L186824O208361l000913p699340j179188K844384l537602
8399g681934q108078j45201J0693906R425504j529352p442911l151804K197648
8391e742222J118785j701522J650477R099205J0492187J499740j0166936j4428017
8383h178303j0094325k748432M309329J0830649J4036410J0095576J312268m919372
$$ plain form
8375 14643800 9447960 6879660 6693473 7967480 8453132 5463505 849499 587084 5727703
8366 5727703 9319403 7049374 4496178 7295365 10667018 7255441 -174533 -3439262
8358 -3439262 -1632612 916171 4698007 11588987 15474605 9429998 -439403 -2433959
8350 -2433959 1245890 -1726017 -10571101 -9967062 4323858 16543884 15400167 10729965
8342 10729965 14918414 22331054 20874436 12750478 8877328 10410843 10098597 6500009
8334 6500009 3375324 -794504 -9339101 -16382404 -12629656 -1207634 4724315 611726
8326 611726 -4637654 -3561463 1095652 4885221 8472385 11777827 10024710 1105866
8318 1105866 -8930900 -12399361 -7996335 321893 7930022 10584555 5893686 -2749588
$$ packed form
8375A4643800n195840k568300j86187J274007M85652k989627m614006k62415N140619
8366E727703L591700k270029k553196K799187L371653l411577p429974l264729
8358c439262J806650K548783L781836O890980L885618o044607r869401j994556
8350b433959L679849k971907q845084O04039J4290920J2220026j143717m670202
8342A0729965M188449P412640j456618q123958l873150J533515l12246l598588
8334F500009l124685m169828q544597p043303L752748J1422022N931949m112589
8326F11726n249380J076191M657115L789569L587164L305442j753117q918844
8318A105866j0036766l468461M403026Q318228P608129K654533m690869q643274
$$ plain form
8310 -2749588 -7315389 -3436892 4770520 9884445 8513927 2624779 -2871354 -2839976 3628093
8301 3628093 10011560 7902331 -2386863 -11183723 -11542041 -6963083 -4033075 -3011732
8293 -3011732 -987538 302937 -3006863 -8963830 -11864310 -11630439 -13422943 -16873657
8285 -16873657 -14038633 -2275341 8105781 6393947 -2618259 -4209663 5692448 14859517
8277 14859517 12366739 3217372 -1029573 52486 -2929474 -11984553 -16268434 -7264911
8269 -7264911 8140856 15731907 11047882 2489079 -605668 2801399 7872964 10326892
8261 10326892 8931717 5153420 2238324 2581434 4883018 5851893 5314716 6761316 11234738
8252 11234738 13777947 9367385 821412 -3300069 934307 8063959 10400335 7155640
$$ packed form
8310b749588m565801L878497Q207412N113925j370518n889148n496133L1378O468069
8301C628093O383467k109229j0289194q796860l58318M578958K930008J021343
8293c011732K024194J290475l309800n956967k900480K33871j792504l450714
8285a6873657K835024J1763292J0381122j711834r012206j591404R902111R167069
8277A4859517k492778r149367m246945J082059k981960r055079m283881R003523
8269g264911J5405767P591051m684025q558803l094747L407067N071565K453928
8261A0326892j395175l778297k915096L43110K301584R68875n37177J446600M473422
8252A1234738K543209m410562q545973m121481M234376P129652K336376l244695
$$ plain form
8244 7155640 3863079 4526153 7785819 10649282 12452112 13558599 12765025 8852117 3915251
8235 3915251 2307242 5412899 9246572 8828851 4338102 1079117 2708646 6169690
8227 6169690 5496151 120759 -3697181 -1011437 5099579 7630522 4410065 -620295
8219 -620295 -3530897 -3970107 -3427639 -4128187 -9102195 -18414120 -25359954 -22433082 -12391859
8210 -12391859 -6961671 -11729941 -18610735 -17348607 -8549547 -90514 4025795 4985963
8202 4985963 3822054 1613545 1709247 5183994 7224174 4585943 2904529 8618061 16853595
8193 16853595 16800179 7615565 -653470 -1745341 672379 2077201 2920719 3823557 3645801
8184 3645801 4098556 7954329 11432311 7682092 -437323 -1500373 7399873 15465870
$$ packed form
8244G155640l292561O63074L259666K863463J802830J106487p93574l912908m936866
8235C915251j608009L105657L833673m17721m490749l258985J629529L461044
8227F169690o73539n375392l817940K685744O111016K530943l220457n030360
8219f20295k910602m39210N42468p00548m974008r311925o945834K926872J0041223
8210a2391859N430188m768270o880794J262128Q799060Q459033M116309R60168
8202D985963j163909k208509R5702L474747K040180k638231j681414N713532Q235534
8193A6853595n3416r184614q269035j091871K417720J404822Q43518R02838j77756
8184C645801M52755L855773L477982l750219q119415j063050Q900246Q065997
$$ plain form
8176 15465870 14776440 11371791 13474090 18663693 20413140 18402604 14126553 4886606
8168 4886606 -8469835 -15801345 -10482740 -1674043 -2536609 -11227489 -15368475 -11609812
8160 -11609812 -8033706 -8494970 -7197651 -517707 6048917 5819470 -1101683 -9432910
8152 -9432910 -12905348 -7329683 4488358 12053513 7879013 -2792681 -9755533 -12180743
8144 -12180743 -15932995 -19388118 -14441563 -2415110 3840742 -2108618 -11085435 -12540856
8136 -12540856 -8586436 -7098234 -8396207 -6385541 1693197 12745117 21543777 22838174
8128 22838174 14095518 152903 -9352558 -10857375 -10078887 -10821962 -7544964 4631783
8120 4631783 18666163 22952375 16616574 9071397 6084597 4714403 2125991 1175081
$$ packed form
8176A5465870o89430l404649K102299N189603J749447k010536m276051r239947
8168D886606j3356441p331510N318605Q808697q62566q690880m140986L758663
8160a1609812L576106m61264J297319O679944O566624k29447o921153q331227
8152i432910l472438N575665J1818041P565155m174500j0671694o962852k425210
8144a2180743l752252l455123M946555J2026453O255852n949360q976817j455421
8136a2540856L954420J488202j297973K010666Q078738J1051920Q798660J294397
8128B2838174q742656j3942615r505461j504817P78488p43075L276998J2176747
8120D631783J4034380M286212o335801p545177k986800j370194k588412r50910
$$ plain form
8112 1175081 4414186 8346733 7450657 1102991 -6006987 -8725267 -5628174 -233732
8104 -233732 1302383 -4224610 -12898995 -16891808 -12739480 -4907398 -297095 -823217 -2789922
8095 -2789922 -2400703 241055 2757625 4081913 4691749 4070626 509676 -5586258 -10361273
8086 -10361273 -10586951 -7777337 -5779941 -5136865 -2904982 1849660 5625052 4984654 1427692
8077 1427692 118770 4515802 12857501 19298190 18662812 11148975 2096828 -3581548
8069 -3581548 -5365902 -4441554 -164881 7040468 11744914 8375403 -245928 -5227210
8061 -5227210 -3424934 -810003 -2099862 -3887387 -2342402 -1479011 -7046429 -16132429
8053 -16132429 -20401026 -18097951 -15583110 -16846181 -18326980 -15848918 -10837499 -6801039
$$ packed form
8112A175081L239105L932547q96076o347666p109978k718280L097093N394442
8104b33732J536115n526993q674385l992813M152328P832082M610303n26122j966705
8095b789922L89219K641758K516570J324288O09836o21123l560950o095934m775015
8086a0361273k25678K809614J997396O43076K231883M754642L775392o40398l556962
8077A427692j308922M397032Q341699O440689o35378p513837r052147n678376
8069c581548j784354R24348M276673P205349M704446l369511q621331m981282
8061e227210J802276K614931j289859j787525J544985Q63391n567418r086000
8053a6132429m268597K303075K514841j263071j480799K478062N011419M036460
$$ plain form
8045 -6801039 -4233588 -2306587 -1882706 -3140814 -3181770 -93844 2863948 1615455 -1890025
8036 -1890025 -2392911 -75463 -428988 -4562739 -6416241 -2587484 1769844 2028577 2825075
8027 2825075 9944314 18243816 18007200 11302300 10074697 16725492 19277397 10879361
8019 10879361 1896093 3625822 10100357 8165470 -1223804 -5732875 -2529011 -1937747
8011 -1937747 -9201977 -15642455 -12226474 -1826798 7089766 10962955 10276716 5113089
8003 5113089 -2852923 -8935262 -10843699 -11537389 -13112570 -12321193 -6025322 2987571 9468146
7994 9468146 11422229 9189541 2832225 -5921168 -12757105 -15567552 -17271516 -20865395
$$ packed form
8045f801039K567451J927001M23881j258108m0956L087926K957792j248493l505480
8036a890025n02886K317448l53525m133751j853502L828757M357328K58733P96498
8027B825075P119239Q299502k36616o704900j227603O650795K551905q398036
8019A0879361q983268J729729O474535j934887r389274m509071L203864N91264
8011a937747p264230o440478L415981J0399676Q916564L873189o86239n163627
8003E113089p966012o082339j908437o93690j575181P91377O295871R012893O480575
7994I468146J954083k232688o357316q753393o835937k810447j703964l593879
$$ [...]
##END NTUPLES=NMR SPECTRUM
##END=
