##TITLE=31Pdec_SR75-DMSO-DCC
 DMSO-d6, 24 sc
 13.5.2022
##JCAMPDX= 6.0         $$ Bruker NMR JCAMP-DX V2.0
##DATA TYPE= NMR SPECTRUM
##DATA CLASS= NTUPLES
##ORIGIN= UXNMR, Bruker Analytische Messtechnik GmbH
##OWNER= root
$$ XWIN-NMR		Version 3.5
$$ Fri May 13 15:25:03 2022 Russian Standard Time (UT+4h)  she@DPX200
##.OBSERVE FREQUENCY= 81.013821
##.OBSERVE NUCLEUS= ^31P
##.ACQUISITION MODE= SIMULTANEOUS
##.ACQUISITION SCHEME= undefined
##.AVERAGES= 8
##.DIGITISER RES= 16
##SPECTROMETER/DATA SYSTEM= spect
##.PULSE SEQUENCE= zgpg30
##.SOLVENT NAME= CDCl3
##.SHIFT REFERENCE= (INTERNAL, CDCl3, 0, 248.564)
##AUDIT TRAIL= $$ (NUMBER, WHEN, WHO, WHERE, WHAT)
$$ ##TITLE= Audit trail, XWIN-NMR		Version 3.5
$$ ##JCAMPDX= 5.01
$$ ##ORIGIN= Bruker BioSpin GmbH
$$ ##OWNER= she
$$ F:/spectra/data/she/nmr/P31/1/pdata/1/auditp.txt
$$ ##AUDIT TRAIL=  $$ (NUMBER, WHEN, WHO, WHERE, WHAT)
(   1,<2022-05-13 15:23:04.70 +0400>,<she>,<DPX200>,
      <created by zg, POWCHK disabled, PULCHK disabled
       configuration hash MD5:
       00 E9 B6 7A A2 85 ED C7 34 08 36 98 17 FE 4E 26
       data hash MD5: 32K
       A5 EA C2 14 DE 87 95 BC 72 08 45 58 B3 76 6D EB>)
(   2,<2022-05-13 15:23:06.93 +0400>,<she>,<DPX200>,
      <Start of raw data processing
       efp BC_mod = 2 LB = 1 FT_mod = 6 PKNL = 1 PHC0 = -9818.862 PHC1 = -147.3463 SI = 64K 
       data hash MD5: 64K
       01 BA 54 4E 28 10 62 DA 6A B9 34 04 34 64 CC 8D>)
(   3,<2022-05-13 15:23:38.89 +0400>,<she>,<DPX200>,
      <pk PHC0 = -72.95038 PHC1 = 178.2 
       data hash MD5: 64K
       0B 8C 9D 1F 10 83 65 AA E5 B9 C3 97 EF C3 FD F6>)
(   4,<2022-05-13 15:23:42.21 +0400>,<she>,<DPX200>,
      <abs ABSG = 5 
       data hash MD5: 64K
       7A 88 24 42 82 4B F5 84 8E 5B B6 CB 3C CF 42 9B>)
$$ ##END=
$$ 
$$ hash MD5
$$ A0 61 C1 6D A6 65 FB E7 58 C9 C9 95 B3 0E 2F 14
##$RELAX= 
##$RELAX= 
##$RELAX= 
##$RELAX= 
##$RELAX= 
##$RELAX= 
##$RELAX= 
##$RELAX= 
$$ Bruker specific parameters
$$ --------------------------
##$DU= <F:/spectra>
##$EXPNO= 1
##$NAME= <P31>
##$PROCNO= 1
##$TYPE= <nmr>
##$USER= <she>
##$AMP= (0..31)
100 100 100 100 100 100 100 100 100 100 100 100 100 100 100 100 100 100 
100 100 100 100 100 100 100 100 100 100 100 100 100 100 
##$AQSEQ= 0
##$AQ_mod= 1
##$AUNM= <au_zg>
##$AUTOPOS= <>
##$BF1= 81.014009
##$BF2= 200.13
##$BF3= 200.13
##$BF4= 200.13
##$BF5= 200.13
##$BF6= 200.13
##$BF7= 200.13
##$BF8= 200.13
##$BYTORDA= 1
##$CFDGTYP= 0
##$CFRGTYP= 5
##$CHEMSTR= <none>
##$CNST= (0..31)
1 1 145 1 1 1 1 1 1 1 1 1 1 1 1 1 1 1 1 1 1 1 1 1 1 1 1 1 1 1 1 1 
##$CPDPRG= <waltz16>
##$CPDPRG1= <>
##$CPDPRG2= <waltz16>
##$CPDPRG3= <>
##$CPDPRG4= <mlev>
##$CPDPRG5= <mlev>
##$CPDPRG6= <mlev>
##$CPDPRG7= <mlev>
##$CPDPRG8= <mlev>
##$CPDPRGB= <>
##$CPDPRGT= <>
##$D= (0..31)
0 1 0 0 0 0 0 0 0 0 0 0.03 2e-05 3e-06 0 0 0 0 0 0 0 0 0 0 0 0 0 0 0 0 
0 0 
##$DATE= 1652440984
##$DBL= (0..7)
120 120 120 11 120 120 24 19 
##$DBP= (0..7)
150 150 150 150 150 150 150 150 
##$DBP07= 0
##$DBPNAM0= <>
##$DBPNAM1= <>
$$ [...]
##$SUBNAM3= <"">
##$SUBNAM4= <"">
##$SUBNAM5= <"">
##$SUBNAM6= <"">
##$SUBNAM7= <"">
##$SUBNAM8= <"">
##$SUBNAM9= <"">
##$SW= 501.771253377433
##$SWIBOX= (0..15)
0 1 3 0 0 0 0 0 0 0 0 0 0 0 0 0 
##$SW_h= 40650.406504065
##$TD= 32768
##$TD0= 1
##$TE= 0
##$TE2= 300
##$TE3= 300
##$TEG= 300
##$TL= (0..7)
0 120 53 12 22 120 120 120 
##$TP= (0..7)
150 150 150 150 150 150 150 150 
##$TP07= 0
##$TPNAME0= <>
##$TPNAME1= <>
##$TPNAME2= <>
##$TPNAME3= <>
##$TPNAME4= <>
##$TPNAME5= <>
##$TPNAME6= <>
##$TPNAME7= <>
##$TPOAL= (0..7)
0.5 0.5 0.5 0.5 0.5 0.5 0.5 0.5 
##$TPOFFS= (0..7)
0 0 0 0 0 0 0 0 
##$TUNHIN= 0
##$TUNHOUT= 0
##$TUNXOUT= 0
##$USERA1= <user>
##$USERA2= <user>
##$USERA3= <user>
##$USERA4= <user>
##$USERA5= <user>
##$V9= 5
##$VALIST= <valist>
##$VCLIST= <CCCCCCCCCCCCCCC>
##$VD= 0
##$VDLIST= <DDDDDDDDDDDDDDD>
##$VPLIST= <PPPPPPPPPPPPPPP>
##$VTLIST= <TTTTTTTTTTTTTTT>
##$WBST= 1024
##$WBSW= 4
##$XGAIN= (0..3)
0 0 0 0 
##$XL= 0
##$YL= 0
##$YMAX_a= 1669
##$YMIN_a= -804
##$ZGOPTNS= <>
##$ZL1= 120
##$ZL2= 120
##$ZL3= 120
##$ZL4= 120
##$ABSF1= 248.5645
##$ABSF2= -253.2056
##$ABSG= 5
##$ABSL= 3
##$ALPHA= 0
##$AQORDER= 0
##$ASSFAC= 0
##$ASSFACI= 0
##$ASSFACX= 0
##$ASSWID= 0
##$AUNMP= <proc_1d>
##$AZFE= 0.1
##$AZFW= 0.5
##$BCFW= 0
##$BC_mod= 2
##$BYTORDP= 0
##$COROFFS= 0
##$CY= -3
##$DATMOD= 1
##$DC= 0
##$DFILT= <>
##$DTYPP= 0
##$F1P= 0
##$F2P= 0
##$FCOR= 1
##$FTSIZE= 65536
##$FT_mod= 6
##$GAMMA= 0
##$GB= 0
##$INTBC= 1
##$INTSCL= 5.30512e-09
##$ISEN= 30
##$LB= 1
##$LEV0= 0
##$LPBIN= 0
##$MAXI= 10000
##$MC2= 0
##$MEAN= 0
##$ME_mod= 0
##$MI= 50
##$NCOEF= 0
##$NC_proc= -10
##$NLEV= 6
##$NOISF1= 182.463
##$NOISF2= 159.3651
##$NSP= 0
##$NTH_PI= 0
##$NZP= 0
##$OFFSET= 248.5645
##$PC= 4
##$PHC0= -9891.812
##$PHC1= 30.8537
##$PH_mod= 1
##$PKNL= yes
##$PPARMOD= 0
##$PSCAL= 0
##$PSIGN= 0
##$REVERSE= no
##$SF= 81.014009
##$SI= 65536
##$SIGF1= 159.3651
##$SIGF2= -187.1042
##$SINO= 113.3802
##$SIOLD= 16384
##$SREGLST= <1H.CDCl3>
##$SSB= 0
##$STSI= 65536
##$STSR= 0
##$SW_p= 40650.406504065
##$SYMM= 0
##$S_DEV= 0
##$TDeff= 32768
##$TDoff= 0
##$TI= <>
##$TILT= no
##$TM1= 0
##$TM2= 0
##$TOPLEV= 0
##$USERP1= <user>
##$USERP2= <user>
##$USERP3= <user>
##$USERP4= <user>
##$USERP5= <user>
##$WDW= 1
##$XDIM= 65536
##$YMAX_p= 531359265
##$YMIN_p= -182104564
$$ End of Bruker specific parameters
$$ ---------------------------------
##NTUPLES= NMR SPECTRUM
##VAR_NAME=  FREQUENCY,     SPECTRUM/REAL,   SPECTRUM/IMAG
##SYMBOL=    X,             R,               I
##VAR_TYPE=  INDEPENDENT,   DEPENDENT,       DEPENDENT
##VAR_FORM=  AFFN,          ASDF,            ASDF
##VAR_DIM=   65536,         65536,           65536
##UNITS=     HZ,            ARBITRARY UNITS, ARBITRARY UNITS
##FACTOR=    0.620285442955139, 1,           1
##FIRST=     20137.2065510759, 0,            0
##LAST=      -20513.1999529892, 0,           0
##MIN=       -20513.1999529892, -182104564,  0
##MAX=       20137.2065510759, 531359265,    0
$$ Real data points
##PAGE= N=1
##DATA TABLE= (X++(R..R)), XYDATA
$$ [...]
45786 -3831706 -14744061 -6947554 12257653 25081693 24562140 18797207 16440123 16443640
45778 16443640 13611528 8363672 6859550 12390107 19634744 20112206 13287502 8090550
45770 8090550 10545128 14711032 12096142 5881284 6014245 11478373 9358638 -5384986
45762 -5384986 -20376311 -22436356 -14861202 -9901970 -10496029 -9172422 -2288618 3984009
45754 3984009 3014566 -2970650 -5534735 160181 9778199 14281905 9929334 2027046
45746 2027046 -2740507 -4168132 -4502992 -1015235 8962723 17922545 14326665 194845
45738 194845 -8752876 -4328250 3664085 3826204 -772345 -1098932 2820628 5756946 8833714
45729 8833714 15541365 20802671 15978654 3115335 -6380764 -7097900 -4503747 -4225455
45721 -4225455 -5123666 -4484914 -2581214 147168 4387883 8283790 7647128 2152309 -2753816
45712 -2753816 -2256978 2413478 6199460 5207169 -1179198 -10387245 -17790325 -19583315
45704 -19583315 -15312954 -7163554 1883582 7988983 7231067 -260572 -8333031 -10418367
45696 -10418367 -6849041 -4189019 -7668959 -15968715 -22679152 -21892765 -14139003 -7606340
45688 -7606340 -10304555 -19537678 -23503558 -16139860 -5251078 -1023229 -1479052 3000621
45680 3000621 13339203 18892059 11772368 -3233305 -15310189 -18477207 -13450118 -4152589
45672 -4152589 3824805 5198310 -151978 -6092521 -7255917 -5528690 -6284785 -9583039
45664 -9583039 -9472673 -2626106 6311134 10342354 8488467 5429387 4362399 4179023
45656 4179023 3630076 3900680 5338587 5310761 1916575 -3040023 -7270136 -10962310 -13539605
45647 -13539605 -11314565 -2916402 6254879 10334090 10697791 11271278 9658056 1708441
45639 1708441 -6861996 -4413206 8850587 17150616 8492459 -9486488 -19023394 -12678190
45631 -12678190 1349696 11093963 12863856 12491757 17362307 26860815 31368019 23550969
45623 23550969 9168668 1313393 4405019 10356717 10982675 6741718 1319515 -4786328
45615 -4786328 -11501865 -15982064 -16110788 -13210634 -9432236 -6631409 -7766161 -13467337
45607 -13467337 -17824604 -15097368 -9697974 -10128412 -14062278 -11690275 -4169011 -3783210
45599 -3783210 -12560556 -16898370 -9641046 -1061753 712950 3141359 11351587 13861114
45591 13861114 2138175 -10629771 -9280185 -2370853 -6444329 -15082095 -9297588 6435798
45583 6435798 6544288 -14865975 -31553003 -22277461 498269 11220922 5263582 -1086957
45575 -1086957 4538708 17540687 24085658 14940882 -5482787 -20996296 -18818232 -4118616
45567 -4118616 5859047 2108126 -8281950 -13800634 -9903132 929651 11668113 13208388
45559 13208388 3297656 -7307034 -6869161 703526 2644458 -1317444 332967 8252841
45551 8252841 8309426 -4315450 -14756324 -11665779 -4950068 -7814399 -14559790 -11465876
45543 -11465876 146949 8173586 10684945 16034544 24863779 27808249 21493410 12935623
45535 12935623 6029478 -3581084 -16315410 -23026595 -18081666 -9364535 -7690233 -12199926
45527 -12199926 -13882624 -9519412 -4094126 -1292097 184092 447047 -3381903 -9819700
45519 -9819700 -10959421 -3282545 4686728 2702603 -6472196 -10835380 -6032971 867297
45511 867297 4757925 8813880 13797641 11812025 -1882178 -19003726 -28710495 -31433098
45503 -31433098 -33339301 -33059575 -25032480 -12705035 -6721476 -9942912 -13846297 -11036211
45495 -11036211 -3800357 1078976 239767 -4292615 -7078416 -4157197 1223468 1552469
45487 1552469 -3066674 -2874231 6006564 12573871 6616242 -4792256 -7857323 -1706639
45479 -1706639 5170353 10241986 13633497 7723250 -10709981 -24080807 -12678505 12415053
45471 12415053 19785152 2790543 -11567126 -4878079 7809192 6863832 -2298939 -4723359
45463 -4723359 -1496503 -1747765 -4121394 -3625389 -4503746 -10142589 -11898279 -3786774 3351449
45454 3351449 -1290854 -9138607 -7603720 -3591479 -11058367 -23782303 -23191901 -8949623
45446 -8949623 318495 -4378611 -13299855 -17565011 -18382019 -15209243 -3907951 9479660
45438 9479660 11025829 700186 -4152484 6167314 19665083 21177240 11957973 2492863
45430 2492863 -2578790 -3253649 1836170 9987110 11094610 517495 -10389327 -7208885
45422 -7208885 7419781 16627204 11072112 -1217854 -7668236 -5895261 -2195299 -743078
45414 -743078 251362 2813681 4481368 1683364 -4254196 -7917474 -6762999 -4017436
45406 -4017436 -3336953 -3830960 -2995172 -1945212 -4111937 -9896800 -15871062 -19056184 -19769152
45397 -19769152 -20364244 -22528885 -25492952 -26414863 -23412760 -17969384 -12734659 -7940201
45389 -7940201 -2685658 1774440 4104735 6398103 10039807 10256773 2715396 -6083022
45381 -6083022 -5599662 1383177 982104 -9383452 -15249443 -8365759 -994534 -6045917
45373 -6045917 -15782498 -14683358 -4074666 1895526 -1176109 -5029514 -4755101 -2813456
45365 -2813456 873218 8333145 13510716 6798102 -8746326 -17651605 -11039678 3820491
45357 3820491 13978656 12446428 75678 -14901810 -19999870 -10655029 1681398 2871423
45349 2871423 -5050407 -9239265 -6723717 -5339573 -5680465 750730 12883862 16555349
45341 16555349 5861596 -6591711 -8588501 -4750532 -5294633 -9365371 -9640533 -5457800
45333 -5457800 -1670713 106623 1363281 2327731 3618854 7579894 13264918 15292186
45325 15292186 11731715 7278142 4902067 1333973 -4715854 -7359550 -2486258 4451162
45317 4451162 5844047 2021530 -1616055 -2851883 -2832069 -2072493 -866492 -516353 -1447948
45308 -1447948 -3484699 -8275659 -15713611 -18639709 -10079529 3802474 9090571 4493009
45300 4493009 3488129 12016625 18579134 14190584 7558081 9068961 12742843 8228420
45292 8228420 17523 -1211673 1857163 -656843 -5899056 -2476941 7979030 11036578
45284 11036578 1572021 -10238966 -16397151 -19096775 -18592241 -8829649 8656578 19757409
45276 19757409 14765257 865502 -9065500 -11645018 -10734876 -8430451 -5733801 -5766198
45268 -5766198 -9098895 -10608904 -6781284 -1442929 1024792 3001389 8154010 13238290
45260 13238290 12056396 4671131 -3130374 -7141745 -6593837 -1718870 5084493 8218539
45252 8218539 4780756 -178871 499823 6646143 12268531 14533358 15229760 14631878 10826363
45243 10826363 5479305 3688641 6502782 9108269 8064313 4944235 1143910 -4715316
45235 -4715316 -11276837 -12849353 -8185783 -5123489 -9932955 -16643184 -15282890 -8136360
45227 -8136360 -7972590 -19300305 -30711793 -29566460 -16848496 -2575980 7069058 11456419
45219 11456419 9314094 -516020 -13047855 -19249047 -15656394 -7278508 -176502 4408279
45211 4408279 7649305 9563878 10069470 10248372 10395348 9431589 7961503 8950093 12989366
45202 12989366 15531659 12045211 4470828 -655619 -73617 2971028 3510151 366874
45194 366874 -4124584 -8105390 -11959940 -16086604 -18275475 -14901416 -5696972 3308921
45186 3308921 3888378 -5651801 -16951998 -19444202 -11947876 -3533357 -1485503 -2134679
45178 -2134679 2205336 9966231 11186076 2387081 -7215765 -8702463 -6017503 -8719751
45170 -8719751 -16967541 -22208037 -20171483 -14137040 -6592489 2277885 7311901 760227
45162 760227 -14219470 -22239531 -13561041 4212309 17353905 21208862 18692980 12138081
45154 12138081 4581053 2351077 7542274 12723523 10894213 5720537 4184555 4828826
45146 4828826 2488879 -636228 684580 3342615 360566 -5588651 -4811580 3788215
45138 3788215 10708864 10233751 7021570 6940307 9730876 12059515 10894609 4070777 -5559779
45129 -5559779 -8341240 1389107 14556082 16769052 6814053 -4247497 -10349980 -14962285
45121 -14962285 -19461359 -20093634 -17331161 -15569335 -12520948 -2272743 9794561 10148840
45113 10148840 -1708957 -10768548 -9911019 -9362297 -15751676 -18951442 -10953520 -2409873
45105 -2409873 -5832633 -14293746 -12935207 -3383264 -242481 -7627984 -14309649 -11213184
45097 -11213184 -1619231 6479719 9098878 6902760 3521671 2689517 3109218 -468890
45089 -468890 -7165759 -6976306 5824506 21882588 27012731 19285676 9097517 5933163
45081 5933163 11112980 19574281 23018785 15624969 2099463 -4644351 1358688 11981569
45073 11981569 17248827 16817457 13796802 6792420 -3602398 -9441262 -6412245 -2184633
45065 -2184633 -3667657 -4333719 4017120 14758567 15223322 5852350 -3130175 -8660846
45057 -8660846 -13941750 -15445041 -7049193 5077079 7824890 1197472 -2102093 2142386
45049 2142386 3865490 -3382811 -12521495 -14811202 -10216949 -2755143 4002015 4660808
45041 4660808 -3720503 -12868366 -10196814 2768225 10349115 4341549 -6192758 -11011918
45033 -11011918 -12175081 -14797127 -15714279 -10674202 -4785373 -5996985 -12611510 -15469473
45025 -15469473 -10336720 -2149508 1878758 -510816 -5529167 -7559669 -5007734 -1457500
45017 -1457500 200959 1851473 5189812 7065101 5396395 4970215 9378742 11756277
45009 11756277 3995522 -8159341 -11608002 -5973465 -3644080 -9250078 -13431716 -10019272
45001 -10019272 -5062544 -3260119 985786 10907895 17480052 12267842 1796583 -991846
44993 -991846 5852686 13115905 13767559 9103969 4007781 1632039 1525725 569608 -2306858
44984 -2306858 -3023164 1146477 3972991 -1818917 -9574739 -3865310 16168494 31288306
44976 31288306 26683596 10912661 1720422 2569798 3894820 806142 -2043486 -425107
44968 -425107 3929950 6982164 5842901 385426 -4537959 -1872807 8560399 17585687
44960 17585687 17046139 8406008 -2141025 -11364692 -17721486 -18689143 -14792224 -11099661
44952 -11099661 -9846344 -6901397 -61114 5476376 5269901 2915532 3278241 4721174
44944 4721174 4432849 5201383 9702807 13709203 12416637 8432429 6332586 4759569
44936 4759569 1605069 1245091 7422051 13681386 11064995 2334370 -1636265 1689933
44928 1689933 3337774 -3342755 -13590766 -17802600 -12225022 -2141642 2855797 -2132845
44920 -2132845 -11120388 -13095109 -5599355 3055604 7080600 10040121 13775737 11123224
44912 11123224 -1216954 -11867178 -8846105 2410180 7919410 6257504 6444179 9073162
44904 9073162 6139603 -1140845 -1474340 6423004 8525228 -3462022 -18560175 -21717053
44896 -21717053 -12799847 -3028176 -446708 -5823991 -15765458 -22689351 -17792218 -1596042
44888 -1596042 12831538 14101822 6462175 2957103 7506849 10987043 4526041 -9542812
44880 -9542812 -21243756 -23344582 -16560816 -6943664 -46530 2766003 3334270 3247992
44872 3247992 2432138 607683 -1683547 -3838619 -5479671 -5664851 -3407439 394964
44864 394964 3076854 3495683 4347442 9350572 17424602 21328044 14937602 2179748
44856 2179748 -5072967 -707761 7441752 7514775 -1176461 -8879674 -9164226 -4261495 2439669
44847 2439669 10033604 15163109 13279424 7892861 8929466 17603165 22656977 17047784
44839 17047784 8258167 5161431 5113479 2935907 2309158 7001416 10150103 5373738
44831 5373738 409399 4971122 12018400 8007578 -3006892 -4325792 5752101 10517484
44823 10517484 1220664 -11538104 -17600220 -21007132 -26317569 -26788691 -16773085 -4208262
44815 -4208262 -7005 -3556886 -7929589 -11589148 -15863452 -17771523 -14644387 -10615407
44807 -10615407 -10290197 -10671231 -6900885 -1297106 1072338 1613444 4974101 9789530
44799 9789530 10732298 8024605 7433818 11293386 15899430 18140163 19438177 21967613
44791 21967613 24587774 24031162 18673922 10594746 4061069 1432671 1234985 1629902
44783 1629902 3674221 7675527 8839857 2658342 -6465260 -9278917 -4685773 -994683
44775 -994683 -3156644 -7322013 -10234322 -14313004 -18893795 -15972252 -1727501 15076013
44767 15076013 23327827 21729289 13970404 -449151 -20656267 -35326458 -31351981 -11058309
44759 -11058309 8496746 14306859 8982880 3456241 4179667 8594578 9501356 3519120
44751 3519120 -3562418 -2707292 5741240 11280635 8446456 4775066 6974118 7982645
44743 7982645 -958911 -12030488 -9354124 6579179 18330075 16546669 10684380 10667192
44735 10667192 12347722 8955999 4644032 6057189 9491236 8125015 5817089 11327418
44727 11327418 22008132 25649304 18626347 11110683 11738417 16382647 16253837 9757962
44719 9757962 1168872 -6927648 -13872880 -16831508 -12429380 -2112316 7856138 11873977
44711 11873977 8712631 1039124 -6423625 -9238122 -6264241 -557490 3383773 2563337
44703 2563337 -3646068 -12264721 -15955622 -8652546 5405666 13651926 10526081 5108636
44695 5108636 7129589 11716468 8309794 103701 537431 10826379 16523487 10518018
44687 10518018 3977198 6148761 7984119 -1024829 -11411919 -6285254 10962820 19516932
44679 19516932 10531546 -3016665 -8092065 -8007720 -11492456 -17747521 -20461405 -18841941
44671 -18841941 -17189491 -18006087 -20568921 -22823926 -21666809 -15151838 -6453240 -1518326
44663 -1518326 -1470210 -1839346 15767 2024310 2364155 1246480 -2672190 -10541976 -16832678
44654 -16832678 -12512056 2360167 15952927 17755427 8926840 -2102735 -8122082 -5909753
44646 -5909753 2261202 8105826 5568802 621100 4019274 13187365 12879962 -2142305
44638 -2142305 -17415287 -19087429 -12977962 -13394636 -21194996 -24378310 -16355139 -3868618
44630 -3868618 1922747 -3628306 -14670141 -18740677 -9046526 5018819 6679978 -6324989
44622 -6324989 -18113989 -17001174 -9925717 -7651312 -7962531 -4271717 -83130 -1807792
44614 -1807792 -5558665 -4489747 -1982839 -3695006 -3560030 6502824 18339822 16482599
44606 16482599 2938694 -4303113 2295283 11395075 12683939 9436417 7447120 5911955
44598 5911955 4559800 7062307 11417176 8439919 -3514077 -12422360 -8574616 1395170
44590 1395170 3963244 -3588942 -11718381 -11307054 -2818112 5249125 4717321 -3822185
44582 -3822185 -11393476 -11838913 -9230564 -9243896 -8474812 -1282130 7257230 7298412 911915
44573 911915 -499120 4947956 7600313 4394158 3612583 7629220 6545204 -3859367
44565 -3859367 -12023218 -7769043 2239577 6124796 3883636 2955829 5472765 9636084
44557 9636084 15921763 22599543 22757052 14963522 8902958 10714080 11303279 759405
44549 759405 -13540659 -16673366 -8057011 435014 3718665 5907338 6196078 -1443886
44541 -1443886 -13515068 -17054157 -8150330 2331345 5795258 6602835 10168500 12158300
44533 12158300 8096016 4470678 9663986 19259281 21069352 12666339 4197235 3416856
44525 3416856 6535053 6595509 3869774 3129081 5267099 7458888 9174179 11734923 12553590
44516 12553590 6780997 -3523653 -8579310 -3186701 5854574 9659770 9038061 9656051
44508 9656051 10633551 7025727 293168 -3785378 -5592309 -9300441 -11647837 -5906206
44500 -5906206 2806336 966559 -11461894 -18076453 -11075126 -3467268 -6902760 -12916030
44492 -12916030 -9763317 -4160040 -8829373 -18553920 -18470355 -10374102 -9858043 -18448468
44484 -18448468 -19227092 -4118798 12249115 13299436 1663145 -8534365 -10648974 -8937191
44476 -8937191 -9610359 -14597210 -20085048 -18659062 -7597619 4751001 7669517 2740276
44468 2740276 838513 4340922 3662487 -5803551 -15154016 -15666026 -10234401 -4639315
44460 -4639315 2053476 9784518 9930777 -2832360 -17212902 -16503442 -1064237 11808872
44452 11808872 11227152 5800081 9393856 20940470 25288710 12837444 -7468080 -18238707
44444 -18238707 -14559672 -8763135 -12229650 -19562436 -18252370 -8751219 -3218454 -5518082
44436 -5518082 -6037383 301951 4366588 -1324212 -8580908 -6108882 2221844 3913036
44428 3913036 -2314317 -5799676 -1556518 2941338 124388 -7393442 -11780817 -9454513
44420 -9454513 -3307349 738096 -1596683 -8825785 -14288236 -13093586 -7288525 -2320252
44412 -2320252 -1205413 -4381493 -10802369 -15458287 -10990431 2810747 15837638 19889215
44404 19889215 18850460 19650650 19223591 10736369 -1573513 -6123742 -1274675 3043366
44396 3043366 1298049 -1725701 -2407243 -3779271 -6328434 -4738414 1457060 4585212
44388 4585212 1885836 1547209 8456811 13595549 7199882 -4813933 -8185806 374788
44380 374788 11166649 15982135 15056732 10741038 3471356 -4614612 -9035014 -8299028
44372 -8299028 -5567195 -3415337 -94039 7633222 19425395 29555576 30448018 20285398
44364 20285398 7188705 1676414 3886522 3854144 -3257070 -9598569 -7488647 -2211382
44356 -2211382 -3151648 -7622503 -4935470 5134146 9845997 1853165 -9645552 -10849912
44348 -10849912 125867 13475200 19692613 16498351 6839218 -4830010 -14045313 -16977452
44340 -16977452 -11792706 -909414 8263343 8204149 -521315 -8536412 -8299139 -2757117
44332 -2757117 490569 378144 1869273 6314238 9022677 6280980 -782866 -8958800
44324 -8958800 -14311896 -12147316 -2306445 6377582 4723593 -3464343 -5135786 3407054
44316 3407054 10526460 5400834 -7900582 -17519437 -18471832 -14634401 -11043263 -9821505
44308 -9821505 -10697010 -11332481 -9277533 -5489382 -2637157 473589 6849940 12625037
44300 12625037 8700691 -4989208 -14914477 -9845417 4997751 16203322 18997889 18755416
44292 18755416 20361309 23705241 26847011 26952225 20288406 6851454 -7326431 -16913504
44284 -16913504 -22852566 -27120479 -27320864 -22314535 -17547025 -17299724 -16664338 -9575975
44276 -9575975 -250103 2714606 -322603 -2935845 -5640697 -14061233 -25048917 -27062161
44268 -27062161 -16404453 -2437897 6159782 10488520 13333813 11783857 3813962 -5006660
44260 -5006660 -7988786 -6234673 -5701387 -8097073 -9161470 -5087959 1936592 4984497
44252 4984497 -392584 -9992728 -14718162 -11842680 -7897028 -7430287 -5723654 1129229
44244 1129229 6327974 2588870 -3625119 -809389 8231526 10109151 2824930 -1431912
44236 -1431912 2758564 5924531 1336971 -3928733 -2978091 -1367040 -6268594 -13668870
44228 -13668870 -15963448 -14315743 -14370646 -16104843 -16189895 -15152149 -15165122 -15477289 -15470159
44219 -15470159 -16979566 -19276194 -18182467 -13992340 -12447686 -14105167 -12326385 -6186808
44211 -6186808 -3630625 -5551107 -423082 15338995 25437145 15942043 -2124427 -8806254
44203 -8806254 -4638575 -5642762 -14912448 -19116291 -12045392 -3004003 382541 1673653
44195 1673653 4439961 5584078 4056256 3876544 3837665 -4335737 -21583660 -34761378
44187 -34761378 -31343068 -14976692 -866942 494604 -8463463 -17199246 -17524988 -10620510
44179 -10620510 -3611838 681448 5704903 11099435 9587224 531941 -2992073 8133555
44171 8133555 22188630 21153836 6088267 -7326357 -13415686 -18673910 -22444306 -16508829
44163 -16508829 -5423945 -5695535 -18617762 -23912255 -9726506 8766558 12191279 3202741
44155 3202741 -2780197 -452437 4924738 9867628 12849704 10220612 3008643 190344
44147 190344 5457410 9204001 3210561 -6559520 -12420653 -18879739 -30366352 -35940611
44139 -35940611 -23927742 -4518389 1377736 -7734883 -13875472 -8700607 -3487203 -7087310
44131 -7087310 -11690131 -7529929 1793735 6584359 3945153 -2928646 -10126723 -12618498
44123 -12618498 -6585650 2853825 4075588 -5728758 -15159400 -14041830 -6856644 -4144584
44115 -4144584 -7163922 -9235304 -7776575 -6307949 -6505195 -6149008 -4882303 -5574439 -8993012
44106 -8993012 -11962474 -11931479 -9573297 -6081596 -1764004 1319648 -852446 -9085645
44098 -9085645 -17939577 -20826060 -17041900 -11533957 -9026175 -10866720 -15828207 -19853276
44090 -19853276 -16194509 -2081275 13439289 15290728 315784 -16484010 -19700810
44083 -19700810 -12283869 -8557388 -12824244 -15912257 -12138792 -7719255 -8900280 -11620348
44075 -11620348 -8501712 666668 10119767 14203666 9278958 -3524622 -14062992 -9814535
44067 -9814535 7918074 21806543 18495336 4032507 -6607792 -7784778 -3446095 3221369
44059 3221369 10296197 12550697 7129489 1041831 3288243 11247535 13888662 7612645
44051 7612645 575388 1054565 8074199 13810152 10883193 -1185733 -13122644 -13303219
44043 -13303219 -2320622 5417944 287475 -9408676 -10748441 -4990772 -2298838 -4270303
44035 -4270303 -4696927 -3165608 -4062519 -4865843 581725 8847565 10814828 7212449 5627696
44026 5627696 3694539 -7553595 -23061376 -25514878 -11945593 -27351 -952343 -4073884
44018 -4073884 1767515 8864211 5869529 -1774198 -2069506 2985879 2486465 -4560568
44010 -4560568 -9754373 -10064268 -9371013 -8531700 -5201276 -1156780 -30645 -65885 2254708
44001 2254708 4250124 1310140 -3552488 -2900970 4228630 11921793 15830566 15698031
43993 15698031 12402892 8859629 10577744 18911845 26986082 27958586 23096459 16402665
43985 16402665 7561344 -2957838 -9055749 -8146443 -8230607 -15704202 -22847611 -19082806
43977 -19082806 -8346977 -1980314 -53776 4739108 8772711 990422 -15878281 -25642371
43969 -25642371 -22632138 -18244722 -19324301 -17209488 -5687916 5916617 7797458 4992753
43961 4992753 6527281 9706941 7053539 847965 -1180292 901454 1303361 -246558
43953 -246558 516324 3165084 3805421 3530867 6804310 12279441 13207160 7257273 -418970
43944 -418970 -4376049 -4132270 -2125769 -560249 -303624 -15913 2787045 7751527 11099466
43935 11099466 11163170 10823272 11607072 10338291 6051349 4521593 9050876 11719750 3048577
43926 3048577 -12249406 -19261058 -12533422 -2092179 1838171 825786 1266417 3634411
43918 3634411 4339192 2572787 -475984 -5175139 -10878952 -13149855 -8970227 -2357445
43910 -2357445 318021 -1354851 -3200879 -4034810 -5808029 -7494859 -6036306 -3737510
43902 -3737510 -6820335 -14064395 -14977523 -4619340 6855471 7418967 778810 563740
43894 563740 9043975 13233327 4270852 -9825383 -15755137 -10799378 -820597 10201793
43886 10201793 20385536 24800817 19486771 8860829 1514163 -251595 -77346 1379091
43878 1379091 6941283 14634182 17019369 10801592 1095317 -5473493 -6595087 -2335047
43870 -2335047 6522281 16109222 20552432 17760182 10783617 3208781 -2516463 -3042873
43862 -3042873 3226077 11266315 14058378 12686460 14256490 18680286 16768808 5155389
43854 5155389 -5784332 -5210410 3290645 6749733 -1009481 -13510640 -19664698 -14817503
43846 -14817503 -6063309 -6483646 -19549292 -31148370 -25581875 -7925458 2167849 -312448
43838 -312448 580027 13026811 21174663 10764913 -5246942 -5435837 7123428 11964565
43830 11964565 4468167 -934041 1152823 -832088 -11714720 -19500999 -16653781 -12641132
43822 -12641132 -14676259 -12422004 3909666 22420307 23096754 6442497 -7044737 -4628053
43814 -4628053 4805569 6820792 725058 -2952478 1299677 6853131 4023241 -7668585
43806 -7668585 -18989777 -21746403 -16632274 -9604343 -4758510 -3680224 -7200581 -12466633
43798 -12466633 -11974794 -2337458 8450710 9872249 3224875 -906378 1660741 4473275
43790 4473275 1967368 -4055897 -10840376 -18419771 -24475916 -24122553 -18247340 -14352368
43782 -14352368 -15404156 -14847539 -6529289 6493154 16408278 18713391 13917963 6759730
43774 6759730 4584267 10110782 15615544 11529326 -47789 -9337767 -14531373 -21217342
43766 -21217342 -27046754 -22630064 -10327568 -5497585 -13293127 -20396116 -17066886 -10623801
43758 -10623801 -7846053 -2041429 9483872 12947141 257787 -11878064 -5313433 9583068
43750 9583068 9851620 -3273736 -7794559 3339418 14058426 12731473 6191781 3481061
43742 3481061 4048280 5458546 7112027 4301250 -6452551 -15758411 -11150980 1648993
43734 1648993 5355172 -550152 1106073 14463334 21480049 11496799 -1460844 -2750318
43726 -2750318 574283 -3721562 -10175225 -6533099 3525737 5821623 -2376583 -10250662
43718 -10250662 -9471824 -1244027 8996863 14854085 10894605 -1036417 -11430796 -14421990
43710 -14421990 -13464675 -11375526 -4149365 8518714 16818484 14205122 8132780 7760245
43702 7760245 10089819 8910607 7789482 11187504 11678850 1750019 -8331138 -2240202
43694 -2240202 15602242 22917074 10514857 -5958915 -9577587 -3392099 -798007 -4747588
43686 -4747588 -5829182 2777554 15427049 19974087 11894028 611089 -1313541 5342890
43678 5342890 7659044 226817 -6041658 -1061235 8385010 10084273 5683570 5550397
43670 5550397 10125202 10967741 7486105 7787278 13121901 15177533 9783092 818815
43662 818815 -9879944 -22918773 -30564299 -21141692 1033240 14587415 7287144 -8799489
43654 -8799489 -15958178 -12766737 -7723822 -1895002 8705779 19497925 19975369 9286882
43646 9286882 -1402107 -3514102 -157086 1713865 2005619 5834786 13593976 17691219
43638 17691219 11571246 -349260 -6600884 -3124529 2255878 3076631 4508486 12908689
43630 12908689 21782063 19827786 9437129 3429998 3813459 -930574 -13863247 -20464764
43622 -20464764 -9993547 6624648 11630666 4538484 -499977 3837447 10578540 10229892
43614 10229892 872665 -12339161 -20655588 -16362583 -754184 13683774 15076316 5210610
43606 5210610 -4093708 -5615411 -2080453 1270833 2704368 2256874 -354909 -4191130
43598 -4191130 -6514612 -5163522 -450863 5001070 7729700 6128337 2015902 -2447323
43590 -2447323 -8462432 -17059776 -23092820 -20046287 -11573431 -9072541 -14458918 -15593405
43582 -15593405 -5303387 5528154 4261576 -2884523 -574840 10172050 12230667 -1589752
43574 -1589752 -17549511 -20317689 -11376564 -1938350 3127004 6689300 10712009 13487440
43566 13487440 12736203 7082330 -2709120 -11246222 -11807753 -5776308 -3821631 -12430578
43558 -12430578 -23398962 -23446067 -12002932 -1966677 -2531147 -8435153 -9223776 -3618398
43550 -3618398 586170 -1573184 -6269925 -7624749 -5926590 -6246283 -11070674 -17503025
43542 -17503025 -21154027 -20164011 -15602168 -10579346 -9137748 -12967314 -18034498 -17163586
43534 -17163586 -7988834 3311567 8087121 4084015 -2967765 -5708621 -2194715 2598525
43526 2598525 1955971 -5062812 -11892350 -11985282 -7035205 -4652651 -8401827 -13933088 -15102295
43517 -15102295 -10006283 -877752 7509620 9316735 3085121 -3925313 -3556766 235915
43509 235915 -5164917 -21722208 -34668644 -31502423 -17738406 -5975444 1488349 8495140
43501 8495140 11584483 4711243 -6746451 -10946819 -7195281 -5222996 -7404476 -5954252
43493 -5954252 558023 2587841 -4006996 -10366125 -9454610 -6141382 -5412163 -2730841
43485 -2730841 4737005 8584777 2053469 -7017081 -8415377 -6418255 -10585645 -16837321
43477 -16837321 -14175183 -6028090 -6326814 -14334347 -12775858 3908768 17678355 12981541
43469 12981541 -525999 -4359092 1697636 4628537 2277796 4316715 11506262 11905763
43461 11905763 1003436 -9424123 -8946211 -2853632 -796860 -1155777 2750440 7794871
43453 7794871 4712308 -5554818 -10618812 -3513301 7818176 11521440 6742512 3602331
43445 3602331 10983433 26910099 39865780 39009088 24403160 6877321 -3220121 -5088566
43437 -5088566 -3732074 -1606607 997575 1145504 -3410921 -7790951 -5448690 170646
43429 170646 -1030869 -9250233 -12014669 -2513630 8903881 8530158 -2924977 -13975839
43421 -13975839 -17459236 -13782722 -4583010 7303391 14759347 12613401 5700441 3187910
43413 3187910 6525813 10148013 11531607 12085739 10278838 3887018 -1548522 2728702
43405 2728702 14144724 19063352 10724837 -2475552 -10549914 -14301350 -18263086 -19849373
43397 -19849373 -14085452 -3985772 2369332 2894185 2717483 5430802 8889802 9697235
43389 9697235 7618596 5104082 4703672 6420215 6404670 560438 -8715770 -12638392 -6201015
43380 -6201015 4458735 8971902 5214090 473728 1038316 5204165 7253259 4537596
43372 4537596 -1150135 -6768230 -10234310 -10227543 -6154697 112353 3053437 -3057286 -17086471
43363 -17086471 -29000962 -28694497 -16961870 -4015718 3161451 6892395 10450374 10190299
43355 10190299 2057166 -8299654 -10554522 -4586060 -1684662 -7836785 -13725154 -8132709
43347 -8132709 4111902 7317159 -2954511 -13250096 -10987404 -726110 4911567 3268503
43339 3268503 1193501 1281114 45184 -1534925 2231161 9804811 12095010 7872364
43331 7872364 7635986 15934584 21582939 14615797 2583389 -1349962 2243499 4399126
43323 4399126 4775308 8414640 11153931 5036605 -4395586 -3589583 6253297 9230364
43315 9230364 -150577 -9020410 -7866663 -3693188 -4720527 -7260834 -6395284 -6142827
43307 -6142827 -9632087 -11179204 -7415431 -4932037 -7879096 -9698932 -6446588 -5507535
43299 -5507535 -10327892 -10224282 1197791 11131081 7527030 1440555 9662692 24932650
43291 24932650 25943696 11150572 -756964 -1823351 -2753254 -8681180 -10170909 -3650482
43283 -3650482 129118 -4041969 -5804341 1665496 8562502 4844508 -3693179 -6103456
43275 -6103456 -1795162 4127120 10717505 17401809 19907307 18242977 19251645 23587699
43267 23587699 20796989 6045346 -9288952 -13993068 -13441958 -17967361 -24542894 -23547429
43259 -23547429 -16249584 -11605610 -11100001 -10142701 -10048934 -15216410 -21440573 -19789869 -10167326
43250 -10167326 151271 8591318 16463631 19741506 13953281 6133143 8057716 18058710
43242 18058710 22792736 17045107 8526290 2902465 -1630088 -3590906 2742824 14008475
43234 14008475 17865529 11081534 4019942 2696580 1063974 -3204815 -1506380 8325265
43226 8325265 13437462 6617817 826578 8634953 20300341 19507912 10115673 7471610
43218 7471610 10752553 6005794 -6195890 -8835023 3357056 14326728 11420439 2000225
43210 2000225 -2619883 -3972296 -6855456 -6395280 2621448 12779344 13144052 5460425
43202 5460425 -132335 -1201800 -3751817 -9293400 -11867412 -8294948 -3025907 -1267039
43194 -1267039 -3043794 -5088662 -4336783 602160 7806352 12422898 11949005 9729414
43186 9729414 9756743 10256053 7062069 1446587 -1016033 1207144 3694012 2783005 -297631
43177 -297631 -2593885 -3061309 -2654969 -3666320 -8463900 -16055361 -21357626 -21310769 -19456842
43168 -19456842 -19826773 -19087178 -11625205 -641073 4636831 3296505 4746533 13310548
43160 13310548 20256188 17152737 9145555 6584907 9176000 8462590 3234624 1432579
43152 1432579 5650111 7047191 -1244451 -12051366 -12995169 -4060381 1507019 -5562982
43144 -5562982 -18640035 -23523736 -14741832 393394 11522956 14165114 9876227 3446404
43136 3446404 1381408 7211097 14630158 10874602 -7015035 -23758980 -22199559 -6115083
43128 -6115083 3365246 -4756022 -17996959 -19116253 -8417483 844112 2177738 215866
43120 215866 -1531711 -5998924 -14157269 -19984176 -17686506 -9174799 -1676012 -1044397
43112 -1044397 -8177145 -18262728 -23317942 -19984290 -14968105 -17264414 -24668741 -25333826
43104 -25333826 -14890488 -3644194 -1737450 -5177023 -4474377 -574911 -1603016 -7449981
43096 -7449981 -9498036 -5215054 -1305545 -705551 1619535 6072490 4215542 -5359720
43088 -5359720 -8787560 3819944 19807982 19146946 3127688 -7755372 -3191085 5758607
43080 5758607 7044294 3346610 1221003 -1452144 -7707263 -11851871 -8089353 -1066786
43072 -1066786 1984479 2820989 6140147 8641959 5097504 -254194 -217347 1913265 -1934173
43063 -1934173 -8737952 -7955945 389802 5226354 2369447 -1048446 -1562550 -4047495
43055 -4047495 -7981928 -4358617 7377804 14018648 9138033 5319352 14232705 26426159
43047 26426159 25679342 15058246 11997000 20992823 27483000 20053212 5208264 -3964852
43039 -3964852 -3819267 151841 2707681 2698117 1058360 -1005486 -2491542 -2351750 1028291
43030 1028291 8045260 14531876 13930278 5755639 -1868781 -2052741 2195419 3734488
43022 3734488 1776262 637524 1143507 171800 -2767340 -4919362 -5440827 -5390657 -3319193
43013 -3319193 3332695 12405726 17634008 15615918 8843912 2492267 971745 5322317
43005 5322317 10421396 7881449 -3663151 -14303769 -14049790 -5087795 2598311 4084042
42997 4084042 1492950 -2929595 -7759527 -9296746 -5753480 -2233882 -3621477 -5625125
42989 -5625125 -1934509 3336173 1642706 -4125626 -2829539 6576577 13855312 15652524
42981 15652524 19830656 28129878 29944293 20165140 9115712 5944484 5079486 -216322
42973 -216322 -2853637 6166314 20109956 25562413 22845024 22102252 22818473 13851940
42965 13851940 -5275535 -18606901 -14632482 -1469697 5725893 4241298 2941199 7165046
42957 7165046 12969228 15568332 16800624 21679048 30442215 36922819 34836789 24342371
42949 24342371 11947094 4867903 5741374 11035219 13421542 8023833 -1251261 -3996312
42941 -3996312 4523715 15833877 17717071 9250511 392477 -1982324 -238741 1617059
42933 1617059 3440906 5326169 6284576 8622444 15871183 24165946 24282348 15345054
42925 15345054 7460620 6920826 8690375 8407381 10367973 15950487 15859463 5102254
42917 5102254 -4240960 1181397 14787317 19432402 12858424 7815616 8967313 6277835
42909 6277835 -6559254 -21557872 -28702787 -27483918 -21973535 -14373373 -7822952 -6638102
42901 -6638102 -8934424 -6402350 4312915 16337382 21699513 19262091 11362904 321879
42893 321879 -8532203 -8387207 -186749 6116065 3621412 -4386459 -12450776 -19942706
42885 -19942706 -25038684 -20345110 -3086916 15680198 21041215 11350755 -1393251 -6531174
42877 -6531174 -3764009 1832714 7405393 13030170 17968727 18654011 11611237 -707272
42869 -707272 -9284280 -7752969 -627603 3473667 5114414 11375839 19631261 16677868
42861 16677868 -10726 -12216275 -3082853 18884991 30526720 23782941 11534145
42854 11534145 5899515 4643495 1286359 -3232367 -4216891 -801159 4587886 8831114
42846 8831114 7597056 -1884954 -15087795 -23179610 -24153125 -24583388 -27497757 -25969315
42838 -25969315 -14095583 1798863 9875480 7238278 1471708 57471 3932419 9918961
42830 9918961 13856100 11646581 2190380 -9731588 -16519365 -14363474 -5437105 5214242
42822 5214242 12810587 14539008 11033565 5277778 -1675967 -11465036 -22693863 -28626543
42814 -28626543 -25434155 -19169264 -17919017 -19714191 -16636872 -9543145 -7826345 -12476904
42806 -12476904 -11230971 2700096 17330436 17894235 9143136 8489319 19462287 26099989
42798 26099989 16357307 -1243360 -10649700 -8746986 -4543576 -3856664 -3940165 -1178527
42790 -1178527 3701004 8232833 10600030 9352688 5124495 2293864 4736102 10432168
42782 10432168 14464929 16219707 18226792 18724501 12526344 434447 -9672268 -13974684
42774 -13974684 -17320889 -22092802 -20658788 -7370271 7969808 9992488 -958886 -9175317
42766 -9175317 -6152902 -943213 -3752431 -10585316 -12247237 -9486434 -8240109 -5914853
42758 -5914853 4362477 17574022 18704721 4083076 -10663818 -10381685 296490 5178906
42750 5178906 -1710890 -11361896 -14206915 -10753793 -6975241 -5535362 -4555786 -1973101
42742 -1973101 1713542 4624220 6102652 7027556 7058012 3771691 -2377958 -4452231 3289229
42733 3289229 14134830 13874397 522478 -9626122 -2647490 13660989 20718862 14256428
42725 14256428 6935510 8290900 14622231 19860989 24218959 27581790 24551413 12931176
42717 12931176 416931 -3857007 -395964 2883863 454977 -6948221 -14625283 -16772947
42709 -16772947 -10430083 811808 10104237 15131605 17974662 17630778 10940549 2685759
42701 2685759 4403724 17622931 27737464 22371650 7944287 -651892 521747 5153928
42693 5153928 9716319 13667051 11878162 725037 -10659323 -9333159 1323261 4323932
42685 4323932 -6223463 -16828915 -14931145 -4375074 5163963 11530648 14620887 9125547
42677 9125547 -5756685 -17096740 -10891829 9885757 29562005 38086573 35557638 23339565
42669 23339565 3640242 -13326437 -15448726 -4980818 2566587 -185111 -3165775 2951707
42661 2951707 10114383 4950839 -9752652 -18492724 -15510745 -10950461 -12790772 -14416719
42653 -14416719 -6518642 6538699 10592705 -1062802 -20762960 -35609571 -38697163
42646 -38697163 -32184491 -23803990 -20652569 -23365778 -26040334 -23242930 -15629474 -7043702
42638 -7043702 881274 7848230 11579817 10113431 5599044 1375429 -2487734 -5742357
42630 -5742357 -3349010 7966210 20243743 20692302 8566708 -3015428 -4256460 667334
42622 667334 3087500 1597404 -99642 114768 2882165 7894083 10620779 5572561
42614 5572561 -3685995 -6371598 -698387 1924590 -4779791 -10935879 -7444732 -2545040
42606 -2545040 -7957368 -17673711 -16827255 -5639449 3109255 7159724 16222038 29822081
42598 29822081 33006401 19410859 2023113 -6423017 -9433787 -14678899 -19079429 -16683638
42590 -16683638 -11292213 -9916433 -10980815 -9582877 -8334692 -12145990 -16652705 -12915319
42582 -12915319 -1926229 5227318 1863617 -6920852 -11826052 -8794833 -846169 5152893
42574 5152893 4020025 -2003650 -4582447 484294 7366859 8831403 6990537 8751568
42566 8751568 12893942 10205339 -2344121 -14984532 -16337627 -6444179 5350089 12218081
42558 12218081 14796336 15407916 12626666 4549135 -4701851 -6288662 3362985 16113082
42550 16113082 19185008 9034972 -4507449 -9071886 -2593929 6421144 9839645 7911282
42542 7911282 5476812 3204872 -2882791 -12474601 -17055300 -10160603 1728250 6103556
42534 6103556 1214099 -3125358 -2257479 -2799542 -7723819 -8065494 1141390 8078630 776454
42525 776454 -11889295 -11600455 2381979 14294724 16479892 14719575 10464890 -1564945
42517 -1564945 -15258131 -14025553 2494276 12384229 2879968 -10427642 -9505432 -1869733
42509 -1869733 -4481015 -12951335 -8810739 8735471 19689759 11867843 -4578899 -13748307
42501 -13748307 -11697899 -4318714 2006259 3777756 1118203 -2465476 -4355909 -5151631
42493 -5151631 -3854201 3054307 11985307 10360155 -5518419 -19152933 -14575586 -1677935
42485 -1677935 -2742089 -16822220 -19348737 -1120775 14223032 3879973 -19516233
42478 -19516233 -24336008 -2690747 20963469 23044782 7736228 -4062587 -2325633
42471 -2325633 4356999 5144610 1687703 2577792 8191997 8947189 -263870 -10805147
42463 -10805147 -10313674 1948521 14992029 18902739 12777833 1909356 -7506271 -11481722
42455 -11481722 -10546999 -8831097 -8112218 -4574712 5238658 17427071 23467291 18547312
42447 18547312 5028868 -9452358 -15739898 -10390675 -1991024 -3423971 -13790739 -16758918
42439 -16758918 -3557306 12255280 13430055 3465951 -1374440 2324520 4073729 770529
42431 770529 1104106 7356037 9390310 1477033 -8472386 -11885898 -10270210 -7837301
42423 -7837301 -4076662 666800 1555722 -3033090 -7731804 -8516427 -7669785 -7223707 -5026869
42414 -5026869 -186323 4976669 9983191 15075121 15059273 5091751 -7049765 -7956502
42406 -7956502 -47998 -733757 -15209098 -26205027 -19042254 -1507085 11705398 19539542
42398 19539542 26498269 27736318 18666361 9262178 11106204 16945232 10799711 -5694849
42390 -5694849 -14683575 -8767229 221802 897673 -3510794 -4359063 429012 7785134
42382 7785134 14287703 16038990 10495012 899270 -6220299 -8430408 -7405350 -3369061
42374 -3369061 3655408 8688129 5941066 -2227303 -7954359 -8839251 -8439664 -6633770
42366 -6633770 970943 12479814 17640525 10214682 -3725396 -13080203 -12639991 -4863407
42358 -4863407 4343833 9446199 8749808 5858482 5231975 6460413 5664153 1055031 -6278639
42349 -6278639 -14459939 -19295013 -14538774 -429882 11356759 9709352 -993410 -6967095
42341 -6967095 -4488939 -2646719 -6350453 -8524661 -3221532 3801614 4008842 -1563808
42333 -1563808 -5196276 -2869081 3433572 10121142 14598645 16203726 16781462 17395616
42325 17395616 14441944 4562224 -6331777 -7077821 2794645 9565969 3316730 -7832597
42317 -7832597 -9150519 23545 6225195 1384621 -5980586 -1955220 14914857 30975527
42309 30975527 32337505 19733854 6224657 1046144 551665 -2565513 -6973183 -6034551
42301 -6034551 641504 7424031 12276621 16844598 18012268 10203679 -2786681 -9419837
42293 -9419837 -6655493 -3416757 -4102071 -1108909 9619873 17983688 14519413 5620315
42285 5620315 2741842 4881528 4010264 806207 1421676 3669480 707674 -4340602
42277 -4340602 -1729832 7669666 12003625 6034749 -3343855 -10089053 -14691373 -15256896
42269 -15256896 -7025854 4662545 4514881 -11994027 -28953547 -29552609 -16492073 -4526122
42261 -4526122 -717257 -1601678 -3577663 -5663549 -5458153 -1629314 1605224 89198
42253 89198 -2473369 165439 5824724 6442737 951617 -2390121 2348808 11426272 17750659
42244 17750659 19358604 18934805 18143908 15106746 7031558 -4886891 -13630987 -12330679
42236 -12330679 -3272570 3306133 2371707 1153044 8082881 19386028 23927249 18469681
42228 18469681 10038175 4434857 666889 -3112836 -6151292 -8949984 -13560126 -18475377
42220 -18475377 -19626008 -17534053 -16627459 -16488554 -11872993 -3395306 841406 -1951508
42212 -1951508 -3914807 402636 4371798 365722 -6830547 -7125749 -669951 3503774
42204 3503774 1521813 -2010738 -3372411 -3708538 -3854932 -2888609 -2189199 -4247128 -7335830
42195 -7335830 -7701665 -6464435 -7191838 -7314171 -938907 8734458 9842235 -1254919
42187 -1254919 -12557496 -12202788 -4295864 -1047471 -4592959 -6450944 -3053651 -1555912
42179 -1555912 -7869682 -16878956 -19589451 -15398214 -11518531 -12083045 -13587290 -11780647
42171 -11780647 -7834184 -4654758 -1034458 5562891 12336879 13331929 8697858 5843570
42163 5843570 9199266 14170857 14387406 9837515 3855974 -2552828 -7686749 -5493265
42155 -5493265 6960043 20876141 23076646 11968430 -623751 -3660683 3193351 13158973
42147 13158973 18548142 13266129 -2651332 -18722775 -21421528 -9257969 4921050
42140 4921050 9192249 4643368 -265156 -1505282 -1634877 -4112374 -8952814 -11938180
42132 -11938180 -7463187 4521264 15066115 15024241 6852578 1153842 1897008 3387198
42124 3387198 2380353 2880461 5901143 5172854 -1402362 -5698273 -1663543 5048346
42116 5048346 7481373 9037189 15353158 21701442 19625658 11654080 8146111 11444180
42108 11444180 13354141 8179894 -402023 -6320154 -8015636 -6860727 -3451364 2783911
42100 2783911 11654256 19299830 18261398 5717742 -8330532 -10034686 -1850339 -2892033
42092 -2892033 -22460397 -44202616 -47041483 -32543458 -18737057 -14097228 -12258548 -8033424
42084 -8033424 -3571840 111825 4686405 8214721 8506649 10656172 19474767 27252050
42076 27252050 22524669 8986752 1150798 2225671 1580896 -5779813 -13105618 -16189223
42068 -16189223 -17388382 -13903047 -79998 15258009 13320900 -6205953 -20266291
42061 -20266291 -14670267 -2180796 2610830 6493096 19426899 30581744 23688528 5048237
42053 5048237 -5252093 -3328963 -2156729 -6035723 -4947474 4798242 12482838 10113220
42045 10113220 3818535 2396673 4394390 2481612 -5159577 -12210377 -10737647 437857
42037 437857 12912770 16930531 13360748 11297304 11822094 4547861 -13526676 -27600927
42029 -27600927 -24707119 -13735212 -11808826 -18615861 -20285040 -12897886 -4421341 3191756
42021 3191756 14455485 23227881 15377449 -7105509 -22854263 -19025149 -6865982 -1621570
42013 -1621570 -1859372 764897 3880324 -408533 -10540624 -17729882 -18756193 -16987923
42005 -16987923 -13912664 -7810009 867814 8585453 11980596 9359496 2123845 -3682056
41997 -3682056 -2462896 2395579 1523512 -6717157 -13409536 -13148586 -11583569 -13574512
41989 -13574512 -13706129 -6958242 -205208 -2222702 -8189316 -6134097 4094043 10256749
41981 10256749 6271047 596540 3074665 11456077 15783434 11664578 4448792 1360232
41973 1360232 2874883 3698170 1669206 2042656 9454334 18627201 19931794 13567462
41965 13567462 9791929 13470188 17722491 16711943 14855739 16862875 18040178 13513579
41957 13513579 9152054 12527973 18986206 18337239 11156765 6388103 5656883 2691519
41949 2691519 -2781504 -3572359 1626124 5801299 6828531 11144478 20399831 25870642
41941 25870642 21921699 15170863 13400068 13620953 8788051 -75285 -6261950 -7294812
41933 -7294812 -5356498 -1377129 4547877 9092056 7975022 1416439 -6317781 -11131924
41925 -11131924 -10472786 -4040127 3541138 4721842 -1927254 -8100381 -5895689 1446434
41917 1446434 3960667 -2278238 -11759475 -16928262 -14176177 -4335292 7610130 14292815
41909 14292815 12198413 5768589 1806281 1313790 836848 -167164 1417938 6748862
41901 6748862 13695798 20332681 24828589 23196523 13461474 1755566 -2694485 389546
41893 389546 2312310 -838269 -2290018 3505030 10587073 10010670 3644004 1473210
41885 1473210 7358060 14964520 17428752 14374215 8803400 3342512 1155699 4677443
41877 4677443 10693897 11845774 6584589 3021006 8231328 17516826 20164163 13679208
41869 13679208 5918076 3807500 6581264 10865904 15433881 18092452 14292122 3806065
41861 3806065 -5531510 -6035778 622496 6790806 8379074 6524797 3582891 3533884 12425421
41852 12425421 29741616 41635432 33573715 10718499 -5151325 -2586983 6113991
41845 6113991 4204940 -6963692 -13858598 -11384039 -5902588 -1591023 4256463 12491914
41837 12491914 18725898 20184565 18116909 12310133 1126857 -11176703 -15222648 -8359482
41829 -8359482 467310 1653750 -4177211 -9723085 -10685603 -7994469 -4355934 -2662639
41821 -2662639 -4870398 -9030099 -10222630 -7379225 -5905593 -10126785 -16311518 -17211606
41813 -17211606 -11058062 -2139512 5282086 9555920 10247948 8703363 8643692 11774211
41805 11774211 13911071 10192754 3307786 875848 4082271 5020367 -1846883 -10727552
41797 -10727552 -11713740 -3879090 4365869 7076165 7047388 8604224 9329968 3642490 -7676429
41788 -7676429 -16855285 -18379752 -14439562 -9836450 -5881843 -2099796 173264 455511
41780 455511 2437360 8815467 14141999 9576499 -4100321 -14485342 -11883164 -1224588
41772 -1224588 4419910 -410015 -8378385 -8896830 507579 12650344 18545556 15907196
41764 15907196 9994743 6690506 6713948 7884328 10046287 13601631 15085356 10418612
41756 10418612 3113120 2823159 12964221 24992723 28560429 22993112 14812225 8156073
41748 8156073 3046406 441780 2757986 9145303 14661500 15478815 12718239 10291346
41740 10291346 10071806 9780763 5786647 -1848037 -8338768 -9478800 -6023342 -427910
41732 -427910 7569453 17180027 21636948 15190529 4003799 456070 5460432 6897087
41724 6897087 -1215285 -9332648 -8218117 -3235217 -3811834 -7618238 -5985339 1417326
41716 1417326 8100788 11937802 14597086 14591858 11403757 11885124 21028701 30093526 26029350
41707 26029350 10090274 -4728319 -11769291 -13405255 -9176542 2692092 12723916
41700 12723916 6890395 -10897675 -19681097 -10332915 2203863 2971335 -1882854 1496707
41692 1496707 12734825 21095109 22656851 21936666 22214425 23890635 27422658 29945069
41684 29945069 24685045 11561951 2395435 7222280 20694350 30111933 31687955 30402398
41676 30402398 28593863 23995356 16364512 8258844 1050336 -4553433 -7289524 -8724367
41668 -8724367 -12500218 -16224080 -11946357 -122112 6702648 2110291 -2851334 2710427
41660 2710427 11271654 10340385 4462673 5948791 10437038 2658610 -15239110 -22548524
41652 -22548524 -10392753 5866726 10555675 7099968 5833319 7434592 7897944 7672870
41644 7672870 6456168 -193592 -9700804 -8756994 8048252 24967177 23263449 6541115
41636 6541115 -5038086 -2254034 4672253 4901351 1705050 3683424 9655606 10005274
41628 10005274 1499233 -5527119 893209 16463527 21589628 5303650 -17512313 -22774910
41620 -22774910 -8546475 3412450 -808335 -9176509 -4878657 7996559 13072391 7203876
41612 7203876 2075602 3784187 5556474 1783265 -2816005 -1646955 4448561 9672978
41604 9672978 9257211 1247613 -12013350 -22694783 -23221303 -15132399 -8029671 -8591128
41596 -8591128 -14344649 -18422660 -16298694 -7984229 1987036 7064192 5635570 4434651
41588 4434651 9777584 17122387 16466959 7187617 -1129075 -3173152 -3532856 -5272013
41580 -5272013 -3177458 5905768 14816502 15808488 11935100 10673320 11666749 9788473
41572 9788473 6447828 7915874 13798128 16527095 12810410 7495300 4798582 3132780
41564 3132780 881195 776578 5212463 11656953 15352494 13438509 5715021 -4646725
41556 -4646725 -11180109 -10201455 -6784183 -8127818 -11020974 -5058866 9646231 19220705
41548 19220705 16378260 12612379 19797344 29271065 23837844 5310932 -6462059 -1737585
41540 -1737585 7899324 9593048 5384567 1875206 -2453538 -9536046 -12099528 -3938729
41532 -3938729 7165169 8998174 2876372 215486 4265861 7661025 7024427 7040530
41524 7040530 8339783 4082241 -6443512 -11754314 -3296029 11028170 16671273 10912134
41516 10912134 3737415 3243685 7494341 10043385 7860867 3737406 4445119 15342452
41508 15342452 33106353 45499840 42955856 29606603 18448470 16167388 17419476
41501 17419476 14114358 5345166 -3146401 -5117502 2148491 15983455 28363179 31193995
41493 31193995 24014626 13858938 5998344 -1168905 -9442202 -14234248 -10596817 -2818385
41485 -2818385 -578631 -5770322 -10465748 -9707881 -8967763 -14396321 -21561823 -20766222 -10878726
41476 -10878726 -972269 1643361 -728759 -1429812 1925934 6036855 6442990 2109721
41468 2109721 -2940515 -2762342 3734809 10343299 10990967 7846592 7129795 8306896 4657529
41459 4657529 -4688979 -11505018 -10730563 -8336872 -11306628 -16267353 -15453295 -9096349
41451 -9096349 -3420339 478323 6367409 12699066 12668589 6180502 2772620 8453070
41443 8453070 16462899 16376575 7669594 -1260846 -4625022 -4193524 -3577103 -2573658 924112
41434 924112 5612968 6212588 -149674 -7740261 -6130423 7117468 21056961 23659260
41426 23659260 17186746 14195753 18947015 22404774 18764920 16370173 23692775 32520573
41418 32520573 27954432 12252250 4294986 12488831 21710071 15273831 -707421 -7032757
41410 -7032757 667852 8199693 6189700 2327064 5433831 10244204 7570354 824352
41402 824352 791677 8490442 14652669 14485093 12253540 11392977 10512690 10623969 16299341
41393 16299341 26631669 33778203 33737881 30504887 27050209 21832603 17899202 24359083
41385 24359083 42163370 58422318 63007369 62029494 66415994 76162468 85791807 96582770
41377 96582770 111793729 127884872 143494712 169497521 215132871 270625094 320422135
41370 320422135 368108655 427738610 492034139 531359265 528339254 494176986 445782835
41363 445782835 387103527 321791313 264496088 225198246 195814411 165265169 136188120
41356 136188120 114941519 97560255 79654909 69062659 72589427 78770324 70988240
41349 70988240 52418713 41299030 44384232 50905073 51641233 48765918 45944941 42641628
41341 42641628 40829570 45279706 53608528 55982020 48263735 37166842 29402644 23458828
41333 23458828 15495229 6983338 2857523 5793056 13660662 19785570 17154217 6547531
41325 6547531 -1927119 -380634 7238742 12830265 16143920 20638516 23154639 19824333
41317 19824333 18236124 28874727 45419585 49663178 38412836 29350108 34574909 43664131
41309 43664131 41595734 29985073 19664593 13386726 8373206 7427199 13833714 20367722
41301 20367722 16606069 5076456 -1184270 3604537 12285081 16395871 14598682 9312916
41293 9312916 3211008 221212 3053726 8284795 9559953 6585880 5598938 10016662
41285 10016662 15618716 16258312 10622520 2914253 -227994 5036981 13655162 13543574
41277 13543574 -256778 -15544188 -15189162 1205026 16759163 19025317 12138002 4768986
41269 4768986 -2323074 -9773834 -11191349 -2508525 6574203 3008185 -10260678 -17493805
41261 -17493805 -12609163 -6177546 -7114913 -9392175 -4023471 4945328 6250998 -1731659
41253 -1731659 -9773680 -11666147 -10363775 -9715607 -7894476 -1915497 6520801 12809081
41245 12809081 14082863 10563297 5386371 4030220 9937476 18933065 21967658 16040210
41237 16040210 8835230 9124964 15474399 18695329 14006377 6394288 3562532 6598316
41229 6598316 8915073 3653118 -8033243 -16353159 -12422343 938067 10686882 7699506
41221 7699506 -3309772 -10659875 -9615893 -5309105 -3862818 -6181312 -10552989 -15709018
41213 -15709018 -19071378 -16489098 -7459002 1873548 4786839 2192323 1374912 6277996
41205 6277996 11997877 10523172 280450 -12037193 -18587036 -17199867 -10770523 -2533346
41197 -2533346 5139720 7922961 -129354 -19750593 -40783308 -47682510 -34010403 -10589793
41189 -10589793 4032145 2115994 -7070945 -10917881 -8762438 -8270858 -9998081 -5412988
41181 -5412988 7525984 16810790 11629275 -1851517 -9402446 -8905909 -10442578 -17817063
41173 -17817063 -22285343 -17192202 -8005909 -2699200 -750473 2154573 5154182 4510519
41165 4510519 384171 -4109822 -7044093 -7177298 -3962067 -1516710 -6603458 -18044814
41157 -18044814 -24525078 -18820773 -8083422 -3097962 -3349800 -1143893 4654617 8925259
41149 8925259 11011494 14779228 19206543 18554519 12009569 4744282 -810828 -6771255
41141 -6771255 -12713544 -14927272 -13550124 -12716575 -12719777 -9842667 -4928980 -3462053 -5050098
41132 -5050098 -1971675 7811099 14727061 10623795 1028369 -2587780 1618424 5026446
41124 5026446 1077870 -7485643 -13436303 -12577651 -6147525 1231856 5318708 5339954 3468547
41115 3468547 1112414 -2848227 -9293846 -15912606 -18743781 -16472002 -12126392 -9933562
41107 -9933562 -10626671 -10998072 -8917122 -6695396 -6450988 -4290209 4801888 16326036
41099 16326036 18451360 7927637 -3804262 -5427723 544404 5356694 8046830 12908008
41091 12908008 18462340 19269321 15503325 11216667 6222794 -442186 -2524841 5992248
41083 5992248 17170845 15751755 304299 -14140690 -16325137 -10474689 -5797333 -5486892
41075 -5486892 -9066167 -15005850 -17698278 -11785556 -2202632 501508 -2988312 -865344
41067 -865344 9459623 14919584 6888720 -5472220 -10061498 -7945296 -5553178 -2435481
41059 -2435481 2362817 1988464 -7950636 -18699331 -19574849 -12905465 -6834574 -998015
41051 -998015 8084079 14611879 11203595 4053647 5070164 11749577 10655171 213093
41043 213093 -6292440 -2819323 281828 -4765273 -9010574 -1214235 13353630 19730505
41035 19730505 13885034 6095519 5002890 7220972 4813642 -3345306 -11988118 -17823932
41027 -17823932 -21915249 -23866346 -19847538 -10220247 -4209805 -9813672 -20850998 -22250902
41019 -22250902 -9169718 6932904 13609256 11191329 7578213 6462870 6040121 4213821
41011 4213821 176923 -5434433 -9171718 -8183335 -6279359 -9762174 -16117517 -16281687
41003 -16281687 -10200851 -7978866 -11218316 -7785726 6517507 16342755 9726281 -1279482
40995 -1279482 451799 9194776 7372910 -3739782 -6797127 1603890 6429651 598127
40987 598127 -5490581 -4500493 -2369543 -2384753 1942938 10296056 9903253 -3018122 -12231698
40978 -12231698 -4629913 9109105 11426080 4646033 4665739 14616691 21553871 17819088
40970 17819088 11060708 10469496 13746960 12376301 3870910 -5453471 -7947504 -3016878
40962 -3016878 2014465 232913 -6321890 -9587454 -6635951 -2734355 -2259646 -2936351
40954 -2936351 -2060115 -2068103 -5144088 -7518381 -4774140 975112 4692602 6144029 8491122
40945 8491122 11250367 10065159 2998338 -6645756 -13250701 -12343867 -2901626 11024632
40937 11024632 22334878 26654696 24822226 19168968 11081863 3973689 3644679 11225352
40929 11225352 19068260 18662657 10732051 2771228 -1972388 -7538581 -16682109 -24138627
40921 -24138627 -21620152 -8093767 7425950 14140701 10002224 3099234 2356439 8185470
40913 8185470 13381657 11652771 3273948 -6164293 -9859149 -3981907 8683249 19787449
40905 19787449 23332682 21843236 21396843 22180720 19000125 10309166 665579 -6306474
40897 -6306474 -11224942 -13868272 -11344263 -4290964 1038399 1052749 325111 4045215 8960191
40888 8960191 7595401 -577685 -7879681 -8201415 -3562402 -31193 -540251 -3544018
40880 -3544018 -6578262 -8317611 -7233957 -1303486 8333622 14968521 11864218 1078872
40872 1078872 -7192047 -5940706 1674868 8532199 11899871 12497366 10727681 8811297
40864 8811297 11560639 18866664 22078698 14800285 2609967 -5936040 -12826859 -24647573
40856 -24647573 -37100588 -38374509 -27300415 -15690308 -11429069 -10763672 -9000787 -7242841
40848 -7242841 -6026966 -3639358 -3412303 -10758848 -19783026 -16127306 1595566 16608067
40840 16608067 17324725 12681798 14860975 19560329 16210055 7979336 6918985 14490698
40832 14490698 20362591 18238764 11813021 5979401 949562 -5026819 -12599132 -19435955
40824 -19435955 -18742769 -5460470 12340715 17067499 3424179 -12496876 -14832468 -9074973
40816 -9074973 -9743515 -15969768 -15310270 -6773263 -2502213 -6792450 -9525096 -3466439
40808 -3466439 5439893 9539170 10034144 10846213 10804496 7486052 2613023 -789963 -2284808
40799 -2284808 -2814730 -3758277 -7771535 -15601858 -21978642 -20312768 -11743337 -4079118
40791 -4079118 -2121306 -4811924 -10619094 -17911050 -20188923 -10211563 8282085 20564993
40783 20564993 16953063 4104873 -2999030 2991101 15851586 23006792 17771158 6439939
40775 6439939 2138040 9271913 17446496 15207321 5384447 -444112 997062 2771558
40767 2771558 1222638 707606 3664295 5665810 3463843 431195 955873 5161978
40759 5161978 10706958 14271686 11345514 1367523 -7321881 -5701345 2878572 6623451
40751 6623451 2087621 -3008781 -3690242 -2179407 2918711 17067998 34278424 36421700
40743 36421700 17713193 -3113685 -7214335 -1362130 -4902302 -19202324 -27111597 -19881100
40735 -19881100 -7973235 -3088322 -3125487 89205 8084860 16553322 22302329 24167495
40727 24167495 21226015 14584053 8786092 8395103 13799735 21121151 25346296 24147025
40719 24147025 20128281 18082154 18224076 14468537 2656304 -11638379 -17990028 -13052777
40711 -13052777 -3520859 2435186 2665066 -55873 -2642531 -4200117 -6361932 -11301875
40703 -11301875 -17583632 -19679969 -15189000 -10771848 -15318909 -27171336 -34350090 -29619193
40695 -29619193 -19633647 -15311696 -17818864 -19451430 -15355262 -7854150 92685 8786752
40687 8786752 16997108 19183890 12424068 3162630 1598309 9644352 18871736 20955779
40679 20955779 15948651 8639211 1072753 -7463531 -15345809 -18091977 -13375532 -4075627
40671 -4075627 4088215 6698045 3257708 -2265892 -4108640 -202603 5204019 6449807
40663 6449807 3383712 556936 -407188 -3831868 -13354368 -25007094 -30355431 -26047273
40655 -26047273 -17102010 -9741806 -3949290 3707840 11584227 12865121 5857570 -1000373
40647 -1000373 643966 7688216 11127826 10224067 11982250 16705882 15034552 3314987
40639 3314987 -8210740 -9506054 -4753478 -3732917 -6026398 -4209372 1588596 3648697
40631 3648697 9615 -2297313 1811390 9342766 15166566 17659401 17803988 17898960 20520991
40622 20520991 23963023 21296043 9957000 -1533692 -4282206 -2198799 -4454977 -9046964
40614 -9046964 -7146945 -1532674 -4601792 -16354485 -20978189 -11017257 471351 541281
40606 541281 -4430144 -1337089 8584606 14093506 12312726 10179374 11258380 11998737
40598 11998737 9688354 6008438 3734950 5434931 12730944 21700033 22861839 11830792
40590 11830792 -3103762 -9541537 -4307532 6007156 13684998 14336252 7250828 -3145540
40582 -3145540 -9457951 -8972846 -5473048 -1542389 3919858 7916678 3396517 -6993794
40574 -6993794 -8440759 5235687 18682535 15120610 313039 -8200642 -8475196 -13094673
40566 -13094673 -24234154 -29042493 -22001505 -14584589 -16640174 -21941322 -19962678 -11640279
40558 -11640279 -5255407 -3848195 -4216292 -3853410 -2883568 -1742745 -691002 329091
40550 329091 2755964 7502852 11526849 9979131 2472874 -5848665 -9375407 -5622549
40542 -5622549 4277720 15030526 19570483 16154311 10286693 5974026 270619 -8273767
40534 -8273767 -12962120 -9290826 -4972879 -8517067 -13857177 -9412197 2726896 11455705
40526 11455705 15689536 21106666 21398972 4481970 -21605477 -32350830 -22185676 -13378086
40518 -13378086 -20086488 -26607955 -16079854 479712 3657895 -2859238 -3176553 782926
40510 782926 -4915661 -17209879 -18038162 -4456540 5783349 1615384 -7489914 -9462693
40502 -9462693 -4919613 671296 5507613 6414836 -1426610 -13124619 -14249918 47567
40494 47567 15698427 17011675 5374735 -6434103 -11397712 -11799988 -10791276 -8642050
40486 -8642050 -5730411 -3577713 -2890224 -2737034 -1061290 3450619 7550576 3948202
40478 3948202 -8596015 -17989794 -10795383 8098999 18307199 9910959 -3776798 -5750459
40470 -5750459 1698056 3078401 -7072223 -17910335 -17988612 -8412361 1062613 3164169
40462 3164169 -1807280 -8642629 -12717661 -13231789 -11497924 -7524208 -916516 5512710
40454 5512710 7276087 4204644 964337 665102 1960206 2832784 2154055 -2694647 -12856143
40445 -12856143 -21583779 -19276653 -7793747 -447786 -2962640 -4379387 5794850 21213376
40437 21213376 29447476 30274723 30654586 28722517 18323973 5551097 3567154 10835698
40429 10835698 11606848 1474239 -4608290 2766393 10410646 2608543 -13549973 -17972150
40421 -17972150 -6299127 6406473 8967528 6939110 9581025 15447601 16922159 12161652
40413 12161652 6080776 2703853 1821521 1954446 2271707 1438714 -1753553 -5083527 -3202030
40404 -3202030 5566743 14306723 13899533 4692819 -3173251 -2942719 990306 2434221
40396 2434221 4057888 10935549 17906609 13907681 -1469513 -15469574 -17830815 -10772129
40388 -10772129 -1987691 3746460 4164263 -63809 -1786292 6200363 17952717 18292973
40380 18292973 4503688 -7737817 -6911933 -1398595 -2532083 -4568163 3525299 15519556
40372 15519556 14996984 959172 -10800158 -11440496 -8675068 -10938352 -15747212 -17301986
40364 -17301986 -14567484 -8430877 63510 6555451 6821429 3938401 3443411 2769027
40356 2769027 -3562854 -9864384 -4383236 10930029 20803532 19256118 16026443 16300921
40348 16300921 11518993 -1554462 -9649991 -3103832 6801247 4544905 -6631088 -12790212
40340 -12790212 -11191871 -9012250 -7170329 -1114627 6201658 6848668 1825627 -194270
40332 -194270 2797264 4099161 13913 -6145082 -11134367 -14352947 -14490734 -11080086
40324 -11080086 -7182309 -3977251 2544152 11706776 12111884 -2851778 -19614000 -19174843
40316 -19174843 -3861620 6129286 1717906 -5599465 -4678442 630179 2116729 -856516
40308 -856516 -5261071 -9149498 -8255821 1325101 13014201 13267048 -218722 -14286929
40300 -14286929 -18627130 -17254172 -16826704 -15477474 -10521862 -6571664 -7379838 -8243946
40292 -8243946 -4685309 -833562 -1216918 -1700671 3085325 9813063 12024629 9959956
40284 9959956 7565600 5317408 2766269 2298179 3761256 1665194 -5680243 -11202270
40276 -11202270 -10152416 -8280364 -10863478 -12045716 -5207306 3835736 5657042 2703759
40268 2703759 3531130 7238203 7111476 5188796 8419569 13015255 8198006 -4668009
40260 -4668009 -11834278 -7649523 -952589 1578739 3988880 8440737 8116179 -168964
40252 -168964 -8057914 -8299792 -5242846 -4588604 -2110133 7748950 19230178 21358898
40244 21358898 12459636 591487 -6443529 -4682389 7012064 23038608 30501601 22042351
40236 22042351 6770254 -436285 1751107 2279170 -3015768 -5042202 2659023 12203627
40228 12203627 12401395 4895398 1263574 6673489 13770133 13484096 6604268 1748000
40220 1748000 4113205 9547907 10483560 5641615 1077862 1394253 3297048 821545
40212 821545 -5113968 -7228496 -2807111 411699 -6970472 -23020317 -34457298 -30866689
40204 -30866689 -16605218 -6268985 -8677193 -17502689 -19107788 -8564364 4456146
40197 4456146 6420510 -5315019 -20108318 -25152407 -16745478 -1212371 11799243 15437637
40189 15437637 8493321 -3542681 -10622728 -5598551 8237174 19182670 18865132 10541224
40181 10541224 3712897 2408477 2524026 237972 -1836073 721461 6747074 10562058
40173 10562058 9358239 6156928 5180172 6768902 7748982 5427847 590363 -2818136
40165 -2818136 -1286208 4019703 7494075 5432413 1253677 1415200 6296989 9265348
40157 9265348 6312554 2115481 2758306 6253905 6268031 3121082 3146317 6402362 4161151
40148 4161151 -6456030 -13454649 -4529687 13965175 23230166 16015613 3561315 -2698034
40140 -2698034 -4760980 -8507201 -11453554 -8976796 -5127614 -6799464 -11633137 -12029245
40132 -12029245 -8427810 -8200012 -12446397 -14162928 -10048544 -4665227 -1544233 1058844
40124 1058844 4108199 6161646 9072227 15938094 21902568 17900631 6421669 1391779
40116 1391779 7400006 12008215 6347095 -124457 3222165 8867928 4547080 -3620078
40108 -3620078 -304893 11608274 13180668 -433511 -11438837 -6089348 7157421 14400814
40100 14400814 16518440 21237407 25887098 21611969 9393435 -473475 -3375874 -5105632
40092 -5105632 -11193373 -18914286 -21657008 -16855475 -8334380 -3043707 -5038559 -10692458
40084 -10692458 -11287063 -2776958 8539235 12745478 7385303 -929069 -4985881 -4035571
40076 -4035571 -2161844 -1848596 -802633 4310300 11552599 13675986 6555198 -4463174
40068 -4463174 -10384894 -9341391 -6806216 -6042155 -4794254 -2316810 -2434899 -6379168
40060 -6379168 -9023789 -6816303 -3780929 -4103348 -4019903 1587482 8254082 6469836 -3588546
40051 -3588546 -10415033 -6198178 3341521 7389623 3148961 -3492191 -6861067 -6540726
40043 -6540726 -4910643 -3534034 -2292346 35288 4501509 9785255 11534968 6139204
40035 6139204 -4029127 -11136152 -9682216 -2894600 1033796 -1062201 -3985820 -1756559
40027 -1756559 4742442 10223209 12326475 12549887 11448561 7832027 3107869 2004837
40019 2004837 7284755 16652192 25999590 32719874 34827269 30516427 20927015 10678952
40011 10678952 3379404 -1258951 -4028150 -2843307 4048388 13160878 17805026 15418049
40003 15418049 10453785 8726934 9991338 8200844 203926 -7910956 -7328288 475537
39995 475537 3506761 -4052340 -11423970 -5595208 8379323 12888074 3020799 -6433356
39987 -6433356 -3143301 5507864 5189706 -4363658 -11108210 -8153149 230206 7211493
39979 7211493 9362199 5538319 -2414734 -8222861 -6907536 -1946056 -1556678 -8209183
39971 -8209183 -16191766 -18607101 -12917179 -1647927 8123632 8791908 745242 -6223905
39963 -6223905 -5444596 -3158524 -8583226 -18536389 -21877622 -16759177 -11979267 -11294004
39955 -11294004 -8641083 -1785301 1185545 -4930234 -12135494 -9711899 1398598 11855470
39947 11855470 16739689 18077820 17667099 14123970 6687652 -1903043 -6386000 -2391643
39939 -2391643 8405363 16524533 13101776 1351935 -6089581 -3171890 2867641 3625939
39931 3625939 428967 -2083585 -5281256 -11264687 -14189715 -6832884 6781464 14510483
39923 14510483 11167638 2870485 -2986589 -4541238 -2387955 2497022 6455958 5636290
39915 5636290 2509490 3555896 8531538 8836809 92443 -9798025 -10392724 -2384227
39907 -2384227 4250330 3682328 160393 452425 4949679 8259627 6495209 1869912
39899 1869912 -60740 2896354 6501520 4944436 -1118813 -3429765 4952117 20401505
39891 20401505 31129359 29688669 20705900 14069598 12522593 10128228 2759780 -5364864
39883 -5364864 -8392280 -7477293 -8038053 -11506232 -15050005 -16778613 -15044441 -5478463
39875 -5478463 12560548 28005917 27633781 15185831 8956329 15789997 20324049 8791097
39867 8791097 -8642216 -12708625 -3392377 2885079 -131510 -2501179 1254096 3098792
39859 3098792 -2078260 -6397516 -3449327 -329922 -5210533 -12449767 -11332467 -3249056
39851 -3249056 1202962 -1334482 -4194795 -3080912 -1458859 -2653997 -4577896 -4586440 -3625503
39842 -3625503 -3012330 -1602695 1211984 2997611 1530959 -1248738 -831158 4802812
39834 4802812 12750901 17523522 15578045 8330717 1353420 185285 5682312 12591153
39826 12591153 13785527 8259317 4514468 11933150 27432955 35981267 28283840 12556126
39818 12556126 2396632 -1559139 -7929407 -16236135 -15999804 -5497989 2538098 -406612
39810 -406612 -6470871 -5894830 -2779991 -5919531 -12494973 -13113575 -7529977 -3231257 -2133727
39801 -2133727 -806775 -1486287 -9933478 -22019117 -24670499 -13216167 1767369 8245980
39793 8245980 5620660 1115529 473293 5061801 11955388 14444432 8098374 -2090504
39785 -2090504 -6425039 -3260117 -239251 -1604316 -2226421 2705755 9412858 11336094
39777 11336094 7817158 3047625 424683 498977 815604 -2986143 -11319811 -16759719
39769 -16759719 -13012409 -6692847 -10094465 -21590599 -25605187 -15686521 -4174714 -1913520
39761 -1913520 -1927064 5587875 13997140 11161846 1694915 1029726 10261001 13938605 4372631
39752 4372631 -7100739 -8037425 -1875571 2043 -5236380 -10643923 -9913745 -3308329
39744 -3308329 3850329 4904811 -3053238 -14839464 -20532694 -15731012 -6291072 -927015
39736 -927015 -1389086 -2228504 1174157 6714882 8156931 3134227 -2722009 -1972949 4335689
39727 4335689 6613348 -847296 -11427121 -13908520 -5362463 7714042 17658637 20222353
39719 20222353 14576287 5097320 641305 5514669 13156022 15040054 12764464 13119721
39711 13119721 14097076 7011155 -7224298 -15740812 -11253421 -1903658 1543797 -205975
39703 -205975 188972 4653020 9033614 9691791 5444240 -2626550 -8960538 -6457696 3439624
39694 3439624 9075449 2657773 -9245088 -15476518 -15027908 -14147321 -13577695 -8924447
39686 -8924447 -2069994 -1801904 -11283009 -22841211 -27891636 -25985148 -21584192 -17389683
39678 -17389683 -13891235 -11080723 -7400658 -398987 8621256 13538947 10086381 1456935
39670 1456935 -5553587 -8151910 -8423053 -8453170 -8631420 -10344928 -15426144 -20681275 -17218906
39661 -17218906 -458580 20426915 29183662 20453680 5745913 -2026059 -4277288 -10267886
39653 -10267886 -19308597 -20259945 -9485421 1615165 2039911 -4599926 -8411621 -8563718
39645 -8563718 -10833402 -14380535 -12015658 -2902199 5250063 8195248 10023433 12843923
39637 12843923 10554490 -1027469 -14374113 -18179064 -11676800 -4121360 -2065947 -4186757
39629 -4186757 -8138443 -15002328 -24527238 -31613192 -31364135 -24559423 -15302258 -6193861
39621 -6193861 1288640 4878131 4168918 2928172 4190473 4948125 1303593 -2556295
39613 -2556295 1657717 12250414 16241909 6912878 -5113073 -5972203 2098301 5431145
39605 5431145 -338994 -5957797 -5389847 -4771466 -9778032 -14609349 -11987520 -6968714
39597 -6968714 -10423100 -21717347 -28041970 -21740015 -10198224 -5735547 -11419663 -20251937
39589 -20251937 -24253017 -20651804 -11849570 -3335514 -747088 -5551725 -13093539 -16779471
39581 -16779471 -14433861 -9128274 -4350516 -1172531 -583561 -4647963 -12354059 -17394439
39573 -17394439 -14876926 -8686864 -6411506 -7484203 -3997515 4724339 7288910 -3821740
39565 -3821740 -18823571 -22571375 -15686963 -12873164 -20964099 -29665575 -27007736 -15043993
39557 -15043993 -5157710 -3712364 -7577452 -10515281 -9628605 -6499305 -3947031 -1785981
39549 -1785981 2644541 8447558 9767952 4498022 -473656 797918 3425552 920350
39541 920350 -1141540 6341685 17550060 18247394 10241878 10758613 23885220 32013970
39533 32013970 23275028 8665334 1340242 -2540864 -8517333 -7762448 5335896 15410111
39525 15410111 7776959 -4737846 -833541 13257643 14263598 3099532 5362495 28466620
39517 28466620 47272195 41297623 21819934 9946811 8027479 6634691 3703399 2258294
39509 2258294 770570 -2125620 -3066123 -3053538 -9608683 -21005297 -21959099 -6744067
39501 -6744067 6720075 856032 -14337796 -15204661 1516247 16256108 15154833 4486664
39493 4486664 -3733498 -6230045 -5486283 -2982615 351645 2991963 4373016 4315494 2084326
39484 2084326 -744658 -93914 3758998 4350911 -501134 -3089064 1535206 4405163
39476 4405163 -4856180 -19652462 -23581865 -13658642 -3103468 -802456 -859440 4667227
39468 4667227 13782048 19576006 18750455 11672641 1581396 -3551065 3330619 17028063
39460 17028063 22110385 11107667 -5547840 -12472813 -6766379 2189828 5453433 1853204
39452 1853204 -3925907 -5709139 -211582 9583540 16980262 19095954 18977773 18940439 16409048
39443 16409048 9564186 2844598 1964830 5817723 8216924 6723992 5016208 5880727
39435 5880727 6073257 995942 -7309872 -10483154 -3332964 9439125 18720292 21695052
39427 21695052 22820765 24326031 21959223 13273223 4244846 1765400 3569767 2640308
39419 2640308 -1048283 -1320086 2551073 3850205 -209994 -3234394 513564 7382885
39411 7382885 9925077 6427873 446034 -5242236 -9546257 -10805816 -8290085 -4494359
39403 -4494359 -2440816 -2085876 -2307239 -4438825 -9982034 -15946940 -16800158 -11724419 -6726248
39394 -6726248 -7919589 -14406163 -19397076 -17809604 -11485931 -6629587 -6859987 -9677928
39386 -9677928 -9711763 -4520072 3058103 7472618 5403655 -581558 -3636725 -166146
39378 -166146 4597244 2531377 -5027181 -6580857 4012214 16612445 16211229 2485883
39370 2485883 -9821107 -9714076 -1476094 4379815 4718807 4178513 6424675 9965809
39362 9965809 11367071 9248515 4923031 584457 -2501596 -3797466 -2077286 3697320
39354 3697320 11499925 17123928 19378953 20915124 22035697 18781507 10771360 4922235
39346 4922235 5363690 5594413 -1064801 -8660361 -6948625 1621764 6311992 7304728 14998641
39337 14998641 28517111 31490146 15950652 -3742572 -10054766 -3739345 3761406 8573138
39329 8573138 12841404 13480255 6692840 -702620 2005948 12782832 18482170 13021542
39321 13021542 3979543 652068 4492686 12285070 20428559 24293690 20566561 12644893
39313 12644893 8078452 8644251 7876851 511990 -9714160 -14198634 -9337009 -661772
39305 -661772 2606428 -2511638 -8896968 -7991411 -1310469 2217585 277713 -117375 3612121
39296 3612121 4052089 -1515540 -2183229 9878276 23271776 22165521 10714600 6663352
39288 6663352 14086072 19642145 15722859 9965797 8663508 7221833 3120533 3498255
39280 3498255 11457104 17276335 13111672 6765978 10473932 22646361 30204068 24766841
39272 24766841 9268303 -7690303 -18164643 -19074853 -14649819 -11591214 -10147314 -5521853
39264 -5521853 1236529 2863053 -1083509 -1569409 4601213 7878303 1261171 -8400998
39256 -8400998 -12984103 -16241484 -23709614 -29219232 -24211490 -13074708 -6314404 -4690517
39248 -4690517 -2885519 -2426691 -6495636 -7521406 3473585 18314282 19833268 7975457
39240 7975457 446347 5893327 13828900 14860994 13316124 12946604 6923446 -7391721
39232 -7391721 -17639463 -13306549 -3196412 -2555377 -9786062 -9993837 1503587 12486480
39224 12486480 11384942 1102873 -7751952 -10224674 -9252222 -8296937 -6573466 -2351718
39216 -2351718 1684103 280406 -6115283 -9441088 -4477622 2922499 4474136 2670346
39208 2670346 6340965 15087727 19234159 15713723 12106980 12170661 9633146 1509554
39200 1509554 -4302962 -2008218 2287887 2329346 3225056 11065923 19838196 20176883 14082559
39191 14082559 9082693 4136686 -5472353 -14223467 -12190193 -2838073 -297456 -8069112
39183 -8069112 -14023191 -9423359 -685779 2494541 668360 625160 5143363 11674358
39175 11674358 15920460 13564577 3681997 -7247437 -10143752 -4091936 3100444 6290425
39167 6290425 8356884 12295081 15241564 14117717 11245721 10048536 9624980 7445230
39159 7445230 4011021 1803179 2166783 4608190 6281029 2451663 -7778467 -16558479
39151 -16558479 -14556433 -4005115 2469606 -2093742 -11056807 -14567293 -10457466 -1687580
39143 -1687580 9046649 17144926 15734488 3923131 -9536032 -16146345 -16344696 -13774912
39135 -13774912 -7617463 2427709 9405698 6381962 -2464413 -6171568 -814832 7977206
39127 7977206 14610276 18384198 19624795 18156362 16172960 16677347 18164048 15722428
39119 15722428 8165136 -23868 -4152880 -3189000 1343703 6586649 9281829 9357141
39111 9357141 11261820 17296270 21462972 16098837 3966948 -3169139 940881 10370355
39103 10370355 16585328 18094022 17436036 14977554 11078630 9890010 14223165 18279681
39095 18279681 12029142 -5902589 -24132168 -29735816 -21516722 -10159250 -6308923 -10424386
39087 -10424386 -14374019 -11273079 -2308851 5730044 7869103 4915074 1292688 878074
39079 878074 4933284 12029791 18481781 19822687 14022103 3943480 -4648536 -8417718
39071 -8417718 -8788140 -8304813 -6976642 -4650103 -4313509 -7745793 -9064364 -453441 13644183
39062 13644183 17081999 3016007 -13593969 -14248820 -1931979 4610051 -1262028 -6858849
39054 -6858849 -2580271 3782032 2235455 -2614501 -549177 6965040 9886366 5288484
39046 5288484 -415233 -2511540 -2426005 -2289914 -2238959 -2451707 -2591931 -788763 2599570
39037 2599570 3551864 1381068 2260921 9300172 14352781 8443065 -3696277 -9476366
39029 -9476366 -6174995 -2027376 -832620 2742944 11001170 17455217 16996304 12834610
39021 12834610 9282996 5657861 1663482 1157767 5136585 7445577 3622198 -914160
39013 -914160 2135724 11992149 19811396 19938533 14965108 10008307 6141822 577550
39005 577550 -8428540 -17802917 -21271486 -15721379 -5260560 3180982 7840376 12794348
38997 12794348 20458073 26829414 26031056 17780931 8591914 5683281 9904392 14898888
38989 14898888 14342357 9589003 7419961 10237149 13133984 12234084 10196879 9930841
38981 9930841 8761218 4193371 144627 977716 4025163 5031334 6284336 11230271
38973 11230271 15412015 12064270 3272196 -3977185 -9446152 -17024983 -23862445 -23713466
38965 -23713466 -18349834 -13307063 -5575570 9467219 21311348 13188289 -10606683 -25542691
38957 -25542691 -20105308 -9297649 -7485723 -7584038 565118 9331694 7430962 838093
38949 838093 1268259 4269991 -1778830 -11693923 -8677082 8412614 21079480 16229456
38941 16229456 935993 -10215089 -10781844 -3068478 6741449 11174400 6933718 -347787
38933 -347787 -2742956 -713419 -190594 -594460 5085983 17733239 28515056 30482183
38925 30482183 27006512 25440542 26894773 25616612 17167715 5764780 1976605 10322621
38917 10322621 20921765 20482283 11338028 8755866 16565647 19609694 8630136 -2083507
38909 -2083507 3881408 17961095 19164322 6026479 -3575381 -299812 8938583 19267181
38901 19267181 32865724 44064323 40347039 23708800 12438103 14847220 18704712
38894 18704712 14420292 10609069 15706111 20984226 16126520 8103537 8903938 15076239
38886 15076239 15709083 12720691 16412290 25902457 30514977 28364506 28024409 31859355
38878 31859355 32397649 27503433 25958526 33471315 43653001 48114346 47386583 46978035
38870 46978035 49533445 55443242 64603048 72537198 71318582 61170825 56019980 68807194
38862 68807194 93400305 110097310 109910090 105123793 112786709 135505981 164332564 194242087
38854 194242087 227960871 267298301 309770810 353176265 394528362 424095458 430778544
38847 430778544 416371868 394698168 372751879 343517715 302978166 261388795 227759028
38840 227759028 195477475 157462836 125096701 113760757 115811841 108143606 84843999
38833 84843999 62503242 52229511 46627168 38762744 34414091 37881514 42807274 45534705
38825 45534705 51435513 59017600 54592685 34492704 16946944 17834247 28067444 29822274
38817 29822274 22748897 17821826 16283452 12667867 9969876 13223748 14898556 5738627
38809 5738627 -5214847 -1465168 13104815 17710400 5832101 -6810584 -7453259 -743174
38801 -743174 5549927 11199429 14376946 8631998 -3635136 -8935817 -940756 12041186
38793 12041186 23380984 36863030 51651974 54777323 40490940 23773961 21014547
38786 21014547 27760577 29345854 24291338 22032532 24279459 24486287 21999721 21625671
38778 21625671 21024956 13138898 1295965 -1808652 7656106 19257196 23715079 22850088
38770 22850088 21316819 19598600 19737517 27159796 39881887 45167876 35916379 23715830
38762 23715830 25311184 39302329 46435930 33406161 8374767 -9270873 -8793750 4844042
38754 4844042 19106481 24960789 21681650 14554667 9240739 7599287 7653433 6442577
38746 6442577 3049379 187568 2592533 11486625 20580960 21489152 14625868 9768295
38738 9768295 12294249 14743080 8962321 1337121 4686373 16712081 20303370 8517543
38730 8517543 -4721909 -6482711 -4015796 -9614211 -17337199 -12319970 2480763 8576353
38722 8576353 918779 -4894561 987975 7465041 2700613 -6406441 -7464805 -2798672
38714 -2798672 -2050318 -3823133 -324495 5311304 2238105 -9194293 -15742075 -9412777
38706 -9412777 3654751 13504816 16542463 15072068 14582780 20607274 30733336 32686113
38698 32686113 19659015 3585276 844461 7896866 6538980 -6988552 -15638441 -8216599
38690 -8216599 4537382 8022263 2880957 -3572194 -11526734 -22292426 -28506325 -24021244
38682 -24021244 -16318013 -16744713 -23919688 -28046343 -26458891 -23359418 -18504137 -8375574
38674 -8375574 3556154 8925360 6022039 63145 -6509655 -14807094 -22037546 -22660313
38666 -22660313 -16607854 -8541698 -374771 7752670 11893111 8960976 4301545 4433093
38658 4433093 5150548 -1174815 -9082398 -5800599 6396117 10372834 700150 -6626653
38650 -6626653 984454 13114384 12873738 1392848 -7036077 -5940533 46898 6826944
38642 6826944 12892302 13410601 4586474 -7220031 -11059395 -5691561 238985 1306377
38634 1306377 94251 -218076 543327 3075806 7463530 8675370 1690542 -8545080
38626 -8545080 -11079175 -4093945 2644871 2402691 -466999 -298124 1032043 210431 -90968
38617 -90968 3832678 9876278 13881166 15188737 13145853 3845537 -12675591 -26966270
38609 -26966270 -30401394 -27654197 -29544269 -34886864 -30256532 -10243226 11942134 20214472
38601 20214472 15166916 9881679 9809238 6566386 -6414555 -20331793 -20052807 -3997716
38593 -3997716 12376641 14604885 5102814 -2729592 -1877335 2945942 5330715 5022123
38585 5022123 4276172 2908787 583661 -700581 -506204 -2558979 -8968338 -14871209
38577 -14871209 -13754455 -6046720 2320924 7899319 10811899 9384023 594910 -12968220
38569 -12968220 -22555936 -22513081 -16350511 -11302336 -10178345 -11068335 -12077510 -12931512 -13199655
38560 -13199655 -11964590 -9494404 -7661422 -8016534 -9679066 -9730666 -6589130 -2603811
38552 -2603811 -1084662 -490378 4539448 14077957 19353213 13224791 822379 -6705426
38544 -6705426 -6738348 -5662830 -5871403 -2022424 7486658 14749114 13206430 6965947 3422014
38535 3422014 2839810 1842211 1676202 5115130 8983456 7929345 3243609 165034 -1447270
38526 -1447270 -5166760 -7973647 -2226878 10591688 17566171 10374534 -3291253 -9635927
38518 -9635927 -5116078 2528396 6134563 6365813 8134995 13708452 19478873 18500557
38510 18500557 8036858 -4659340 -7878577 709226 9628536 7176929 -3598601 -9027877
38502 -9027877 -2549267 8045828 12292157 10057730 8769818 11193739 12123199 8011890
38494 8011890 4544942 9719337 20943159 25366983 15969094 2283438 -1003159 6387804
38486 6387804 10357316 2820248 -7032985 -6864023 1346440 6767144 7763109 13006303
38478 13006303 24663130 31976459 26339838 14146109 7510208 7668994 5728398 -2286860
38470 -2286860 -9025348 -5739394 6351763 16864722 16536874 6075180 -4353262 -5226294
38462 -5226294 2282848 8835954 9945890 10908316 15368893 16027599 5039720 -10937437
38454 -10937437 -17124448 -10805115 -3369283 -931928 4127835 16968280 27870395 25518852
38446 25518852 14015760 5995558 4840898 4779004 4469726 8673684 17494591 24267354
38438 24267354 24548222 19231540 9707865 -1645205 -7666243 -3109108 5211253 5464121
38430 5464121 -1611891 -3648916 3159439 7730012 2728135 -3042426 1067310 11127939
38422 11127939 16246692 14968953 13749641 14212861 12194289 6998754 2870084 2031759
38414 2031759 2600750 2575998 1385507 -759733 -1716488 1022981 4564490 1734423 -7942133
38405 -7942133 -15129729 -14474047 -13887786 -21219519 -28608868 -22371751 -4981399 6007229
38397 6007229 1368583 -8997702 -11133628 -3377664 5677143 7856448 450366 -13130817
38389 -13130817 -23977909 -23504559 -12007088 1066947 6609070 3447482 -2604910 -3737184
38381 -3737184 4501860 18309586 27034577 23866489 13779111 6438672 3873863 1370856
38373 1370856 -1879894 -1287173 4137844 9043768 9336097 6328105 2201721 -3168578
38365 -3168578 -9826347 -16460071 -21264060 -20434757 -8829935 11824583 28728425 30260954
38357 30260954 20422183 12497270 10454411 6734156 -2592699 -11853238 -15887861 -15411878
38349 -15411878 -10765965 -979436 8844758 9898785 2220674 -5116195 -8251207 -11579512
38341 -11579512 -14406032 -8495122 5424164 12125629 1466079 -16980035 -27181198
38334 -27181198 -25163824 -16509849 -5228369 5621462 10610223 8752255 7046911 9627729
38326 9627729 10943982 6949321 3782915 6438694 8388423 3154376 -2928805 -1928466
38318 -1928466 -156760 -8420826 -22003634 -25399333 -14586723 -1029939 5554767 6320717
38310 6320717 5497021 4390724 3529752 1856808 -5492224 -20226754 -33637969 -35464424
38302 -35464424 -28268763 -23557667 -25153149 -26297063 -22524621 -17517250 -15433947 -15514018
38294 -15514018 -14934885 -11058327 -2440900 6556856 6141570 -6322592 -18666374 -17940339
38286 -17940339 -7582130 -691537 -1255824 -3743001 -6511483 -11764334 -15255945 -10595319
38278 -10595319 -2248811 -66814 -2342807 741885 7981949 7851567 -1409644 -9385469
38270 -9385469 -12527850 -17790564 -24376378 -20738590 -5482930 6751033 7376266 4501059
38262 4501059 4078112 -780856 -11304715 -12844720 2230419 17345690 13984603 -1466871
38254 -1466871 -9767305 -6961997 -3314880 -2730766 -746671 2729872 4735453 8644020
38246 8644020 17496643 22734208 14506527 -1076870 -10183952 -12769934 -19418213 -29155076
38238 -29155076 -28409519 -13620403 1605394 6213894 5027873 7324450 13345244 17562127
38230 17562127 16743950 10516693 925882 -6154830 -6136180 -3264926 -5350457 -10635074
38222 -10635074 -9219458 1127133 10502318 10917319 5420290 -34138 -4256869 -5828077
38214 -5828077 143558 13202265 22269004 17065848 1550131 -10095842 -9249614 -701518
38206 -701518 3948452 -1779980 -13062561 -18843354 -14031038 -4960300 -260895 253440
38198 253440 2359912 6584946 8431984 7482079 7259237 6728185 1746083 -4730054 -4844311
38189 -4844311 -92192 -1534580 -11803681 -19050158 -15238281 -8602468 -8834968 -10768444
38181 -10768444 -4813465 4853239 6794500 2049055 2352032 9898933 13532175 7496348
38173 7496348 929377 3074058 9226914 9057152 2417007 -1238221 3403534 10812213
38165 10812213 11732210 3479698 -7496023 -12411250 -9670101 -6602106 -9703736 -15219580
38157 -15219580 -14639550 -8955596 -9578034 -21603135 -33603146 -31385173 -17514128 -8158651
38149 -8158651 -11467027 -18135882 -15741345 -4526826 6057180 10894697 12552066 13444639
38141 13444639 11226479 2969709 -9682267 -20649242 -23391008 -15811607 -3312205 4394537
38133 4394537 2198438 -5490411 -10434894 -8911314 -2231908 6909858 13944658 12397774
38125 12397774 1465738 -9067137 -9643133 -4603686 -5267700 -10651209 -7914616 5774396
38117 5774396 15911491 11806127 2356022 1099924 6329787 7825973 4712732 3342259
38109 3342259 3682350 1651040 674085 6765538 14666340 13094574 2831015 -4297799
38101 -4297799 -4264491 -4362328 -7071741 -5773588 147010 1254261 -4897853 -6739713 3237966
38092 3237966 15417050 17116182 9717078 2796156 263608 1685215 9097589 22036887
38084 22036887 31726871 29943490 19407452 7882261 -2512345 -12363473 -17686355 -15063217
38076 -15063217 -9363673 -7011790 -5360036 2114520 13137403 18253274 13571253 4699267
38068 4699267 -356105 3047971 13609456 21675074 15091227 -5313469 -22134879 -21782360
38060 -21782360 -12108694 -9434549 -14246384 -12940616 -305366 13435195 17544841 11168282
38052 11168282 -755106 -11291859 -12220269 -1805247 9075877 9147023 2995165 3362471
38044 3362471 10045780 10961580 2756694 -5930905 -12060048 -21234508 -30498405 -26978815
38036 -26978815 -9967773 3393116 2673601 -2343329 -1702986 -1220457 -6495431 -8337226
38028 -8337226 116849 6586965 -1931049 -15981501 -18420588 -12729508 -15243008 -25291038
38020 -25291038 -25484509 -10170954 7251822 16409342 20008457 19629924 11038071 -1047567
38012 -1047567 -2136809 9338136 14534378 467520 -19305733 -23185671 -11208171 -2075252
38004 -2075252 -5352513 -10407935 -3790299 12311239 22904881 17223967 -284530 -15590808
37996 -15590808 -20308314 -18808276 -18688883 -18709910 -12684275 -2775793 736142 -5471094
37988 -5471094 -11984148 -9945646 -2522553 2079403 2698312 4059873 7862635 11163434
37980 11163434 11331166 7989707 1951684 -4235773 -6786932 -4829570 -2027930 -1546851
37972 -1546851 -1751359 638767 5462373 9620727 10843614 9209960 6486203 4678293
37964 4678293 3610869 701940 -4321481 -6778281 -3719316 -326408 -2393382 -5045731
37956 -5045731 746295 11269790 12735175 3324927 -1816841 5803675 13554238 7439434
37948 7439434 -5855687 -10476372 -5621938 -2342512 -2199490 3389145 14146919 18234331
37940 18234331 10917547 1701865 -1058682 -331873 -585937 677170 5171675 7127474
37932 7127474 1911791 -5331949 -6693000 -2244828 2436488 5629479 10275636 17455256
37924 17455256 23915523 25697368 21777986 14500048 6900671 -1100359 -11975245 -23569307
37916 -23569307 -26659497 -15902201 -604668 4212165 -2820273 -8301502 -3260802 6703080
37908 6703080 13110006 15523011 15695488 11293781 2890434 -1727977 1251674 3925714
37900 3925714 -838029 -6685619 -4303404 1839489 274233 -7594404 -8211234 3712048
37892 3712048 17888242 23082488 18123598 6465179 -9050783 -22200229 -24395846 -15453938
37884 -15453938 -5901327 -3757949 -5930490 -6776166 -6983877 -8086595 -6043865 1863456
37876 1863456 9802730 11369316 9919090 12134168 15286188 11072002 427726 -5982034
37868 -5982034 -3120105 1764154 518783 -5481081 -9892596 -10425233 -9444156 -9845833 -13307101
37859 -13307101 -18984265 -22117696 -18242001 -10305899 -6268274 -7675007 -7080500 40991
37851 40991 8197042 11792437 14462645 20573178 23922599 15684723 328688 -7650627
37843 -7650627 -2461616 7512557 13055545 12790662 7772269 -1339081 -8758009 -6270026
37835 -6270026 3864153 8954212 3989330 -1359396 -482921 -1863220 -12476892 -21117014
37827 -21117014 -13887893 1899588 7308302 695076 -2389558 2772582 3316910 -5552600
37819 -5552600 -9148433 1976955 13621100 9043259 -4604001 -7833661 1831228 9756753
37811 9756753 8865644 6589967 7555899 6116936 -275641 -4528824 -2681164 -1632054
37803 -1632054 -6885180 -11905524 -7919247 2645138 10917029 14451879 16501887 16170562
37795 16170562 9317465 -985396 -4043631 5460649 20013304 27974856 25461031 16609380
37787 16609380 6166162 -3393049 -9108027 -7321929 1863609 12566712 18054142 16961082
37779 16961082 12624800 6909177 -1625959 -11687985 -15760676 -8571912 2526383 3951465
37771 3951465 -4938846 -8033352 5340389 22485403 23341391 9753964 3165874 12337950
37763 12337950 20793884 13773299 1113534 -514246 4925918 1862588 -8367689 -9860075
37755 -9860075 -1146694 740208 -10743672 -20022733 -15434151 -7235905 -6997386 -6830523
37747 -6830523 3682757 14065658 7351805 -10617076 -18006414 -9776938 -3100850 -9530892
37739 -9530892 -20584044 -24614280 -21708709 -16419441 -9432766 -2794222 -2523145 -10129243
37731 -10129243 -19749773 -26984181 -32213858 -33719028 -27576380 -16200622 -6823164 -539904
37723 -539904 6053438 8992075 1427172 -9479728 -8008022 4263866 7639283 -3958586
37715 -3958586 -11404179 -1484566 11435666 10525366 3835115 6630755 13037453 9010327
37707 9010327 1181300 6601450 20924249 23306309 10555523 1140815 4189498 8193951
37699 8193951 4330525 -917542 -2254806 -4582760 -8143191 -3139129 11864727 22734063
37691 22734063 20890510 16682066 20656074 25052942 17087955 509890 -9801495 -8669476
37683 -8669476 -4130387 -3668498 -6675927 -8917391 -7565424 -2775568 2042213 3582300
37675 3582300 3623574 6371542 10322437 9456398 3807046 879917 4193994 8744061 10859357
37666 10859357 13833499 19779579 24266276 23444107 18921990 12225616 2814385 -5604198
37658 -5604198 -6985574 -4760584 -10143901 -23514639 -29870472 -19861735 -2941790 8854321
37650 8854321 17350792 27820347 34810687 31909214 25255107 22921614 19980075 9369548
37642 9369548 -1013810 450264 7473241 4740441 -5287821 -4755144 10445283 23819684
37634 23819684 23990568 18739775 17006909 13604696 1632296 -12457516 -17024166 -10744332
37626 -10744332 -1663112 3143405 807689 -8046781 -17283057 -18111385 -9338817 27006
37618 27006 2214155 -937565 -4317683 -6981735 -8482545 -5286884 2473436 6960070
37610 6960070 2954611 -2784466 -832811 5848975 5498915 -4786354 -13977470 -11571984
37602 -11571984 -138921 9847231 12566348 9949079 5400500 -161741 -5836232 -8792500
37594 -8792500 -7619801 -5426405 -5994756 -7604385 -5121333 992744 3221324 -1918669
37586 -1918669 -6169541 925188 17137700 28830884 26658262 13996078 -257944 -10623310
37578 -10623310 -15222764 -13720020 -9028309 -6705846 -8614046 -10057116 -6619900 -1200129
37570 -1200129 -373158 -5298413 -10246926 -10374686 -7912863 -8923884 -14829979 -19093469
37562 -19093469 -13846033 350991 13444878 15825395 7650335 -3252926 -10572314 -13711677
37554 -13711677 -14461826 -13719180 -12303193 -12117793 -14597411 -18478472 -19924770 -15781880
37546 -15781880 -7711414 -1870159 -1898368 -3630568 -1334551 2108210 -1038070 -8596866
37538 -8596866 -7817869 5408251 17125852 14246113 3931914 1603753 6177991 2885538
37530 2885538 -11351121 -21916588 -18838932 -10726682 -10093042 -15715864 -17234872 -10161306
37522 -10161306 351214 6381496 4002670 -3078914 -5610725 466045 6501191 2327843
37514 2327843 -6672775 -5653561 5870629 11132834 2156534 -6527274 -93705 13518266
37506 13518266 16058826 5697098 -2941923 -791026 6601473 10230759 7498254 1894182
37498 1894182 427234 8784397 22029520 24634444 8547701 -13141068 -20670745 -12113464
37490 -12113464 -2349137 -506904 -1535995 -228153 -9783 -3794670 -7174082 -6550394
37482 -6550394 -5895041 -9289353 -12592437 -8666467 2244075 12105660 13885419 8283778
37474 8283778 2267814 1442660 3672381 2137415 -4440402 -9041629 -6921199 -3383019
37466 -3383019 -5236265 -9881576 -10808085 -9126340 -9703270 -9668916 -2822724 6349597 6409813
37457 6409813 -2690339 -8425923 -4961554 412720 3819775 12203961 26590886 33099035
37449 33099035 22708620 7913018 5337627 10981717 8947291 -1246931 -4234099 5222953
37441 5222953 13366151 8856878 -1110565 -3345931 2886703 8327639 8230876 6148686
37433 6148686 5942441 6641446 5396765 2024411 -422280 703050 3573590 3646690 1356570
37424 1356570 4049561 14656411 21973675 12038128 -10372061 -22676528 -11929740 8201320
37416 8201320 15781792 8183435 539265 1334908 2789026 -3640787 -14390391 -21713574
37408 -21713574 -25614006 -30452090 -34850743 -32818502 -23267481 -12190735 -5169055 -1700135
37400 -1700135 2846909 12171704 25091315 34344575 31358162 15698701 -1931141 -10041910
37392 -10041910 -8036461 -3282550 838453 6852763 13945283 15746793 10405210 5340947
37384 5340947 7012983 11632027 11517340 6092957 611690 -2524076 -4855357 -6505695
37376 -6505695 -5697614 -2536092 1391977 5685900 9320327 8937158 4013853 646062
37368 646062 3972538 9839991 11374665 10791330 14949011 20615175 16080774 -173844
37360 -173844 -13769789 -12848054 -3171851 1774230 -1467665 -5850799 -5808710 -2158467 2053776
37351 2053776 4439575 3645320 813826 -1384246 -3210921 -7103930 -10591161 -6923245
37343 -6923245 3006112 7150365 -2207160 -15910279 -19212178 -10473027 21586 4968001
37335 4968001 4012935 -2614205 -12643925 -16474919 -6105705 10682955 17316578 10597959
37327 10597959 3312117 2634827 402165 -8967348 -14840306 -5735367 11260615 19179615
37319 19179615 14304591 8706419 11483756 18093035 19446064 13564896 5512826 581416
37311 581416 33123 1541866 2873810 5251544 11239607 18969048 22526615 19948596
37303 19948596 15978454 13789034 9532796 82544 -9155517 -10976226 -6886001 -3267099
37295 -3267099 -37351 8323868 21686123 32654675 36147789 32958543 23846507 8908119
37287 8908119 -5549542 -8840577 728566 11253905 11198600 2658174 -4327493 -5787091
37279 -5787091 -5947778 -8380136 -11464379 -12276092 -10351250 -7081674 -4152339 -2774439
37271 -2774439 -2680584 -2079669 275090 3634658 6497917 8044237 7865461 6135837 4691430
37262 4691430 5668648 7949978 7140553 643590 -8501918 -13659046 -9756937 2385790
37254 2385790 14592106 16168334 4902483 -7740497 -8368296 1359920 6692466 165425
37246 165425 -8583917 -7812308 -250696 2730535 -2328729 -8791702 -10760435 -7730816
37238 -7730816 -447163 9746216 17870532 18691221 13465047 8011077 5056233 4126155
37230 4126155 7051485 15943323 26201736 29511781 24716965 18691808 15878924 14595719
37222 14595719 14407434 17985691 22906590 20836549 9750965 -957953 -3233891 -1144789
37214 -1144789 -2589572 -6655238 -6700566 -1205281 5792334 11021907 11795439 4170174 -10238928
37205 -10238928 -19583338 -14024913 -508366 5544443 2526762 3961501 14957307 21146603
37197 21146603 9733683 -8964702 -13890228 -2362303 7015498 1395371 -9102160
37190 -9102160 -7348198 6802404 18117371 17351555 10414872 5831413 3030252 -2273453
37182 -2273453 -8536130 -11222292 -10629808 -9635372 -7099405 -1813405 -354982 -10267484
37174 -10267484 -25214924 -28947713 -17834894 -7573725 -10443738 -17234497 -12749685 -77387
37166 -77387 5225360 190385 -2522684 3630994 10049157 9456295 7349921 10028580 12613177
37157 12613177 8023615 -264629 -3714462 -1369297 1395514 2196684 1728267 -1417117
37149 -1417117 -7830545 -12573915 -11735611 -10616784 -16095132 -23165898 -19969711 -6071288
37141 -6071288 5845934 8837770 10466024 17417840 22636782 16999578 5375432 -691389
37133 -691389 -1486318 -7283832 -18888388 -23462587 -13868793 -859826 1823240 -3387757
37125 -3387757 -3525522 4400024 9757926 5492026 -1474560 -1501065 3860850 6110517 3231374
37116 3231374 714590 763619 -842879 -5195547 -5491325 2612051 10922618 6626760 -10675696
37107 -10675696 -26627451 -28182849 -16545739 -1783360 9806168 17879012 21412782
37100 21412782 17392171 6954374 -2691874 -5222600 -1191046 4634595 8873819 10364178
37092 10364178 8525223 4297053 945066 613958 1144637 -682524 -3886066 -4797968
37084 -4797968 -3116451 -2182696 -2650306 -187177 8202903 18411032 22655880 17803875
37076 17803875 8573996 2726742 3496278 6350077 3935938 -4579990 -10909409 -7587410
37068 -7587410 846760 1863582 -9077711 -22097816 -25216262 -18302873 -10510062 -7356092
37060 -7356092 -5801196 -1103800 6125747 10628293 8143070 45981 -7097342 -7774828
37052 -7774828 -3553755 -550619 -953923 -1344254 -448910 -2673248 -10400787 -18115960 -19026655
37043 -19026655 -13155951 -4163035 6622538 16965555 20358379 14431456 8149510 10635650
37035 10635650 16389837 13369614 3663841 1989439 12152485 19723857 13632044 1729186
37027 1729186 -3600987 -3967044 -7976849 -13947440 -12466126 -2748850 4945525 2991247
37019 2991247 -5590864 -12689554 -12669920 -5337572 3542225 6503871 3717887 4574975 14395549
37010 14395549 24359677 22808284 12318916 4901255 2597812 -4238207 -18009410 -26498899
37002 -26498899 -20263466 -6882620 117660 -1166005 -3225065 -2999468 -3414227 -3971132
36994 -3971132 -304431 6217476 7500021 393670 -7640432 -8756686 -5089344 -3541617
36986 -3541617 -4407549 -2257122 3354922 5770422 1414408 -4542368 -6192311 -4941897
36978 -4941897 -4625097 -3484882 1961053 8105494 7642170 1162009 -2890464 -719707
36970 -719707 2608606 3346075 4399957 6451093 2904557 -9306153 -21181258 -22277299
36962 -22277299 -14431866 -6281535 954391 11743408 23050363 24588226 13652992 464892
36954 464892 -4199082 -256659 4861143 5224000 740917 -3066967 507770 10758037
36946 10758037 17065466 11246584 410162 -902250 9502393 19419116 20568223 17736132
36938 17736132 16346231 12345971 1218732 -11976625 -19591591 -21737630 -21893155 -17930010
$$ [...]
##END NTUPLES=NMR SPECTRUM
##END=
