##TITLE=31Pdec_SR75+TFAA20
 DMSO, 24 sc
 9.6.2022
##JCAMPDX= 6.0         $$ Bruker NMR JCAMP-DX V2.0
##DATA TYPE= NMR SPECTRUM
##DATA CLASS= NTUPLES
##ORIGIN= UXNMR, Bruker Analytische Messtechnik GmbH
##OWNER= root
$$ XWIN-NMR		Version 3.5
$$ Thu Jun  9 15:11:13 2022 Russian Standard Time (UT+4h)  she@DPX200
##.OBSERVE FREQUENCY= 81.013821
##.OBSERVE NUCLEUS= ^31P
##.ACQUISITION MODE= SIMULTANEOUS
##.ACQUISITION SCHEME= undefined
##.AVERAGES= 24
##.DIGITISER RES= 16
##SPECTROMETER/DATA SYSTEM= spect
##.PULSE SEQUENCE= zgpg30
##.SOLVENT NAME= Acetone
##.SHIFT REFERENCE= (INTERNAL, Acetone, 0, 248.564)
##AUDIT TRAIL= $$ (NUMBER, WHEN, WHO, WHERE, WHAT)
$$ ##TITLE= Audit trail, XWIN-NMR		Version 3.5
$$ ##JCAMPDX= 5.01
$$ ##ORIGIN= Bruker BioSpin GmbH
$$ ##OWNER= she
$$ F:/spectra/data/she/nmr/P31/1/pdata/1/auditp.txt
$$ ##AUDIT TRAIL=  $$ (NUMBER, WHEN, WHO, WHERE, WHAT)
(   1,<2022-06-09 15:09:52.00 +0400>,<she>,<DPX200>,
      <created by zg, POWCHK disabled, PULCHK disabled
       configuration hash MD5:
       00 E9 B6 7A A2 85 ED C7 34 08 36 98 17 FE 4E 26
       data hash MD5: 32K
       90 20 0B EC CE 56 06 F2 9C 86 68 B4 6B 22 1B E4>)
(   2,<2022-06-09 15:10:03.25 +0400>,<she>,<DPX200>,
      <Start of raw data processing
       efp BC_mod = 2 LB = 1 FT_mod = 6 PKNL = 1 PHC0 = -10250.45 PHC1 = 2.853455 SI = 64K 
       data hash MD5: 64K
       04 58 F4 13 8C 33 04 D3 A3 D5 E6 BF 8E 33 1B BA>)
(   3,<2022-06-09 15:10:26.04 +0400>,<she>,<DPX200>,
      <pk PHC0 = -8.03366 PHC1 = 0 
       data hash MD5: 64K
       0B A7 67 34 9F 2C 61 08 6B 53 65 0E 9E 67 51 34>)
$$ ##END=
$$ 
$$ hash MD5
$$ BC 8C 90 92 AC 36 D4 A3 B7 7C 21 44 13 E8 4B 79
##$RELAX= 
##$RELAX= 
##$RELAX= 
##$RELAX= 
##$RELAX= 
##$RELAX= 
##$RELAX= 
##$RELAX= 
$$ Bruker specific parameters
$$ --------------------------
##$DU= <F:/spectra>
##$EXPNO= 1
##$NAME= <P31>
##$PROCNO= 1
##$TYPE= <nmr>
##$USER= <she>
##$AMP= (0..31)
100 100 100 100 100 100 100 100 100 100 100 100 100 100 100 100 100 100 
100 100 100 100 100 100 100 100 100 100 100 100 100 100 
##$AQSEQ= 0
##$AQ_mod= 1
##$AUNM= <au_zg>
##$AUTOPOS= <>
##$BF1= 81.014009
##$BF2= 200.13
##$BF3= 200.13
##$BF4= 200.13
##$BF5= 200.13
##$BF6= 200.13
##$BF7= 200.13
##$BF8= 200.13
##$BYTORDA= 1
##$CFDGTYP= 0
##$CFRGTYP= 5
##$CHEMSTR= <none>
##$CNST= (0..31)
1 1 145 1 1 1 1 1 1 1 1 1 1 1 1 1 1 1 1 1 1 1 1 1 1 1 1 1 1 1 1 1 
##$CPDPRG= <waltz16>
##$CPDPRG1= <>
##$CPDPRG2= <waltz16>
##$CPDPRG3= <>
##$CPDPRG4= <mlev>
##$CPDPRG5= <mlev>
##$CPDPRG6= <mlev>
##$CPDPRG7= <mlev>
##$CPDPRG8= <mlev>
##$CPDPRGB= <>
##$CPDPRGT= <>
##$D= (0..31)
0 1 0 0 0 0 0 0 0 0 0 0.03 2e-05 3e-06 0 0 0 0 0 0 0 0 0 0 0 0 0 0 0 0 
0 0 
##$DATE= 1654772991
##$DBL= (0..7)
120 120 120 11 120 120 24 19 
##$DBP= (0..7)
150 150 150 150 150 150 150 150 
##$DBP07= 0
##$DBPNAM0= <>
##$DBPNAM1= <>
##$DBPNAM2= <>
##$DBPNAM3= <>
##$DBPNAM4= <>
##$DBPNAM5= <>
##$DBPNAM6= <>
##$DBPNAM7= <>
##$DBPOAL= (0..7)
0.5 0.5 0.5 0.5 0.5 0.5 0.5 0.5 
##$DBPOFFS= (0..7)
$$ [...]
##$SUBNAM2= <"">
##$SUBNAM3= <"">
##$SUBNAM4= <"">
##$SUBNAM5= <"">
##$SUBNAM6= <"">
##$SUBNAM7= <"">
##$SUBNAM8= <"">
##$SUBNAM9= <"">
##$SW= 501.771253377433
##$SWIBOX= (0..15)
0 1 3 0 0 0 0 0 0 0 0 0 0 0 0 0 
##$SW_h= 40650.406504065
##$TD= 32768
##$TD0= 1
##$TE= 0
##$TE2= 300
##$TE3= 300
##$TEG= 300
##$TL= (0..7)
0 120 53 12 22 120 120 120 
##$TP= (0..7)
150 150 150 150 150 150 150 150 
##$TP07= 0
##$TPNAME0= <>
##$TPNAME1= <>
##$TPNAME2= <>
##$TPNAME3= <>
##$TPNAME4= <>
##$TPNAME5= <>
##$TPNAME6= <>
##$TPNAME7= <>
##$TPOAL= (0..7)
0.5 0.5 0.5 0.5 0.5 0.5 0.5 0.5 
##$TPOFFS= (0..7)
0 0 0 0 0 0 0 0 
##$TUNHIN= 0
##$TUNHOUT= 0
##$TUNXOUT= 0
##$USERA1= <user>
##$USERA2= <user>
##$USERA3= <user>
##$USERA4= <user>
##$USERA5= <user>
##$V9= 5
##$VALIST= <valist>
##$VCLIST= <CCCCCCCCCCCCCCC>
##$VD= 0
##$VDLIST= <DDDDDDDDDDDDDDD>
##$VPLIST= <PPPPPPPPPPPPPPP>
##$VTLIST= <TTTTTTTTTTTTTTT>
##$WBST= 1024
##$WBSW= 4
##$XGAIN= (0..3)
0 0 0 0 
##$XL= 0
##$YL= 0
##$YMAX_a= 2826
##$YMIN_a= -2963
##$ZGOPTNS= <>
##$ZL1= 120
##$ZL2= 120
##$ZL3= 120
##$ZL4= 120
##$ABSF1= 0
##$ABSF2= 0
##$ABSG= 0
##$ABSL= 0
##$ALPHA= 0
##$AQORDER= 0
##$ASSFAC= 0
##$ASSFACI= 0
##$ASSFACX= 0
##$ASSWID= 0
##$AUNMP= <proc_1d>
##$AZFE= 0.1
##$AZFW= 0.5
##$BCFW= 0
##$BC_mod= 2
##$BYTORDP= 0
##$COROFFS= 0
##$CY= -3
##$DATMOD= 1
##$DC= 0
##$DFILT= <>
##$DTYPP= 0
##$F1P= 0
##$F2P= 0
##$FCOR= 1
##$FTSIZE= 65536
##$FT_mod= 6
##$GAMMA= 0
##$GB= 0
##$INTBC= 1
##$INTSCL= 5.30512e-09
##$ISEN= 30
##$LB= 1
##$LEV0= 0
##$LPBIN= 0
##$MAXI= 10000
##$MC2= 0
##$MEAN= 0
##$ME_mod= 0
##$MI= 50
##$NCOEF= 0
##$NC_proc= -8
##$NLEV= 6
##$NOISF1= 182.463
##$NOISF2= 159.3651
##$NSP= 0
##$NTH_PI= 0
##$NZP= 0
##$OFFSET= 248.5645
##$PC= 4
##$PHC0= -10258.48
##$PHC1= 2.853455
##$PH_mod= 1
##$PKNL= yes
##$PPARMOD= 0
##$PSCAL= 0
##$PSIGN= 0
##$REVERSE= no
##$SF= 81.014009
##$SI= 65536
##$SIGF1= 159.3651
##$SIGF2= -187.1042
##$SINO= 113.3802
##$SIOLD= 16384
##$SREGLST= <1H.CDCl3>
##$SSB= 0
##$STSI= 65536
##$STSR= 0
##$SW_p= 40650.406504065
##$SYMM= 0
##$S_DEV= 0
##$TDeff= 32768
##$TDoff= 0
##$TI= <>
##$TILT= no
##$TM1= 0
##$TM2= 0
##$TOPLEV= 0
##$USERP1= <user>
##$USERP2= <user>
##$USERP3= <user>
##$USERP4= <user>
##$USERP5= <user>
##$WDW= 1
##$XDIM= 65536
##$YMAX_p= 461494036
##$YMIN_p= -35147411
$$ End of Bruker specific parameters
$$ ---------------------------------
##NTUPLES= NMR SPECTRUM
##VAR_NAME=  FREQUENCY,     SPECTRUM/REAL,   SPECTRUM/IMAG
##SYMBOL=    X,             R,               I
##VAR_TYPE=  INDEPENDENT,   DEPENDENT,       DEPENDENT
##VAR_FORM=  AFFN,          ASDF,            ASDF
##VAR_DIM=   65536,         65536,           65536
##UNITS=     HZ,            ARBITRARY UNITS, ARBITRARY UNITS
##FACTOR=    0.620285442955139, 1,           1
##FIRST=     20137.2065510759, 0,            0
##LAST=      -20513.1999529892, 0,           0
##MIN=       -20513.1999529892, -35147411,   0
##MAX=       20137.2065510759, 461494036,    0
$$ Real data points
##PAGE= N=1
##DATA TABLE= (X++(R..R)), XYDATA
$$ [...]
13046b571361O8860r34707j141475R72832L494172L585989Q17174k643667m357151
13037b709334l480457q36416J832124K702262J348775j00872R87757L523994K964365
13028F232198j923275n453391k296389L967061N247421O47556l064872k610873
13020G45436j889937k936832j866375K455962M264569Q78280j388117J698562
13012A961548L414623k459212q553401m170470O263584Q532789M95250n399505
13004H5206k382708J767162Q0729k296678Q88024N179649L426308j799998k902800
12995B044894M36635K215693M45082j230286q33799l01736p46385q62498k90833
12986H76767m10242j413080j718130n84343Q56225J117247l67167k649217l158150
$$ plain form
13046 -2571361 -2502501 -3437208 -4578683 -3605851 -111679 3474310 4291484 1647817 -2709334
13037 -2709334 -6189791 -7026207 -5194083 -2491821 -1143046 -1243918 -256161 3267833 6232198
13028 6232198 4308923 -1144468 -3440857 526204 5773625 6421181 3356309 745436
13020 745436 -1144501 -4081333 -5947708 -3491746 772823 1651103 262986 1961548
13012 1961548 5376171 2916959 -5636442 -9806912 -3543328 4989461 5484711 85206
13004 85206 -2297502 -530340 -449611 -2746289 -1858265 3321384 6747692 4947694 2044894
12995 2044894 2481529 4697222 5142304 3912018 3078219 2776483 2030098 1167600 876767
12986 876767 466525 -946555 -2664685 -3249028 -2392803 -1275556 -1642723 -4291940 -7450090
12977g450090m4954M424030N430983J884462k004006l060413l058092l630602
12969g508682j962305L745405Q380121N781902j535414n118576k466203L92660
12961b91092r85913l226867j650318K259470L785285J928173n33835j812665k243780
12952b771542j871700l56004J044566L82529j746003k274209K70666L566851M329191
12943E74345K092175q39423k342207k244602j499136o94225K19626J158685J480682
12934b094080P74039m8818O25024K689360L429321O27463l782368n281924k447673
12925e509656J155336J833436J97783j026285j248932j363771q23421J161390
12917e624120K808339J931071k4175k27201J70942j935808m574826k189782M483473
$$ plain form
12977 -7450090 -7495044 -3071014 2359969 4244431 2240425 -819988 -3878080 -7508682
12969 -7508682 -9470987 -5725582 2654539 8436441 6901027 1782451 -683752 -291092
12961 -291092 -1277005 -4503872 -6154190 -3894720 -109435 1818738 1284903 -527762 -2771542
12952 -2771542 -4643242 -4999246 -3954680 -3572151 -5318154 -7592363 -7321697 -3754846 574345
12943 574345 2666520 1827097 -515110 -2759712 -4258848 -4953073 -4733447 -3574762 -2094080
12934 -2094080 -1320041 -1368859 -743835 1945525 5374846 6002309 2219941 -3061983 -5509656
12925 -5509656 -4354320 -2520884 -2323101 -3349386 -4598318 -5962089 -6785510 -5624120
12917 -5624120 -2815781 -884710 -908885 -1136086 -965144 -2900952 -7475778 -9665560 -5182087
12908e182087P065873J490773n172937m824731L99181L151261K372985K221163
12900A521481K798901N23677l397646l401274P71736K697796l16935k577428P21169
12891f58523N523677N021864k80126l732663j825955K147397L280265N94341l057403
12882G012874m597331l389825j067505N25139Q24860K37370n63116o08535P41849
12873h84220K354121J994075n87703k967095l331803k132687L64957M514827P556590
12864F881062M357769m369008r460932m515004M272420O177589O74112l710749
12856C07259l098473j818839k505379j908797J442046L612250K407338J249803
12848c12792K595957L607726J803519n41298j061026j230730k308727k278782
$$ plain form
12908 -5182087 1883786 3374559 -1798378 -6623109 -6223928 -3072667 -699682 1521481
12900 1521481 4320382 4844059 1446413 -1954861 -1183125 1514671 1197736 -1379692 -658523
12891 -658523 4865154 9887018 9606892 5874229 4048274 6195671 9475936 10070277 7012874
12882 7012874 2415543 -974282 -2041787 -1516648 -691788 -454418 -1017534 -1626069 -884220
12873 -884220 1469901 3463976 2876273 -90822 -3422625 -5555312 -5190355 -675528 6881062
12864 6881062 11238831 6869823 -2591109 -7106113 -2833693 3343896 4018008 307259
12856 307259 -2791214 -4610053 -7115432 -9024229 -7582183 -3969933 -1562595 -312792
12848 -312792 2283165 5890891 7694410 7153112 6092086 4861356 2552629 273847
12840B73847k28888Q75929p86731k393274j177526J416976K996671L390144K310571
12831F677719j194842m649267l260138K022808L914721j65438l407991p17839
12823g80267K782058Q73931k887397j730532K163767J491716l314994m608544
12815f010262J28253N031842N233531K242822p66314k816947l314071j608175
12807a879321O97456J137546K14601J32649N78379q7925p41179O43824K340281
12798C036311J319140q57708l77545J547901K64920l661226m404164m86694K551472
12789a067593J216331q26692J09219J488339k01187k730624j779692J754407L131584
12780A094092R11890j664921j936345p93119p5084J88710Q68395J636732J065316
$$ plain form
12840 273847 44959 920888 134157 -2259117 -3436643 -2019667 977004 4367148 6677719
12831 6677719 5482877 833610 -2426528 -403720 3511001 3345563 -62428 -780267
12823 -780267 2001791 2875722 -11675 -1742207 421560 1913276 -1401718 -6010262
12815 -6010262 -5882009 -850167 4383364 6626186 5859872 3042925 -271146 -1879321
12807 -1879321 -1181865 -44319 170282 302931 881310 793385 52206 696030 3036311
12798 3036311 4355451 3497743 3120198 4668099 4933019 1271793 -3132371 -3619065 -1067593
12789 -1067593 148738 -677954 -568735 919604 718417 -2012207 -3791899 -2037492 1094092
12780 1094092 2005982 341061 -1595284 -2388403 -2463487 -2274777 -1406382 230350 1295666
12771A295666j371703m036327m399980j774043J718504L409251K865274J742018
12763e51340J349377J363142R57765L95675Q31432K276018K349707j230264o340252
12754A401260p218252j868250L901928L749905k06109j213428J023840P16578
12746B87472k566548k146248L303092N228641j161122p532748m691700L049186
12738f229975N266021J562692l12033J316858J082689j794328k125387P22242
12730e11221J273684j675938k629528N91850L178461K153998O24133N29458p96681
12721B738216l731762l833887K29878L569749L463075L421297N023965L619808
12713A4500339k743927p667114n791252j146590L63899L99741K807228M775739
$$ plain form
12771 1295666 -76037 -4112364 -8512344 -10286387 -8567883 -5158632 -2293358 -551340
12763 -551340 798037 2161179 3118944 3514619 4346051 6622069 8971776 7741512 1401260
12754 1401260 -5816992 -7685242 -3783314 -33409 -239518 -1452946 -429106 287472
12746 287472 -2279076 -4425324 -1122232 4106409 2945287 -4587461 -9279161 -6229975
12738 -6229975 -963954 598738 286705 1603563 2686252 891924 -1233463 -511221
12730 -511221 762463 -913475 -3543003 -2951153 227308 2381306 3005439 3534897 2738216
12721 2738216 -993546 -4827433 -4597555 -1027806 2435269 5856566 10880531 14500339
12713 14500339 11756412 4089298 -1701954 -2848544 -2484645 -2084904 722324 5498063
12705E498063J941008k222607j295168K779962K507505k635771n563113l236005
12697b226126l70260n26189j346042n34771M54133J094446L619597P170876O263198
12688A3598862p93848p110515n835632K51066L120947Q20857j438197m25052R84501
12679C172989j41877j921328j591940m40179j054907k151477n61443K649615K900080
12670H59533m97445k457883J83973L466453K394640j284892k222674m9081Q29831
12661A222455q86477j708638r8583R75746K3119K7667K467318L280901r19930
12652D383578o268487o229763p42382L968252L879660J174293l99171m41585q67231
12643a542836k218060k717484o65791K838608M171246J127173l670505n137537
$$ plain form
12705 5498063 7439071 5216464 3921296 6701258 9208763 6572992 1009879 -2226126
12697 -2226126 -2596386 -3122575 -4468617 -5003388 -4549255 -3454809 164788 7335664 13598862
12688 13598862 12805014 5694499 -141133 109933 3230880 4051737 2613540 2188488 3172989
12679 3172989 3031112 1109784 -482156 -922335 -1977242 -4128719 -4690162 -2040547 859533
12670 859533 362088 -2095795 -1911822 1554631 3949271 2664379 441705 392624 1222455
12661 1222455 335978 -1372660 -1471243 -495497 -472378 -444711 2022607 5303508 4383578
12652 4383578 -1884909 -8114672 -8857054 -4888802 -1009142 165151 -234020 -675605 -1542836
12643 -1542836 -3760896 -6478380 -7144171 -4305563 -134317 992856 -2677649 -7815186
12635g815186j872523K193299L096824J412243J25780K92893Q39976R10782L77921
12626d37991n92754r11379P47817L068463K295802k346504n919821l787741J515051
12617f369057L484014P56341j491889L80693L467590L334861N96700o76737O40818
12608D123334J426832m71157k663900j654683J691269K769095m55069m338982
12600D26739m439762j472123M25771K33006J011873L886586N091143J414265m221433
12591B356065n931208k428743J711195K272735J71149q99702M08147K180436K786938
12582B627012L054270L777239K920556j750503p533742q180375k194832L876568
12574c403807L681944n03626j969938L19793J537722l25132k075707j889696j675083
$$ plain form
12635 -7815186 -9687709 -7494410 -4397586 -2985343 -2859563 -2566670 -1726694 -815912 -437991
12626 -437991 -1030745 -1942124 -1194307 1874156 4169958 1823454 -4096367 -7884108 -6369057
12617 -6369057 -2885043 -2128702 -3620591 -3239898 227692 3562553 4159253 3482516 4123334
12608 4123334 5550166 5079009 2415109 760426 2451695 5220790 4765721 426739
12600 426739 -4013023 -5485146 -5059375 -4826369 -3814496 72090 5163233 6577498 2356065
12591 2356065 -3575143 -6003886 -4292691 -2019956 -1848807 -2748509 -2340362 -159926 2627012
12582 2627012 5681282 9458521 12379077 10628574 3094832 -5085543 -7280375 -3403807
12574 -3403807 278137 -225489 -2195427 -1875634 -337912 -663044 -2738751 -4628447 -6303530
12565f303530j459585J827351P176957P747941P79622o368569n743249o0556J894647
12556e08971j779420m614847k280343J917152L068346J252756m9692P22906J633963
12547f38150K09197k962110m080599n50677M873529O698626L648034r2350j228486
12538E877014r91791r79819n1815J902183J791298j324416l150174q82550J358849
12529C548779p77622l935602k453560J675980J979185j463978k490842K99061
12521c618599J717623j49950o51468K445874M393631J721682j461886k65491K876694
12512G008110K203577k478682n926857m885766j427148M76048q28570l348306
12504i207594l169860J247054O111291O085744J555109j387319M41586K844859
$$ plain form
12565 -6303530 -7763115 -5935764 1241193 8989134 9768756 3400187 -2343062 -2403618 -508971
12556 -508971 -2288391 -6903238 -9183581 -7266429 -4198083 -2945327 -2995019 -2272113 -638150
12547 -638150 -428953 -3391063 -7471662 -8022339 -3148810 3549816 7197850 7105500 5877014
12538 5877014 4885223 3905404 3853589 5755772 7547070 6222654 3072480 2189930 3548779
12529 3548779 2771157 -1164445 -3618005 -1942025 37160 -1426818 -3917660 -3618599
12521 -3618599 -1900976 -2050926 -2702394 -256520 4137111 5858793 4396907 4131416 7008110
12512 7008110 9211687 6733005 806148 -4079618 -5506766 -5030718 -5859288 -9207594
12504 -9207594 -12377454 -11130400 -5019109 1066635 2621744 1234425 1676011 4520870
12496D520870J139926k401694k304317J476148L656448J584283j576405k252838
12488C842421j180616r75648j688526j258391O86690J890935P08020j376522j710050
12479a061687j73370P93653j36832j474032j635819j249991j156347j97613K535518
12470c756520M890691M128474J166430q61647j455079k491702l608618k177853
12462d165824J586054L859444K878008J244655Q10111m25038l522026m884961
12454b619577j524063K925257K424699k580355n440735k522974K335387L856813
12446c145548K102225Q57973J651610K343305R72476j608473l439057l885414
12438d150903l205852j058384K617434N714476N377664J976442o15812j50477
$$ plain form
12496 4520870 5660796 3259102 954785 2430933 6087381 7671664 6095259 3842421
12488 3842421 2661805 1686157 -2369 -1260760 -574070 1316865 2024885 648363 -1061687
12479 -1061687 -1235057 -441404 -578236 -2052268 -3688087 -4938078 -6094425 -6292038 -3756520
12470 -3756520 1134171 5262645 6429075 5567428 4112349 1620647 -1987971 -4165824
12462 -4165824 -2579770 1279674 4157682 5402337 6212448 5787410 2265384 -2619577
12454 -2619577 -4143640 -1218383 1206316 -1374039 -6814774 -9337748 -7002361 -3145548
12446 -3145548 -1043323 -185350 1466260 3809565 4782041 3173568 -265489 -4150903
12438 -4150903 -7356755 -8415139 -5797705 -83229 5294435 7270877 6655065 6504588
12430F504588P16308j490337n483510o799279m026432r7464K400053L675676M046592
12421e53805K469049o69443k305453m69643K685071L670488K004051n8644q88788
12412E882883p37340l79850j41365q2062k12543n79910j251907j725897p71391
12403F18J873637M024191L124895k19694k851000l286672k921453k658636j305239
12394d219353J453772L292123K381769J46180j051616j081214r83764n98579N29152
12385a31530J365389Q01970k55288l11704J97680j83176j436380k419733k762041
12376e134813k463471o90644K705987N314025M419555Q80861j654507j335024
12368B041969L41218J458711J657271R24230q69528k336091j107386K380526L909372
$$ plain form
12430 6504588 7220896 5730559 247049 -6552230 -10578662 -10676126 -8276073 -4600397 -553805
12421 -553805 1915244 1245801 -1059652 -1529295 1155776 4826264 6830315 6771671 5882883
12412 5882883 5145543 4765693 4624328 4542266 4329723 3749813 2497906 772009 618
12403 618 1874255 5898446 9023341 8803647 5952647 2665975 -255478 -2914114 -4219353
12394 -4219353 -2765581 526542 2908311 3054491 2002875 921661 -62103 -660682 -131530
12385 -131530 1233859 2035829 1780541 1468837 1666517 1483341 46961 -2372772 -5134813
12376 -5134813 -7598284 -8288928 -5582941 -268916 4150639 5031500 3376993 2041969
12368 2041969 2383187 3841898 5499169 6423399 5553871 3217780 2110394 4490920 8400292
12359H400292O50806m175575m694799l1933M351787L696733k87790k494861j391765
12350D022895j64412j375593l434244l418899j213719R76472J913269K050085
12342f44146J540449k86767l058974m617853l148414N80104L766157M222429K340878
12333F93863N76413Q74122K523590L008042J162579j287176j859653k11022J821002
12324G301760K333452O81721k596195o048098p695257o016241r55676N562683
12316g431851R760070Q053306J143504m786339m190546N70173J990125j971478
12308C136964n047255k500610J748668J944806n54526q56684Q29414Q68129j32478
12299e63572J342242M036362L076369j326630l573551j756742o0441q39302j213024
$$ plain form
12359 8400292 9051098 4875523 180724 148791 4500578 8197311 7909521 5414660 4022895
12350 4022895 3858483 2482890 -951354 -4370253 -5583972 -4607500 -2694231 -644146
12342 -644146 896303 609536 -2449438 -7067291 -10215705 -9635601 -5869444 -1647015 693863
12333 693863 1270276 2144398 4667988 7676030 8838609 7551433 5691780 5480758 7301760
12324 7301760 9635212 10316933 7720738 1672640 -6022617 -12038858 -12994534 -7431851
12316 -7431851 2328219 10381525 11525029 6738690 2548144 3118317 5108442 3136964
12308 3136964 -1910291 -4410901 -2662233 -717427 -1271953 -2128637 -1299223 -431094 -563572
12299 -563572 778670 4815032 7891401 6564771 2991220 1234478 1174037 334735 -878289
12290h78289M28844J136877o96988k116843j135565K4089r4406M47534J902625
12281i82122J028179k456748l617352k22630L026500K274977M57232Q47373R40273
12272A295682j658187l337172j034745R42658j911528n305696k636415L525519
12264a0119884N351131K297944N33354J569100R03150k313678l329225m66263
12256e574371K269763K564582K461231K440150K01006l021793k347748K167115
12248A159935L947777k8507m216684l239891M17862J689495N71088j61484m18705
12239b79114j120737o25490K295666M596468K749594j460036l209054j462186
12231A485111L35241k59571j900368k213550q91735M26142K01536j164628j414967
$$ plain form
12290 -878289 -449445 687432 -9556 -2126399 -3261964 -3237875 -3332281 -2884747 -982122
12281 -982122 46057 -2410691 -6028043 -6250673 -3224173 -949196 -491964 355409 1295682
12272 1295682 -362505 -3699677 -4734422 -3791764 -5703292 -11008988 -13645403 -10119884
12264 -10119884 -4768753 -2470809 -1937455 -368355 534795 -1778883 -5108108 -5574371
12256 -5574371 -3304608 -740026 1721205 4161355 4362361 1340568 -1007180 1159935
12248 1159935 5107712 5079205 862521 -2377370 -1959508 -270013 301075 139591 -279114
12239 -279114 -1399851 -2025341 270325 4866793 7616387 6156351 2947297 1485111
12231 1485111 1820352 1560781 -339587 -2553137 -3444872 -3018730 -2817194 -3981822 -5396789
12222e396789Q05352L567569L860964J938932P67631R95660K6443k788895l951064
12213a74197j224858K122269J788882j328294l016546k152051j244409j313332
12205f542536l98534K142759L545078J798741p43397p10338Q72936P0909l169607
12196c133989l949452j62101K897198K24800l692270m02970Q476618J1346661
12188A1604495L296438n915707o060309q32905Q7805k920292k021124K881128
12180A19529L488257k294433o289996l053409K597009M478407L163877J429311
12172C638552q31051l059849k353772O39353Q73412k195767k220629L012446O142321
12163C645016J906125l433200k019082K867656K845602j961826m719013l584888
$$ plain form
12222 -5396789 -4591437 -1023868 2837096 4776028 5543659 6539319 6565762 3776867 -174197
12213 -174197 -1399055 723214 2512096 1183802 -1832744 -3984795 -5229204 -6542536
12205 -6542536 -6941070 -4798311 -1253233 545508 -197889 -908227 -35291 35618 -3133989
12196 -3133989 -7083441 -7245542 -4348344 -4123544 -7815814 -8218784 257834 11604495
12188 11604495 14900933 8985226 2924917 2092012 2179817 -740475 -2761599 119529
12180 119529 3607786 1313353 -4976643 -8030052 -5433043 -954636 2209241 3638552
12172 3638552 2807501 -252348 -2606120 -1966767 -1093355 -3289122 -5509751 -2497305 3645016
12163 3645016 5551141 2117941 98859 2966515 5812117 3850291 -868722 -4453610
12155d453610k263875j371858J532398M739236M011844P24325J41394K053567
12147E113421J318860k408822l904871j844387o13545j454944l44298L146112
12139i92474L437180j077194l613390N51157N913617M801070j461157n393820
12131B164989l968779q48249k3831j757666l834771l801644r32242K385627L052906
12122g563660J944689K970025O199270O325011O53576n672695o292723k049659
12114c486166J391856J589766N48267j00610o56982j087216q99707n79260l85963
12105c666015Q55537L030126K974153r66531m779439l668959M94142J734760p76273
12096d768499j678426J795917N474186M626942K62590l390351m172537k391952
$$ plain form
12155 -4453610 -6717485 -8089343 -6556945 -1817709 2194135 2918460 3059854 5113421
12147 5113421 6432281 4023459 118588 -1725799 -2339344 -3794288 -4138586 -992474
12139 -992474 2444706 1367512 -2245878 -1694721 4218896 9019966 7558809 2164989
12131 2164989 -1803790 -2652039 -2675870 -4433536 -8268307 -12069951 -13002193 -10616566 -7563660
12122 -7563660 -5618971 -2648946 3550324 9875335 10528911 4856216 -1436507 -3486166
12114 -3486166 -2094310 -504544 43723 -56887 -713869 -1801085 -2700792 -3280052 -3666015
12105 -3666015 -2810478 219648 3193801 2227270 -2552169 -6221128 -5726986 -3992226 -4768499
12096 -4768499 -6446925 -4651008 823178 5450120 5712710 2322359 -1850178 -4242130
12088d242130Q76143L321517K104732k121099m363757j503157K882716L373551
12080C28516N05352n09385K050494M208257K755059m91743k573831l663381m734191
12071b124853m066041J36158N221689O183122K132278k665083m585184m235187
12063d003101l316394j355346K054446M315970K524853j831232l993525j809086
12055g413415K017989L864843L047622J084185o90565j610148j523073j400638
12047b623200k573405m147082k984122J871948O391935N842510J038744k566646
12039B50682j843463R99434K722660L011157K690250J196020j602548l409913
12031D014279k346521j51450M81093K07256J121996J970982p1269l312539k706485
$$ plain form
12088 -4242130 -3365987 -44470 2060262 -60837 -4424594 -5927751 -3045035 328516
12080 328516 833868 324483 2374977 6583234 9338293 8846550 6272719 2609338 -2124853
12071 -2124853 -6190894 -6054736 -833047 5350075 7482353 4817270 232086 -4003101
12063 -4003101 -7319495 -8674841 -6620395 -2304425 220428 -1610804 -5604329 -7413415
12055 -7413415 -5395426 -1530583 1517039 2601224 1910659 300511 -1222562 -2623200
12047 -2623200 -5196605 -9343687 -12327809 -10455861 -4063926 1778584 2817328 250682
12039 250682 -1592781 -593347 2129313 5140470 7830720 9026740 7424192 4014279
12031 4014279 1667758 1516308 1997401 2204657 3326653 5297635 5226366 1913827 -792658
12022g92658J882224M186744P62671l600478l358384k71074Q27008J64105J001817
12013H01975K502688J294522j537204j797575K48923M85047j008956K43703M314060
12004E547183N296257Q89139l351726k664269J60472M86373j185170j984212j529253
11995A664794k27931K354115L906227k6129p633732r657299k350802N071586L365036
11986c534135k674594k356328L828627O295499K519030o66598j65517l73500k680700
11977A91784k296406J701002L254105m4496k478234o13077P18998k004287l864630
11968e435241l21191M141411L349131n19287j629126l91265j083656l201307k665557
11959g756088O25633L094923L621499L614774K737996L6347k376659j960002l10097
$$ plain form
12022 -792658 1089566 5276310 6038981 2438503 -919881 -1190955 -363947 -199842 801975
12013 801975 3304663 4599185 3061981 1264406 1513329 1998376 989420 1233123 5547183
12004 5547183 10843440 11732579 8380853 5716584 5877056 6363429 5178259 3194047 1664794
11995 1664794 1436863 3790978 7697205 7671076 37344 -9619955 -11970757 -6899171 -3534135
11986 -3534135 -6208729 -8565057 -4736430 1559069 4078099 3411501 3245984 2872484 191784
11977 191784 -2104622 -403620 2850485 2805989 327755 -285322 433676 -1570611 -5435241
11968 -5435241 -5756432 -1615021 1734110 1214823 -414303 -805568 -1889224 -5090531 -7756088
11959 -7756088 -7130455 -4035532 -414033 3200741 5938737 5975084 3598425 1638423 1328326
11950A328326j99853l99984J195568J982542j327315n243933l479036K563665
11942c580020M964609J215216k559678j624430J265018K049748J165520K19647
11934C115630j342988k940172j513631K747241M182227m14695n719883m751221
11926f637492J166771M633260K623464o40236r61354N76574Q44376m17272j051112
11917A36979j23394Q82170L58682j050335j184292M76112J604558L01607j543586
11908a41499p74821J561095J034457k828305m331416J91181N693608M893276p33993
11899D563583k673951J805729N241330J313735n121770m869269K045976O427931
11891H733294L064968k842891m412136k427128j880705l323641l118391m03731
$$ plain form
11950 1328326 1128473 728489 1924057 3906599 2579284 -2664649 -6143685 -3580020
11942 -3580020 1384589 2599805 40127 -1584303 -319285 1730463 2895983 3115630
11934 3115630 1772642 -1167530 -2681161 66080 4248307 3833612 -1886271 -6637492
11926 -6637492 -5470721 -837461 1786003 1145767 184413 760987 1605363 1188091 136979
11917 136979 13585 895755 1254437 204102 -980190 -504078 1100480 1402087 -141499
11908 -141499 -916320 644775 1679232 -1149073 -5480489 -5289308 404300 5297576 4563583
11899 4563583 1889632 3695361 8936691 10250426 5128656 259387 2305363 8733294
11891 8733294 11798262 8955371 4543235 2116107 235402 -3088239 -6206630 -6610361
11883f610361J709611J697552J453840J846862R57574j712135l261552j793302
11875e711911M75029Q30337m8550k41451j741l62440n84140K78603J186302J033920
11865c146042P68479J044623J00655k908238m766077k248024K420801M341297
11857d392526K925833J644939J580044K47750k781507m073389j820378R38563
11849e730671R83084k42620P75781L988096N509863K739008k007403l719989m39699
11840A855450L960864M024093m51446m228361l964770k288644k347730k180247
11832e620791J185626M982857L802506j735243n184336l226934P93112K781098
11824b222105K333598M56709k228698l735163j759648K091053L368723J170976
$$ plain form
11883 -6610361 -4900750 -3203198 -1749358 97504 1055078 -657057 -3918609 -5711911
11875 -5711911 -5236882 -4406545 -4455095 -4696546 -4698287 -5060727 -5644867 -5366264 -4179962 -3146042
11865 -3146042 -2377563 -1332940 -1232285 -4140523 -8906600 -11154624 -8733823 -4392526
11857 -4392526 -1466693 178246 1758290 2006040 -775467 -4848856 -6669234 -5730671
11849 -5730671 -4747587 -4990207 -4214426 -226330 5283533 8022541 6015138 2295149 1855450
11840 1855450 5816314 9840407 9388961 5160600 1195830 -1092814 -3440544 -5620791
11832 -5620791 -4435165 547692 4350198 2614955 -2569381 -5796315 -5003203 -2222105
11824 -2222105 111493 568202 -1660496 -5395659 -7155307 -5064254 -1695531 -524555
11816e24555r75880j346946j752411j960615J109173O200160O655912O14336m337873
11807C681301k210322J709551o54078o714360o907281M10264O564231N348330
11799A227636M84059j667363n75969M34213K30569K66422J086453J373368P576
11790B866964k273299l303141j678926J230494K465257J291666J33030N26363
11782A258408N16181j706303l933784k978139P1001J313164p1791j026570M89781
11773f068052L072979M469839L812259J178015k443181m574287l078403J027215
11765b603616M284087M243630R64921l780343o953857n509066P5811M771352M398056
11756a09025Q64858j001497l29183n1094j061715j108967O29183K230234K636256
$$ plain form
11816 -524555 -1500435 -2847381 -4599792 -6560407 -5451234 748926 7404838 8019174 3681301
11807 3681301 1470979 3180530 2526452 -4187908 -11095189 -10684925 -4120694 1227636
11799 1227636 1711695 44332 -531637 -97424 133145 399567 1486020 2859388 2866964
11790 2866964 593665 -2709476 -4388402 -3157908 -692651 599015 732045 1258408
11782 1258408 1774589 68286 -3865498 -6843637 -6772636 -5459472 -5531263 -6557833 -6068052
11773 -6068052 -2995073 1474766 5287025 6465040 4021859 -552428 -3630831 -2603616
11765 -2603616 1680471 5924101 6889022 3108679 -3845178 -9354244 -9278433 -4507081 -109025
11756 -109025 755833 -245664 -574847 -625941 -1687656 -2796623 -2167440 62794 2699050
11747B699050K612088J845053q22821l930236m476057k947568k615041l129503
11739a0765035l43988N636474Q074964K924903m218969n101498N15581N719223
11731B441655N687761J669126k748601n121282m503865j791943M09453N99232
11723c358464L43835J388124K340459J031407j265897j458187K83739P51081j006789
11714i50692k214222r13774J245674K009727J551610R26490r7969j617488j889260
11705a949904L86841L088632K707178o56530k885600j295070J719988K220178
11697C335713L37219k23219K085318M253083L047313n26673k941186k888298k100924
11688D378346k014647j858086m95764J418960K131341J110560j69124k06884J58303
$$ plain form
11747 2699050 5311138 7156191 6333370 2403134 -2072923 -5020491 -7635532 -10765035
11739 -10765035 -11109023 -5472549 2602415 5527318 1308349 -3793149 -3277568 2441655
11731 2441655 8129416 9798542 7049941 1928659 -2575206 -4367149 -3957696 -3358464
11723 -3358464 -3014629 -1626505 713954 1745361 479464 -978723 -694984 56097 -950692
11714 -950692 -3164914 -4078688 -2833014 -823287 728323 1654813 1556844 -60644 -1949904
11705 -1949904 -1563063 1525569 4232747 3576217 690617 -604453 1115535 3335713
11697 3335713 3672932 3449713 5535031 9788114 12835427 12308754 9367568 6479270 4378346
11688 4378346 2363699 505613 9849 1428809 3560150 4670710 4501586 4294702 4453005
11679D453005j129915l130247j393151N163449R172118K714356r680696j3743910
11671g574991m408144N975271M753535l033573l534305M236459Q214479L343602
11663G972333j800772r39646L76715l034965n756049k146446K320384J90139m456169
11654g274476k690664L761093N394161R37321j365616J427294K365219k473533
11646H0799o664750l962028J791089L247042M20097j192519L23212K017778J946550
11637a992730J170242M51930r80003l056853m074785k902461l51712J986682L193328
11628f556362L168579K207744Q62769N53M62681K022946K869002J407903j119534
11619E326281j612447M46149J722421j74127k978379l236175j238714M83217J422486
$$ plain form
11679 4453005 3323090 192843 -1200308 3963141 13135259 15849615 6168919 -7574991
11671 -7574991 -11983135 -6007864 -1254329 -4287902 -7822207 -3585748 4628731 7972333
11663 7972333 6171561 5231915 5608630 2573665 -3182384 -5328830 -3008446 -2818307 -7274476
11654 -7274476 -9965140 -6204047 -809886 127435 -1238181 189113 2554332 80799
11646 80799 -6583951 -10545979 -8754890 -5507848 -5087751 -6280270 -5957058 -3939280 -1992730
11637 -1992730 -822488 -370558 -1350561 -4407414 -8482199 -11384660 -11736372 -9749690 -6556362
11628 -6556362 -3387783 -1180039 -317270 -316717 145964 2168910 5037912 6445815 5326281
11619 5326281 3713834 4159983 5882404 5708277 2729898 -506277 -1744991 -1261774 160712
11610A60712K232228J660879j214894l340574j419387J806955Q74828l196240
11602b435493l691946R29336M063262J383109k524181j907787J666581L486641
11594I69522L338671L390642K534419r56699m142692l300618j037203k695765
11586a899723o659164n535143K176507Q509429O715978k8163m103536l329043
11578d152858j187801q3991R30927K590080L587444K883452J241143k67396j430365
11569D110635j923091r66534R10934J333790q75514l107589j892253J767318L046840
11560B404536K68302k238869q19468J337074o82055m471408k878827M228262P900487
11551E048034K769858m487765m464342J777061N231738K193820j949865k006003
$$ plain form
11610 160712 2392940 4053819 2838925 -501649 -1921036 -114081 760747 -2435493
11602 -2435493 -6127439 -5198103 -1134841 248268 -2275913 -4183700 -2517119 969522
11594 969522 4308193 7698835 10233254 9276555 5133863 1833245 796042 -1899723
11586 -1899723 -8558887 -14094030 -11917523 -3408094 3307884 3279721 -823815 -4152858
11578 -4152858 -5340659 -5424650 -4493723 -1903643 1683801 4567253 5808396 5541000 4110635
11569 4110635 2187544 1221010 2131944 3465734 2590220 -517369 -2409622 -642304 2404536
11560 2404536 2672838 433969 -385499 951575 269520 -4201888 -7080715 -2852453 5048034
11551 5048034 7817892 3330127 -1134215 642846 5874584 8068404 6118539 4112536
11543D112536K35522L47090k122841m029473l149511k53629K134684K140043N10784
11534g4795n0575J378006K100313k51790l459729l572243r05037P17022K00733
11525c918095J94458J554295J631520n04895j796776m83577N72302j073166k779892
11516f603826r99229K724034M087388K434131O27993k30507j660026l698326m026070
11507g344438j812776Q29642K110883K562311K873316K270111L37219j548811
11499B77457j980381j272593m24580K39306M23014n48412k177656k338970j02721
11490g905536K194919J853854J838K15544K881585L941849O99631l680686m084362
11481c881364l59240K825180K560867P47537L7445K40396M14137J270661K811725
$$ plain form
11543 4112536 4348058 4695148 2572307 -1457166 -4606677 -4860306 -2725622 -585579 -74795
11534 -74795 -125370 1252636 3352949 3101159 -358570 -3930813 -4835850 -4118828 -3918095
11525 -3918095 -3723637 -2169342 -537822 -1042717 -2839493 -3323070 -2750768 -3823934 -6603826
11516 -6603826 -7603055 -4879021 -791633 1642498 2270491 2039984 379958 -3318368 -7344438
11507 -7344438 -9157214 -8327572 -6216689 -3654378 -781062 1489049 1826268 277457
11499 277457 -1702924 -2975517 -3400097 -3160791 -2737777 -3286189 -5463845 -7802815 -7905536
11490 -7905536 -5710617 -3856763 -3854925 -3639381 -757796 3184053 3883684 202998 -3881364
11481 -3881364 -4240604 -1415424 1145443 1892980 1930425 2170821 2584958 3855619 6667344
11472F667344K337102j554385m982896l222960J826774L476596k00510l622150
11464G24915k042119J964424L061964M82568k519676l786416l387599j636447
11456g138386P17945J783655R52026N54025K236238L474819J210940k559362l032019
11447a800119K00499K504354J035019j748685k298110l51083J995318K821475
11439B358668J154156k211898m110902j970430K177985L632388J317832j293288
11431A054511j952406k036824k116848j73442L308814L574821j094229m710530
11423d146133j424140N165000O494931J125764l758396k730071J569737L527272
11415E823964J550401j539518k132121R46120M555265L258293l682505q820312
$$ plain form
11472 6667344 9004446 7450061 2467165 -755795 1070979 4547575 4347065 724915
11464 724915 -1317204 647220 3709184 4191752 1672076 -2114340 -5501939 -7138386
11456 -7138386 -6420441 -4636786 -3684760 -3130735 -894497 2580322 3791262 1231900 -1800119
11447 -1800119 -1599620 904734 1939753 191068 -2107042 -2458125 -462807 2358668
11439 2358668 3512824 1300926 -2809976 -4780406 -2602421 1029967 2347799 1054511
11431 1054511 -897895 -2934719 -5051567 -5225009 -1916195 1658626 564397 -4146133
11423 -4146133 -5570273 -405273 6089658 7215422 3457026 726955 2296692 5823964
11415 5823964 7374365 5834847 3702726 4648846 9204111 12462404 8779899 -40413
11407d0413m945928L922910O525246R7490n323845j547128N939747O514602m28220
11398A0714461n966921m536110O03421L827442L000287j102234n898460p115114
11390f473228k593133L383030M085499n80141l687779j203741K724858K806760
11382a537875K26919n89802O36462N96375j312826j867830O53142L543527L214814
11373C562906l94109m094687m976067k680315J207357M839620O710260N442113
11365I617078P45467m776584o642349l240812J563567K827273O16528r92085j92005
11356d73922Q35886M66919q2667O8420j53601q17440k32402J099323o2740l781806
11346c134030m865602m12005M567745L873926p15018k563947k42532J686632R13765
$$ plain form
11407 -40413 -4986341 -1063431 5461815 5559305 235460 -1311668 4628079 11142681 10714461
11398 10714461 4747540 211430 814851 4642293 7642580 6540346 641886 -6473228
11390 -6473228 -9066361 -5683331 -1597832 -2177973 -5865752 -7069493 -4344635 -1537875
11382 -1537875 -1310956 -1900758 -1264296 -667921 -1980747 -3848577 -3195435 348092 3562906
11373 3562906 3168797 -925890 -5901957 -8582272 -7374915 -2535295 4174965 9617078
11365 9617078 10362545 5585961 -1056388 -4297200 -2733633 93640 710168 -281917 -473922
11356 -473922 361964 828883 746216 814636 661035 -156405 -388807 710516 647776 -3134030
11346 -3134030 -7999632 -8411637 -3843892 30034 -684984 -3248931 -3491463 -1804831 -891066
11337h91066N234M35068J39261j400587j163034J760507L175156j88544n025363
11328c153368n440094o25096M518220N417213K256029j083885j190366J386829
11320B085482K662798K21712l084979k831856K92095J274457j442812l547620
11312d370723j925769N29280L45821m90256J467821M135475K579708k497289m778142
11303e004074j495723K575422K359521m63353q74478J787501L543891K209995
11295D638702J28092k35965k3998j218581k585018j529106J141770J973808M32048
11286B721752j91834J403927J916577q48417l571187k584472j19333l96038k052359
11277c721384n87260L086937L566201M99003k71585L108881M618146K38821m984968
$$ plain form
11337 -891066 -885832 -450764 -311503 -1712090 -2875124 -1114617 2060539 1871995 -3153368
11328 -3153368 -8593462 -9218558 -4700338 716875 2972904 1889019 698653 2085482
11320 2085482 4748280 4969992 1885013 -946843 -654748 619709 -823103 -4370723
11312 -4370723 -6296492 -5767212 -5421391 -5911647 -4443826 -308351 2271357 -225932 -5004074
11303 -5004074 -6499797 -3924375 -1564854 -2028207 -2902685 -1115184 2428707 4638702
11295 4638702 4766794 4530829 4506831 3288250 703232 -825874 315896 2289704 2721752
11286 2721752 2529918 3933845 5850422 5002005 1430818 -1153654 -1272987 -1669025 -3721384
11277 -3721384 -4308644 -1221707 2344494 2843497 2571912 5680793 10298939 10537760 5552792
11268E552792m859248j506452q52912k818895k757375r1233J402274R23878J685578
11259c321593M209516M504901O99084l181565k738475N35760J512197j357932
11251H61893l877998j821457K853160L880794o69155m623824j737392M747855
11243c86124N861303k70894n727955m330339O67670L322733L033561J739621p31348
11234C178228l442762k456551J958890K434209l957880p721319j57186J0847405
11226F83034J0374410j077719q153257l738686K280050O95407l556749k212435
11218d705945K460160L107621m24482k552253j233149J216398L300582M519617
11210E688549L222176o74233l461407k516700n82571j047963k117091l11711K989090
$$ plain form
11268 5552792 693544 -812908 -1665820 -4484715 -7242090 -7333323 -5931049 -5007171 -3321593
11259 -3321593 887923 5392824 6091908 2910343 171868 707628 2219825 861893
11251 861893 -3016105 -4837562 -1984402 1896392 1227237 -3396587 -5133979 -386124
11243 -386124 5475179 5204285 -523670 -4854009 -4186339 -863606 2169955 3909576 3178228
11234 3178228 -264534 -2721085 -762195 1672014 -2285866 -10007185 -10164371 683034
11226 683034 11057444 9979725 1826468 -1912218 367832 1063239 -2493510 -4705945
11218 -4705945 -2245785 861836 437354 -2114899 -3348048 -2131650 1168932 5688549
11210 5688549 8910725 8236492 4775085 2258385 1675814 627851 -1489240 -1800951 1188139
11201A188139L526067Q77697j406773j280212M5322R12464O66409p06768j916002
11192A906343q44207K054407K922964l40719m279071m163463k10009L393038M003307
11183D442590K285156p8247j820438k309970k175537k484091k411188j29178L069301
11174a611602L065280q64778l917505k421500J011559J972555L88198j140116
11166c517909j817175j933586p38516J386661J600555r78292k564193j07214L699398
11157d970271M634507K932049J035595j064923l587499l592566O56134M881520
11149I24546M097073L01334r59961N01254L51086k085150l034749j194566N32806
11140e66327L36266n04369r01283r23859j04848J189259K28350l777629o053434
$$ plain form
11201 1188139 4714206 5591903 4185130 2904918 2950240 3862704 4529113 3822345 1906343
11192 1906343 1062136 3116543 6039507 5698788 1419717 -2743746 -2953755 439283 4442590
11183 4442590 6727746 6649499 4829061 2519091 343554 -2140537 -4551725 -4680903 -1611602
11174 -1611602 1453678 588900 -3328605 -5750105 -4738546 -2765991 -2377793 -3517909
11166 -3517909 -5335084 -7268670 -8007186 -6620525 -5019970 -5998262 -8562455 -8669669 -4970271
11157 -4970271 -335764 2596285 3631880 2566957 -1020542 -4613108 -3956974 924546
11149 924546 5021619 5322953 4362992 4864246 5215332 3130182 95433 -1099133 -566327
11140 -566327 -230061 -734430 -1635713 -2559572 -2664420 -1475161 -1246811 -5024440 -11077874
11131a1077874k383618L352636M122920L58310j447273O09663K373168K239467
11123a852601K937171M215590K180014k501839l852393l50890K302019R00980
11115C978051n44456P98700J315098j370305k840263J65055K685854p00140o019046
11106b531452n291919J239838N505849L006497k294375m356517j617209L074553
11098c264735N563959L327852k018258n344065l299802J489180L434676O13020
11090E01827l382735l882217j56000L941012M061391L70884k430989j261907J006341
11081a232393J05110k747733l044841p86965j49163j354064K23077N071537O806364
11072B890929K109074l003135j960079K573874L653667O93176j420965j095911
$$ plain form
11131 -11077874 -13461492 -10108856 -5985936 -5627626 -7074899 -6465236 -4092068 -1852601
11123 -1852601 1084570 5300160 7480174 4978335 1125942 775052 3077071 3978051
11115 3978051 3433595 4232295 5547393 4177088 1336825 1501880 4187734 3487594 -2531452
11106 -2531452 -7823371 -6583533 -1077684 1928813 -365562 -4722079 -6339288 -3264735
11098 -3264735 2299224 5627076 3608818 -1735247 -5035049 -3545869 -111193 501827
11090 501827 -2880908 -6763125 -6919125 -2978113 1083278 1454162 -976827 -2238734 -1232393
11081 -1232393 -1127283 -3875016 -6919857 -7706822 -7855985 -9210049 -8986972 -3915435 2890929
11072 2890929 5000003 1996868 36789 2610663 6264330 6957506 5536541 4440630
11064D440630j079672k028343j604236K223l39819k617191k625702J008481L518010
11055a325619Q96843l386643k829125K504139N458923J680103m014486m125637
11047e141502J200227M836989L063521p6213k95220O68954p972k27620K394584
11038F415748M048742K31511m982721l666699K987359N552882R26224l367455
11030H145591j862585J049237J95145j931796j370298j03590r80859j387921J315745
11021C068669L335866M97761l592514k748482J699787L151302j64174l807032
11013A441183m172824j390106K888054N593396K821699m428391q284984l720321
11005i252294L188473L632174p37923j483757K206253K811961j924883m909453
$$ plain form
11064 4440630 3360958 1332615 -271621 -269398 -609217 -3226408 -5852110 -4843629 -1325619
11055 -1325619 -428776 -3815419 -6644544 -4140405 1318518 2998621 -1015865 -5141502
11047 -5141502 -3941275 895714 3959235 3883022 3587802 4256756 4248784 4021164 6415748
11038 6415748 10464490 10696001 5713280 2046581 5033940 10586822 11513046 8145591
11030 8145591 6283006 7332243 7527388 5595592 4225294 4121704 3140845 1752924 3068669
11021 3068669 6404535 6902296 3309782 561300 2261087 5412389 5248215 1441183
11013 1441183 -2731641 -4121747 -1233693 4359703 7181402 2753011 -5531973 -9252294
11005 -9252294 -6063821 -2431647 -3169570 -4653327 -2447074 364887 -1559996 -6469449
10997f469449j593437K986394L018279M43399n2854J139795Q10596j005333j920555
10988b643165j556995j217932j061074m83010K29879P04437J332636J882384J225331
10979a587509l02713n85848Q23984J370550o69009l203500l106018k42912K998219
10970d504756M667609M198197J943956n83990j353461l04244l2486k348659n217754
10961c535588n021166j240757L050218N136999N043073L668523R16560k756641
10953E261221m777347l141522M8474Q60500n62407j03722L214013M700293J428003
10944F927506k366481j992359k60690k195354n063382k213440M521912O026586
10936C384298L96282l816716j673989R93731p11509j987156J557423M188253r2190
$$ plain form
10997 -6469449 -8062886 -5076492 -2058213 -1614814 -1667668 -527873 282723 -722610 -2643165
10988 -2643165 -4200160 -5418092 -6479166 -6962176 -6732297 -6027860 -4695224 -2812840 -1587509
10979 -1587509 -1890222 -2476070 -1652086 -281536 -950545 -4154045 -7260063 -7502975 -4504756
10970 -4504756 162853 4361050 6305006 5721016 4367555 4063311 4030825 1682166 -3535588
10961 -3535588 -8556754 -9797511 -6747293 -1610294 3432779 7101302 8017862 5261221
10953 5261221 483874 -2657648 -2609174 -1748674 -2311081 -2414803 799210 5499503 6927506
10944 6927506 4561025 2568666 2307976 112622 -4950760 -7164200 -2642288 3384298
10936 3384298 3780580 -36136 -1710125 -716394 -1427903 -3415059 -1857636 2330617 2238427
10927B238427n291693k104659O083593P648538P77060m562031k635795Q13443
10919B966883o38540n008502o788283m311163N77756N140769O168959K298812
10911D06691k852042l941384p65905K129456K335975J469827O81459o14447j630010
10902b780380p13890J154253J790994J776869K380365J508323k472232n210873
10894b566571j972889L168418K369127k843692l378481K078463M381443p51052
10886D84766n409919k421179L731261N208887K406650M12610J712r27882j626672
10877A860234o37620Q2774j171087j658797R98522L423668J487438k481093l283888
10868a379849j100288k44874j404965r92308K212992M804354L622216n35568m299771
$$ plain form
10927 2238427 -3053266 -5157925 925668 8574206 9351266 4789235 2153440 2966883
10919 2966883 2328343 -2680159 -9468442 -13779605 -13201849 -8061080 -1892121 406691
10911 406691 -2445351 -6386735 -7152640 -5023184 -2687209 -1217382 -535923 -1150370 -2780380
10902 -2780380 -3494270 -2340017 -549023 1227846 3608211 5116534 2644302 -2566571
10894 -2566571 -4539460 -1371042 998085 -1845607 -5224088 -3145625 1235818 484766
10886 484766 -4925153 -7346332 -3615071 1593816 4000466 4413076 4414788 3486906 1860234
10877 1860234 1222614 1305388 134301 -1524496 -525974 2897694 4385132 1904039 -1379849
10868 -1379849 -2480137 -2725011 -4129976 -5122284 -2909292 1895062 5517278 4981710 681939
10859F81939m538947m80120M810419O237942K244534k726052l548511o57334J506003
10850C529873P38075j191597k184230k272486k370848k593702k257335p67229
10842i369479J432238K780672K367673J545866K129282L175357J974832j427290
10834D609151l465466j852834J331726K728945J780317K43822o72910j093575
10826C609176j278959q60216O55115K500656K170515j723343n687256l931546
10818d545858L135891P155698K664621m303265m419291J358609M027828O34890
10810E709123k613925j701300m12286k090313l565595j258077K609543L909854
10802E87024K284758j74421k008950j977662M55988K756441J776190o48793J48683
$$ plain form
10859 681939 -3857008 -4337128 473291 6711233 8955767 6229715 2681204 2023870 3529873
10850 3529873 4267948 3076351 892121 -1380365 -3751213 -6344915 -8602250 -9369479
10842 -9369479 -7937241 -5156569 -2788896 -1243030 886252 4061609 6036441 4609151
10834 4609151 1143685 -709149 622577 3351522 5131839 5375661 4702751 3609176
10826 3609176 2330217 1470001 2125116 4625772 6796287 5072944 -614312 -4545858
10818 -4545858 -1409967 5745731 8410352 4107087 -312204 1046405 5074233 5709123
10810 5709123 3095198 1393898 981612 -1108701 -4674296 -5932373 -3322830 587024
10802 587024 2871782 2697361 688411 -1289251 -833263 1923178 3699368 3050575 3199258
10793C199258L353795L108338j457148m114375j909779J34860j610625k926147
10785b221823L44137M552260M108069j51113l642920m504967l012469O33924L905630
10776A0728K566018k404080m316387j136447N93320k907843n202487m41959N686528
10767g552609M564646j532212l720954n31561J957765J364616J062860K242858
10759b144591K323425R46063M38277O62111l79247j635400o38859J222964J020598
10750A815341K11370J822181L432919L04062n414500o421787j559883K202009
10742c608288N59296k324584j376632J931037L144351J611089R4157N1388K94798
10733C76612n75756k188552k874143j857158o57054j108890k089735o72699K900728
$$ plain form
10793 3199258 6553053 9661391 8204243 4089868 2180089 2314949 704324 -2221823
10785 -2221823 -1877686 2674574 6782643 6631530 2988610 -1516357 -4528826 -3894902 10728
10776 10728 2576746 172666 -4143721 -5280168 -4686848 -7594691 -12797178 -13239137 -7552609
10767 -7552609 -2987963 -4520175 -8241129 -8772690 -6814925 -5450309 -4387449 -2144591
10759 -2144591 178834 1124897 1563174 2225285 1846038 210638 -428221 794743 1815341
10750 1815341 2026711 3848892 7281811 7585873 2171373 -4250414 -5810297 -3608288
10742 -3608288 -3048992 -5373576 -6750208 -4819171 -1674820 -63731 30426 81814 376612
10733 376612 -199144 -2387696 -5261839 -7118997 -7776051 -8884941 -10974676 -11647375 -8746647
10724h746647M693775K897670N26520K51441M11382j142947l056874l405327k927059
10715a0498066k240628J88820L986981N155572K276548q7145J453716L231452
10707C467250Q60399l059332l376111o54343R31157N83108M7449q36788k143841
10698d181052j070987L039015M875291P53863m086521k995784J201353J021625
10690a443197l098286l987509J33109L436723K144530j120001k786101j983203
10682h703935R13523M127944M212402P84014j129447J419345L593093Q29248k554319
10673C491868r13461J956935k88767l849969j112799M129614J882291n413112
10665a17400m988207M432608Q853133J297730p099176n229073J909566M059433
$$ plain form
10724 -8746647 -4052872 -1155202 -628682 -377241 34141 -1108806 -4165680 -7571007 -10498066
10715 -10498066 -12738694 -12549874 -8562893 -3407321 -1130773 -1217918 235798 3467250
10707 3467250 4327649 1268317 -2107794 -2762137 -1830980 -1247872 -1200423 -2037211 -4181052
10698 -4181052 -5252039 -2213024 2662267 3416130 -670391 -3666175 -2464822 -1443197
10690 -1443197 -4541483 -8528992 -8395883 -4959160 -2814630 -3934631 -6720732 -8703935
10682 -8703935 -7790412 -3662468 549934 1333948 204501 1623846 5216939 6046187 3491868
10673 3491868 2578407 4535342 4246575 396606 -716193 3413421 5295712 -117400
10665 -117400 -5105607 -672999 8180134 9477864 2378688 -2850385 -940819 3118614
10657C118614J668101R83112J657889k85938k988924k065922O07202J75909k084261
10648G85782j030713K936936M236561J095645k305593k737477j558554q23525
10640E99062j81799J015132J532012j52246l286290m980387l040068J329557M349202
10631b815825L994947K343864J999255J850032o05296l978783m178253q17803
10623b207862J761782P80558j424482j561218N7385Q71626k45615k117803k573076
10614f658705q6984M229227O270149K820172l815892p318780m402557J288634
10606g674736L412897J78676l760537k938921K054315N031382K289126k292781
10598c700579k909464p4564J274401N9237m29051N52508M58515l90768Q95710
$$ plain form
10657 3118614 4786715 5769827 7427716 7141778 4152854 2086932 2694134 2870043 785782
10648 785782 -244931 2692005 6928566 8024211 5718618 2981141 1422587 599062
10640 599062 417263 1432395 2964407 2812161 -474129 -5454516 -8494584 -7165027 -2815825
10631 -2815825 1179122 3522986 5522241 7372273 6766977 2788194 -1390059 -2207862
10623 -2207862 -446080 334478 -1090004 -2651222 -2593837 -1722211 -1967826 -4085629 -6658705
10614 -6658705 -6745689 -2516462 3753687 6573859 2757967 -4560813 -8963370 -7674736
10606 -7674736 -4261839 -4083163 -7843700 -10782621 -8728306 -3696924 -1407798 -3700579
10598 -3700579 -6610043 -6684607 -5410206 -5350969 -5780020 -5227512 -4768997 -5159765 -4264055
10589d264055K930944J403121k028035j229225K747096J994637l749956m735096
10581f930569K215780P014395K659282l699352l857322j051952n40792O70670
10573c519860M654616M565945k956232q388209m302616J217799r22380m199968
10565a3850905Q48822Q006880O140648n07980m45715M152804K678689l713013
10557C310230m946773m43368K045062J619271K503093K238362k890684o574398
10549c139205k140628L609535K089782n51967L850126O864746j799730j1589649
10541b806990o748314M911850M672546m097264l482450N367614N856708j713905
10533A959795k037968M134223J962835o430382m582859N653833O312708k397971
$$ plain form
10589 -4264055 -1333111 70010 -1958025 -3187250 -440154 1554483 -2195473 -6930569
10581 -6930569 -4714789 2299606 4958888 1259536 -2597786 -3649738 -4190530 -3519860
10573 -3519860 1134756 5700701 2744469 -5643740 -9946356 -8728557 -9650937 -13850905
10565 -13850905 -13002083 -4995203 1145445 637465 191750 4344554 7023243 3310230
10557 3310230 -1636543 -2079911 -34849 1584422 4087515 6325877 3435193 -3139205
10549 -3139205 -5279833 -1670298 419484 -132483 3717643 10582389 8782659 -2806990
10541 -2806990 -9555304 -4643454 29092 -4068172 -7550622 -2183008 3673700 1959795
10533 1959795 -78173 4056050 6018885 -411497 -4994356 659477 6972185 4574214
10525D574214l198104L314620q688j0207568o399548R091435J0945049l521942
10517D589468r122050J008034N374386k592313m049109M107166K070280r601034
10509h215172o356045J0494204J0490002p787119r896423Q947498J1490300j0124796
10501i57551j5814091N784936J2651725q556865j2448144J5079522K0807688j2793556
10493C753664k1281372K0118343L1781530k1366211k5073222J04494891K26956013
10486C19383636J42110400r5900452k23258886j29973247J2037374K9127254k8504351
10479B5021728l1574708J2862053J8459614j2948295j5255923J1268212J2743919
10472B0576600j0740254j2971475O200656O335391j1825075j0456641J0076206
$$ plain form
10525 4574214 1376110 4690730 4682042 -5525526 -11925074 -2833639 8111410 4589468
10517 4589468 -4532582 -3524548 1849838 -742475 -4791584 -684418 1385862 -8215172
10509 -8215172 -14571217 -4077013 6412989 -1374130 -11270553 -2323055 9167245 -957551
10501 -957551 -16771642 -10986706 1665019 -6891846 -19339990 -4260468 16547220 3753664
10493 3753664 -17527708 2590635 34372165 13005954 -12067268 92427623 319383636
10486 319383636 461494036 365593584 142334698 12361451 24398825 53526079 25021728
10479 25021728 -6552980 6309073 24768687 11820392 -3435531 7832681 20576600
10472 20576600 9836346 -3135129 3065527 9400918 -2424157 -12880798 -2804592
10465b804592J3016150m269042q351953N165932O583690q399263j1704493K259049
10457h504522P854013j336134k587839R376616J1835349j796309r392534j162565
10449D286075N002581p56476m350290J852844M743212k363563o898314j861880
10441c45811K300294j65371n21691L849558K454653o395340q990164j78892O789308
10432a203456K992179k787455j881321Q46888j19520o83818K085454K954987n70845
10423A633093k771186o68863J087774J99782J29968Q85021j827273o127950m645964
10414a2105598K386121O408790M380782J847943J343509m95047l440847k974975
10406b649322J96067R28684k21741J340889L655538J091798l628645k881953J695557
$$ plain form
10465 -2804592 10211558 5942516 -2409437 2756495 9340185 940922 -10763571 -8504522
10457 -8504522 -650509 -1986643 -4574482 4802134 16637483 14841174 5448640 4286075
10449 4286075 9288656 8532180 4181890 6034734 10777946 8414383 1516069 -345811
10441 -345811 1954483 1789112 1267421 5116979 7571632 1176292 -7813872 -7992764 -1203456
10432 -1203456 1788723 -998732 -2880053 -2033165 -2152685 -2836503 -751049 2203938 1633093
10423 1633093 -1138093 -1806956 -719182 -519400 -389432 495589 -1331684 -7459634 -12105598
10414 -12105598 -9719477 -3310687 1070095 2918038 4261547 3766500 325653 -2649322
10406 -2649322 -2453255 -1524571 -1746312 -405423 3250115 4341913 713268 -2168685 -473128
10397d73128J596953k991447l507142J461100M326191K338143M95710N44969o34284
10388C157065j983117L02526L186028P04360m183691m042410o79166j109412l075959
10379g723776N29482N978038L850266k729865k647079K439953J092588n093115
10371d303508k802381P382757Q894305k542816j0275729m044519M293487K267281
10363a131123m169621m600001j439897j029485m97595M344375Q496137O109620
10355F082410O97320j922116k621763l532247k318211J272583J918767j878518
10347b301775l719383k96377K798772J601469K84505J771673K075897m68001q59047
10338H87733K063193J763411l444083n517932q32117K712451p8297k564995M60841
$$ plain form
10397 -473128 1123825 -1867622 -5374764 -3913664 412527 2750670 3246380 3791349 3157065
10388 3157065 1173948 1476474 4662502 5366862 1183171 -2859239 -3538405 -4647817 -7723776
10379 -7723776 -7194294 -1216256 2634010 -95855 -2742934 -302981 789607 -4303508
10371 -4303508 -7105889 276868 9171173 6628357 -3647372 -7691891 -3398404 -1131123
10363 -1131123 -5300744 -9900745 -11340642 -12370127 -12867722 -8523347 -27210 6082410
10355 6082410 6779730 4857614 2235851 -1296396 -3614607 -2342024 -423257 -2301775
10347 -2301775 -6021158 -6317535 -3518763 -1917294 -1632789 138884 2214781 1746780 887733
10338 887733 2950926 4714337 1270254 -4247678 -5079795 -2367344 -2445641 -5010636 -4549795
10329d549795K747005q08601l592992J38701L631752J62617l645230K60675N938362
10320B82494L651386k857718l506300O13152J258529j014317M94691M149435K615703
10311E687055k622176l287328O32706J254320k312105k594284J912878L649309
10303B320375m26281l555376j027356K548835K059992k95887n66867K79445k60102
10294A076778j376210j439863j164301j052540M95919L549517M645658J601662
10286F336620k499883l370937j491839o98771j989570k325459K8302K197115Q26696
10277b987726k451935k916761L32095L140519K900076K156810L210105L513692
10269F896875N91388k411625j548682Q20123O8623k387768k144620p04797k612668
$$ plain form
10329 -4549795 -1802790 -2611391 -6204383 -6065682 -2433930 -2271313 -5916543 -5655868 282494
10320 282494 3933880 1076162 -2430138 -1816986 -558457 -1572774 -1078083 3071352 5687055
10311 5687055 3064879 -222449 410257 1664577 -647528 -3241812 -1328934 2320375
10303 2320375 1894094 -1661282 -2688638 -139803 1920189 1624302 1057435 1336880 1076778
10294 1076778 -299432 -1739295 -2903596 -3956136 -3460217 89300 4734958 6336620
10286 6336620 3836737 465800 -1026039 -1724810 -3714380 -6039839 -6011537 -3814422 -2987726
10277 -2987726 -5439661 -8356422 -8024327 -4883808 -1983732 173078 3383183 6896875
10269 6896875 7488263 5076638 3527956 4348079 4416702 2028934 -115686 -820483 -3433151
10260c433151n247001j642890O290684Q312378J859508l366888r04772K855465
10252D723333N12358m254565m009234L06273K494740J073985j067299k793453
10244c013862m194370l556810k97900K435618K470448K048605K803311K095733
10236G90773j526691m341491l370755j196555m99302O90208L601014M470566J065188
10227c17045k167609j084341J472569J585510J112990K584593L054811l13160
10219E928318l949011l792808k059540j604904J60375M435008N156411j030527
10211C243322n801251r88364O523488M317072n273074q257371q66548N712588
10203a390138L800863n88283J59673L792839M119365O42113k708409l305838j131222
$$ plain form
10260 -3433151 -8680152 -10323042 -4032358 4280020 6139528 2772640 1867868 4723333
10252 4723333 5235691 981126 -3028108 -2721835 -227095 846890 -220409 -3013862
10244 -3013862 -7208232 -10765042 -11062942 -8627324 -6156876 -4108271 -1304960 790773
10236 790773 -735918 -5077409 -8448164 -9644719 -10144021 -9453813 -5852799 -1382233 -317045
10227 -317045 -2484654 -3568995 -2096426 -510916 602074 3186667 6241478 5928318
10219 5928318 1979307 -1813501 -3873041 -5477945 -5317570 -882562 4273849 3243322
10211 3243322 -2557929 -3546293 2977195 7294267 2021193 -6236178 -7102726 -1390138
10203 -1390138 2410725 1822442 1982115 5774954 9894319 10536432 7828023 4522185 3390963
10194C390963J594102J073025l357812n852503j230739N761374O004014R836k856056
10185D536204L26188J972436k016468m886196j073534L823663K548781j812822
10177C418252j917825J117668M02382m187567n439856o67551L907316K637957
10169g29224j745649k993325l6163K756983K114382o31910k341321j860792j15536
10160e582555J938151L620878L380310j83801n231651o886068k707654L324449
10152h327941M923884J226214k209261o50035L805258M970387L45035n495446
10144a411905n890666Q8204O185432O159031J036986k953160k726901j133969
10136f46948j104874j200985P30713K878380J935770j563788l712986k317436
$$ plain form
10194 3390963 4985065 6058090 2700278 -3152225 -4382964 1378410 7382424 7392260 4536204
10185 4536204 4862392 6834828 4818360 -67836 -1141370 2682293 5231074 3418252
10177 3418252 1500427 2618095 3020477 -1167090 -6606946 -7274497 -3367181 -729224
10169 -729224 -2474873 -5468198 -5504361 -2747378 -632996 -1264906 -3606227 -5467019 -5582555
10160 -5582555 -3644404 -23526 3356784 3172983 -2058668 -8944736 -11652390 -8327941
10152 -8327941 -3404057 -2177843 -4387104 -5037139 -1231881 3738506 4083541 -1411905
10144 -1411905 -7302571 -7214367 -1028935 5130096 6167082 3213922 487021 -646948
10136 -646948 -1751822 -2952807 -2222094 656286 2592056 1028268 -2684718 -5002154
10128e002154R97332L335196L284907J464184l52656q80948m75834N5846J160204
10119C586077L051891L439889L17426l300007k266446K285872L109215k331370
10111G892547p128792m908973R55634L311275J726742P26305R75718o73954l973393
10102a096891m922756k510671r4827L52024M99932J536889K019707P57816j406417
10093d865194l239440l887723k157645K139965O253698O626416L052260j313611
10085B608726l650430l382011j367917Q75784K082449K724898M044904M770435
10077H706838J891883l720616o528023l915060l39725k83484j559459m04581J243792
10068d908435k46436k596295j187928K264716K181317j206116k297764L53276
$$ plain form
10128 -5002154 -4004822 -669626 2615281 4079465 3726809 2845861 2370027 2425873 3586077
10119 3586077 6637968 10077857 10395283 7095276 4828830 7114702 10223917 7892547
10111 7892547 763755 -4145218 -3189584 121691 1848433 2574738 3550456 2876502 -1096891
10102 -1096891 -6019647 -8530318 -8625145 -8273121 -7773189 -6236300 -4216593 -3458777 -4865194
10093 -4865194 -8104634 -11992357 -14150002 -12010037 -5756339 870077 3922337 2608726
10085 2608726 -1041704 -4423715 -5791632 -4915848 -2833399 -108501 3936403 8706838
10077 8706838 10598721 6878105 350082 -3564978 -3904703 -4188187 -5747646 -6152227 -4908435
10068 -4908435 -5154871 -7751166 -8939094 -6674378 -4493061 -5699177 -7996941 -7643665
10060g643665K639531L098214M572552O579560M187528k715836o547959k680090
10052A489835L172160L257435j284413l477374j342257M02293j397334l750184
10044b929839k504122J558119L944567K508657L0265K39153K770694L765633J071298
10035A0454425l141927n234125l712039K38339L686607L347625j107415m925556
10027c94066l065733K461520M588323J376203j537778o12516K59324k202440m276671
10018c403834k409037k44634j619335k470322K064384P529682O426949P22323
10010F596176j811662p83801k034729n155356l747688J799050L478675n09105
10002b168440k291719J962037N423050K559804j776814j355004J348169R42951
$$ plain form
10060 -7643665 -5004134 -1905920 2666632 9246192 13433720 10717884 4169925 1489835
10052 1489835 4661995 7919430 6635017 3157643 1815386 2217679 820345 -2929839
10044 -2929839 -5433961 -3875842 68725 2577382 2607647 2846800 5617494 9383127 10454425
10035 10454425 7312498 2078373 -1633666 -1395327 2291280 5638905 4531490 -394066
10027 -394066 -3459799 -998279 3590044 4966247 3428469 2815953 3075277 872837 -3403834
10018 -3403834 -5812871 -6057505 -7676840 -10147162 -8082778 -553096 5873853 6596176
10010 6596176 4784514 4000713 1965984 -3189372 -6937060 -5138010 -1659335 -2168440
10002 -2168440 -4460159 -2498122 2924928 5484732 3707918 2352914 3701083 4644034
9994D644034j378954j381293r3576j414011m399112m459359p55249K843008L439180
9985b955332J784206j84504j395505j511187q03907P59N38568P50501J32682j362756
9975e006475k085354n82946J730795K367314J513966J087826J122535O01985N61018
9966A310664K077361K570771o89403m498251l261265J761472L475547k10422l450747
9957i14273j893455J592006K868023K068262N76767j844442m137246l436953k26719
9948e348030R91565j261872k770281n71190K516230L102528K017149J042865l03244
9939e84280j890583j651286J38232J71096j650200p85108L860113O182865J708917
9930E499766m786486n665847q19975L349500K867284l22260k358480j642430L14605
$$ plain form
9994 4644034 3265080 1883787 1790211 376200 -4022912 -8482271 -9237520 -6394512 -2955332
9985 -2955332 -1171126 -1355630 -2751135 -4262322 -5066229 -5065470 -4526902 -3776401 -3643719 -5006475
9975 -5006475 -7091829 -7674775 -5943980 -3576666 -2062700 -974874 147661 749646 1310664
9966 1310664 3388025 5958796 5269393 771142 -2490123 -728651 2746896 2536474 -914273
9957 -914273 -2807728 -1215722 1652301 3720563 4297330 2452888 -1684358 -5121311 -5348030
9948 -5348030 -4356465 -5618337 -8388618 -8959808 -6443578 -3341050 -1323901 -281036 -584280
9939 -584280 -2474863 -4126149 -3987917 -3816821 -5467021 -6252129 -2392016 3790849 5499766
9930 5499766 713280 -4952567 -5772542 -2423042 444242 121982 -2236498 -3878928 -3564323
9921c564323P05913j077091k171227n21246J253317P8015j687198j61237K446957
9912d698120J431035j034882Q89678N134215L942351k055421l799043M25686J922656
9903B158155k360082m265816j30306J971590k149569m146921P46443L320053k548406
9894g404859o918786j972900J317533p109130j3059269K244498K7269305L1291444
9886B5657836R010275j1764528j0982200o68736M31269n186217n125204j08544
9878A263951P84007j953382o26303M425913N226552j45490m830467m079617r28562
9869h63398p0330j578433k169918J75427L794488M897898K091629j217043j077507
9860C982813J280418J499936r38661k444138j769035j489489k559210k675365
$$ plain form
9921 -3564323 -2858410 -3935501 -6106728 -6627974 -5374657 -5296642 -6983840 -7145077 -4698120
9912 -4698120 -3267085 -4301967 -3412289 1721926 5664277 3608856 -190187 235499 2158155
9903 2158155 -201927 -4467743 -4598049 -2626459 -4776028 -8922949 -8176506 -4856453 -7404859
9894 -7404859 -14323645 -16296545 -14979012 -22088142 -35147411 -32902913 -5633608 25657836
9886 25657836 34668111 22903583 11921383 11252647 11683916 6497699 1372495 1263951
9878 1263951 2047958 94576 -531727 3894186 9120738 8975248 4144781 65164 -863398
9869 -863398 -933728 -2512161 -4682079 -4506652 -712164 4185734 6277363 5060320 3982813
9860 3982813 5263231 6763167 5824506 3380368 1611333 121844 -2437366 -5112731
9852e112731r55535P95922K116662L950019M507543J198651l038089k526053J206789
9843B143178O19016m726938n707206J453520P321285L202408n115638o391418
9835g201793p95046K183402o31665k778008j06272L108718K198268o38912o29983
9826e291291K215991L633936J236938k474129l230228j44278L040102K546514
9818A533555l95826j328529P63686J892346o61267m036852m158592j468522P30842
9809g129159J391383J775565J897730N09020j739413k234123j6643K638319L002199
9800I4878R90854j236689k098383k050183j965438j133740J364925L665211K591785
9791B23220q88291j605367J835086L439482j163146o329206l982285L311759N528147
$$ plain form
9852 -5112731 -6068266 -5272344 -3155682 794337 5301880 6500531 3462442 936389 2143178
9843 2143178 2762194 -1964744 -7671950 -6218430 1102855 4305263 -810375 -7201793
9835 -7201793 -7996839 -5813437 -6445102 -9223110 -9329382 -6220664 -4022396 -4661308 -5291291
9826 -5291291 -3075300 558636 1795574 -678555 -3908783 -4053061 -1012959 1533555
9818 1533555 1137729 -190800 572886 2465232 1803965 -2232887 -6391479 -7860001 -7129159
9809 -7129159 -5737776 -3962211 -2064481 -1555461 -3294874 -5528997 -5545640 -2907321 94878
9800 94878 1085732 -150957 -2249340 -4299523 -6264961 -7398701 -6033776 -2368565 223220
9791 223220 -665071 -2270438 -435352 3004130 1840984 -4488222 -8470507 -5158748 369399
9782C69399M98662l538266j828070M10224j227313k594129M07295L696379K360778
9773a445041m94055L84101L089968K731334L81764m311J05888l075732o879108
9764e205192n087666J497070N476975L767621P87528K93538Q41192N15626J46456
9755C033148J98201o06825k134555k375704r63250M10751J035339J030503p83083
9746a155475m394748n521554q21839M963739M080980k180507m308479J279918
9738h057965P009347N991996J337734q89763j127445k719500m135336j693858
9730d284790K883792M083414O20878l204086l719734j578458M82767O80450p26777
9721d762544j558301J78937L179651L784836J161205j326282j465136j308678
$$ plain form
9782 369399 868061 -2670205 -4498275 -4088051 -5315364 -7909493 -7502198 -3805819 -1445041
9773 -1445041 -1939096 -1554995 1534973 4266307 4648071 4643760 4749648 1673916 -5205192
9764 -5205192 -10292858 -8795788 -3318813 448808 1236336 1529874 2371066 2886692 3033148
9755 3033148 3231349 2624524 489969 -1885735 -2848985 -2438234 -1402895 -372392 -1155475
9746 -1155475 -5550223 -11071777 -11893616 -6929877 -2848897 -5029404 -9337883 -8057965
9738 -8057965 -1048618 4943378 6281112 5391349 4263904 1544404 -2590932 -4284790
9730 -4284790 -1400998 2682416 3303294 99208 -3620526 -5198984 -4716217 -4035767 -4762544
9721 -4762544 -6320845 -6141908 -2962257 822579 1983784 657502 -807634 -2116312
9713b116312k585018l022749p43581J486560P52737o15880Q77549L342008K660960
9704C6274m9374l51219J539053J229028j819674l322482j695259j25214k1194
9695d580061J156424L610842L216349j130673m115798j946343J537242J313933
9687i38085q94342o10281J224592L44908k817584l633044r86682J538320K361478
9678d410720L987735P011427P297543K018844n068926p621239m127609J111231
9670A98286L220351J053957k819686m714919k773741J469725M451280L921582
9662D006835P41748k559351m230526m152710l109168j734496l4157K022199L524036
9653e525590L201377J456839M11475P85172M00289k196589m284836k315629K181528
$$ plain form
9713 -2116312 -4701330 -7724079 -8467660 -6981100 -6228363 -6844243 -5966694 -2624686 36274
9704 36274 -13100 -364319 1174734 2403762 584088 -2738394 -4433653 -4558867 -4580061
9695 -4580061 -3423637 187205 3403554 2272881 -1842917 -3789260 -2252018 -938085
9687 -938085 -1832427 -2442708 -1218116 -873208 -3690792 -7323836 -8310518 -6772198 -4410720
9678 -4410720 -422985 6588442 13885985 15904829 10835903 3214664 -912945 198286
9670 198286 3418637 4472594 1652908 -3062011 -5835752 -4366027 85253 4006835
9662 4006835 4748583 2189232 -2041294 -6194004 -9303172 -11037668 -11071825 -9049626 -5525590
9653 -5525590 -2324213 -867374 -455899 329273 729562 -1467027 -5751863 -8067492 -5885964
9644e885964L971226J607188o80368O2278J074901o86413k557775k16871M509158
9635A197360N320837P22797l627595l301575j119307j749720l996330l079202
9627i632735J132955L414410J171264j664627r02044J733376K219557J084742
9619a443102J859338M071694L330043r78246l424436l75439M289954M714315R69591
9610A3013712k434350l352381l024080k094237j93436J331840N56932j494785
9602B309215k304488k195385k991459l143371L99148N340707N358092J2742l021054
9593b35853Q60896N590504L322160l416021n204450N03747N964869M226414j983097
9584I629169n053627k628949O02312K27316k072702j561011K256072M453623J801017
$$ plain form
9644 -5885964 -1914738 -307550 -987918 -925640 149261 -537152 -3094927 -3311798 1197360
9635 1197360 6518197 7240994 3613399 311824 -807483 -2557203 -6553533 -9632735
9627 -9632735 -8499780 -5085370 -3914106 -5578733 -6480777 -4747401 -2527844 -1443102
9619 -1443102 416236 4487930 7817973 6839727 3415291 3039852 7329806 12044121 13013712
9610 13013712 10579362 7226981 4202901 2108664 1915228 3247068 3804000 2309215
9602 2309215 4727 -2190658 -5182117 -8325488 -7926340 -2585633 2772459 2785201 -235853
9593 -235853 625043 6215547 9537707 6121686 917236 1420983 7385852 11612266 9629169
9584 9629169 4575542 1946593 2548905 2776221 703519 -857492 1398580 5852203 7653220
9575G653220k068906j857453J205780J295157k509537m559970j760772J609566
9567i92915J180784p94642k39051J761953J823708N77690O82085J209092l76939
9558D831765k646511k297225l41615l99177j807993n67772L020663L893660L25367
9549D011162l161585k599129M62570K379209J633070j514200n375916o033091
9541a0197910r31983N746747O673576J718958j379611J021898K833668j175259
9533D310084o050390m632498M94646J429837j864633k135643K097643L637223
9525b713731j011248m970023j554684N002471N864104O65715k782227m55539L011889
9516A056727K318674j284674l271547k324666m58687O88252O45710q68362k722992
$$ plain form
9575 7653220 5584314 3726861 4932641 6227798 3718261 -841709 -2602481 -992915
9567 -992915 187869 -606773 -845824 916129 2739837 3317527 3999612 5208704 4831765
9558 4831765 2185254 -111971 -453586 -852763 -2660756 -3228528 -207865 3685795 4011162
9549 4011162 849577 -1749552 -1286982 1092227 2725297 1211097 -4164819 -10197910
9541 -10197910 -11129893 -5383146 1290430 3009388 1629777 2651675 5485343 4310084
9533 4310084 -1740306 -6372804 -5878158 -4448321 -6312954 -8448597 -6350954 -2713731
9525 -2713731 -3724979 -8695002 -10249686 -5247215 616889 1282604 -1499623 -1955162 1056727
9516 1056727 3375401 2090727 -1180820 -3505486 -3964173 -3275921 -2630211 -3498573 -6221565
9507f221565j854836K627828O130237L461649l354569o649735l186914J852156
9499g195749K702993M21726n80873L08715L79244j036592j939432j429641m70215
9490h839824O14895K311815L916436M005606K564307N50574j660519l198433j822863
9481a558006K672108N816918L364898k040552l627637J37286L609799K238228
9473A0613042j684098l331282j745710L46938N30768j504554m288382n306374
9465f369652l105866M97831K118648J100210n0950K83221J083778J398986J676424
9456a367370J593899j01057k269882j321326L435843P294371N573826m91739n578848
9447F767717o291498l310729P79130L456402L074421n1657l426066m374813k285213
$$ plain form
9507 -6221565 -8076401 -5448573 681664 4143313 788744 -5860991 -9047905 -7195749
9499 -7195749 -4492756 -4071030 -4651903 -4343188 -3963944 -5000536 -6939968 -8369609 -8839824
9490 -8839824 -8224929 -5913114 -1996678 2008928 4573235 5123809 3463290 264857 -1558006
9481 -1558006 1114102 6931020 10295918 8255366 4627729 4765015 8374814 10613042
9473 10613042 8928944 5597662 3851952 4198890 4729658 3225104 -1063278 -6369652
9465 -6369652 -9475518 -8977687 -6859039 -5758829 -5809779 -5526558 -4442780 -3043794 -1367370
9456 -1367370 226529 125472 -2144410 -3465736 -29893 7264478 12838304 12346565 6767717
9447 6767717 476219 -2834510 -2055380 1401022 4475443 4423786 997720 -3377093 -5662306
9438e662306J169368L327336K442529l38500j388741J139700M097586K986433
9430G773405j592986m470589l107788n42115n2258n95482L42239K298056K813097
9421B865579J103452j315230k602859k032275m51097L73296R8113Q33707L670641
9412B543327N427734K552845k521632l731897k24877K522446J387026n32499q18710
9403F603763k128951n799790o893311j294403O312500P787125K608010k186641
9395E008302k041323M57158J033769n97095j670591l77083K112114K717073k12652
9386F429672m259690n113067k028568R97178N69081j887871k584524P0546M442459
9377c364784P121410N033123j183173o027991n032115j304405j125052l562352
$$ plain form
9438 -5662306 -4492938 -1165602 1276927 938427 -450314 689386 4786972 7773405
9430 7773405 6180419 1709830 -1397958 -1940073 -1992331 -2587813 -2245574 52482 2865579
9421 2865579 3969031 2653801 50942 -1981333 -2432430 -2059134 -1961021 -1127314 2543327
9412 2543327 7971061 10523906 8002274 4270377 4045500 6567946 7954972 7422473 6603763
9403 6603763 4474812 -1324978 -8218289 -9512692 -3200192 4586933 7194943 5008302
9395 5008302 2966979 3424137 4457906 3860811 2190220 1813137 3925251 6642324 6429672
9386 6429672 2169982 -2943085 -4971653 -3974475 -3405394 -5293265 -7877789 -7807243 -3364784
9377 -3364784 3756626 8789749 7606576 1578585 -3453530 -4757935 -5882987 -9445339
9369i445339j838177M052512N309657j321285o520253k265254N396889N901029
9361g30221J07696k830983j65429K612562K130693L87976r74029j947475j136377
9352b545587J635208J962398k716231o342334k277050M807431M948051j133169
9344a661283l187667J582219M421049J69552m486647k376341L508492N978952
9336C948326L498108o56303l672476l869797q28565K358449J539589k062699l013949
9327b759317l72287R92286q18737j689491M43683J661754n52617k708532j810854
9318g614112l44776q98971j433548K30000K243481K480428J748913P02858j357855
9309d243582k723594m18113L085943J566882m157205n411446Q81235O668888N347173
$$ plain form
9369 -9445339 -11283516 -7231004 -1921347 -3242632 -9762885 -12028139 -6631250 -730221
9361 -730221 -622525 -3453508 -3618937 -1006375 1124318 1512294 538265 -1409210 -2545587
9352 -2545587 -910379 1052019 -1664212 -8006546 -10283596 -5476165 -528114 -1661283
9344 -1661283 -4848950 -3266731 1154318 1323870 -3162777 -5539118 -2030626 3948326
9336 3948326 7446434 6790131 3117655 -752142 -1580707 777742 2317331 254632 -2759317
9327 -2759317 -3131604 -2139318 -2958055 -4647546 -4203863 -2542109 -3094726 -5803258 -7614112
9318 -7614112 -7958888 -8857859 -10291407 -10061407 -7817926 -5337498 -3588585 -2885727 -4243582
9309 -4243582 -6967176 -7385289 -4299346 -2732464 -6889669 -12301115 -11419880 -4750992 596181
9300E96181J010070n58257j103555l077015k520608K526835M660694j661503q391373
9291h518531m772381N185069Q191842J529385m717107m190027j390235j258353
9283i940338j841773p7041K803059M415870M323353K494378o98716k556609o12808
9274a690625L042594M171791K225655k86622k404297m086361l329518P35336M059583
9265B437536K508733j731338l937956m049222m103014k173171L658479Q476735
9257A086782O157940m11842l285663j623885r79891k282318j394806J255437Q55810
9248f22436j990977j823319Q94323K7022m169123m221185J210074M244793J354625
9239e096203q64182J998702M443997J420069k772737k411414M94386J307090M81139
$$ plain form
9300 596181 1606251 1047994 -55561 -3132576 -5653184 -3126349 1534345 -127158 -8518531
9291 -8518531 -13290912 -8105843 85999 1615384 -3101723 -7291750 -8681985 -9940338
9283 -9940338 -11782111 -11859152 -9056093 -4640223 -316870 2177508 1478792 -1077817 -1690625
9274 -1690625 1351969 5523760 7749415 7462793 5058496 972135 -2357383 -1622047 2437536
9265 2437536 4946269 3214931 -723025 -4772247 -8875261 -11048432 -7389953 1086782
9257 1086782 7244722 6832880 3547217 1923332 943441 -1338877 -2733683 -1478246 -622436
9248 -622436 -2613413 -4436732 -3542409 -3515387 -7684510 -11905695 -10695621 -6450828 -5096203
9239 -5096203 -5960385 -3961683 482314 1902383 -870354 -3281768 -2787382 -1480292 -999153
9230i99153M38863N69755J97499P68692J186802k377585q209500q298591n70589
9221a7293807O114218M801005L73445J97795K537982J928452n45655n49013J124615
9212a310963J195027N49258J352679J748077k71762k113452j486238j049709k541277
9203c928360k200461J719328L489575o54802m239197l24337O381429O587033O81156
9194G511364l561921l353634j707535K09130K443199J854231k659391m770976
9186d035533J27191N174123J845542n277365n394583Q18119L411640M55163n72366
9177c448069K214115K400449j535442l030702N57009L868831L357754J307408
9169E691353p64584l091790k588932K758625O023388J4248q068835n144711N618423
$$ plain form
9230 -999153 -560290 9465 206964 975656 2162458 -215127 -8424627 -16723218 -17293807
9221 -17293807 -11179589 -6378584 -6005139 -5807344 -3269362 -1340910 -1886565 -2435578 -1310963
9212 -1310963 -115936 433322 1786001 3534078 3262316 1148864 -337374 -1387083 -3928360
9203 -3928360 -6128821 -4409493 -919918 -1574720 -5813917 -6138254 243175 6830208 7511364
9194 7511364 3949443 595809 -1111726 -902596 1540603 3394834 735443 -4035533
9186 -4035533 -3908342 1265781 3111323 -2166042 -7560625 -6742506 -3330866 -2875703 -3448069
9177 -3448069 -1233954 1166495 -368947 -3399649 -2842640 1026191 4383945 5691353
9169 5691353 4926769 1834979 -753953 2004672 8028060 8042308 -26527 -5171238 447185
9160D47185P932764j393077p682583l383201J272933r36357j823660M287059Q081517
9151F802580K570113l168429o68499K374085k401124o982446j686301N500326
9143B340305K202348n909307m983611K614911L617934j787608j223713O523849
9135C395108R129207K357003l871712l434357j888410l056891k494743J365470
9127A500675K710902l19148j475388J907444L905598J179005j196041J25588N20452
9118H859087l312777o507867m232722M27471K149276J048374K21709O85728K104681
9109A442960L908022L738589j78065m330430l599289K12166P99391j690238r78485
9100f75379L305039M061692m51882k748228J041410M610447K744260n82181j128180
$$ plain form
9160 447185 8379949 6986872 -695711 -4078912 -2805979 -3742336 -5565996 -1278937 6802580
9151 6802580 9372693 6204264 5535765 7909850 5508726 -1473720 -3160021 2340305
9143 2340305 4542653 -1366654 -6350265 -3735354 -117420 -1905028 -3128741 3395108
9135 3395108 12524315 14881318 11009606 7575249 5686839 2629948 135205 1500675
9127 1500675 4211577 3892429 2417041 4324485 8230083 9409088 8213047 8338635 8859087
9118 8859087 5546310 -961557 -5194279 -4766808 -2617532 -1569158 -1347449 -661721 1442960
9109 1442960 5350982 9089571 8911506 4581076 981787 1193953 1993344 303106 -675379
9100 -675379 2629660 6691352 6239470 3491242 4532652 9143099 11887359 11305178 10176998
9091A0176998j927749n175664n655903j94110M458869J908713k828806j837584
9083a075236K307268J716188k923893m088873l24731K458087J428254j65865j66668
9074h35469j55566p82113p39000m09964j177410j688905K6737J752326j40009
9065d149373l933480m186826J25465M261831M608088K383423L55639j23145J167682
9056E09304L028375K671733q78702m107925l113269P18513K692225J330693p33988
9047B116959j351416o83173O94253K105965J996253j79300k269365k149141n82378
9038c01343Q30177K069804K674283P57829k810283l320611O54022L510785J019875
9029E084538k288258n32959L368866K962495j90313L26371L478502K111215l848062
$$ plain form
9091 10176998 8249249 3073585 -2582318 -2776428 1682441 3591154 762348 -1075236
9083 -1075236 1232032 2948220 24327 -4064546 -4389277 -1931190 -502936 -668801 -835469
9074 -835469 -991035 -1773148 -2512148 -2922112 -4099522 -5788427 -5761690 -4009364 -4149373
9065 -4149373 -8082853 -12269679 -12144214 -7882383 -3274295 -890872 -535233 -658378 509304
9056 509304 3537679 6209412 5330710 1222785 -1890484 -1171971 1520254 2850947 2116959
9047 2116959 765543 82370 776623 2882588 4878841 4699541 2430176 281035 -301343
9038 -301343 528834 2598638 5272921 6030750 3220467 -100144 553878 4064663 5084538
9029 5084538 2796280 2263321 5632187 8594682 8404369 8730740 12209242 14320457 10472395
9020A0472395o129747j614068K787716J621293j625572k173694j103745p36866
9012A497712j9272J212241k451l373868l302689J970982N508422J636002m901954
9003B25125o097160k217888O37530P85382J421971K958457K007929k185904n792114
8994h256672n275798p06304N178117Q244198N133781k211544o300563k673247
8986f868032L313319L364287j820322l811190O45427M997642L234330j352691
8978A702770j891903J827123M012999J924784q44309n67971J169885L51458l402842
8969D281994o357559n741555k885819p46027k66211l99035k03289O25160K107176
8960i585165L263659K344225l90097j718160K46949K613535J915512o6407O70885
$$ plain form
9020 10472395 4342648 2728580 5516296 7137589 5512017 3338323 2234578 1497712
9012 1497712 1478440 2690681 2688230 -685638 -3988327 -2017345 3491077 5127079 225125
9003 225125 -5872035 -8089923 -7452393 -6667011 -5245040 -2286583 -278654 -2464558 -8256672
8994 -8256672 -13532470 -14238774 -9060657 -816459 4317322 2105778 -4194785 -6868032
8986 -6868032 -3554713 -190426 -2010748 -5821938 -5176511 -178869 3055461 1702770
8978 1702770 -189133 1637990 5650989 7575773 6731464 6163493 7333378 7684836 4281994
8969 4281994 -2075565 -7817120 -10702939 -11448966 -11715177 -12114212 -12317501 -11692341 -9585165
8960 -9585165 -6321506 -3977281 -4367378 -6085538 -5838589 -3225054 -1309542 -1375949 -705064
8951g05064K815098J320844l351373m556057o2052L667643J646980j655429m0948
8942i20358M089198M015227l33452l042968j869057j38279J55029M84390J092359
8933C532089L35002r46880k38467J109768p36997m483047m187258Q89961L871833
8924h53996Q14960k962127j541552K525112L399911J303130K15950L3084j793077
8915A141395l294161n14762L934633K988031l346945o518103k137813L213167
8907d534558K310625j959408k353044Q85362J458735j912938l659612q46304K481723
8898h129419K356562M73778j06584O6786l37205J63004K434224L206436o3058
8889F4524l459184j543340L412298L631717k389008o886284l895055K464543M593762
$$ plain form
8951 -705064 2110034 3430878 79505 -4476552 -4538604 -870961 776019 -879410 -920358
8942 -920358 3168840 7184067 6850615 3807647 1938590 1800311 1955340 2439730 3532089
8933 3532089 3867091 2920211 2681744 3791512 3054515 -1428532 -5615790 -4725829 -853996
8924 -853996 -39036 -3001163 -4542715 -2017603 1382308 2685438 2901388 2934472 1141395
8915 1141395 -2152766 -2667528 1267105 4255136 908191 -5609912 -7747725 -4534558
8907 -4534558 -2223933 -4183341 -6536385 -5651023 -4192288 -6105226 -9764838 -10611142 -8129419
8898 -8129419 -5772857 -5299079 -5405663 -5338877 -5676082 -5513078 -3078854 127582 64524
8889 64524 -3394660 -4938000 -1525702 2106015 -282993 -7169277 -11064332 -8599789 -4006027
8880d006027J846067m77097K86985J768702J645253M64774o57073j486304j433637
8871b048357J47199K067248K327195J213244P38000R19028k99951k848527l594105
8862a379026j111676J516512Q58228k016341l236370j351941J441846K609815
8854b668953J791280J63266j158187j764688j691196q08134J149541L355876L500105
8845A868910M57029k977374k673822J030294L168616J105828j597970o55197K629334
8836B355648L833190J857117r34601l174537m787015m159977J9184M466841M001740
8827C477590q77436m064326k515602K65154R72612J104485K011623J004115l171913
8818a793698n747938k349439L539728N437063L481334K811579M174906L241098
$$ plain form
8880 -4006027 -2159960 -2637057 -2350072 -581370 1063883 1528657 871584 -614720 -2048357
8871 -2048357 -1901158 166090 2493285 3706529 4444529 5363557 5063606 2215079 -1379026
8862 -1379026 -2490702 -974190 -115962 -2132303 -5368673 -6720614 -5278768 -2668953
8854 -2668953 -877673 -714407 -1872594 -3637282 -5328478 -6136612 -4987071 -1631195 1868910
8845 1868910 2325939 -651435 -3325257 -2294963 873653 1979481 381511 -273686 2355648
8836 2355648 6188838 8045955 7111354 3936817 -850198 -5010175 -4990991 -524150 3477590
8827 3477590 2600154 -1464172 -3979774 -3714620 -2742008 -1637523 374100 1378215 -1793698
8818 -1793698 -7541636 -9891075 -6351347 -914284 2567050 5378629 9553535 12794633
8810A2794633r37621l749537k615232p52119j317938k853024k805057j284429
8802c520324P21611K866711L548606Q78408k783462k247107K311381M055564l99743
8793E431645n308371m732221j572475j578952l152823q79799L814669M233662
8785c744665j50415k343397Q85521M082060K228102j712645k232123O67469L084743
8776G64650L378171K611662J254452p49038k032932j138577R16017J655183J21592
8767F781180k587060m656366m291805q30422L403471M243247N95318l485302l680104
8758d507843o72429J788661K313485K300011K199845J024330o52767q03784M08157
8749C397666M37166j212770j747374L0749R93756j328313l948463k590650J254237
$$ plain form
8810 12794633 11857012 8107475 5492243 4740124 3422186 569162 -2235895 -3520324
8802 -3520324 -2798713 67998 3616604 4495012 1711550 -535557 1775824 5831388 5431645
8793 5431645 123274 -4608947 -6181422 -7760374 -10913197 -11792996 -7978327 -3744665
8785 -3744665 -3895080 -6238477 -5352956 -1270896 957206 -755439 -2987562 -2320093 764650
8776 764650 4142821 6754483 8008935 7259897 5226965 4088388 5004405 6659588 6781180
8767 6781180 4194120 -462246 -4754051 -5584473 -2181002 2062245 2657563 -827739 -4507843
8758 -4507843 -5180272 -3391611 -1078126 1221885 3421730 4446060 3793293 2989509 3397666
8749 3397666 3834832 2622062 874688 905437 1899193 570880 -3377583 -5968233 -4713996
8740d713996K350612K48083J82761M109416O493079K627502l419723m371093l32413
8731C174228K149336K61364k261054k741563l414910n562802n733820j528602
8723a5657823L387816M385719K628166K290105L627318L507245J179857j068272
8715D280131k124830k745101k650944r80040O67891l43228l024884l345096j51626
8706a0417727K862917K124885j605504m830106m821169j091945M245566P186094
8698f346989N261223O54088k295090k596266k850878l975106l289454P66700N067938
8689i603834N271821J342651k324630j901147J675348L632795Q81312l508809
8681d534493l289096K560117P367961N354433l71587k675476p84921k3975k310583
$$ plain form
8740 -4713996 -2363384 -2115301 -1932540 2176876 8669955 11297457 7877734 3506641 3174228
8731 3174228 5323564 5584928 3323874 582311 -2832599 -8395401 -14129221 -15657823
8723 -15657823 -12270007 -7884288 -5256122 -2966017 661301 4168546 5348403 4280131
8715 4280131 2155301 -589800 -3240744 -4220784 -3552893 -3896121 -6921005 -10266101 -10417727
8706 -10417727 -7554810 -5429925 -7035429 -11865535 -16686704 -17778649 -13533083 -6346989
8698 -6346989 -1085766 -431678 -2726768 -5323034 -8173912 -12149018 -15438472 -14671772 -9603834
8689 -9603834 -4332013 -2989362 -5313992 -7215139 -5539791 -1906996 -1025684 -4534493
8681 -4534493 -7823589 -5263472 2104489 7458922 7087335 4411859 3626938 3602963 1292380
8672A292380l659790j894362j89052o34568k93351K865474N215365K975518j398326
8663D279288k881256j197338k4704o94209r29564Q03182L067085L593267J665762
8654G681513j335883k792011j392656N47755n54741m076252n089539j406148K630357
8645e787605K128215j515166l252781j677191K67123P33935J236614L253169N411201
8636G97514N005024J286429k994821l532705P11440M860114L033487l639538p628927
8627b101983n085181q96799o60079k134012J66507N055498N936989J201985l035121
8618a552196j919553J581372J706560j983254m641456k747342J911436M851949
8610b792484M134812K164725J988109K661004M47587m876322p940401m497073
$$ plain form
8672 1292380 -2367410 -4261772 -4450824 -5085392 -5378743 -2513269 2702096 5677614 4279288
8663 4279288 1398032 200694 175990 -518219 -1447783 -644601 2422484 6015751 7681513
8654 7681513 6345630 3553619 2160963 2708718 2153977 -1922275 -7011814 -8417962 -5787605
8645 -5787605 -3659390 -5174556 -8427337 -10104528 -9837405 -9103470 -7866856 -4613687 797514
8636 797514 5802538 7088967 4094146 561441 1272881 6132995 9166482 5526944 -2101983
8627 -2101983 -7187164 -8083963 -8744042 -10878054 -10711547 -5656049 280940 1482925 -1552196
8618 -1552196 -3471749 -1890377 -183817 -2167071 -6808527 -9555869 -7644433 -2792484
8610 -2792484 1342328 3507053 5495162 8156166 8603753 3727431 -4212970 -8710043
8602h710043K085516M742491K015853p59818K71152K414903J493779j577160k556382
8593e79709m06361J564546J000972k94794K23441J663816J356857n73292j345131
8584B610345j79685M58377o47351j114184O01670J626348q21355l821566k430064
8575c717465K267354M032788M80363l914973m789911k989644r40950J479860M716728
8566c375850O687017N184023J051789k958900m701244l282345J77826K025827
8558H08143l38868l939916l266167J669237N074054M057200K005342J609502O43871
8549H322398k389835m352037l016768j185340j251271q96522J538569K793284
8541d37522O69747j000833J162358L635709J916292j799145l064814k746625l529577
$$ plain form
8602 -8710043 -6624527 -1882036 133817 -626001 -354849 2060054 3553833 1976673 -579709
8593 -579709 -986070 578476 1579448 1284654 1508095 3171911 4528768 3955476 2610345
8584 2610345 2430660 2889037 2241686 1127502 1729172 3355520 2534165 -1287401 -3717465
8575 -3717465 -1450111 2582677 3063040 -851933 -5641844 -8631488 -9572438 -8092578 -3375850
8566 -3375850 3311167 8495190 9546979 6588079 1886835 -1395510 -1217684 808143
8558 808143 469275 -3470641 -6736808 -5067571 6483 4063683 6069025 7678527 8322398
8549 8322398 5932563 1580526 -1436242 -2621582 -3872853 -4769375 -3230806 -437522
8541 -437522 232225 -768608 393750 4029459 5945751 4146606 1081792 -1664833 -5194410
8532e194410l366312L24858M010191L256558Q20606J550830L036856K51212l901902
8523G88487k665629K341145L558603P47181O37769L528211K083446m668016p772732
8514a421535k676784L246116K679965j022099j257217J119570J176791j161353
8506F83454j825162P87515M422973O062065L953169q35613l791469j484865K783523
8497A0755590K501412k531810n856994m235563j450896q38694p72558K62262O61548
8488a505703J30610O86027J162513k178927p308848o805195J72271M910042K617159
8479h120051j2945L272673P491819N442907P4879j297498N83390j05916k997366
8470D331892k927460o3018O50092j092905p51421K031567K180691k027942n642902
$$ plain form
8532 -5194410 -8560722 -8235864 -4225673 -969115 -148509 1402321 4439177 4690389 788487
8523 788487 -1877142 464003 4022606 4769787 5407556 8935767 11019213 6351197 -1421535
8514 -1421535 -4098319 -852203 1827762 805663 -451554 668016 1844807 683454
8506 683454 -1141708 -354193 4068780 10130845 14084014 13248401 9456932 7972067 10755590
8497 10755590 13257002 10725192 4868198 632635 -818261 -1656955 -2429513 -2167251 -1505703
8488 -1505703 -1375093 -689066 473447 -1705480 -9014328 -15819523 -15647252 -10737210 -8120051
8479 -8120051 -8132996 -4860323 2631496 8074403 8149282 6851784 7435174 7329258 4331892
8470 4331892 1404432 1341414 1991506 898601 147180 2178747 4359438 2331496 -3311406
8461c311406m273297L12522L444567K889318m5797k279322j683899M21148P36334
8452c789832q92142q09094K087321L588993J088590j421458K4822K209085K06931
8443B293216l645132l197178J413777M065089J929567j741864l399577k361300
8435d643402Q13862M128094L883767l43278k753262R39348N621300L723954k432713
8426H937670l817453R40553L746514K70178m248040m631086k722052j493934J18171
8417b899479K521568K387117j227131l454042r76320K192242J037211k658265
8409c077099l761655j607722M61992Q50732N55319M1581q59076j103491M44925
8400h054494K869188M149754L212277J04622l786757n062960j166350M832524
$$ plain form
8461 -3311406 -7584703 -7272181 -3827614 -938296 -984093 -3263415 -4947314 -4526166 -3789832
8452 -3789832 -4681974 -5491068 -3403747 185246 1273836 -147622 -122800 2086285 2293216
8443 2293216 -1351916 -4549094 -3135317 929772 2859339 1117475 -2282102 -4643402
8435 -4643402 -3829540 298554 4182321 3839043 1085781 2025129 7646429 11370383 8937670
8426 8937670 5120217 6060770 9807284 10077462 5829422 1198336 -1523716 -3017650 -2899479
8417 -2899479 -377911 2009206 782075 -2671967 -3648287 -1456045 -418834 -3077099
8409 -3077099 -6838754 -8446476 -7984484 -7133752 -6578433 -6536852 -7395928 -8499419 -8054494
8400 -8054494 -5185306 -1035552 2176725 2281347 -1505410 -6568370 -7734720 -2902196
8392b902196O261678J737317k275969q48279J964673k79560n952986p542713k754490
8383a2592525K596142L154311M86610n54672J642915M499616M770248J604541
8375E607186k732004m567186k299267J630908L252176J416082j473363k695399
8367a860867j687995M99072K470941K895513J220531j261696k155064o39463J261400
8358G42372J004538j176418k334073n21348K436473L014397O02803j580351r28534
8349A259859Q87504N46806j729942k384575q6339J815013M1977l441444l613744
8340f704885P21248M789868L684223j233321l917586j627309J221265p55315n621115
8331i442927n981643M56979O674938N522977m93016l173120k41162K662293J460282
$$ plain form
8392 -2902196 3359482 5096799 2820830 1972551 3937224 3657664 -2295322 -9838035 -12592525
8383 -12592525 -9996383 -6842072 -6355462 -6910134 -5267219 -767603 4002645 5607186
8375 5607186 2875182 -1692004 -3991271 -2360363 891813 2307895 834532 -1860867
8367 -1860867 -3548862 -3049790 -578849 2316664 3537195 2275499 120435 -519028 742372
8358 742372 1746910 570492 -1763581 -2284929 151544 3165941 3768744 2188393 1259859
8349 1259859 2147363 2694169 964227 -1420348 -1506687 308326 350303 -3091141 -6704885
8340 -6704885 -5983637 -1193769 2490454 1257133 -2660453 -4287762 -3066497 -3821812 -9442927
8331 -9442927 -15424570 -14967591 -8292653 -2769676 -3262692 -6435812 -6676974 -4014681 -2554399
8322b554399p91399J16334K902680L709505K377341J691958K081459J135401j864743
8313H804137m339719m015492j711832M34032J711624K482613K262039J1387l493239
8304B145550n157390k838210J356110K832254Q6688l224462k962326M20110L265908
8295d075768L598188K142354j87580k566478k830679K90550L560848K313898k034456
8286B10877k634567K395033N637689Q89366o551097o625144Q47171N782246K276901
8277B228475l880006m687730o59655K363621K543811K498177K840274J280350
8269D527317k000805l288512r01906K127375K599701J177778J13076j02898L03637
8260D554763J975464M226326L741522r60946n501868m313627J231269L834303
$$ plain form
8322 -2554399 -3345798 -3229464 -326784 3382721 5760062 7452020 9533479 10668880 8804137
8313 8804137 4464418 448926 -1262906 -828874 882750 3365363 5627402 5638789 2145550
8304 2145550 -3011840 -5850050 -4493940 -1661686 -1574998 -4799460 -7761786 -7341676 -4075768
8295 -4075768 -477580 1664774 1477194 -1089284 -3919963 -3629413 -68565 2245333 210877
8286 210877 -2423690 -28657 5609032 6498398 -52699 -6677843 -5830672 -48426 2228475
8277 2228475 -1651531 -6339261 -6998916 -4635295 -2091484 406693 3246967 4527317
8269 4527317 2526512 -762000 -1663906 463469 3063170 4240948 4354024 4251126 4554763
8260 4554763 6530227 10756553 14498075 13537129 8035261 3721634 4952903 8787206
8252H787206J27730m716828m259360O75712L690679J192825l768063n462380j416935
8243e149414N261665Q458235M744432k616538o561833m149419R423j13187m013014
8234d129650n605120j707681L500810L915184m75133l473228p32263M382636N147215
8225H22770O90610k693213n61646L197818K313560k395195m575029j974224J324378
8216c850171K352399K747735L409896J964311j627167k827763K54895K791944
8208E216079Q47670k194727k175110j812532m832463p031825k072069O392467
8200g662510Q106421J499931l874251j792507K626829K617718m49673j751119
8192f79161j186765j358194j841722q38267O02377P39485R38848K946526M677924
$$ plain form
8252 8787206 8914936 4198108 -61252 614460 4305139 5497964 1729901 -3732479 -5149414
8243 -5149414 112251 8570486 13314918 10698380 4136547 -12872 -3449 -116636 -4129650
8234 -4129650 -9734770 -11442451 -7941641 -4026457 -4501590 -7974818 -8707081 -4324445 822770
8225 822770 1513380 -1179833 -1741479 1456339 3769899 1374704 -3200325 -5174549 -3850171
8216 -3850171 -1497772 1249963 4659859 6624170 4997003 2169240 2424135 5216079
8208 5216079 6063749 3869022 1693912 -118620 -4951083 -11982908 -14054977 -7662510
8200 -7662510 443911 1943842 -1930409 -3722916 -1096087 1521631 1071958 -679161
8192 -679161 -1865926 -3224120 -5065842 -5904109 -5301732 -4562247 -3623399 -676873 4001051
8183D001051L135671k76022j729677r40642p84262j805596j712426m12606r64871
8174a489380m137980n881792k674293L121957N999852M110149P13059p22236k82602
8165a243266J12470k3188J82094Q73417J349495J479434J450367N49715j649609
8156C080929l120309j183377L024084M937442K678033l17106p16326j88809j915624
8147F278937m794403m898628j391435K472268L654343K005690o75558k152629
8139D98585j345776m473r21407l122794k188246K403627M771728J399623k393783
8130i02916m96849L822725L180637j745279l862267j642945l10376j541166j366004
8121d864440R02333J007074j233972n44676L534521M335543k69139l179410j4950
$$ plain form
8183 4001051 7136722 6860700 5131023 4190381 3406119 1600523 -111903 -524509 -1489380
8174 -1489380 -5627360 -11509152 -14183445 -11061488 -5061636 -951487 -238428 -960664 -1243266
8165 -1243266 -1130796 -1153984 -971890 -98473 1251022 2730456 4180823 4730538 3080929
8156 3080929 -39380 -1222757 1801327 6738769 9416802 9099696 8383370 8194561 6278937
8147 6278937 1484534 -3414094 -4805529 -2333261 1321082 3326772 2651214 498585
8139 498585 -847191 -851664 -1773071 -4895865 -7084111 -4680484 91244 1490867 -902916
8130 -902916 -1399765 2422960 5603597 3858318 -3949 -1646894 -1957270 -3498436 -4864440
8121 -4864440 -3962107 -2955033 -4189005 -4733681 -1199160 3136383 2867244 -312166 -327116
8112c27116L174387M51918l835261k875942J378198K762708J203224N10904M15953
8103B858973j345130k760141r72188J280788l1609k590876j668554J322770J752841
8094b153126M26582J369670L364873K074967j133292j149323J167010J65575l916321
8085B16615m586862l31307K698041J203029m71716J026644K412316N48609j818601
8076H96768j343166M20419Q29923O90215J264408J166189k55127o58525P51026
8067C762130P00502k448035m650673k144088K070324K392860j240645l884972
8059e442597k571894J125302M199629M531364J387648l288100n261800k516391
8051g836839J806984L489131K584200J784190J362757k54165j968330p44020K717969
$$ plain form
8112 -327116 2847271 3299189 -536072 -3412014 -2033816 728892 1932116 2443020 2858973
8103 2858973 1513843 -1246298 -2218486 -937698 -969307 -3560183 -5228737 -3905967 -2153126
8094 -2153126 -1726544 -356874 3007999 5082966 3949674 2800351 3967361 4132936 216615
8085 216615 -4370247 -4701554 -2003513 -800484 -1272200 -245556 2166760 2715369 896768
8076 896768 -446398 -25979 803944 1494159 2758567 3924756 3669629 3011104 3762130
8067 3762130 4462632 2014597 -2636076 -4780164 -2709840 -316980 -1557625 -5442597
8059 -5442597 -8014491 -6889189 -2689560 1841804 3229452 -58648 -5320448 -7836839
8051 -7836839 -6029855 -2540724 43476 1827666 3190423 2936258 967928 223908 2941877
8042B941877L459208p81355n584788n501940j275425J800895J399602K90682Q36425
8033b414819J277823m60644k378936j325550J408646J668783p76511j661803O73797
8024c989214K491388J283844L93008L007723N598473K841658l371703n932737
8016B322440k666616J374229J980221N31512n23673j686139l530493l951750j243230
8007g393499K682197M543356L349568L02775l006545m936408m172684j224894
7999i856134J575815K347234J199978j82287M25255L828302O936825M661568k824790
7990H111766p674708l878197L500907M966656N46733j074245K798043M611552
7982A1908507l80110o038240n483763j584709p14480k153858j144633J867514
$$ plain form
8042 2941877 6401085 5619730 34942 -5466998 -6742423 -4941528 -3541926 -3251244 -2414819
8033 -2414819 -1136996 -1597640 -3976576 -5302126 -3893480 -2224697 -3001208 -4663011 -3989214
8024 -3989214 -1497826 -213982 179026 3186749 8785222 11626880 8255177 2322440
8016 2322440 -344176 1030053 3010274 3541786 3018113 1331974 -2198519 -6150269 -7393499
8007 -7393499 -4711302 -167946 3181622 3484397 477852 -4458556 -8631240 -9856134
7999 -9856134 -8280319 -5933085 -4733107 -4915394 -4490139 -661837 6274988 10936556 8111766
7990 8111766 437058 -3441139 59768 5026424 5573157 4498912 7296955 11908507
7982 11908507 11528397 5490157 6394 -1578315 -2292795 -4446653 -5591286 -3723772
7974c723772K643734J052295N06875J236591M93705j653774k453810j513840o51853
7965d063849J51583J728237K125256o05601l350419j501440L205099M457102P94806
7956B940774k752776k790438j299792l60971R00280K422906J796512j022593k375731
7947b541829n52708J548508J455031M63019o6352j104917k265938o78157L234832
7938e08511L814940j633198p070079n514075P27318L701902J584383Q2747K361039
7929b453534M343879K169014j163479m87575L358123M495662M14209m388101m391353
7920A896845l37941J849919j019603n142999m796515N064L544443J894193k349521
7911d456115l873159j117065K703047L861917J850114o92495q45094J472971L172257
$$ plain form
7974 -3723772 -1080038 -27743 479132 1715723 2209428 555654 -1898156 -3411996 -4063849
7965 -4063849 -3912266 -2184029 -58773 -664374 -4014793 -5516233 -2311134 2145968 2940774
7956 2940774 187998 -2602440 -3902232 -4263203 -3362923 -940017 856495 -166098 -2541829
7947 -2541829 -3094537 -1546029 -90998 372021 305669 -799248 -3065186 -3743343 -508511
7938 -508511 3306429 1673231 -5396848 -10910923 -10183605 -6481703 -4897320 -4814573 -2453534
7929 -2453534 1890345 4059359 2895880 2408305 5766428 10262090 10676299 6288198 1896845
7920 1896845 1558904 3408823 2389220 -2753779 -7550294 -7545230 -4000787 -2106594 -4456115
7911 -4456115 -8329274 -9446339 -6743292 -2881375 -1031261 -1723756 -2568850 -1095879 2076378
7902B076378J765747q27415m20415L143440M812771J188338m224470n556454k399805
7893d41885N57349P39821L65415J487685K412159J042624j203404j629077o03910
7884B726777o12905j785446j651808L16095J158279r45615l154664j837894J670042
$$ plain form
7902 2076378 3842125 3014710 2594295 5737735 10550506 11738844 7514374 1957920 -441885
7893 -441885 115464 855285 1220700 2708385 5120544 6163168 4959764 3330687 2726777
7884 2726777 2113872 328426 -1323382 -1007287 150992 -794623 -3949287 -5787181 -4117139
$$ [...]
##END NTUPLES=NMR SPECTRUM
##END=
