##TITLE=31Pdec_SR75+TFAA20
 DMSO-d6, 24 sc
 7.6.2022
##JCAMPDX= 6.0         $$ Bruker NMR JCAMP-DX V2.0
##DATA TYPE= NMR SPECTRUM
##DATA CLASS= NTUPLES
##ORIGIN= UXNMR, Bruker Analytische Messtechnik GmbH
##OWNER= root
$$ XWIN-NMR		Version 3.5
$$ Tue Jun  7 15:08:14 2022 Russian Standard Time (UT+4h)  she@DPX200
##.OBSERVE FREQUENCY= 81.013821
##.OBSERVE NUCLEUS= ^31P
##.ACQUISITION MODE= SIMULTANEOUS
##.ACQUISITION SCHEME= undefined
##.AVERAGES= 24
##.DIGITISER RES= 16
##SPECTROMETER/DATA SYSTEM= spect
##.PULSE SEQUENCE= zgpg30
##.SOLVENT NAME= DMSO
##.SHIFT REFERENCE= (INTERNAL, DMSO, 0, 248.564)
##AUDIT TRAIL= $$ (NUMBER, WHEN, WHO, WHERE, WHAT)
$$ ##TITLE= Audit trail, XWIN-NMR		Version 3.5
$$ ##JCAMPDX= 5.01
$$ ##ORIGIN= Bruker BioSpin GmbH
$$ ##OWNER= she
$$ F:/spectra/data/she/nmr/P31/1/pdata/1/auditp.txt
$$ ##AUDIT TRAIL=  $$ (NUMBER, WHEN, WHO, WHERE, WHAT)
(   1,<2022-06-07 15:03:42.98 +0400>,<she>,<DPX200>,
      <created by zg, POWCHK disabled, PULCHK disabled
       configuration hash MD5:
       00 E9 B6 7A A2 85 ED C7 34 08 36 98 17 FE 4E 26
       data hash MD5: 32K
       BE D0 8C A1 20 03 98 32 82 43 E5 AF F9 EE C4 0B>)
(   2,<2022-06-07 15:07:09.18 +0400>,<she>,<DPX200>,
      <Start of raw data processing
       efp BC_mod = 2 LB = 1 FT_mod = 6 PKNL = 1 PHC0 = -10268.07 PHC1 = 63.45376 SI = 64K 
       data hash MD5: 64K
       DC 7E 82 52 C2 01 DA 0C A1 F9 89 A8 27 66 84 CA>)
(   3,<2022-06-07 15:07:30.06 +0400>,<she>,<DPX200>,
      <pk PHC0 = -0.517703 PHC1 = 0 
       data hash MD5: 64K
       F5 50 9C D4 72 9F FE EA 7E 21 07 61 FE 42 3A 3C>)
$$ ##END=
$$ 
$$ hash MD5
$$ 16 2C 30 30 96 75 BF 4B B7 FE 99 F3 C4 7C A5 52
##$RELAX= 
##$RELAX= 
##$RELAX= 
##$RELAX= 
##$RELAX= 
##$RELAX= 
##$RELAX= 
##$RELAX= 
$$ Bruker specific parameters
$$ --------------------------
##$DU= <F:/spectra>
##$EXPNO= 1
##$NAME= <P31>
##$PROCNO= 1
##$TYPE= <nmr>
##$USER= <she>
##$AMP= (0..31)
100 100 100 100 100 100 100 100 100 100 100 100 100 100 100 100 100 100 
100 100 100 100 100 100 100 100 100 100 100 100 100 100 
##$AQSEQ= 0
##$AQ_mod= 1
##$AUNM= <au_zg>
##$AUTOPOS= <>
##$BF1= 81.014009
##$BF2= 200.13
##$BF3= 200.13
##$BF4= 200.13
##$BF5= 200.13
##$BF6= 200.13
##$BF7= 200.13
##$BF8= 200.13
##$BYTORDA= 1
##$CFDGTYP= 0
##$CFRGTYP= 5
##$CHEMSTR= <none>
##$CNST= (0..31)
1 1 145 1 1 1 1 1 1 1 1 1 1 1 1 1 1 1 1 1 1 1 1 1 1 1 1 1 1 1 1 1 
##$CPDPRG= <waltz16>
##$CPDPRG1= <>
##$CPDPRG2= <waltz16>
##$CPDPRG3= <>
##$CPDPRG4= <mlev>
##$CPDPRG5= <mlev>
##$CPDPRG6= <mlev>
##$CPDPRG7= <mlev>
##$CPDPRG8= <mlev>
##$CPDPRGB= <>
##$CPDPRGT= <>
##$D= (0..31)
0 1 0 0 0 0 0 0 0 0 0 0.03 2e-05 3e-06 0 0 0 0 0 0 0 0 0 0 0 0 0 0 0 0 
0 0 
##$DATE= 1654599822
##$DBL= (0..7)
120 120 120 11 120 120 24 19 
##$DBP= (0..7)
150 150 150 150 150 150 150 150 
##$DBP07= 0
##$DBPNAM0= <>
##$DBPNAM1= <>
##$DBPNAM2= <>
##$DBPNAM3= <>
##$DBPNAM4= <>
##$DBPNAM5= <>
##$DBPNAM6= <>
##$DBPNAM7= <>
##$DBPOAL= (0..7)
0.5 0.5 0.5 0.5 0.5 0.5 0.5 0.5 
##$DBPOFFS= (0..7)
0 0 0 0 0 0 0 0 
$$ [...]
##$SUBNAM2= <"">
##$SUBNAM3= <"">
##$SUBNAM4= <"">
##$SUBNAM5= <"">
##$SUBNAM6= <"">
##$SUBNAM7= <"">
##$SUBNAM8= <"">
##$SUBNAM9= <"">
##$SW= 501.771253377433
##$SWIBOX= (0..15)
0 1 3 0 0 0 0 0 0 0 0 0 0 0 0 0 
##$SW_h= 40650.406504065
##$TD= 32768
##$TD0= 1
##$TE= 0
##$TE2= 300
##$TE3= 300
##$TEG= 300
##$TL= (0..7)
0 120 53 12 22 120 120 120 
##$TP= (0..7)
150 150 150 150 150 150 150 150 
##$TP07= 0
##$TPNAME0= <>
##$TPNAME1= <>
##$TPNAME2= <>
##$TPNAME3= <>
##$TPNAME4= <>
##$TPNAME5= <>
##$TPNAME6= <>
##$TPNAME7= <>
##$TPOAL= (0..7)
0.5 0.5 0.5 0.5 0.5 0.5 0.5 0.5 
##$TPOFFS= (0..7)
0 0 0 0 0 0 0 0 
##$TUNHIN= 0
##$TUNHOUT= 0
##$TUNXOUT= 0
##$USERA1= <user>
##$USERA2= <user>
##$USERA3= <user>
##$USERA4= <user>
##$USERA5= <user>
##$V9= 5
##$VALIST= <valist>
##$VCLIST= <CCCCCCCCCCCCCCC>
##$VD= 0
##$VDLIST= <DDDDDDDDDDDDDDD>
##$VPLIST= <PPPPPPPPPPPPPPP>
##$VTLIST= <TTTTTTTTTTTTTTT>
##$WBST= 1024
##$WBSW= 4
##$XGAIN= (0..3)
0 0 0 0 
##$XL= 0
##$YL= 0
##$YMAX_a= 3108
##$YMIN_a= -4170
##$ZGOPTNS= <>
##$ZL1= 120
##$ZL2= 120
##$ZL3= 120
##$ZL4= 120
##$ABSF1= 0
##$ABSF2= 0
##$ABSG= 0
##$ABSL= 0
##$ALPHA= 0
##$AQORDER= 0
##$ASSFAC= 0
##$ASSFACI= 0
##$ASSFACX= 0
##$ASSWID= 0
##$AUNMP= <proc_1d>
##$AZFE= 0.1
##$AZFW= 0.5
##$BCFW= 0
##$BC_mod= 2
##$BYTORDP= 0
##$COROFFS= 0
##$CY= -3
##$DATMOD= 1
##$DC= 0
##$DFILT= <>
##$DTYPP= 0
##$F1P= 0
##$F2P= 0
##$FCOR= 1
##$FTSIZE= 65536
##$FT_mod= 6
##$GAMMA= 0
##$GB= 0
##$INTBC= 1
##$INTSCL= 5.30512e-09
##$ISEN= 30
##$LB= 1
##$LEV0= 0
##$LPBIN= 0
##$MAXI= 10000
##$MC2= 0
##$MEAN= 0
##$ME_mod= 0
##$MI= 50
##$NCOEF= 0
##$NC_proc= -8
##$NLEV= 6
##$NOISF1= 182.463
##$NOISF2= 159.3651
##$NSP= 0
##$NTH_PI= 0
##$NZP= 0
##$OFFSET= 248.5645
##$PC= 4
##$PHC0= -10268.59
##$PHC1= 63.45376
##$PH_mod= 1
##$PKNL= yes
##$PPARMOD= 0
##$PSCAL= 0
##$PSIGN= 0
##$REVERSE= no
##$SF= 81.014009
##$SI= 65536
##$SIGF1= 159.3651
##$SIGF2= -187.1042
##$SINO= 113.3802
##$SIOLD= 16384
##$SREGLST= <1H.CDCl3>
##$SSB= 0
##$STSI= 65536
##$STSR= 0
##$SW_p= 40650.406504065
##$SYMM= 0
##$S_DEV= 0
##$TDeff= 32768
##$TDoff= 0
##$TI= <>
##$TILT= no
##$TM1= 0
##$TM2= 0
##$TOPLEV= 0
##$USERP1= <user>
##$USERP2= <user>
##$USERP3= <user>
##$USERP4= <user>
##$USERP5= <user>
##$WDW= 1
##$XDIM= 65536
##$YMAX_p= 463200334
##$YMIN_p= -125005130
$$ End of Bruker specific parameters
$$ ---------------------------------
##NTUPLES= NMR SPECTRUM
##VAR_NAME=  FREQUENCY,     SPECTRUM/REAL,   SPECTRUM/IMAG
##SYMBOL=    X,             R,               I
##VAR_TYPE=  INDEPENDENT,   DEPENDENT,       DEPENDENT
##VAR_FORM=  AFFN,          ASDF,            ASDF
##VAR_DIM=   65536,         65536,           65536
##UNITS=     HZ,            ARBITRARY UNITS, ARBITRARY UNITS
##FACTOR=    0.620285442955139, 1,           1
##FIRST=     20137.2065510759, 0,            0
##LAST=      -20513.1999529892, 0,           0
##MIN=       -20513.1999529892, -125005130,  0
##MAX=       20137.2065510759, 463200334,    0
$$ Real data points
##PAGE= N=1
##DATA TABLE= (X++(R..R)), XYDATA
$$ [...]
13021B028307O396933m833466p854511j032169K727563j727857m103462K085420
$$ 2028307 8425240 3591774 -4262737 -5294906 -2567343 -4295200 -8398662 -6313242
13013f313242P594532L392169l953371l811814J201648J738299j413998j65510
$$ -6313242 1281290 4673459 720088 -3091726 -1890078 -151779 -1565777 -1731287
13005a731287N048718N424461r66226n801111l724614Q82006K620706K188841
$$ -1731287 3317431 8741892 7775666 1974555 -1750059 -868053 1752653 3941494
12997C941494J837434P81224j380555k150841l69271J278676O51394p27051j192078
$$ 3941494 5778928 6560152 5179597 3028756 2659485 3938161 4589555 3862504 2670426
12988B670426j823667l285431l198956K33238M309126M626411P50791l260585
$$ 2670426 846759 -2438672 -5637628 -5404390 -1095264 3531147 4281938 1021353
12980A021353l684267r42927J537979J508409L12235P05948K762224L550514J269175
$$ 1021353 -2662914 -3605841 -2067862 -559453 -247218 458730 3220954 6771468 8040643
12971H040643k229561m040386l475315j609174M06074J284549R2578j795190j629902
$$ 8040643 5811082 1770696 -1704619 -3313793 -2907719 -1623170 -1530592 -3325782 -4955684
12962d955684N19206J510950M78139M67936K558997L018551k30795l095760j854522
$$ -4955684 -4436478 -2925528 -2447389 -1979453 579544 3598095 3367300 271540 -1582982
12953a582982M12558m27227j829505L92735L067438J73639n849639o528356o96000
$$ -1582982 -1170424 -1597651 -3427156 -3034421 33017 206656 -5642983 -12171339 -12867339
12944a2867339L785590K729920J009138K583016L701796N50702l364243l030561
$$ -12867339 -9081749 -6351829 -5342691 -2759675 942121 1492823 -1871420 -4901981
12936d901981R512J067055J35795P70329L283381M138483J576111j888095k855226
$$ -4901981 -4892469 -3825414 -3689619 -2919290 364091 4502574 6078685 4190590 1335364
12927A335364q15916J689490J823052m45897k088313p42022K017600K826955J067768
$$ 1335364 519448 2208938 4031990 3586093 1497780 755758 2773358 5600313 6668081
12918F668081j105624k399199l140012l085553j670423R286N53759Q47563K061132
$$ 6668081 5562457 3163258 23246 -3062307 -4732730 -4723444 -4169685 -3322122 -1260990
12909a260990K469169L34541j695103k63781K087762L65392l631850l015381K720215
$$ -1260990 1208179 1542720 -152383 -416164 1671598 2036990 -1594860 -4610241 -1890026
12900a890026N957229K717787j695672j996915l09272r5849J85660K204032K852428
$$ -1890026 4067203 6784990 5089318 3092403 2783131 2687282 2872942 5076974 7929402
12891G929402m8906k649714j476952K99208q94136j872839J073672L733848L03740
$$ 7929402 7880496 5230782 3753830 4053038 3158902 1286063 2359735 6093583 6397323
12882F397323n452642m871002J570727M645618R28162k589503n11749L021946
$$ 6397323 944681 -3926321 -2355594 2290024 3218186 628683 116934 3138880
12874C138880K343299q65813j833897p68219j096222k758833k675401n58947N25749
$$ 3138880 5482179 4616366 2782469 2014250 918028 -1840805 -4516206 -5075153 -4549404
12865d549404m92031p27099J889955M613916L146577k023395n333329l156359
$$ -4549404 -5041435 -5768534 -3878579 735337 3881914 1858519 -3474810 -6631169
12857f631169J216008K064564p62083k141342J15085K039791M12053j670809M0842
$$ -6631169 -5415161 -3350597 -4112680 -6254022 -6138937 -4099146 -3687093 -5357902 -5317060
12848e317060L607595L730740J20931k261038r96653P75245O218j922558k214951
$$ -5317060 -1709465 2021275 2142206 -118832 -1115485 -340240 -334022 -2256580 -4471531
12839d471531o72440J240580K714059K975904N84317m183621p491953n161331
$$ -4471531 -5143971 -3903391 -1189332 1786572 2370889 -1812732 -9304685 -14466016
12831a4466016K011946P846688O767035j06120n789301m914509L69945L366533
$$ -14466016 -12454070 -4607382 2159653 2053533 -3735768 -8650277 -8280332 -4913799
12823d913799J296145j707287r54495K342073L623089K030104J129922K844181
$$ -4913799 -3617654 -5324941 -6279436 -3937363 -314274 1715830 2845752 5689933
12815E689933M307821K096334k854687o338259n663067j932572J765064L203537
$$ 5689933 9997754 12094088 9239401 2901142 -2761925 -4694497 -2929433 274104
12807B74104K230909J86795j302679j166435O84901L067991L959432K221383r49953
$$ 274104 2505013 2691808 1389129 222694 907595 3975586 7935018 10156401 9206448
12798I206448l125944l258986k296829j357007o70341l58790n96425p28072M5518
$$ 9206448 6080504 2821518 524689 -832318 -1502659 -1861449 -2457874 -3185946 -3140428
12789c140428Q80273K45770j065652n21408J835254K679913M41187k001466j642065
$$ -3140428 -2260155 -2014385 -3080037 -3601445 -1766191 913722 1354909 -646557 -2288622
12780b288622N37453K124093L009062L693383K732983n40670l128137k126123
$$ -2288622 -1751169 372924 3381986 7075369 9808352 9267682 6139545 4013422
12772D013422N07049R10291p87200j791139j989058k957405l139978O3933L985568
$$ 4013422 4520471 5430762 4643562 2852423 863365 -2094040 -5234018 -5170085 -1184517
12763a184517K972789k361272m791978j209130K804708K101238n49896m11383
$$ -1184517 1788272 -573000 -5364978 -6574108 -3769400 -1668162 -2218058 -2629441
12755b629441J254826O76713j160207q60017O68417J61161j237663K58133L376641
$$ -2629441 -1374615 -697902 -1858109 -2718126 -2049709 -1888548 -3126211 -2868078 508563
12746E08563K727602j926565m081466l94736L870093K932674r11968j605084J100064
$$ 508563 3236165 1309600 -2771866 -3166602 703491 3636165 2724197 1119113 2219177
12737B219177J890418j488810n005454m377516n38366K457574K612057J342147
$$ 2219177 4109595 2620785 -2384669 -6762185 -7300551 -4842977 -2230920 -888773
12729h88773P50625J004472O43510q61989j652580K57060L457455L957939L70451
$$ -888773 -138148 866324 1509834 647845 -1004735 -747675 2709780 6667719 7038170
12720G038170l809606m528320j764627J775093M052398L659580m27606n619664
$$ 7038170 3228564 -1299756 -3064383 -1289290 2763108 6422688 5995082 375418
12712C75418n612805J341357O967164K698967o843143q740553m06273O514365
$$ 375418 -5237387 -3896030 3071134 5770101 -1073042 -9813595 -10219868 -3705503
12704c705503L870241j547661n10918L855371L031889j839256k856407M31392
$$ -3705503 164738 -1382923 -1893841 1961530 4993419 3154163 297756 729148
12696G29148J089330k185635l202357j60354J185114j287525j619531L298869
$$ 729148 1818478 -367157 -3569514 -3729868 -2544754 -3832279 -5451810 -2152941
12688b152941P123782M023052j849615l180284l22607J184067k00461j734073
$$ -2152941 4970841 8993893 7144278 3963994 3641387 4825454 4624993 2890920
12680B890920k414329l226581l219856q00358K149973K174956m32763k179438
$$ 2890920 476591 -2749990 -5969846 -6770204 -4620231 -2445275 -2878038 -5057476
12672e057476j511438J56485J711865L091645L318808J157536k328461m425529
$$ -5057476 -6568914 -6412429 -4700564 -1608919 1709889 2867425 538964 -3886565
12664c886565l762139q62940L105665O004350M806874r02450o505109o605302
$$ -3886565 -7648704 -8511644 -5405979 598371 5405245 4502795 -2002314 -8607616
12656h607616j411538L789330N169724L638353J643448l27187k816638m781428
$$ -8607616 -10019154 -6229824 -1060100 2578253 4221701 3894514 1077876 -3703552
12648c703552l835823N59227N033705N035446M04814l572432k708035M48857R86209
$$ -3703552 -7539375 -6980148 -1946443 3089003 3493817 -78615 -2786650 -2337793 -1351584
12639a351584k54018J488153N437136M823089k085786p565007n184493J032505
$$ -1351584 -1605602 -117449 5319687 10142776 8056990 491983 -4692510 -3660005
12631c660005L402791J423420k10913k87221j056741k291481j936557j005469
$$ -3660005 -257214 1166206 955293 668072 -388669 -2680150 -4616707 -5622176
12623e622176j918103l365182k241641Q47530L173219M836662O558238N240160
$$ -5622176 -7540279 -10905461 -13147102 -12299572 -9126353 -4289691 2268547 7508707
12615G508707j302382p428844n637042J673497N015706K075071k39885J140640
$$ 7508707 6206325 -1222519 -6859561 -5186064 -170358 1904713 1664828 2805468
12607B805468P47267l851286o043072j511474L268941J363981k889645j213807
$$ 2805468 3552735 -298551 -6341623 -7853097 -4584156 -3220175 -6109820 -7323627
12599g323627M613613N659813K34980m010001k312377J218245J600621O2861j8578
$$ -7323627 -2710014 2949799 3184779 -825222 -3137599 -1919354 -318733 -255872 -274450
12590b74450P82405k16076k723484l783337k066140N50944J418250r8790k043302
$$ -274450 507955 291879 -2431605 -6214942 -8281082 -7730138 -6311888 -6410678 -8453980
12581h453980j675442J562761M828229M658037J146927j961535j843337K19736
$$ -8453980 -10129422 -8566661 -3738432 919605 2066532 104997 -1738340 -1518604
12573a518604J262757Q22833P82986J730870J996256Q21322J8015Q82160J503459
$$ -1518604 -255847 566986 1349972 3080842 5077098 5898420 5916435 6798595 8302054
12564H302054m01649l396658m122754k403717r75373k90948K061031N739912O189422
$$ 8302054 7900405 4503747 380993 -2022724 -2998097 -3289045 -1228014 4511898 10701320
12555A0701320J424624l864095m629726k420754j726726k422806j194648J506775
$$ 10701320 12125944 8261849 3632123 1211369 -515357 -2938163 -4132811 -2626036
12547b626036K017361M20217P74807L535554L703866j040533n431138l586895
$$ -2626036 -608675 -188458 586349 4121903 7825769 6785236 1354098 -2232797
12539b232797K466992N411978K160399l061345m957770l247606j228446l06182
$$ -2232797 234195 5646173 7806572 4745227 -212543 -3460149 -4688595 -4994777
12531d994777J380230M535860N645138J310127n392291p221967k482939K095393
$$ -4994777 -3614547 921313 6566451 7876578 2484287 -4737680 -7220619 -5125226
12523e125226Q89354k602396j767178K619755L959895K54882l403023k915531
$$ -5125226 -4235872 -6838268 -8605446 -5985691 -2025796 -1770914 -5173937 -8089468
12515h089468j14505J531171J478906Q63329L50777N31035J539039J776234j21048
$$ -8089468 -8203973 -6672802 -5193896 -4330567 -3979790 -3448755 -1909716 -133482 -254530
12506b54530k252791j746437M95752J298327P00617J127138J662674r53254n238247
$$ -254530 -2507321 -4253758 -3758006 -2459679 -1759062 -631924 1030750 77496 -5160751
12497e160751n293337J11113M857548M330365J323920K70015R48636J340036J804861
$$ -5160751 -10454088 -10342975 -5485427 -1155062 168858 438873 1387509 2727545 4532406
12488D532406K587890J421796k451322n448083m407855r67989J754025L253102
$$ 4532406 7120296 8542092 6090770 642687 -3765168 -4733157 -2979132 273970
12480B73970L634045J685697j794830k966278p34021P23420j112212k408417K95337
$$ 273970 3908015 5593712 3798882 832604 98583 822003 -290209 -2698626 -2403289
12471b403289L480488K289017j343957k217035j72811J157499R86356P36700m22878
$$ -2403289 1077199 3366216 2022259 -194776 -367587 789912 1776268 2512968 2090090
12462B090090l249732m402508j272139J899540r8810m009761k702866K667651
$$ 2090090 -1159642 -5562150 -6834289 -4934749 -5033559 -9043320 -11746186 -9078535
12454i078535M247066O24765j329070J260415K972277O75427r77233J252261L026311
$$ -9078535 -4831469 -4206704 -5535774 -4275359 -1303082 -627655 -1604888 -352627 2673684
12445B673684O88007j862747n41292J317351n74559l117842j376710K130658J629913
$$ 2673684 3361691 1498944 957652 2275003 1700444 -1417398 -2794108 -663450 966463
12436I66463j806116k581073p43599j259274m038634l521289R85904L153645L80395
$$ 966463 -839653 -3420726 -4164325 -5423599 -9462233 -12983522 -11997618 -8843973 -8463578
12427h463578j182015L288706Q635875O962417o96551o000322m500481J10673
$$ -8463578 -9645593 -6356887 2278988 9241405 8544854 2544532 -1955949 -1845276
12419a845276K218451N00873k137517k024039J735714N526908M487470q20371
$$ -1845276 373175 874048 -1263469 -3287508 -1551794 3975114 8462584 7642213
12411G642213l814748q18687L006931J381767k933753k666951J522569K081074
$$ 7642213 3827465 3008778 6015709 7397476 4463723 1796772 3319341 5400415
12403E400415j949471k694874K394086M709318j022576o197493j644659O350641
$$ 5400415 3450944 756070 3150156 7859474 6836898 639405 -1005254 5345387
12395E345387N274882l395615o812109j759271J398641k531498n140350o7821
$$ 5345387 10620269 7224654 412545 -1346726 51915 -2479583 -7619933 -7687754
12387g687754N574234L563093j848961k309608O53988N10909j447502O07461M757976
$$ -7687754 -2113520 1449573 -399388 -2708996 -2055008 -1544099 -2991601 -2384140 2373836
12378B373836L756476j902918m176257p01795K257164J158157p3022J266502K116674
$$ 2373836 6130312 4227394 51137 -650658 1606506 2764663 2691641 3958143 6074817
12369F074817P66544L38561J707973P34853l398339m761138o10637K575002p53787
$$ 6074817 6841361 7179922 8887895 9622748 6224409 1463271 852634 3427636 2673849
12360B673849n585855m295737J133854L172020J105338L95776J962662J332548
$$ 2673849 -2912006 -7207743 -6073889 -2901869 -1796531 -1400755 561907 1894455
12352A894455j931647k800599L6027J527641r11806k987387j012237K257373K817022
$$ 1894455 -37192 -2837791 -2801764 -1274123 -2185929 -5173316 -6185553 -3928180 -1111158
12343a111158J292827k1592j411503l202557l102834j26423K394357J688720M6701
$$ -1111158 181669 160077 -1251426 -4453983 -7556817 -7683240 -5288883 -3600163 -3553462
12334c553462M49843J316738K36542o31201J501623L729589J560340k754919l078956
$$ -3553462 -3103619 -1786881 -1550339 -2181540 -679917 3049672 4610012 1855093 -1223863
12325a223863N25554K105530J42459m97072J736095J848091j971087l505008J287229
$$ -1223863 -698309 1407221 1549680 1052608 2788703 4636794 2665707 -839301 447928
12316D47928O148209L595369l006797m499815m3515K331833j321600n421179m102089
$$ 447928 6596137 10191506 7184709 2684894 2641379 4973212 3651612 -1769567 -5871656
12307e871656N47708K699817R07267j451287j388942R50800L533188M301039K420899
$$ -5871656 -5323948 -2624131 -1716864 -3168151 -4557093 -3606293 -73105 4227934 6648833
12298F648833r27146l272586l162814j556661m66383m38763n2306J630088K768035
$$ 6648833 5721687 2449101 -713713 -2270374 -2736757 -3175520 -3227826 -1597738 1170297
12289A170297P44198l040285l245982J967797O429687L579377l254260m637552
$$ 1170297 1914495 -1125790 -4371772 -2403975 4025712 7605089 4350829 -286723
12281b86723J139488N609061L232463j148685j758452p06187j539944j522640
$$ -286723 852765 6461826 9694289 8545604 6787152 6080965 4541021 3018381
12273C018381J894656L350419k252231q717760o238661K912679P334890L752596
$$ 3018381 4913037 8263456 6011225 -2706535 -8945196 -6032517 1302373 5054969
12265E054969J31154J240534K249227r11206m721567n154285l385112j198540
$$ 5054969 5186123 6426657 8675884 7764678 3043111 -2111174 -5496286 -6694826
12257f694826J855495M050655J882754k525669k446760K292807L930778m5654
$$ -6694826 -4839331 -788676 1094078 -1431591 -3878351 -1585544 2345234 2299580
12249B299580k014711K369626N731957J304185n028145m192917J237725J778812
$$ 2299580 284869 2654495 8386452 9690637 4662492 469575 1707300 3486112
12241C486112l595740o673545k842319L551864O285188L651279j666483m739655
$$ 3486112 -109628 -6783173 -9625492 -6073628 211560 3862839 2196356 -2543299
12233b543299j938918M160276O187146J596583l270346k681182J89960j58588
$$ -2543299 -4482217 -321941 5865205 7461788 4191442 1510260 1700220 1541632
12225A541632k115060j071904J568593J341619p07477l10898J724060J270847
$$ 1541632 -573428 -1645332 -76739 1264880 557403 246505 1970565 3241412
12217C241412j062996j167405R18058J775574J396255K117321K599873K04031
$$ 3241412 2178416 1011011 1929069 3704643 5100898 7218219 9818092 10022123
12209A0022123k510445j423099R07980q63755m373936k470906L940366O129327
$$ 10022123 7511678 6088579 6996559 6132804 1758868 -712038 3228328 9357655
12201I357655J483216k854327k358172j280670l090738m063725j135900J850412
$$ 9357655 10840871 7986544 5628372 4347702 1256964 -2806761 -3942661 -2092249
12193b092249J117627m96627N93469J962946j45966l813137m381506j290901K171754
$$ -2092249 -974622 -1471249 -877780 1085166 939200 -2873937 -7255443 -8546344 -6374590
12184f374590L377195J799627j137437j823525K132665O777417N049379k890721
$$ -6374590 -2997395 -1197768 -2335205 -4158730 -2026065 4751352 9800731 6910010
12176F910010q323641n836995m01461J331375M88095J251098K351469L41565k538921
$$ 6910010 -1413631 -7250626 -7652087 -6320712 -5832617 -4581519 -2230050 -1888485 -4427406
12167d427406j379585K518018L059040q10934l325239q83216K716538K152010
$$ -4427406 -5806991 -3288973 -229933 -1040867 -4366106 -5249322 -2532784 -380774
12159c80774k080312m715930k360878K754395N398146L188065o62061j428876
$$ -380774 -2461086 -7177016 -9537894 -6783499 -1385353 1802712 1140651 -288225
12151b88225Q10364J485696j500464m607337m190192j668687k60313L01366J867202
$$ -288225 522139 2007835 507371 -4099966 -8290158 -9958845 -10219158 -9917792 -8050590
12142h050590L109373J476764j219455l99208L669272M883588M8783n572562n097571
$$ -8050590 -4941217 -3464453 -4683908 -5083116 -1413844 3469744 3518527 -2054035 -7151606
12133g151606K06144K742172k85557k812289O80906O138526N381736j505844n783610
$$ -7151606 -6945462 -4203290 -4488847 -7301136 -6620230 -481704 4900032 3394188 -2389422
12124b389422k788603J651778Q90688k511960k100960J659778L077883J126135
$$ -2389422 -5178025 -3526247 -2635559 -5147519 -7248479 -5588701 -2510818 -1384683
12116a384683j54470j17453k168422n352149l661816L646731Q668270N816040
$$ -1384683 -1539153 -1656606 -3825028 -9177177 -12838993 -9192262 -523992 5292048
12108E292048k80112k571845j521312j516681k153580m3739L392750L056710j393022
$$ 5292048 5011936 2440091 918779 -597902 -2751482 -2795221 597529 3654239 2261217
12099B261217m260336j896204K509689L787304J177075k044298l357429l283707
$$ 2261217 -1999119 -3895323 -1385634 2401670 3578745 1534447 -1822982 -5106689
12091e106689l159855k361244O27278M472664M998096J010932k384931k33440
$$ -5106689 -8266544 -10627788 -10000510 -5527846 -529750 481182 -1903749 -2137189
12083b137189M288709L853529j549859l991670j3084L680128R57668l904062l244304
$$ -2137189 2151520 6005049 4455190 463520 450436 4130564 5088232 1184170 -2060134
12074b060134K014021M678707K652118L80365M3723j122478l834631l971857M36721
$$ -2060134 -46113 4632594 7284712 7665077 7708800 6586322 2751691 -1220166 -783445
12065g83445M632188L345411j661242m245101k403013j75712j018473k865117
$$ -783445 3848743 7194154 5532912 1287811 -1115202 -1290914 -2309387 -5174504
12057e174504j786255J673283L205558J490959K67775J909161K862020o47067
$$ -5174504 -6960759 -5287476 -2081918 -590959 -323184 1585977 4447997 3800930
12049C800930n440648n526725j715603k59869j931597l50964O414359J0527965
$$ 3800930 -1639718 -7166443 -8882046 -9141915 -11073512 -11424476 -5010117 5517848
12041E517848N695822k657852n078982j243616J765498J046283n5646P2892q79316
$$ 5517848 11213670 8555818 3476836 2233220 3998718 5045001 4989355 5062247 4182931
12032D182931k979628k699594N62659K446849N40345j490543K93101L802253L889964
$$ 4182931 1203303 -1496291 -933632 1513217 2053562 563019 856120 4658373 8548337
12023H548337m26488m859920n329946k323560M50438O16610m69211j36920J541300
$$ 8548337 8121849 3261929 -2068017 -4391577 -3941139 -3324529 -3793740 -3930660 -2389360
12014b389360J867747o5944j593283o41662P63557k45878k504659k432211M55092
$$ -2389360 -521613 -587557 -2180840 -2822502 -2058945 -2304823 -4809482 -7241693 -6786601
12005f786601K879241K395527p9083k243521k574417p22585K002990K791773J60773
$$ -6786601 -3907360 -1511833 -1590916 -3834437 -6408854 -7131439 -5128449 -2336676 -2175903
11996b175903l571438m612793k146494J339641L375066L125289P83952k088028
$$ -2175903 -5747341 -10360134 -12506628 -11166987 -7791921 -4666632 -3882680 -5970708
11988e970708k561502M49204L716360L450101P28613l34100P61839M37915k379400
$$ -5970708 -8532210 -8083006 -4366646 -916545 -187932 -522032 239807 677722 -1701678
11979a701678l881017j419310K073435K490188L82277q18873l87732n94306k135941
$$ -1701678 -5582695 -7002005 -4928570 -2438382 -2056105 -2874978 -3262710 -3857016 -5992957
11970e992957k550833J40922M256120N987338L333173k032464o259673o340370
$$ -5992957 -8543790 -8402868 -4146748 1840590 5173763 3141299 -3118374 -9458744
11962i458744k243888L124145O007849M620727O61607k121385j566481O97033
$$ -9458744 -11702632 -8578487 -2570638 2050089 2711696 590311 -976170 -279137
11954b79137J287796q42822l275263l079822M2452L618231M503427J397722l506090
$$ -279137 1008659 165837 -3109426 -6189248 -6146796 -2528565 1974862 3372584 -133506
11945a33506n803991l462132L97852J453260K02930P33866L614343M462396J070495
$$ -133506 -5937497 -9399629 -9001777 -7548517 -7345587 -6611721 -2997378 1465018 2535513
11936B535513k495793j891928R78148J199442j799347m016777k716636P57243
$$ 2535513 39720 -1852208 -874060 325382 -1473965 -5490742 -8207378 -7450135
11928g450135L260591K695703l34345k149144P06749O153784P534874K217314
$$ -7450135 -4189544 -1493841 -1828186 -3977330 -3270581 2883203 10418077 12635391
11920A2635391m224371n599711l133551j703074j801309q10581O50715M8483j265745
$$ 12635391 8411020 2811309 -322242 -2025316 -3826625 -4637206 -3986491 -3938008 -5203753
11911e203753r1276K058839J156751j472883p99850K576378K710487j061332k133367
$$ -5203753 -5295029 -3236190 -2079439 -3552322 -4352172 -1775794 934693 -126639 -2260006
11902b260006K136067N316983K215426k921054l799020j579280r62486j743712
$$ -2260006 -123939 5193044 7408470 4487416 688396 -890884 -1853370 -3597082
11894c597082q37170Q65394K28428j913586k307044j199328r93082o72644K346470
$$ -3597082 -4434252 -3568858 -3340430 -5254016 -7561060 -8760388 -9753470 -10426114 -8079644
11885h079644N788289M367172j581317n264364k629836K578431M725059K943896
$$ -8079644 -2291355 2075817 494500 -4769864 -7399700 -4821269 -96210 2847686
11877B847686j09253k399736l064769j772900J98653N04159r10936j253059P56206
$$ 2847686 2738433 338697 -2726072 -4498972 -4300319 -3796160 -4707096 -5960155 -5203949
11868e203949K492145J369946j199178k147203j079369K33913J062761J771934
$$ -5203949 -2711804 -1341858 -2541036 -4688239 -5767608 -5533695 -4470934 -2699000
11860b699000J913752R47468j8718K27772N23889r17732l017472l161655j609370
$$ -2699000 -785248 162220 143502 371274 895163 -22569 -3040041 -6201696 -7811066
11851g811066j063464j682399m53045L287538N629917L712497K96774k87451J702090
$$ -7811066 -8874530 -10556929 -11009974 -7722436 -2092519 1619978 1916752 1629301 3331391
11842C331391K611689R32496j704007l737971m557562l264196k4139K217603J000027
$$ 3331391 5943080 6875576 5171569 1433598 -3123964 -6388160 -6412299 -4194696 -3194669
11833c194669j424644j088675J172688J067881j322919r23382L555208O191739
$$ -3194669 -4619313 -5707988 -4535300 -3467419 -4790338 -5713720 -2158512 4033227
11825D033227K625065k863894l676671l89384J451870L68883j13046J443778K085730
$$ 4033227 6658292 3794398 117727 -271657 1180213 1549096 1436050 2879828 4965558
11816D965558m9444k477996k173556L46841K136462J169075k052148m774033m015685
$$ 4965558 4916114 2438118 264562 611403 2747865 3916940 1864792 -2909241 -6924926
11807f924926Q5940L546712L037011J71642j083581j68016J48244j072422j738477
$$ -6924926 -6838986 -3292274 -255263 -83621 -1167202 -1335218 -1186974 -2259396 -3997873
11798c997873r86353o79874j425665p22229K810625O189031N605451J419658k683892
$$ -3997873 -4984226 -5664100 -7089765 -7811994 -5001369 1187662 6793113 8212771 5528879
11789E528879m259906l754723k559572j506004r92369r32819m98026R97364K902665
$$ 5528879 1268973 -2485750 -5045322 -6551326 -7543695 -8476514 -8974540 -7977176 -5074511
11780e074511L747164K979023J532363O15766N39329R14008J377741J508471M05677
$$ -5074511 -1327347 1651676 3184039 3799805 4339134 5253142 6630883 8139354 8545031
11771H545031k448788n523621n780793k190844K259985L848853K643175J455350
$$ 8545031 6096243 572622 -5208171 -7399015 -5139030 -1290177 1352998 2808348
11763B808348R23821r93878m231280n180367j861586K713214M647474L824232
$$ 2808348 3732169 2738291 -1492989 -6673356 -8534942 -5821728 -1174254 2649978
11755B649978K136012J15734j717561j240960J753767L115163j94787m432249
$$ 2649978 4785990 4901724 3184163 1943203 3696970 6812133 6617346 2185097
11747B185097l876825L72020K041228o18697k797651j259496J334895J835875
$$ 2185097 -1691728 -1319708 721520 102823 -2694828 -3954324 -2619429 -783554
11739g83554J132979R24564L04183j724159l696666m072542l295055j599798K039300
$$ -783554 349425 1273989 1578172 -145987 -3842653 -7915195 -11210250 -12810048 -10770748
11730a0770748O630583Q056816M053139k044226n053803l615385k51824K064095
$$ -10770748 -4140165 3916651 7969790 5925564 871761 -2743624 -2995448 -931353
11722i31353J587489j583333m568944l701149N67841L245035J435187j401215
$$ -931353 656136 -927197 -5496141 -9197290 -8629449 -5384414 -3949227 -5350442
11714e350442o64460K523040L291341J55875l533138m480038k608030K23712K024762
$$ -5350442 -6014902 -3491862 -200521 -44646 -3577784 -8057822 -10665852 -10442140 -8417378
11705h417378J601650j35694m67899J589894L264457J854492q96323j252908Q46325
$$ -8417378 -6815728 -6951422 -7419321 -5829427 -2564970 -710478 -1606801 -2859709 -2013384
11696b013384K039042Q72051p05244j152661j141550j178610q17590q64412k887273
$$ -2013384 25658 897709 192465 -960196 -2101746 -3280356 -4097946 -4962358 -7849631
11687g849631n444356m364173J305406O710133O953936L027683m60898j272742
$$ -7849631 -13293987 -17658160 -16352754 -9642621 -2688685 338998 -121900 -1394642
11679a394642m82052P07478J866095K106006J040772L88261J729123L190197J506692
$$ -1394642 -1876694 -1169216 696879 2802885 3843657 4231918 5961041 9151238 10657930
11670A0657930k776479n542151m868499l045377k009219o03666J829049K922569
$$ 10657930 7881451 2339300 -2529199 -5574576 -7583795 -8187461 -6358412 -3435843
11662c435843J256855l36357Q67446K324439j00179m733764n399964k82650N085040
$$ -3435843 -2178988 -2515345 -1647899 676540 576361 -4157403 -9557367 -9840017 -4754977
11653d754977N038139M40509l574070l793717j094907J589765J919159M7548j368524
$$ -4754977 283162 723671 -2850399 -6644116 -7739023 -6149258 -4230099 -4182551 -5551075
11644e551075k91103J734368J703879k24987j162953l90184j66144j105395p97749
$$ -5551075 -5842178 -4107810 -2403931 -2628918 -3791871 -4182055 -4348199 -5453594 -6251343
11635f251343J555148L094591J940307K20224J27239M41377l85090j020228l4498
$$ -6251343 -4696195 -1601604 338703 558927 686166 1127543 742453 -277775 -312273
11626c12273J207630J328268J433712J879509J69917m222992o578182l068152
$$ -312273 895357 2223625 3657337 5536846 5706763 1483771 -5094411 -8162563
11618h162563K766995M589488J935151n89960o88024Q8602M76527L00117j326055
$$ -8162563 -5395568 -806080 1129071 539111 -148913 -60311 416216 716333 -609722
11609f09722m031793m417589r51081K038600P82359p51720K721517P157139M203389
$$ -609722 -4641515 -9059104 -10010185 -7971585 -7189226 -7940946 -5219429 1937710 6141099
11600F141099m280347p099123m29232O427148N208278o24741l916615m177375
$$ 6141099 1860752 -5238371 -5667603 759545 5967823 5343082 1426467 -2750908
11592b750908m145408l056298Q5074J953309Q6127j757883N10947M050166L793092
$$ -2750908 -6896316 -9952614 -9867540 -7914231 -7828104 -9585987 -9075040 -5024874 -1231782
11583a231782P98706m48191K3311q46229k056513m7213L759690L783274j142963
$$ -1231782 -433076 -881267 -857956 -1704185 -3760698 -3807911 -48221 3735053 2592090
11574B592090n916359o479816l789196N6326M301691O959840N004316n32378l901567
$$ 2592090 -3324269 -9804085 -13593281 -13536955 -9235264 -2275424 2728892 2196514 -1705053
11565a705053j806544K150127K950528J005171N1987N30994n42979l583716m689333
$$ -1705053 -3511597 -1361470 1589058 2594229 2646216 3177210 2634231 -949485 -5638818
11556e638818j410418K946582L516929O02054j140162J85195J138111j219362
$$ -5638818 -7049236 -4102654 -585725 16329 -1123833 -938638 199473 -1019889
11548a019889m294898l636264M96479L642063L237592R19100q94106j586633j471336
$$ -1019889 -5314787 -8951051 -8454572 -4812509 -1574917 -655817 -1549923 -3136556 -4607892
11539d607892j067268j254784j755684k75374L685620N438102L49151p775101
$$ -4607892 -5675160 -6929944 -8685628 -8961002 -5275382 162720 511871 -7263230
11531g263230r421455j983059O107967O690389J966074p74908J86470J122613
$$ -7263230 -16684685 -18667744 -12559777 -5869388 -3903314 -4678222 -4491752 -3369139
11523c369139N75729P10460J766495Q09248k925731n540117l308692K193413N668387
$$ -3369139 -2793410 -2082950 -316455 492793 -2432938 -7973055 -11281747 -9088334 -3419947
11514c419947M152017L21041p12434K284055M836252K506254k891881n550888
$$ -3419947 732070 1053111 340677 2624732 7460984 9967238 7075357 1524469
11506A524469l565612r73333j379650l315245l515356j558852P75814K185158
$$ 1524469 -2041143 -3014476 -4394126 -7709371 -11224727 -12783579 -12007765 -9822607
11498i822607K141404R44163P03157L352313O526858N114353j263475o268431
$$ -9822607 -7681203 -6737040 -6033883 -2681570 3845288 8959641 7696166 1427735
11490A427735m912776J04494L033418K377630K24418k126654l844294k894445
$$ 1427735 -3485041 -3380547 -347129 2030501 2254919 128265 -3716029 -6610474
11482f610474J000536M010325K766641q17578k880623l199811l521118l116550
$$ -6610474 -5609938 -1599613 1167028 349450 -2531173 -5730984 -9252102 -12368652
11474a2368652p31002J423962P79457m36419J349085M022344K382564k784041
$$ -12368652 -13099654 -11675692 -10896235 -11332654 -9983569 -5961225 -3578661 -6362702
11466f362702m730114p67989L713028L375425R6245r95123R61503K442429J189488
$$ -6362702 -11092816 -11860805 -8147777 -4772352 -4676107 -5671230 -4709727 -2267298 -1077810
11457a077810r61615q85102J566744K947868N92199k929145k371566K269927M220342
$$ -1077810 -2039425 -2924527 -1357783 1590085 2182284 -746861 -3118427 -848500 3371842
11448C371842o15582o318896m387687L559063P035881J006099p212510p781156
$$ 3371842 2756260 -3562636 -7950323 -4391260 2644621 3650720 -3561790 -11342946
11440a1342946m88825O370578O583023J922457j788435j721694o8601J05024p98992
$$ -11342946 -11831771 -5461193 1121830 3044287 1255852 -465842 -534443 -429419 -1228411
11431a228411k98901J439628J552081l14952p73108J295217J803201j844777n143365
$$ -1228411 -1527312 -87684 1464397 1149445 376337 1671554 3474755 1629978 -3513387
11422c513387k714541K840027M336281N18123l059622k893373j079755J7111O44699
$$ -3513387 -6227928 -3387901 948380 1466503 -1593119 -4486492 -5566247 -5549136 -4904437
11413d904437N95768j064003k379959k30627L419995L008182j444660l123359
$$ -4904437 -4308669 -5372672 -7752631 -7983258 -4563263 -1555081 -2999741 -6123100
11405f123100J007313M874303K555277k761028m161541j080638J516459J156125
$$ -6123100 -5115787 -241484 2313793 -447235 -4608776 -5689414 -4172955 -3016830
11397c016830k85407j095081j309810n57811J688742L930510L782792J173333
$$ -3016830 -3302237 -4397318 -5707128 -6264939 -4576197 -645687 3137105 4310438
11389D310438j792768l597300m038502l105269j118096O78313J243796Q11004
$$ 4310438 2517670 -1079630 -5118132 -8223401 -9341497 -8663184 -7419388 -6608384
11381f608384l5945j033361j356618j62981J171191J25954k431827k234412J833303
$$ -6608384 -6644329 -7677690 -9034308 -9197289 -8026098 -7900144 -10331971 -12566383 -10733080
11372a0733080M982478L458835N13866J191517M327595M951082K414461L91646
$$ -10733080 -5750602 -2291767 -1777901 -586384 3741211 8692293 11106754 11498400
11364A1498400L9395q77673k427737k120763m95342j079037l644587l571664J84538
$$ 11498400 11537795 10660122 8232385 6111622 5616280 4537243 892656 -2679008 -2494470
11355b494470K661160J209275l891K226772M039120J644166j078269P63246L378989
$$ -2494470 166690 1375965 1372074 3598846 7637966 9282132 8203863 8967109 12346098
11346A2346098k9202o681948p196505p29822L131853l06088l641312j11611N330018
$$ 12346098 12316896 5634948 -1561557 -2291379 840474 534386 -3106926 -3218537 2111481
11337B111481M577187p37448l019152r19289N73967l41718q15422l48064j617008
$$ 2111481 6688668 5951220 2932068 2012779 2586746 2245028 1429606 1081542 -535466
11328e35466m111935l819976k20138K459136K122706J266499J273698N7742k592057
$$ -535466 -4647401 -8467377 -8687515 -6228379 -4105673 -2839174 -1565476 -1507734 -4099791
11319d099791k917217O10851L762212K629275n68907j234465R79267K576185J285944
$$ -4099791 -7017008 -6406157 -2643945 -14670 -583577 -1818042 -838775 1737410 3023354
11310C023354j807764l806011k346206J890687M669558K728002j313200k149691
$$ 3023354 1215590 -2590421 -4936627 -3045940 1623618 4351620 3038420 888729
11302H88729K98513J054260j388158k639378l21774J758256M39019j533502r71061
$$ 888729 1187242 2241502 853344 -1786034 -2107808 -349552 89467 -1444035 -2415096
11293b415096K47106m56792j174851N80211K933510L280126K895795L321821K323835
$$ -2415096 -2167990 -2624782 -3799633 -3219422 -285912 2994214 5890009 9211830 11535665
11284A1535665j553754m611013l639970j846555l229452n132236l015080J151179
$$ 11535665 9981911 5370898 1730928 -115627 -3345079 -8477315 -11492395 -10341216
11276a0341216K552301K155808L662459M848302J077028m393560l567232K967732
$$ -10341216 -7788915 -5633107 -1970648 2877654 3954682 -438878 -4006110 -1038378
11268a038378N868104J610682k535962j130758J156775j139414m582756l107648
$$ -1038378 4829726 6440408 3904446 2773688 3930463 2791049 -1791707 -4899355
11260d899355J480196K492169r90893l120073l93358L551702L507666k58143k774255
$$ -4899355 -3419159 -926990 -1917883 -5037956 -5431314 -1879612 1628054 1369911 -1404344
11251a404344j209843J386127N80836k681972l186806M46454L218553J574036
$$ -1404344 -2614187 -1228060 -647224 -3329196 -6516002 -6069548 -2850995 -1276959
11243a276959q44874O27977L803282L452738M8399j523258j52298Q15190o3312
$$ -1276959 -2121833 -1493856 2309426 5762164 5810563 4287305 4135007 4950197 4886885
11234D886885j296612k768288m981878n068333k08525N676947N855735J221830
$$ 4886885 3590273 821985 -4159893 -9228226 -9436751 -3759804 2095931 3317761
11226C317761q63593J378969J671787k823361o032344k870582K578283L730738
$$ 3317761 2454168 3833137 5504924 2681563 -3350781 -6221363 -3643080 87658
11218H7658R10134r58342j79675Q10720K7979j952099l056163j433838K197325
$$ 87658 997792 39450 -140225 670495 698474 -1253625 -4309788 -5743626 -3546301
11209c546301M065857J919885j061068r72907L45k576609o285401m517222J844292
$$ -3546301 519556 2439441 1378373 405466 405811 -2170798 -8456199 -12973421 -11129129
11200a1129129M436249Q32499j430323K197887N479934K135229l501271l600034
$$ -11129129 -6692880 -5860381 -7290704 -5092817 387117 2522346 -978925 -4578959
11192d578959J151605L842268J796309j656649l306499k742782p75708J021970
$$ -4578959 -3427354 414914 2211223 554574 -2751925 -5494707 -6270415 -5248445
11184e248445R76834j96382q7719J078076O91828q73422m52880J361601M61496
$$ -5248445 -4271611 -4467993 -4555712 -3477636 -2785808 -3659230 -4112110 -2750509 -2289013
11175b289013k439808j581056L094526L860192j840309n641638j521747M209140
$$ -2289013 -4728821 -6309877 -3215351 644841 -1195468 -6837106 -8358853 -4149713
11167d149713L820588O03123J264816L412723J191160k538460j050255L391922
$$ -4149713 -329125 273998 1538814 4951537 6142697 3604237 2553982 5945904
11159E945904L043693j603823k923757L83909J890666o39315k298445r00768k25483
$$ 5945904 8989597 7385774 4462017 4845926 6736592 6097277 3798832 2898064 2672581
11150B672581j753973j898659L18874P34020k155598l819481j115343K713785
$$ 2672581 918608 -980051 -661177 72843 -2082755 -5902236 -7017579 -4303794
11142d303794L324637Q76873j907727l318670k743984p22285L55955r88747k027340
$$ -4303794 -979157 -102284 -2010011 -5328681 -8072665 -8794950 -8438995 -9427742 -11455082
11133a1455082Q07208N737920P219113L433191j930565m848871m021575j17286
$$ -11455082 -10647874 -4909954 2309159 5742350 3811785 -1037086 -5058661 -5175947
11125e175947L790213L093828k155385m688799L43430O419514M165273l907856
$$ -5175947 -1385734 1708094 -447291 -5136090 -4792660 1626854 5792127 1884271
11117A884271o825177k072560J696531l28293k532890l79708J902349N3732k551051
$$ 1884271 -4940906 -7013466 -5316935 -5645228 -8178118 -8557826 -6655477 -6601745 -9152796
11108i152796j625755Q28044J516459J723475L033798L196454J294988J057481
$$ -9152796 -10778551 -9950507 -8434048 -6710573 -3676775 -480321 814667 1872148
11100A872148L780554M093172j245893o279218m585797J01043m7284m203711m792892
$$ 1872148 5652702 9745874 8499981 2220763 -2365034 -2263991 -2311275 -6514986 -11307878
11091a1307878O048M201584M096436K701497K923440K902307M54523k615372l298140
$$ -11307878 -11301830 -7100246 -3003810 -302313 2621127 5523434 5977957 3362585 64445
11082F4445j573311J44315l4685k092404m265846m157197r30250L426979N884135
$$ 64445 -1508866 -1364551 -1399236 -3491640 -7757486 -11914683 -12844933 -9417954 -3533819
11073c533819N157372K223583r99489k818971k768058k075026j972608j569604
$$ -3533819 1623553 3847136 2847647 28676 -2739382 -4814408 -6787016 -8356620
11065h356620O01220L156253L121154Q91923M3843J261260J028000j741117k811845
$$ -8356620 -7755400 -4599147 -1477993 -586070 -542227 719033 1747033 5916 -2805929
11056b805929L33735L375767J699803j830511j128356L700711O829466N150685
$$ -2805929 -2472194 903573 2603376 772865 -355491 3345220 10174686 15325371
11048A5325371J046757k481620m662516n204538l918784k158277j397081q74025
$$ 15325371 16372128 13890508 9227992 4023454 104670 -2053607 -3450688 -4324713
11040d324713M94425J299615J50350q41763P24981K616702J172204k003125k180846
$$ -4324713 -3830288 -2530673 -2380323 -3222086 -2497105 119597 1291801 -711324 -2892170
11031b892170M42144J007794j556216k750696l75757J978616J427994J46346N37462
$$ -2892170 -2450026 -1442232 -2998448 -5749144 -6124901 -4146285 -2718291 -2571945 -2034483
11022b034483J121046K53225o04968m22343j032243k815125k419049J375712L852841
$$ -2034483 -913437 -660212 -1265180 -1687523 -2719766 -5534891 -7953940 -6578228 -2725387
11013b725387J136353k908022j993906K970174N350533K513629j490272k756159
$$ -2725387 -1589034 -4497056 -6490962 -3520788 1829745 4343374 2853102 96943
11005I6943k065178j814961k233691j904490J33876L257987M960800K742076k058502
$$ 96943 -1968235 -3783196 -6016887 -7921377 -7787501 -4529514 431286 3173362 1114860
10996A114860m351153j722386J705142J304619q89392M2608L139734K925150j061536
$$ 1114860 -3236293 -4958679 -3253537 -1948918 -2838310 -2795702 344032 3269182 2207646
10987B207646k986113k18714K370455L94627l201787l079785O38618L460642L014189
$$ 2207646 -778467 -997181 1373274 1767901 -1433886 -4513671 -3875053 -414411 2599778
10978B599778R82206o3644O69067J805504J047664j899164l815876j969248R46422
$$ 2599778 3581984 3518340 4187407 5992911 7040575 5141411 1325535 -643713 302709
10969C02709O1116l502380l321622K075797N883357L000690k569289m503360k868933
$$ 302709 363825 -3138555 -6460177 -4384380 1498977 4499667 1930378 -2572982 -5441915
10960e441915j047105Q29599L294726L096030j520178m875028j208412M907724
$$ -5441915 -6489020 -5659421 -2364695 731335 -788843 -5663871 -6872283 -1964559
10952a964559M443327j448755k707310L223964O790963J576675n394710m728592
$$ -1964559 2478768 1030013 -1677297 1546667 8337630 9914305 4519595 -208997
10944b08997J219795L114549p35164k879763J014292N748944M517954j595995
$$ -208997 1010798 4125347 3390183 510420 1524712 7273656 11791610 10195615
10936A0195615n669599m525313k311954l569492n942678l572333L171692O634442
$$ 10195615 4526016 703 -2311251 -5880743 -11823421 -15395754 -12224062 -5589620
10928e589620K624485k857943k146556K819242M047834k385k924057j221485R07057
$$ -5589620 -2965135 -5823078 -7969634 -5150392 -1102558 -1104943 -4029000 -5250485 -4343428
10919d343428l01465j920139M2156L639773M056065Q25616k021628j787284q6660
$$ -4343428 -4644893 -6565032 -6522876 -2883103 1172962 1998578 -23050 -1810334 -1896994
10910a896994p1970k110959k865697M91953N212039N081177o35832m515757j297725
$$ -1896994 -1968964 -4079923 -6945620 -6453667 -1241628 3839549 3203717 -1312040 -2609765
10901b609765L536349K042445l129641l021545K300583L637325j427009m152819
$$ -2609765 926584 2969029 -160612 -3182157 -881574 2755751 1328742 -2824077
10893b824077J90502M014780N36300m667554l526586J052393J187933k286018
$$ -2824077 -2633575 1381205 1917505 -2750049 -6276635 -5224242 -4036309 -6322327
10885f322327k373808J322962K570538l4444r67603K183275M572095K094578k490905
$$ -6322327 -8696135 -7373173 -4802635 -4837079 -5804682 -3621407 950688 3045266 554361
10876E54361m093150j910952Q73746J639570P84816N19650J770782K527362N52449
$$ 554361 -3538789 -5449741 -4575995 -2936425 -2151609 -1631959 138823 2666185 3218634
10867C218634k561362k981711o36186M17256j156377j575415J227433L480821
$$ 3218634 657272 -2324439 -2960625 -2543369 -3699746 -5275161 -4047728 -566907
10859e66907J836078r90873j087544M22670N54307j33500j1721l74757k069098
$$ -566907 1269171 278298 -809246 -386576 167731 34231 22510 -352247 -2421345
10850b421345k020708J665176M938878L573006r7478j777236k361799m178147
$$ -2421345 -4442053 -2776877 2162001 5735007 5637529 3860293 1498494 -2679653
10842b679653m426827P7069N188415M604988L0148k031935j161665j978634m191393
$$ -2679653 -7106480 -7029411 -1840996 2763992 2794140 762205 -399460 -2378094 -6569487
10833f569487l124853O38578J576473p52805j132232J389909K087004n1046o84938
$$ -6569487 -9694340 -9055762 -7479289 -8232094 -9364326 -7974417 -5887413 -5938459 -6623397
10824f623397Q20146J31837k474008j221573L756908M537908r37448l909533N75921
$$ -6623397 -5803251 -5671414 -8145422 -9366995 -5610087 -1072179 -2009627 -5919160 -5343239
10815e343239M401820q3938o288479l504197N552778Q670981K373496m486832
$$ -5343239 -941419 -1025357 -7313836 -10818033 -5265255 3405726 5779222 1292390
10807A292390m546544q7914L270693L425263J024613k126684k858110J00278K405573
$$ 1292390 -3254154 -3342068 -71375 3353888 4378501 2251817 -606293 -506015 1899558
10798A899558r45266o910109p077011j31380N375672L527664o62657l48029J958361
$$ 1899558 954292 -5955817 -13032828 -13164208 -7788536 -4260872 -4923529 -5271558 -3313197
10789c313197l68321n576867n365431J435072O114771L374826q84715J60740L285013
$$ -3313197 -3681518 -9258385 -14623816 -13188744 -7073973 -3699147 -4583862 -4423122 -1138109
10780a138109J677787k736862k540213J980436K798886k168705n136045j266603
$$ -1138109 539678 -2197184 -4737397 -2756961 41925 -2126780 -7262825 -8529428
10772h529428L551132K893708m3499O39986K828540R14351l359300l708269o12757
$$ -8529428 -4978296 -2084588 -2128087 -1488101 1340439 2254790 -1104510 -4812779 -5425536
10763e425536m66287l801852l611590K713229P998438N615143j102296m346425
$$ -5425536 -5891823 -9693675 -13305265 -10592036 -2593598 3021545 1919249 -2427176
10755b427176k335745M00387N18258q29283j174011J64162K161692L274758K422135
$$ -2427176 -4762921 -4362534 -3844276 -4673559 -5847570 -5683408 -3521716 -246958 2175177
10746B175177q9824k536518l155270j630406O29979J529505J60907j994278k580171
$$ 2175177 2085353 -451165 -3606435 -5236841 -4606862 -3077357 -2916450 -4910728 -7490899
10737g490899j395333m61506n23079K51557K529981L262325k01040m934071m951154
$$ -7490899 -8886232 -9347738 -9870817 -9619260 -7089279 -3826954 -4027994 -8962065 -13913219
10728a3913219J027089P268522P541778K099607l198740l849968j092623J130878
$$ -13913219 -12886130 -5617608 1924170 4023777 825037 -3024931 -4117554 -2986676
10720b986676J776552K630624L270995O86716m195429m883495J144960O062393
$$ -2986676 -1210124 1420500 4691495 5378211 1182782 -3700713 -2555753 3506640
10712C506640J830934o879786q701293k368881K645935J805383M96236J856878
$$ 3506640 5337574 -1542212 -10243505 -12612386 -9966451 -8161068 -7664832 -5807954
10704e807954J551342j576402j337078L881634O178503J621158k296449j94688
$$ -5807954 -4256612 -5833014 -7170092 -3288458 2890045 4511203 2214754 2020066
10696B020066J370206l200029o821722k110764M384737L025497k299182j962455
$$ 2020066 3390272 190243 -6631479 -8742243 -4357506 -1332009 -3631191 -5593646
10688e593646K236143K041974j139533r7167K932045L31107m940658l197789M132008
$$ -5593646 -3357503 -1315529 -2455062 -2552229 379816 710923 -4229735 -7427524 -3295516
10679c295516O174142J259339j657231k78421j786061o807617o336659J778453
$$ -3295516 2878626 4137965 2480734 2202313 416252 -6391365 -12728024 -10949571
10671a0949571P693199N401752P51714q02926j965251m267059l023451K664108
$$ -10949571 -3256372 2145380 2897094 2094168 128917 -4138142 -7161593 -4497485
10663d497485N586697J899520k553647k502742q09409j050467j304019R5153P58555
$$ -4497485 1089212 2988732 435085 -2067657 -2877066 -3927533 -5231552 -5136399 -4377844
10654d377844R0734J009879K923056J448138k511216k779134P25463R75082l092529
$$ -4377844 -4287110 -3277231 -354175 1093963 -1417253 -4196387 -3470924 -2495842 -5588371
10645e588371l726582J644605N141712K093696j376026k80688O92110k635337
$$ -5588371 -9314953 -7670348 -2528636 -434940 -1810966 -2091654 -1399544 -4034881
10637d034881n431274l021288N15219L86248m84756J727864M150126L319532J751773
$$ -4034881 -9466155 -12487443 -11972224 -11585976 -12070732 -10342868 -6192742 -2873210 -1121437
10628a121437K046277J506409j406843k542745J40011J691847r91707l113652
$$ -1121437 924840 2431249 1024406 -1518339 -1378328 313519 -678188 -3791840
10620c791840r77171P61257k209193n267768k607604K708845M109036J808270
$$ -3791840 -4769011 -4007754 -6216947 -11484715 -14092319 -11383474 -7274438 -5466168
10612e466168N75483J326498J308171m37810k572153l628653j996933K483647
$$ -5466168 -4890685 -3564187 -2256016 -2693826 -5265979 -8894632 -10891565 -8407918
10604h407918N618905K939337k429245k781604K288175M965823J601923k650432
$$ -8407918 -2789013 150324 -2278921 -5060525 -2772350 2193473 3795396 1144964
10596A144964l470227k582678j239818K033681M916468K409270l186672l770318
$$ 1144964 -2325263 -4907941 -6147759 -4114078 802390 3211660 24988 -3745330
10588c745330Q70320K163810k037797l871648m42042R43177k762127m053652R73795
$$ -3745330 -2875010 -711200 -2748997 -6620645 -7062687 -6119510 -8881637 -12935289 -11961494
10579a1961494N018883K702734p73088n24151K70629n08339P98796L576772J095325
$$ -11961494 -6942611 -4239877 -5012965 -5537116 -5266487 -5774826 -4976030 -1399258 -303933
10570c03933n588418n878977J935560N501870r70268o503886k596971K991227
$$ -303933 -5892351 -11771328 -9835768 -4333898 -5304166 -11808052 -14405023 -11413796
10562a1413796J943870l01156K590509M840359N39775m162435k665006K22347
$$ -11413796 -9469926 -9771082 -7180573 -2340214 -1800439 -5962874 -8627880 -8405533
10554h405533j071366k295542L41520J614964j318155j904458K235936K812388
$$ -8405533 -9476899 -11772441 -11430921 -9815957 -11134112 -13038570 -10802634 -7990246
10546g990246k871900m552961K317162O928312K631961j215388J792443K659971
$$ -7990246 -10862146 -15415107 -13097945 -6169633 -3537672 -4753060 -2960617 -300646
10538c00646l955874p233679p13318L821628j843786n911084J636275R705047
$$ -300646 -4256520 -11490199 -12203517 -8381889 -10225675 -16136759 -14500484 -4795437
10530d795437N957079k097979l236974j940622m804665n679628o16372J286302
$$ -4795437 1161642 -936337 -4173311 -6113933 -10918598 -16598226 -17214598 -15928296
10522a5928296l007059j746396O912849O478013o273516r994243L253295J0705237
$$ -15928296 -18935355 -20681751 -13768902 -7290889 -13564405 -23558648 -20305353 -9600116
10514i600116J49592o655973L964437J0124485k445168j0055228K821816R666971
$$ -9600116 -9450524 -16106497 -12142060 -2017575 -4462743 -14517971 -11696155 -2029184
10506b029184p386979j7967826O98385J5490016k976329k1160771l506972J7404923
$$ -2029184 -9416163 -27383989 -26685604 -11195588 -14171917 -35332688 -38839660 -21434737
10498b1434737J554626j8685185o42743J8968613p510415l3535984J188570L5496235
$$ -21434737 -19880111 -38565296 -39208039 -20239426 -27749841 -61285825 -60097255 -24601020
10490b4601020j8962875q1441235J2933600K19030599K77428955P8812310j55457864
$$ -24601020 -43563895 -125005130 -112071530 106959069 384388024 463200334 307742470
10483C07742470j78193607m3021567K8922788j6036079m9858250j3007463J6343040
$$ 307742470 129548863 86527296 115450084 99414005 49555755 36548292 52891332
10476E2891332o962657k4217321J319899K0927246Q08529j9100756o312987R581051
$$ 52891332 45928675 21711354 23031253 43958499 44767028 25666272 19353285 28934336
10468B8934336J015417j0077895l091522L828948k880870n130655N127888O634689
$$ 28934336 29949753 19871858 16780336 20609284 17728414 12597759 17725647 24360336
10460B4360336p022037j1377831J668257P369686l290608n859748Q175455J1980881
$$ 24360336 17338299 5960468 7628725 14998411 11707803 5848055 14023510 26004391
10452B6004391n405378j5162100m19489J2362843J137793j3418499p233864N871720
$$ 26004391 20599013 5436913 5017424 17380267 18518060 5099561 -2134303 3737417
10444C737417L672652m921813j503238O622003L332448n259393m388742K164278
$$ 3737417 7410069 2488256 985018 7607021 10939469 5680076 1291334 3455612
10436C455612K579401p83233l05989N13697k717628l524026J832698M525430O7145
$$ 3455612 6035013 5251780 4945791 5459488 2741860 -782166 1050532 5575962 5643107
10427E643107j963137K904317M045417k924993n317415K897367P737913K03659
$$ 5643107 3679970 6584287 10629704 7704711 2387296 5284663 13022576 13226235
10419A3226235o680347j753003M344065M30268m292931P39596O514521K158453
$$ 13226235 6545888 4792885 9136950 9567218 5274287 6013883 12528404 14686857
10411A4686857l827076j46270N430687J156936o198120m388484J634538K01762
$$ 14686857 10859781 10713511 16144198 17301134 11103014 6714530 8349068 8550830
10403H550830n338695m808328p49857j059586j771136M406171J1121293P877284
$$ 8550830 3212135 -1596193 -2346050 -3405636 -5176772 -770601 10350692 18227976
10395A8227976j137338m431485k157065j972285l364362j409243R79550p87073
$$ 18227976 17090638 12659153 10502088 8529803 5165441 3756198 4735748 3948675
10387C948675j838534L076924P235014K788496m233675m238243q98408k520068
$$ 3948675 2110141 5187065 12422079 15210575 10976900 6738657 5840249 3320181
10379C320181n097678m46461O167529L729084m911033p831415l706178o36444
$$ 3320181 -1777497 -2223958 3943571 7672655 2761622 -5069793 -8775971 -9412415
10371i412415J86344L575842O951318L893224j770130q80024M483608M402650
$$ -9412415 -9226071 -5650229 1301089 5194313 3424183 2544159 7027767 11430417
10363A1430417j110497k843997O54584J824336r44016j660550O8842j571235n492091
$$ 11430417 10319920 7475923 8130507 9954843 9010827 7350277 7419119 5847884 355793
10354C55793l886759L043607N785865J136067l163563k000169L96580K86108K38361
$$ 355793 -3530966 -487359 5298506 6434573 3271010 1270841 1667421 1953529 2191890
10345B191890J678728J226111j922823l342766j310206K22156p08690p27033J895091
$$ 2191890 3870618 5096729 3173906 -168860 -1479066 -1256910 -1965600 -2692633 -797542
10336g97542L697389K241604m0561o52277n50606r12929q78360O0009J102830
$$ -797542 2899847 5141451 5100890 4448613 3898007 2985078 2106718 2166727 3269557
10327C269557J934467K191253K98027l393513m623239j199325J970980r1794l506334
$$ 3269557 5204024 7395277 7693304 4299791 -323448 -1522773 448207 356413 -3149921
10318c149921j354299M000053L786554k492439n275520J76148O340957M981907
$$ -3149921 -4504220 -504167 3282387 789948 -4485572 -4309424 2031533 7013440
10310G013440j321376m557374k891231q88381r90246p09406J686710L298484P87606
$$ 7013440 5692064 1134690 -1756541 -2644922 -3635168 -4344574 -2657864 640620 1428226
10301A428226l649757m055159R38234N190397L448326o99786n07143K827342K302845
$$ 1428226 -2221531 -6276690 -5338456 -148059 3300267 2600481 2093338 4920680 7223525
10292G223525k378140l676403P32400L602511Q19467j302572K378216N971921
$$ 7223525 4845385 1168982 1901382 5503893 6323360 5020788 7399004 13370925
10284A3370925K420469m320674o083057l429230k399551l305010k342747l36940
$$ 13370925 15791394 11470720 5387663 1958433 -441118 -3746128 -6088875 -6425815
10276f425815l07072K19487M750480Q606335M337143n325652r868111n731680
$$ -6425815 -6732887 -6513400 -1762920 6843415 11180558 5854906 -4013205 -9744885
10268i744885M22103K765460J889626m58291l600192m545037m62439M927945M934961
$$ -9744885 -9322782 -6557322 -4667696 -5125987 -8726179 -13271216 -13733655 -8805710 -3870749
10259c870749P8251k777343j426328m48948j895633k153153M48799K625077K584243
$$ -3870749 -3792498 -6569841 -7996169 -8445117 -10340750 -12493903 -12045104 -9420027 -6835784
10250f835784K484533K790023J061538j947175j922642J333711K693646L35610
$$ -6835784 -4351251 -1561228 -499690 -2446865 -4369507 -3035796 -342150 -6540
10242f540j265963M13302J627742k22056j354208J660736N218159L828538j647098
$$ -6540 -1272503 -859201 768541 546485 -807723 853013 6071172 9899710 8252612
10233H252612n554432m904353j524485J577635K937415K588148J274768n00578
$$ 8252612 2698180 -2206173 -3730658 -2153023 784392 3372540 4647308 4146730
10225D146730k776573m697950m105214p27115J982358J573339J212943M722415
$$ 4146730 1370157 -3327793 -7433007 -8160122 -6177764 -4604425 -3391482 1330933
10217A330933Q544227N290637m303821j0115270o011755J677186L368065q20093
$$ 1330933 9875160 15165797 10861976 746706 -5265049 -3587863 -219798 -1039891
10209a039891k919677M47892L577979O17931n336370n620773K281511J0114108
$$ -1039891 -3959568 -3511676 66303 684234 -4652136 -10272909 -7991398 2122710
10201B122710Q522165p05984o648637l561620K430008L303069n7613j864151j312702
$$ 2122710 10644875 9938891 3290254 -271366 2158642 5461711 5404098 3539947 2227245
10192B227245j661018k508080o79827K307398J328382l340696n234959j607177
$$ 2227245 566227 -1941853 -2621680 -314282 1014100 -2326596 -7561555 -9168732
10184i168732K303208J600250j178797r23373K200774L838522K067830p24332
$$ -9168732 -6865524 -5265274 -6444071 -7367444 -5166670 -1328148 739682 15350
10176A5350j803273j252600q48086j095138m52327K011457M090321K703810j247350
$$ 15350 -1787923 -3040523 -3888609 -4983747 -5436074 -3424617 665704 3369514 2122164
10167B122164l277223j567536O41762O72462M39529K052481L434147K144690l8690
$$ 2122164 -1155059 -2722595 -2080833 -1408371 -968842 1083639 4517786 6662476 6623786
10158F623786n61264o51322k019373k651010q51210L04692j777163l341070k14402
$$ 6623786 6062522 5411200 3391827 740817 -110393 194299 -1582864 -4923934 -5138336
10149e138336M000448L175787r18736j724833Q29848J101070j458333j560576
$$ -5138336 -1137888 2037899 1119163 -605670 224178 1325248 -133085 -1693661
10141a693661J779958L384869J247596n53282K63698R96270J18238m39571k60411
$$ -1693661 86297 3471166 4718762 4165480 4429178 5425448 5543686 5104115 4843704
10132D843704r28684j318169L95015P58175m131246q730075m003204O343067Q402698
$$ 4843704 3915020 2596851 2991866 3750041 -381205 -9111280 -13114484 -6771417 1631281
10123A631281m77944o504150j077986O143698M267113j494351q96719L237876
$$ 1631281 1153337 -5350813 -6428799 -285101 3982012 2487661 1590942 4828818
10115D828818J491448m514894m981697J059138M584167J434865k866913l487998
$$ 4828818 6320266 1805372 -3176325 -2117187 2466980 3901845 1034932 -2453066
10107b453066j983481o85064O30687J365346M1570j630316m15269K544859K960968
$$ -2453066 -4436547 -5121611 -4490924 -3125578 -3084008 -4714324 -5129593 -2584734 376234
10098C76234K95364j947073k310203k317027j975730r734K015216J536092L54109
$$ 376234 671598 -1275475 -3585678 -5902705 -7878435 -7888169 -5872953 -4336861 -3982752
10089c982752K166358N312774M514893j77178k981705j610255j74064j586753
$$ -3982752 -1816394 3496380 8011273 7834095 4852390 3242135 3068071 1481318
10081A481318l510916l549599k373111r7102M085544P006623L487814m131003
$$ 1481318 -2029598 -5579197 -7952308 -8049410 -3963866 3042757 6530571 2399568
10073B399568o149409N96957O599373L344131l842154m421177J247445L737217
$$ 2399568 -3749841 -3152884 3446489 6790620 2948466 -1472711 -225266 3511951
10065C511951l11749m454227l611487m04955J162597J184652P72719m41467j268213
$$ 3511951 3200202 -1254025 -4865512 -5270467 -4107870 -2923218 -2150499 -2591966 -3860179
10056c860179J003559M715350L502922m215686j0307914o715185L183653Q730755
$$ -3860179 -2856620 1858730 5361652 1145966 -9161948 -15877133 -12693480 -3962725
10048c962725N697374O3973j520431N56242K049868J226790m93543j554125j502298
$$ -3962725 1734649 1798622 278191 834433 2884301 4111091 3617548 2063423 561125
10039E61125o27778R6803j29968k69723J707134N171106N947390J140886o196696
$$ 561125 -66653 30150 -99818 -369541 1337593 6508699 12456089 13596975 7400279
10030G400279r479258n710367J327206N289715L611892p85131l335248k490288
$$ 7400279 -2078979 -7789346 -6462140 -1172425 2439467 1654336 -1680912 -4171200
10022d171200l31007Q54341J320603K469130L789102L007829o37150m872293o718729
$$ -4171200 -4502207 -3647866 -2327263 141867 3930969 6938798 6301648 1429355 -5289374
10013e289374n244493j594150K432283N088004N124950K727701k94779j890418
$$ -5289374 -10533867 -12128017 -9695734 -4607730 517220 3244921 2950142 1059724
10005A059724j277349Q21392K872352L546675K768318J702472J160697N38187
$$ 1059724 -217625 603767 3476119 7022794 9791112 11493584 12654281 13192468
9997A3192468q86094k533586l666259m719543n628137m303177K65558M484663
$$ 13192468 12306374 9772788 6106529 1386986 -4241151 -8544328 -8278770 -3794107
9989c794107L662888j090941l728517j649991J286656J546226Q03534J319831
$$ -3794107 -131219 -1222160 -4950677 -6600668 -5314012 -3767786 -2964252 -1644421
9981a644421J147176j772042m291577k073374L033294M865899J637372j984339
$$ -1644421 -497245 -2269287 -6560864 -8634238 -5600944 -735045 902327 -1082012
9973a082012j873702O09911J889835J087009j70766p05233n68075J09392J251146
$$ -1082012 -2955714 -2345803 -455968 631041 460275 -244958 -813033 -703641 547505
9964E47505J816720P1248l948519o725120m153334K753907P292137M782565r43101
$$ 547505 2364225 2435473 -1513046 -8238166 -12391500 -9637593 -2345456 2437109 1494008
9955A494008k510623Q33660L061265J166836r86694k44281P23386o80183j646619
$$ 1494008 -1016615 -182955 2878310 4045146 3058452 2814171 3537557 2857374 1210755
9946A210755O14827K750338L58724m044233m295434M4111L384484K299451j092712
$$ 1210755 1825582 4575920 4934644 890411 -3405023 -3360912 23572 2323023 1230311
9937A230311l495041l639751j446971J862902L065308J92673l752377l922734
$$ 1230311 -2264730 -5904481 -7351452 -5488550 -2423242 -2230569 -5982946 -9905680
9929i905680p8965L511099L983390K129247m76383k666588k569339N28684L392644
$$ -9905680 -9984645 -6473546 -2490156 -360909 -837292 -3503880 -6073219 -5544535 -2151891
9920b151891K106715j795501k824479L20449K706187P70604k400198k150652P29363
$$ -2151891 -45176 -1840677 -4665156 -4344707 -1638520 -867916 -3268114 -5418766 -4689403
9911d689403J784359K1949q18445J453981L527798J459832k673837l169085M57486
$$ -4689403 -2905044 -2883095 -3701540 -2247559 1280239 2740071 66234 -3102851 -2645365
9902b645365K201348q50094l462427j193951J610805j55561k181590J285251M434817
$$ -2645365 -444017 -1294111 -4756538 -5950489 -4339684 -4495245 -6676835 -5391584 -956767
9893i56767j299842q861657m052991P667573N452139r812094q652708K0841006
$$ -956767 -2256609 -11118266 -15171257 -7503684 -2051545 -11863639 -20516347 324659
9885C24659M4677201K6966912j5259032l3595510j5756076L769579N69699q619229
$$ 324659 45001860 71968772 56709740 23114230 7358154 11127733 11697432 3078203
9877C078203k644061Q660682O119638n055717o904623N28048L026891j757895
$$ 3078203 434142 9094824 15214462 10158745 3254122 3782170 6809061 5051166
9869E051166l187009J534147L949116Q37032j554562m77783n78172l131664k953667
$$ 5051166 1864157 3398304 7347420 8184452 6629890 6152107 5573935 2442271 -511396
9860e11396J226904L122143p45431m830841k928459K829855N516060K598517j873085
$$ -511396 715508 3837651 3092220 -1738621 -4667080 -1837225 3678835 6277352 4404267
9851D404267k844093J95520L238064K749576k15340k147555k330506k886866l952506
$$ 4404267 1560174 1755694 4993758 7743334 7527994 5380439 3049933 163067 -3789439
9842c789439l149552n16128R47780R86214K853748O296974N932341J09233m696997
$$ -3789439 -6938991 -7455119 -6507339 -5521125 -2667377 3629597 9561938 9671171 4974174
9833D974174l136248Q02356N10400k919750l583763o77319J255313L54388l89756
$$ 4974174 1837926 2640282 3150682 230932 -3352831 -4030150 -2774837 -2420449 -2810205
9824b810205J252285L620352L939039J355017k556877m705891l127449L15083
$$ -2810205 -1557920 2062432 6001471 7356488 4799611 93720 -3033729 -2718646
9816b718646J976997J508681J509802K100921R26635q74940P27305M436901L592647
$$ -2718646 -741649 767032 2276834 4377755 5304390 4429450 5156755 9593656 13186303
9807A3186303k656699o377363l480150n89686l079090n168045n85297M879911
$$ 13186303 10529604 4152241 672091 82405 -2996685 -8164730 -8750027 -3870116
9799c870116K329373m641663n253830J108300M953058K512046k62384L24594Q98254
$$ -3870116 -1540743 -6182406 -11436236 -10327936 -5374878 -2862832 -3125216 -2800622 -1902368
9790a902368j14705R97553M794605N555043M81389n071464n498120k268641K14428
$$ -1902368 -2017073 -1019520 3775085 9330128 9811517 4740053 -758067 -3026708 -2812280
9781b812280R62926J039120J70348j615784k095447J77746L004324L036239P54
$$ -2812280 -1849354 -810234 -639886 -2255670 -4351117 -4173371 -1169047 1867192 1867946
9772A867946k841758j924210K689608O059674L024270m471853p942550l174412
$$ 1867946 -973812 -2898022 -208414 5851260 8875530 4403677 -3538873 -6713285
9764f713285L340167L391132j331364l093246o50644L25061j601843j148061L332787
$$ -6713285 -3373118 18014 -1313350 -4406596 -5057240 -4732179 -6334022 -7482083 -4149296
9755d149296N439966O70903n672274n565305R03613O563244O477809K068796k646289
$$ -4149296 1290670 1961573 -3710701 -9276006 -8372393 -1809149 4668660 6737456 4091167
9746D091167n214056n118945k569595J752840O045775P594535N137322J105886
$$ 4091167 -1122889 -6241834 -8811429 -7058589 -1012814 6581721 11719043 12824929
9738A2824929n61001M67335O37997j473154k533353l64442J474601q42771m595928
$$ 12824929 12263928 12731263 13369260 11896106 9362753 8998311 10472912 9630141 5034213
9729E034213m287246q2220K851613K192350M97866L7949L98303J006565J763082
$$ 5034213 746967 664747 3516360 5708710 6206576 6244525 6642828 7649393 9412475
9720I412475J325224j421351m536002n133896l618600k554684k522524k402856
$$ 9412475 10737699 9316348 4780346 -353550 -3972150 -6526834 -9049358 -11452214
9712a1452214k113013j531763J170321O133354R071542O392410Q28899k497966
$$ -11452214 -13565227 -15096990 -13926669 -7793315 1278227 7670637 8499536 6001570
9704F001570l030904l079064k406371j49502J045086r60734k750961q59101J300172
$$ 6001570 2970666 -108398 -2514769 -2664271 -1619185 -2579919 -5330880 -6189981 -4889809
9695d889809n45504k647726N07665M857948K619977l195221k617183L913230N584863
$$ -4889809 -5435313 -8083039 -7575374 -2717426 -97449 -3292670 -5909853 -1996623 3588240
9686C588240k05971l384275J068154M621051M97615m958663m093774m76680o82793
$$ 3588240 3382269 -2006 1066148 5687199 6184814 1226151 -2867623 -3344303 -4027096
9677d027096k365903q7551L805434L629867N97906k02610Q85564j02918k696581
$$ -4027096 -6392999 -6480550 -2675116 954751 1552657 1350047 2235611 2132693 -563888
9668e63888l079234r94144O32692Q94810N91552p85734l045667l132650M18278
$$ -563888 -3643122 -4637266 -4004574 -3109764 -2518212 -3303946 -6349613 -9482263 -9063985
9659i063985L784577L023429o9872j429360q05244l04155j97837q2859p07780
$$ -9063985 -5279408 -2255979 -2325851 -3755211 -4560455 -4864610 -5062447 -5145306 -5853086
9650e853086j202534J203392N283816N124906m03883l785492j46244M094588J307419
$$ -5853086 -7055620 -5852228 -568412 4556494 4152611 367119 220875 4315463 5622882
9641E622882m471290l893143K597466N935966K702741j349613j735219o41150
$$ 5622882 1151592 -2741551 -144085 5791881 8494622 7145009 5409790 4768640
9633D768640r70548j980923k193143j431408N16054K969100K948583p69250l865645
$$ 4768640 3798092 1817169 -375974 -1807382 -1291328 1677772 4626355 3857105 -8540
9624h540j920334K324141K948815O7816j506606r81618j558614k778972q78944
$$ -8540 -1928874 395267 3344082 3411898 1905292 923674 -634940 -3413912 -4292856
9615d292856L112887L473558r43008m671378m190241j803238K48397K631735M293326
$$ -4292856 -1179969 2293589 1350581 -3320797 -7511038 -9314276 -9065879 -6434144 -2140818
9606b140818K093391k566488l553798O29234L682281J018711l623334m821730
$$ -2140818 -47427 -2613915 -6167713 -5538479 -1856198 -837487 -4460821 -9282551
9598i282551l052113j434148k6901K015463K922301J605948Q80383K982259N094407
$$ -9282551 -12334664 -13768812 -13795713 -11780250 -8857949 -7252001 -6371618 -3389359 1705048
9589A705048L536229n52055l661925m964264m890793k107195L172945N861451
$$ 1705048 5241277 4689222 1027297 -3936967 -8827760 -10934955 -7762010 -1900559
9581a900559J862490m490013m942062J268207O408565N188035R83734p72794l97444
$$ -1900559 -38069 -4528082 -9470144 -8201937 -1793372 3394663 4378397 3605603 3208159
9572C208159j614079m615337n721837l175305K19275J033199m00372j068964K89655
$$ 3208159 1594080 -3021257 -8743094 -11918399 -11699124 -10665925 -11066297 -12135261 -11845606
9563a1845606J813960J779470J205786J709714K299325Q91486j524753j405718
$$ -11845606 -10031646 -8252176 -7046390 -5336676 -3037351 -2145865 -3670618 -5076336
9555e076336J932357M384602K304993k541310n394920m266383j076795J766966
$$ -5076336 -3143979 1240623 3545616 1004306 -4390614 -8656997 -9733792 -7966826
9547g966826L507469M149114L533547J619400j253039m168982n330111l258775
$$ -7966826 -4459357 -310243 3223304 4842704 3589665 -579317 -5909428 -9168203
9539i168203O58257K514251O11357j668508j90354L899074N567741K930106m92402
$$ -9168203 -8509946 -5995695 -5384338 -7052846 -7243200 -3344126 2223615 5153721 4661319
9530D661319j040954P36139K134801J797680l27545l705856n907086l458555L065272
$$ 4661319 3620365 4356504 6491305 8288985 7961440 4255584 -1651502 -5110057 -2044785
9521b044785P251102L996100l129315o075582l101740k58559j594568l531336
$$ -2044785 5206317 9202417 6073102 -2480 -3104220 -3362779 -4957347 -8488683
9513h488683j512783K779515M916736M535082L737023J652713l445883q132895
$$ -8488683 -10001466 -7221951 -2305215 2229867 5966890 7619603 4173720 -3959175
9505c959175o577120K85994M627968K551306p86170K06913L228766K818845p79951
$$ -3959175 -10536295 -10250301 -5622333 -3071027 -3857197 -3650284 -421518 2397327 1617376
9496A617376k974576k532510k258029k978790k318135K34789J860824J226562
$$ 1617376 -1357200 -3889710 -6147739 -9126529 -11444664 -11209875 -9349051 -8122489
9488h122489P34168K224113L743338K717481j79869k488535l323947l152189j822938
$$ -8122489 -7388321 -5164208 -1420870 1296611 1116742 -1371793 -4695740 -7847929 -9670867
9479i670867Q51288L487733M182575K675695k0681l193180n775856n332429o99932
$$ -9670867 -8819579 -5331846 -1149271 1526424 1505743 -1687437 -7463293 -12795722 -13495654
9470a3495654M567157M960752M05469k554195N71442N389485M492669j652822
$$ -13495654 -8928497 -3967745 -3562276 -6116471 -5545029 -155544 4337125 2684303
9462B684303m930515r52438N075432O025349J893216k143639l102862j613255
$$ 2684303 -2246212 -3198650 1876782 7902131 9795347 7651708 4548846 2935591
9454B935591J146640L326867J526459m692238r024312n210666K992218N370979
$$ 2935591 4082231 7409098 8935557 4243319 -4780993 -9991659 -6999441 -1628462
9446a628462m17034n230218j826594M966592O138586J159812l144850k999916
$$ -1628462 -2045496 -7275714 -9102308 -4135716 2002870 3162682 17832 -2982084
9438b982084r20306l2121k87644j57636J210037L061254K530600k597436q675096
$$ -2982084 -3902390 -3934511 -4222155 -4379791 -3169754 -108500 2422100 -175336 -8850432
9429h850432p925276P91942P629930M199982l697317l916556L901498P904979
$$ -8850432 -16775708 -15983766 -8353836 -4153854 -7851171 -11767727 -7866229 38750
9421C8750K097898n390491n524929p78592J398700L68069L93011J793703J601596
$$ 38750 2136648 -3253843 -8778772 -9557364 -8158664 -7790595 -7397584 -5603881 -4002285
9412d002285L93955J333928L503778K648308j441235l955105k227797R22732K113805
$$ -4002285 -3608330 -2274402 1229376 3877684 2436449 -1518656 -3746453 -2823721 -709916
9403g09916J539969R36541R39948J666073K749910K021572k261909o923065n870175
$$ -709916 830053 1766594 2706542 4372615 7122525 9144097 6882188 -40877 -5911052
9394e911052J446799P807990P306227K667095j93406r80198l079642n634152m287323
$$ -5911052 -4464253 3343737 10649964 13317059 13123653 12143455 9063813 3429661 -857662
9385h57662O27593L176851M53325l376885l761147j703967l94452j40343K17835
$$ -857662 -230069 2946782 3400107 23222 -3737925 -5441892 -5836344 -5976687 -5758852
9376e758852M45032O67106K602601N681670N458276j6016n524768n243691j175508
$$ -5758852 -5313820 -4646714 -2044113 3637557 9095833 9079817 3555049 -1688642 -2864150
9367b864150M40248j167974j531126M74350J262629j55163m16749J391169J696611
$$ -2864150 -2423902 -3591876 -5123002 -4648652 -3386023 -3541186 -3957935 -2566766 -870155
9358h70155p33389k042488n0965J972438J526365J338365L632129N000404J808626
$$ -870155 -1603544 -3646032 -3696997 -1724559 -198194 1140171 4772300 9772704 11581330
9349A1581330l343936n513556m432457k854839j070619J747096L417772J554988
$$ 11581330 8237394 2723838 -1708619 -4563458 -5634077 -3886981 -469209 1085779
9341A085779j366362j179561J150494J290162r70627j719519n4792O32744q96324
$$ 1085779 -280583 -1460144 -309650 980512 9885 -1709634 -1764426 -1131682 -2028006
9332b028006j620935j10691O57989j226742k660759l10754L670093M305358P27543
$$ -2028006 -3648941 -3759632 -3101643 -4328385 -6989144 -7299898 -3629805 675553 1403096
9323A403096k709769k131913J215610K750639J13756l978468m867503j500934
$$ 1403096 -1306673 -3438586 -2222976 527663 641419 -3337049 -8204552 -9705486
9315i705486K379513K908231N16032j255417j79235K527561L753819J603616k197318
$$ -9705486 -7325973 -4417742 -3901710 -5157127 -5336362 -2808801 945018 2548634 351316
9306C51316l233987N05024N025899M799052M54314k264165j451196j208634l236183
$$ 351316 -2882671 -2377647 2648252 7447304 7901618 5637453 4186257 2977623 -258560
9297b58560l133017R89795L099291j345075o425117m074797K998205N484226J678608
$$ -258560 -3391577 -2401782 697509 -647566 -7072683 -11147480 -8149275 -2665049 -986441
9288i86441j740970j554843j010202j203691Q55286M340841M037411q6513j513965
$$ -986441 -2727411 -4282254 -5292456 -6496147 -5640861 -1300020 2737391 2650878 1136913
9279A136913J724691L283016l40371l404607q44312L162819K729345k95344j153969
$$ 1136913 2861604 6144620 5804249 2399642 1555330 4718149 7447494 7152150 5998181
9270E998181p44003k113374l135430m14988K971502J515253l117585m130561k12850
$$ 5998181 5254178 3140804 5374 -409614 2561888 4077141 959556 -3171005 -3383855
9261c383855L021533K137196p9212m57332K74765L83233j60847j129420k548377
$$ -3383855 -362322 1774874 1695662 1238330 1513095 1896328 1735481 606061 -1942316
9252a942316k902824k88426L794897N043337J830166k525066l890912j634433
$$ -1942316 -4845140 -5133566 -1338669 3704668 5534834 3009768 -881144 -2515577
9244b515577J710194L173093J515837j619970k840970q07641J808810J895302
$$ -2515577 -805383 2367710 3883547 2263577 -577393 -1385034 423776 2319078
9236B319078Q3486j027712j255611k116639k939626j699230P82815J678802J091530
$$ 2319078 2402564 1374852 119241 -1997398 -4937024 -6636254 -5853439 -4174637 -3083107
9227c083107J566170K350013l49188n570486n967019J883984J0232599R108083
$$ -3083107 -1516937 833076 483888 -5086598 -11053617 -9169633 1062966 10171049
9219A0171049n8046o286298m020288M62460n07844n178641o407556k615241J054200
$$ 10171049 10113003 3826705 -193583 268877 -238967 -5417608 -11825164 -14440405 -13386205
9210a3386205J315423P79988K347538M324518L785033J447197r5312p74933k087745
$$ -13386205 -12070782 -11290794 -8943256 -4618738 -833705 613492 518180 -256753 -2344498
9201b344498l108328j437309K102418L599685J678792m45979l5778J064574l07711
$$ -2344498 -5452826 -6890135 -4787717 -1188032 490760 44781 9003 1073577 765866
9192G65866l386209m314770j450838K610645M464685L613614K080270J329564
$$ 765866 -2620343 -6935113 -8385951 -5775306 -1310621 2302993 4383263 5712827
9184E712827P69056n33728j789733j552662m50820o84182k275255k431152r0453
$$ 5712827 6481883 5948155 4158422 2605760 2154940 1470758 -804497 -3235649 -3326102
9175c326102J810531J132138N51281K911038N186901K384104l955625p047548
$$ -3326102 -1515571 -383433 167848 3078886 8265787 10649891 6694266 -353282
9167c53282m450668m59685J456079K333604K729440Q31775k096679j161413L784246
$$ -353282 -4803950 -5263635 -3807556 -1473952 1255488 2087263 -9416 -1170829 2613417
9158B613417N709873Q41300m662103l927088N00571K202273J287978J554281J598702
$$ 2613417 8323290 9164590 4502487 575399 1075970 3278243 4566221 6120502 7719204
9149G719204k215318o536818m394336K830894O094651K181676k320017k453869
$$ 7719204 5503886 -1032932 -5427268 -2596374 3498277 5679953 3359936 906067
9141I06067j619598l302588m000947K13354O002559P548103M966704K390288O87196
$$ 906067 -713531 -4016119 -8017066 -7803712 -1801153 5746950 10713654 13103942 13791138
9132A3791138k327249o138518p174583l921742J300794N465762O909747M935507
$$ 13791138 11463889 5325371 -1849212 -5770954 -4470160 995602 7905349 12840856
9124A2840856L64660l621448l829616o74497K187500J930391r22705l718867m264308
$$ 12840856 13205516 9584068 5754452 5079955 7267455 9197846 8275141 4556274 291966
9115B91966k591171r89279j584711l347703l003375J78007K694946J815081n4897
$$ 291966 -2299205 -3288484 -4873195 -8220898 -11224273 -11046266 -8351320 -6536239 -6591136
9106f591136Q26065L087745K056968k215119l824716J98063M595275L237401j499800
$$ -6591136 -5765071 -2677326 -620358 -2835477 -6660193 -6462130 -1866855 1370546 -129254
9097a29254k119335K442172M915622Q65602m163464k886451K596170M061633k39084
$$ -129254 -2248589 193583 5109205 5974807 1811343 -1075108 1521062 5582695 5343611
9088E343611l261066m52210L299459J637667l425211m975234j607788J481673
$$ 5343611 2082545 1630335 4929794 6567461 3142250 -1832984 -3440772 -1959099
9080a959099R44263q02534q79186k15625m03819j96600J794492L545657K304106
$$ -1959099 -1014836 -1817370 -2696556 -2912181 -3316000 -3512600 -1718108 1827549 4131655
9071D131655m94941o79376K237695L612016K43699m372956m458867l38685J665888
$$ 4131655 3636714 2957338 5195033 8807049 9050748 4677792 218925 -119760 1546128
9062A546128j424004m269373r24720N567762O661079O34759m525066k253466L875149
$$ 1546128 122124 -4147249 -5071969 495793 7156872 7791631 3266565 1013099 4888248
9053D888248N914771J994593l170438n406658m361656j524836Q38509J03135l442165
$$ 4888248 10803019 12797612 9627174 4220516 -141140 -1665976 -827467 -724332 -4166497
9044d166497n041163j260782M002470M023141j095885m566273k755651O73138
$$ -4166497 -9207660 -10468442 -6465972 -2442831 -3538716 -8104989 -10860640 -10187502
9036a0187502J583122Q76437Q81729R70222l2760o23842Q36983K846062K950723
$$ -10187502 -8604380 -7727943 -6846214 -5875992 -5908752 -6532594 -5695611 -2849549 101174
9027A01174J330223j93419r56513j236628j001024o59663j243041k289215j684682
$$ 101174 1431397 1237978 281465 -955163 -1956187 -2615850 -3858891 -6148106 -7832788
9018g832788Q45098K570329J857934O59523P00946K45205k270716m171556k071744
$$ -7832788 -6987690 -4417361 -2559427 -1899904 -1198958 -953753 -3224469 -7396025 -9467769
9009i467769K408472M579492L214463J174803K93486k21166m85058O65835K314742
$$ -9467769 -7059297 -2479805 734658 1909461 2202947 1981781 1496723 2162558 4477300
9000D477300J512241j861856l750063j487224K059592K440331k42640k019269
$$ 4477300 5989541 4127685 377622 -1109602 949990 3390321 3147681 1128412
8992A128412j018672J95361j085728l254531k258756K359032N582256K939652
$$ 1128412 109740 305101 -780627 -4035158 -6293914 -3934882 1647374 4587026
8984D587026k730163l801735K011157P572988N287860k508802o643277l580159
$$ 4587026 1856863 -1944872 66285 7639273 12927133 10418331 3775054 194895
8976A94895O05733q7225l219340k788201J241741L363177J206935j292272l30425
$$ 194895 800628 713403 -2505937 -5294138 -4052397 -689220 517715 -774557 -1104982
8967a104982K201899J961999j417619l941169k530963J548499M606263M273257
$$ -1104982 1096917 3058916 1641297 -2299872 -4830835 -3282336 1323927 5597184
8959E597184J041907k652175m317554l283853j316669p26038j434080q60180K426083
$$ 5597184 6639091 3986916 -330638 -3614491 -4931160 -5657198 -7091278 -7951458 -5525375
8950e525375N904871N553507Q73076m188915n672005l470576k30919J951183K557214
$$ -5525375 379496 5933003 6806079 2617164 -3054841 -6525417 -6756336 -4805153 -2247939
8941b247939J822686O35629M01318J266698J244868q82092k604808n72974L605756
$$ -2247939 -425253 210376 611694 1878392 3123260 2241168 -363640 -936614 2669142
8932B669142M148940q43712n679488m374616J074107L766497J655473o36699K35668
$$ 2669142 6818082 5974370 294882 -4079734 -3005627 760870 2416343 1779644 2015312
8923B015312J689275M62155j753675j367857J039974J543223j215137m181493
$$ 2015312 3704587 4166742 2413067 1045210 2085184 3628407 2413270 -1768223
8915a768223m004708p96745K421157K792472M03870j387553L93457L784987L444449
$$ -1768223 -5772931 -6569676 -4148519 -1356047 -952177 -2339730 -1946273 1838714 5283163
8906E283163j710657n668648l295535J916901K790253r71335l006055m35602K531607
$$ 5283163 3572506 -2096142 -5391677 -3474776 -684523 -1655858 -4661913 -5097515 -2565908
8897b565908K105477N3952q26800j127025j848780j501240O85448K406771K049726
$$ -2565908 -460431 -406479 -1233279 -2360304 -4209084 -5710324 -5024876 -2618105 -568379
8888e68379J227463R76811m48219l058480l082473O75187L115662L72603l310406
$$ -568379 659084 1635895 1187676 -1870804 -4953277 -4278090 -1162428 -789825 -4100231
8879d100231k050756K146123L059506N05314n01115J010882J329659l3397L62954
$$ -4100231 -6150987 -4004864 -945358 -440044 -941159 69723 1399382 1365985 1728939
8870A728939K313424J421008k424470l484465L61669L469239J315880k405236
$$ 1728939 4042363 5463371 3038901 -445564 -83895 3385344 4701224 2295988
8862B295988j906825K131623M643454L457829M03309k353171l511324k156026
$$ 2295988 389163 2520786 7164240 10622069 11025378 8672207 5160883 3004857
8854C004857Q74388K569971R34320k640693n378594n761788l583248J09134K485483
$$ 3004857 3879245 6449216 7383536 4742843 -635751 -6397539 -9980787 -9871653 -7386170
8845g386170J283034j661117k368263n23502N41823o1842L94769K452458L001877
$$ -7386170 -6103136 -7764253 -10132516 -10656018 -10114195 -10176037 -9781268 -7328810 -4326933
8836d326933J294227N76955J487991K07257l662704m318913N85229M505705K315308
$$ -4326933 -3032706 -2455751 -967760 -760503 -4423207 -8742120 -8156891 -3651186 -1335878
8827a335878o92607K010478N912838K375138n892028p482713K51579P179804N584379
$$ -1335878 -2028485 -18007 5894831 8269969 2377941 -5104772 -4853193 2326611 7910990
8818G910990j49206k490374j328713p09516j084864m26012N91374l55544k711720
$$ 7910990 7761784 5271410 3942697 3233181 2148317 1722305 2313679 1958135 -753585
8809g53585l422012j207464J902908L025697J342363j033746j148663J018501
$$ -753585 -4175597 -5383061 -3480153 -454456 887907 -145839 -1294502 -276001
8801b76001J934316n80339l463672k510216J081219K457505P22568j47109J573535
$$ -276001 1658315 1077976 -2385696 -4895912 -3814693 -1357188 -634620 -781729 791806
8792G91806K490882J14710k799328k564147K02822K259328K022127O2966k222326
$$ 791806 3282688 3397398 598070 -1966077 -1763255 496073 2518200 2581166 358840
8783C58840k715041J7375L793555M247183R44741j291352N07822K717872R48883
$$ 358840 -2356201 -2338826 1454729 5701912 6646653 5355301 5863123 8580995 9529878
8774I529878k707026k951377K57110J800710n12754l105455k830555j474125j838324
$$ 9529878 6822852 3871475 4128585 5929295 5416541 2311086 -519469 -1993594 -3831918
8765c831918k861679j859195M84575J015139n96192j010466J519606M083523L276529
$$ -3831918 -6693597 -8552792 -8068217 -7053078 -7649270 -8659736 -7140130 -3056607 219922
8756B19922K43004j205429k67732L53689n67738q89086Q17425K546807K077627
$$ 219922 462926 -742503 -1010235 -656546 -1224284 -2113370 -1295945 1250862 3328489
8747C328489K70663r21187j371334j484314l65301K064120L283598J435792j524003
$$ 3328489 3599152 2677965 1306631 -177683 -542984 1521136 4804734 6240526 4716523
8738D716523k805495k774486k844862j961291Q11594K707580J123222j160123
$$ 4716523 1911028 -863458 -3708320 -5669611 -4858017 -2150437 -1027215 -2187338
8730b187338k00228J725050k66792m090943k948612K698101M522717l9944k875437
$$ -2187338 -2387566 -662516 -929308 -5020251 -7968863 -5270762 -748045 -787989 -3663426
8721c663426J459646O075790K466159n803649q574135l983844Q16773J582708
$$ -3663426 -2203780 3872010 6338169 534520 -8039615 -12023459 -11206686 -9623978
8713i623978J099263J779479J967909R58686J264542L647266M846414K680992
$$ -9623978 -8524715 -6745236 -4777327 -3818641 -2554099 1093167 5939581 8620573
8705H620573m60742j583198j364292k011745l222312k892039o67542J347070J245892
$$ 8620573 8159831 6576633 5212341 3200596 -21716 -2913755 -3581297 -2234227 -988335
8696i88335m08303j112351Q27940L965770M757855J584834l051645n321475m263706
$$ -988335 -1396638 -2508989 -1681049 2284721 7042576 8627410 5575765 254290 -4009416
8687d009416k027822p01812l30361K51467J695056L083583K409790q33757l579064
$$ -4009416 -6037238 -6739050 -7069411 -6817944 -5122888 -2039305 370485 -463272 -4042336
8678d042336k065657K391958L668505r17842n707463l767534L232945O860244
$$ -4042336 -6107993 -3716035 -47530 -965372 -6672835 -10440369 -7207424 -347180
8670c47180L145218k616010l359117J091453M919628L777603p35504l497044j624318
$$ -347180 2798038 182028 -3177089 -2085636 2833992 6611595 5876091 2379047 754729
8661G54729K482228M097853J870475r64281j438725n39985n56915j304026j503583
$$ 754729 3236957 7334810 9205285 8241004 6802279 6262294 5705379 4401353 2897770
8652B897770j643442k242185j268878K749832O477641N166978k22482l899016
$$ 2897770 1254328 -987857 -2256735 493097 6970738 12137716 11915234 8016218
8644H016218l319992j756328k101516k871930k023926n03719K60203R11687J958885
$$ 8016218 4696226 2939898 838382 -2033548 -4057474 -4561193 -4300990 -3389303 -1430418
8635a430418K093636Q65726J17768P27407R83037K92870R86463L625790M167534
$$ -1430418 663218 1528944 1646712 2374119 3357156 3650026 4636489 8262279 12429813
8626A2429813l21700o137986p647849n192349l253429k411171R10423O712705
$$ 12429813 12108113 5970127 -1677722 -6870071 -10123500 -12534671 -11624248 -4911543
8618d911543R465402N765757p21425m422539m250554k392888k38445J392644R45282
$$ -4911543 4553859 10319616 9598191 5175652 925098 -1467790 -1706235 -313591 631691
8609F31691j297411j689207J676937M306340Q18076n732812o167264J831783R053174
$$ 631691 -665720 -2354927 -677990 3628350 4446426 -1286386 -7453650 -5621867 3431307
8600C431307O716666j699118n873279k751925J208862R31708j001457m97407J499335
$$ 3431307 10147973 8448855 2575576 -176349 1032513 1964221 962764 465357 1964692
8591A964692J886359O68144l48749j197706k550045l197233k131271j046833j410353
$$ 1964692 3851051 4519195 4170446 2972740 422695 -2774538 -4905809 -5952642 -7362995
8582g362995j300411R95531K665299N68070k265658m85639M129691M246790j216881
$$ -7362995 -8663406 -7667875 -5002576 -4434506 -6700164 -7185803 -3056112 1190678 -26203
8573b6203m550345j356338K403447O22967k461471L40732N958662M801642l584635
$$ -26203 -4576548 -5932886 -3529439 -2906472 -5367943 -5027211 931451 5733093 2148458
8564B148458q395777l165408M977743O094480R10928k515680j169152R18199J062216
$$ 2148458 -6247319 -9412727 -4434984 1659496 2570424 54744 -1114408 -196209 866007
8555H66007J185272K212545J489240j953780m460211l192044p28028o43411j616049
$$ 866007 2051279 4263824 5753064 3799284 -660927 -3852971 -4580999 -5224410 -6840459
8546f840459k75756K321115K213705l84973j014624J531268L001062P17762k163955
$$ -6840459 -7116215 -4795100 -2581395 -2966368 -3980992 -2449724 551338 1269100 -894855
8537h94855k140853n57345J75564J272995L939739M838400J006172l425345k250284
$$ -894855 -3035708 -3593053 -3417489 -2144494 1795245 6633645 7639817 4214472 1964188
8528A964188K356135J956878m914981r268970m370565M436832P140411J880586
$$ 1964188 4320323 6277201 1362220 -7906750 -12277315 -7840483 -700072 1180514
8520A180514m420093n485120j399024L469958M748797J312026l320173m114954
$$ 1180514 -3239579 -8724699 -10123723 -6653765 -1904968 -592942 -3913115 -8028069
8512h028069o33268K258336J354758n95252j24672J267582N99518q52941k22470
$$ -8028069 -8661337 -6403001 -5048243 -5643495 -5768167 -4500585 -3901067 -4754008 -4976478
8503d976478J260396P94591O6473K385235N033348J876408n872086r081899l435126
$$ -4976478 -3716082 -2921491 -2855018 -469783 4563565 6439973 567887 -8514012 -11949138
8494a1949138M016809M945742P02426j826396q08375J65618l02090K37322K592607
$$ -11949138 -7932329 -2986587 -2284161 -4110557 -4918932 -4753314 -5055404 -4818082 -2225475
8485b225475M147377L283331J483016P1199j603617l513542l731310j721065k27494
$$ -2225475 1921902 5205233 6688249 6759448 5155831 1642289 -2089021 -3810086 -4037580
8476d037580j506747l495232k481910J279937L583002K179886p0050M79566K816618
$$ -4037580 -5544327 -9039559 -11521469 -10241532 -6658530 -4478644 -4548694 -4069128 -1252510
8467a252510K791842n49908l189503j647958K162394L567457J130219k200901
$$ -1252510 1539332 989424 -2200079 -3848037 -1685643 1881814 3012033 811132
8459H11132l179000j365378J445285K879639J325270k378128m798388l474396
$$ 811132 -2367868 -3733246 -2287961 591678 1916948 -461180 -5259568 -8733964
8451h733964k17679J471351J555692K642647M339769L084871j157498l025907
$$ -8733964 -8951643 -7480292 -5924600 -3281953 1057816 4142687 2985189 -40718
8443d0718L48980L884958J445144m799834p126127k962612K328403L360107R08839
$$ -40718 308262 4193220 5638364 838530 -6287597 -9250209 -6921806 -3561699 -2652860
8434b652860p62048N56789L292677L925354M63731m307473m516827J163189N820449
$$ -2652860 -3414908 -2858119 434558 4359912 4823643 516170 -4000657 -2837468 2982981
8425B982981K757085m290105n762922m77529K743538o93975l928911l60846N169372
$$ 2982981 5740066 1449961 -4312961 -4790490 -2046952 -2740927 -6669838 -7030684 -1861312
8416a861312M329358j133368k726584Q17689K355930j187097m129445j868803
$$ -1861312 2468046 1334678 -1391906 -574217 1781713 594616 -3534829 -5403632
8408e403632K173548K981665J438533J180090K231449K104425M03249j502330
$$ -5403632 -3230084 -248419 1190114 2370204 4601653 6706078 7109327 5606997
8400E606997l344561n115134n015522j564871L127565N041247K980535k79906
$$ 5606997 2262436 -2852698 -7868220 -9433091 -6305526 -1264279 1716256 1436350
8392A436350j384900K99754K434363K129368p70376k949700j616337J257896J345817
$$ 1436350 51450 351204 2785567 4914935 4144559 1194859 -421478 836418 2182235
8383B182235j517901k960762j013908R38589J63333r78116J34611J280720m39392
$$ 2182235 664334 -2296428 -3310336 -2371747 -2208414 -3186530 -3051919 -1771199 -2210591
8374b210591k761446j800931J039542J370452n50501m26830K424745L954714K223323
$$ -2210591 -4972037 -6772968 -5733426 -4362974 -4913475 -5340305 -2915560 1039154 3262477
8365C262477k33554j655107l123480m106683j711213L254036M960393P92174l757997
$$ 3262477 3028923 1373816 -1749664 -5856347 -7567560 -4313524 646869 1439043 -2318954
8356b318954k636628K049889L622254N35913k587277k458428p86028j53890j93829
$$ -2318954 -4955582 -2905693 716561 1252474 -1334803 -3793231 -4579259 -4733149 -4926978
8347d926978O89622K139543K082059n10751l938748n085248k633027J349203L785380
$$ -4926978 -4237356 -2097813 -15754 -526505 -4465253 -9550501 -12183528 -10834325 -7048945
8338g048945L980969L258943K088258N4855j767485j630964m08556n15040j235747
$$ -7048945 -3067976 190967 2279225 2334080 566595 -1064369 -1472925 -1987965 -3223712
8329c223712M72254L629310L143586j615827m104815n44920L249859R64346l397836
$$ -3223712 -2751458 877852 4021438 2405611 -1699204 -2244124 1005735 1970081 -1427755
8320a427755j762856M329011N741807N63369k985047k06394K938265O32587k955705
$$ -1427755 -3190611 1138400 6880207 7443576 4458529 4252135 7190400 7822987 4867282
8311D867282j144494L658523L521663k594547p360309n677083o68604J996448
$$ 4867282 3722788 7381311 10902974 8308427 948118 -4728965 -5397569 -3401121
8303c401121J070389q60492j606626q07582Q97581K190840J659918m36230j699459
$$ -3401121 -2330732 -3191224 -4797850 -5605432 -4707851 -2517011 -857093 -1293323 -2992782
8294b992782k26477K663191L661584J518600j461068k617846k341993k730565
$$ -2992782 -3219259 -556068 3105516 4624116 3163048 545202 -1796791 -4527356
8286d527356l658043k683721O98519L350753K633348J79647o02059Q07361K240691
$$ -4527356 -8185399 -10869120 -10170601 -6819848 -4186500 -4006853 -4608912 -3801551 -1560860
8277a560860K365981J421213m00850k493668k822901m30256K083336J965119R74835
$$ -1560860 805121 2226334 1825484 -668184 -3491085 -3921341 -1838005 127114 1101949
8268A101949K389762M434515K271618l416423o156871l439984k62159k83171j78862
$$ 1101949 3491711 7926226 10197844 6781421 624550 -2815434 -3077593 -3360764 -3539626
8259c539626K854551M444000K50481n217666m603838P64359L332734J391591K96638
$$ -3539626 -685075 3758925 4009406 -1208260 -5812098 -5047739 -1715005 -323414 -26776
8250b6776K023828K151538j157117l231300j209297O49329j614982m545600k817281
$$ -26776 1997052 4148590 2991473 -239827 -1449124 -799795 -2414777 -6960377 -9777658
8241i777658K115938M350814K061082j205402k268024j128566R70628K704384
$$ -9777658 -7661720 -3310906 -1249824 -2455226 -4723250 -5851816 -4881188 -2176804
8233b176804K676404J262278J257268L688598M672314L89305o045964p486059
$$ -2176804 499600 1761878 3019146 6707744 11380058 11769363 5723399 -1762660
8225a762660k533442K390190J927094j694356l189751j458735Q55239K348649
$$ -1762660 -4296102 -1905912 21182 -1673174 -4862925 -6321660 -5466421 -3117772
8217c117772L642737M346629K814644p67094l584825l407034j226418P7871r44870
$$ -3117772 524965 4871594 7686238 6919144 3334319 -72715 -1299133 -1221262 -2166132
8208b166132k832362k911984m62191K089997J930997l05303j145953O21532J714352
$$ -2166132 -4998494 -7910478 -8372669 -6282672 -4351675 -4656978 -5802931 -5181399 -3467047
8199c467047o94466l725343k081825L895719P637794N030622j46467j985659l84688
$$ -3467047 -4161513 -7886856 -9968681 -6072962 1564832 6595454 6448987 4463328 4078640
8190D078640N04369n70793j158491o52274j434632l622897l605333j6662L121586
$$ 4078640 4583009 4012216 2853725 2201451 766819 -2856078 -6461411 -6478073 -3356487
8181c356487K344118J61714O82585K872286K831352N95632n42472j98538q41918
$$ -3356487 -1012369 -850655 -168070 2704216 5535568 6131200 5588728 5390190 4548272
8172D548272k137734j312757N68305p39372m301794l475271L030298O792838J858750
$$ 4548272 2410538 1097781 1666086 926714 -3375080 -6850351 -3820053 2972785 4831535
8163D831535n064378m141027K521572M520873l43462l282866R02772N975570M705699
$$ 4831535 -232843 -4373870 -1852298 2668575 2325113 -957753 -54981 5920589 10626288
8154A0626288m38268k480100o12271L53888j552747l136324j537740J922359L767232
$$ 10626288 10188020 7707920 7095649 7449537 5896790 2760466 1222726 3145085 6912317
8145F912317K167737j338035l174864j570845Q61009K20296l065618m632043k544620
$$ 6912317 9080054 7742019 4567155 2996310 3857319 4077615 1011997 -3620046 -6164666
8136f164666L85127J657452K262533K980571K029307p17279j550458J227423L245410
$$ -6164666 -5779539 -4122087 -1859554 1121017 3150324 2433045 882587 2110010 5355420
8127E355420L89952m194148m510310m75028K983852L502768K592492J037149j451553
$$ 5355420 5745372 1551224 -2959086 -3434114 -450262 3052506 5644998 6682147 5230594
8118E230594k997897j390264J404053J502445q19155k187609k168731k830983
$$ 5230594 2232697 842433 2246486 3748931 2929776 742167 -1426564 -4257547
8110d257547l383776j362597J518745J226208j241969j292377P01737J41548k150099
$$ -4257547 -7641323 -9003920 -7485175 -6258967 -7500936 -8793313 -8091576 -7950028 -10100127
8101a0100127j24832N801437P077870R24003l793985m86462M320317J889201m440125
$$ -10100127 -10224959 -4423522 2654348 3578351 -215634 -702096 3618221 5507422 1067297
8092A067297n171720L10145M219008K860946k34544k024084k870717k648267q06140
$$ 1067297 -4104423 -3794278 424730 3285676 3051132 1027048 -1843669 -4491936 -5298076
8083e298076M37387r65788k005459J256445O118917O279942J370143k996848l814807
$$ -5298076 -4860689 -5826477 -7831936 -6575491 -456574 5823368 7193511 4196663 381856
8074C81856k897343j400453J120140K734154J002105j610751r73882Q85430j101952
$$ 381856 -2515487 -3915940 -2795800 -61646 940459 -670292 -1644174 -758744 -1860696
8065a860696m858430l307497K743334M103717j822256n821893j296894N528591
$$ -1860696 -6719126 -10026623 -7283289 -3179572 -5001828 -10823721 -12120615 -6592024
8057f592024O086838J995554j98907L3560m54841o91961J430991K563352j078869
$$ -6592024 -505186 1490368 1291461 1325021 870180 178219 1609210 4172562 3093693
8048C093693n124141k375467M977223P496090K709902j626225p7680K809617Q58648
$$ 3093693 -2030448 -4405915 571308 8067398 10777300 9151075 9073395 11883012 12741660
8039A2741660m272069o660459m767030j719888L43198J692885K089728N69508
$$ 12741660 8469591 1809132 -2957898 -4677786 -4334588 -2641703 -551975 17533
8031A7533j783018k012370Q10321L860817L838575P63871k491172l517436k079490
$$ 17533 -1765485 -3777855 -2967534 893283 4731858 5495729 3004557 -512879 -2592369
8022b592369O32137K772939K297125j109835m213979k863196K431517O074117
$$ -2592369 -1960232 812707 3109832 1999997 -2213982 -5077178 -2645661 3428456
8014C428456M307368P701j801909n73982P82857R53494K47080k074392n685468
$$ 3428456 7735824 7743525 5941616 5367634 6150491 7103985 7351065 5276673 -408795
8005d08795o438619j441463M520267M142107j480500m244281j409452J432920
$$ -408795 -6847414 -8288877 -3768610 373497 -1107003 -5351284 -6760736 -5327816
7997e327816R85058J017026L439437L461311j210333m242341l11684N596364N646074
$$ -5327816 -4342758 -3325732 113705 3575016 2364683 -1877658 -2189342 3407022 9053096
7988I053096O37434l153561l984144m007769k642690J454973M731433K929698
$$ 9053096 9690530 6536969 2552825 -1454944 -4097634 -2642661 2088772 5018470
7980E018470j157954j561484J170302J592564j020940k394572j407608q17068
$$ 5018470 3860516 2299032 3469334 5061898 4040958 1646386 238778 -578290
7972e78290o38994J410729L434652J415742k434038j959139J922812J753616l392484
$$ -578290 -1217284 193445 3628097 5043839 2609801 650662 2573474 4327090 934606
7963I34606n195021J48358M973987K367502k975250l035526Q79822J655155j731765
$$ 934606 -4260415 -4112057 861930 3229432 254182 -2781344 -1901522 -246367 -1978132
7954a978132l788669k033538J10280k23355j444335q53846J745833M546691N572967
$$ -1978132 -5766801 -7800339 -7690059 -7913414 -9357749 -10211595 -8465762 -3919071 1653896
7945A653896L796846L9099l250238m081674k563741k94038R58212J52789j871315
$$ 1653896 5450742 5489841 2239603 -1842071 -4405812 -4699850 -3741638 -3588849 -5460164
7936e460164k387233J79011L613450M511064K743751O60657r72210k625384k860090
$$ -5460164 -7847397 -7668386 -4054936 456128 3199879 3860536 2888326 262942 -2597148
7927b597148k25459K486296J359936j515362k96937M661418O042943O48936n565548
$$ -2597148 -2822607 -336311 1023625 -491737 -788674 3872744 9915687 10564623 4999075
7918D999075o407379l039379N55962L312867M484273J734647l542137n027312
$$ 4999075 -1408304 -4447683 -3891721 -578854 3905419 5640066 2097929 -2929383
7910b929383o15041L162891J194857k036295p70637J924954M58822k438417p13864
$$ -2929383 -3544424 -381533 813324 -1222971 -1993608 -68654 390168 -2048249 -2762113
7901b762113L195573J960914l428950m639289K30451L950984K248581p18710q94932
$$ -2762113 433460 2394374 -1034576 -5673865 -5443414 -1492430 756151 37441 -857491
7892h57491J03015L72619R68002J178041j993934o756491o337595N78368O284338
$$ -857491 -754476 -381857 586145 1764186 -229748 -6986239 -13323834 -12745466 -6461128
$$ [...]
##END NTUPLES=NMR SPECTRUM
##END=
