##TITLE=31Pdec_SR75+TFAA20''
 DMSO-d6, 24 sc
 7.6.2022
##JCAMPDX= 6.0         $$ Bruker NMR JCAMP-DX V2.0
##DATA TYPE= NMR SPECTRUM
##DATA CLASS= NTUPLES
##ORIGIN= UXNMR, Bruker Analytische Messtechnik GmbH
##OWNER= root
$$ XWIN-NMR		Version 3.5
$$ Tue Jun  7 15:27:56 2022 Russian Standard Time (UT+4h)  she@DPX200
##.OBSERVE FREQUENCY= 81.013821
##.OBSERVE NUCLEUS= ^31P
##.ACQUISITION MODE= SIMULTANEOUS
##.ACQUISITION SCHEME= undefined
##.AVERAGES= 24
##.DIGITISER RES= 16
##SPECTROMETER/DATA SYSTEM= spect
##.PULSE SEQUENCE= zgpg30
##.SOLVENT NAME= DMSO
##.SHIFT REFERENCE= (INTERNAL, DMSO, 0, 248.564)
##AUDIT TRAIL= $$ (NUMBER, WHEN, WHO, WHERE, WHAT)
$$ ##TITLE= Audit trail, XWIN-NMR		Version 3.5
$$ ##JCAMPDX= 5.01
$$ ##ORIGIN= Bruker BioSpin GmbH
$$ ##OWNER= she
$$ F:/spectra/data/she/nmr/P31/1/pdata/1/auditp.txt
$$ ##AUDIT TRAIL=  $$ (NUMBER, WHEN, WHO, WHERE, WHAT)
(   1,<2022-06-07 15:26:49.45 +0400>,<she>,<DPX200>,
      <created by zg, POWCHK disabled, PULCHK disabled
       configuration hash MD5:
       00 E9 B6 7A A2 85 ED C7 34 08 36 98 17 FE 4E 26
       data hash MD5: 32K
       11 A5 E7 21 A4 C5 CA BA 92 87 20 A1 8D B8 2B 67>)
(   2,<2022-06-07 15:26:51.90 +0400>,<she>,<DPX200>,
      <Start of raw data processing
       efp BC_mod = 2 LB = 1 FT_mod = 6 PKNL = 1 PHC0 = -10268.59 PHC1 = 63.45376 SI = 64K 
       data hash MD5: 64K
       BC B8 F8 5D AA 88 20 6C F8 97 54 35 4E D1 68 82>)
(   3,<2022-06-07 15:27:19.35 +0400>,<she>,<DPX200>,
      <pk PHC0 = 217.6785 PHC1 = -591.0001 
       data hash MD5: 64K
       98 C9 70 D4 AA 8D 9F 1C C5 44 48 D0 1A 31 4F E8>)
$$ ##END=
$$ 
$$ hash MD5
$$ 85 AA E8 4B E9 7B 5E F8 FD 1D CF F7 16 51 50 B4
##$RELAX= 
##$RELAX= 
##$RELAX= 
##$RELAX= 
##$RELAX= 
##$RELAX= 
##$RELAX= 
##$RELAX= 
$$ Bruker specific parameters
$$ --------------------------
##$DU= <F:/spectra>
##$EXPNO= 1
##$NAME= <P31>
##$PROCNO= 1
##$TYPE= <nmr>
##$USER= <she>
##$AMP= (0..31)
100 100 100 100 100 100 100 100 100 100 100 100 100 100 100 100 100 100 
100 100 100 100 100 100 100 100 100 100 100 100 100 100 
##$AQSEQ= 0
##$AQ_mod= 1
##$AUNM= <au_zg>
##$AUTOPOS= <>
##$BF1= 81.014009
##$BF2= 200.13
##$BF3= 200.13
##$BF4= 200.13
##$BF5= 200.13
##$BF6= 200.13
##$BF7= 200.13
##$BF8= 200.13
##$BYTORDA= 1
##$CFDGTYP= 0
##$CFRGTYP= 5
##$CHEMSTR= <none>
##$CNST= (0..31)
1 1 145 1 1 1 1 1 1 1 1 1 1 1 1 1 1 1 1 1 1 1 1 1 1 1 1 1 1 1 1 1 
##$CPDPRG= <waltz16>
##$CPDPRG1= <>
##$CPDPRG2= <waltz16>
##$CPDPRG3= <>
##$CPDPRG4= <mlev>
##$CPDPRG5= <mlev>
##$CPDPRG6= <mlev>
##$CPDPRG7= <mlev>
##$CPDPRG8= <mlev>
##$CPDPRGB= <>
##$CPDPRGT= <>
##$D= (0..31)
0 1 0 0 0 0 0 0 0 0 0 0.03 2e-05 3e-06 0 0 0 0 0 0 0 0 0 0 0 0 0 0 0 0 
0 0 
##$DATE= 1654601208
##$DBL= (0..7)
120 120 120 11 120 120 24 19 
##$DBP= (0..7)
150 150 150 150 150 150 150 150 
##$DBP07= 0
##$DBPNAM0= <>
##$DBPNAM1= <>
##$DBPNAM2= <>
##$DBPNAM3= <>
##$DBPNAM4= <>
##$DBPNAM5= <>
##$DBPNAM6= <>
##$DBPNAM7= <>
##$DBPOAL= (0..7)
0.5 0.5 0.5 0.5 0.5 0.5 0.5 0.5 
##$DBPOFFS= (0..7)
$$ [...]
##$SUBNAM2= <"">
##$SUBNAM3= <"">
##$SUBNAM4= <"">
##$SUBNAM5= <"">
##$SUBNAM6= <"">
##$SUBNAM7= <"">
##$SUBNAM8= <"">
##$SUBNAM9= <"">
##$SW= 501.771253377433
##$SWIBOX= (0..15)
0 1 3 0 0 0 0 0 0 0 0 0 0 0 0 0 
##$SW_h= 40650.406504065
##$TD= 32768
##$TD0= 1
##$TE= 0
##$TE2= 300
##$TE3= 300
##$TEG= 300
##$TL= (0..7)
0 120 53 12 22 120 120 120 
##$TP= (0..7)
150 150 150 150 150 150 150 150 
##$TP07= 0
##$TPNAME0= <>
##$TPNAME1= <>
##$TPNAME2= <>
##$TPNAME3= <>
##$TPNAME4= <>
##$TPNAME5= <>
##$TPNAME6= <>
##$TPNAME7= <>
##$TPOAL= (0..7)
0.5 0.5 0.5 0.5 0.5 0.5 0.5 0.5 
##$TPOFFS= (0..7)
0 0 0 0 0 0 0 0 
##$TUNHIN= 0
##$TUNHOUT= 0
##$TUNXOUT= 0
##$USERA1= <user>
##$USERA2= <user>
##$USERA3= <user>
##$USERA4= <user>
##$USERA5= <user>
##$V9= 5
##$VALIST= <valist>
##$VCLIST= <CCCCCCCCCCCCCCC>
##$VD= 0
##$VDLIST= <DDDDDDDDDDDDDDD>
##$VPLIST= <PPPPPPPPPPPPPPP>
##$VTLIST= <TTTTTTTTTTTTTTT>
##$WBST= 1024
##$WBSW= 4
##$XGAIN= (0..3)
0 0 0 0 
##$XL= 0
##$YL= 0
##$YMAX_a= 2915
##$YMIN_a= -3821
##$ZGOPTNS= <>
##$ZL1= 120
##$ZL2= 120
##$ZL3= 120
##$ZL4= 120
##$ABSF1= 0
##$ABSF2= 0
##$ABSG= 0
##$ABSL= 0
##$ALPHA= 0
##$AQORDER= 0
##$ASSFAC= 0
##$ASSFACI= 0
##$ASSFACX= 0
##$ASSWID= 0
##$AUNMP= <proc_1d>
##$AZFE= 0.1
##$AZFW= 0.5
##$BCFW= 0
##$BC_mod= 2
##$BYTORDP= 0
##$COROFFS= 0
##$CY= -3
##$DATMOD= 1
##$DC= 0
##$DFILT= <>
##$DTYPP= 0
##$F1P= 0
##$F2P= 0
##$FCOR= 1
##$FTSIZE= 65536
##$FT_mod= 6
##$GAMMA= 0
##$GB= 0
##$INTBC= 1
##$INTSCL= 5.30512e-09
##$ISEN= 30
##$LB= 1
##$LEV0= 0
##$LPBIN= 0
##$MAXI= 10000
##$MC2= 0
##$MEAN= 0
##$ME_mod= 0
##$MI= 50
##$NCOEF= 0
##$NC_proc= -8
##$NLEV= 6
##$NOISF1= 182.463
##$NOISF2= 159.3651
##$NSP= 0
##$NTH_PI= 0
##$NZP= 0
##$OFFSET= 248.5645
##$PC= 4
##$PHC0= -10050.91
##$PHC1= -527.5464
##$PH_mod= 1
##$PKNL= yes
##$PPARMOD= 0
##$PSCAL= 0
##$PSIGN= 0
##$REVERSE= no
##$SF= 81.014009
##$SI= 65536
##$SIGF1= 159.3651
##$SIGF2= -187.1042
##$SINO= 113.3802
##$SIOLD= 16384
##$SREGLST= <1H.CDCl3>
##$SSB= 0
##$STSI= 65536
##$STSR= 0
##$SW_p= 40650.406504065
##$SYMM= 0
##$S_DEV= 0
##$TDeff= 32768
##$TDoff= 0
##$TI= <>
##$TILT= no
##$TM1= 0
##$TM2= 0
##$TOPLEV= 0
##$USERP1= <user>
##$USERP2= <user>
##$USERP3= <user>
##$USERP4= <user>
##$USERP5= <user>
##$WDW= 1
##$XDIM= 65536
##$YMAX_p= 268135640
##$YMIN_p= -324675137
$$ End of Bruker specific parameters
$$ ---------------------------------
##NTUPLES= NMR SPECTRUM
##VAR_NAME=  FREQUENCY,     SPECTRUM/REAL,   SPECTRUM/IMAG
##SYMBOL=    X,             R,               I
##VAR_TYPE=  INDEPENDENT,   DEPENDENT,       DEPENDENT
##VAR_FORM=  AFFN,          ASDF,            ASDF
##VAR_DIM=   65536,         65536,           65536
##UNITS=     HZ,            ARBITRARY UNITS, ARBITRARY UNITS
##FACTOR=    0.620285442955139, 1,           1
##FIRST=     20137.2065510759, 0,            0
##LAST=      -20513.1999529892, 0,           0
##MIN=       -20513.1999529892, -324675137,  0
##MAX=       20137.2065510759, 268135640,    0
$$ Real data points
##PAGE= N=1
##DATA TABLE= (X++(R..R)), XYDATA
$$ [...]
##PAGE= N=2
##DATA TABLE= (X++(I..I)), XYDATA
13011a337678k763276l393079l119057q78585K268293L504170K163775O52338
13003b903099M96116N31265K21316J194591L603545M544250K359263r97133l942409
12994E107705p207053r235421n336541M036426R825776N659849k100942l277872
12986b528073J089517J778024l043129n773347k829979M47510M12653O99463L490935
12977f256426M242385K16818l437386j944844J261254R74390j217818j089974
12969g251601M45205K34707o14509L30167J044579j135165l125210n69124L750526
12960f890425L289572j847270m958800k749810J244069L307017L590119K966081
12952b049447J233805o57868j008364m39094p36232j073628M50640K427628K076616
$$ y = [-1337678, -4100954, -7494033, -10613090, -11491675, -9223382, -5719212, -3555437, -2903099, -2406983, -1875718, -1654402, -459811, 3143734, 7687984, 10047247, 9050114, 5107705, -2099348, -11334769, -16671310, -12634884, -2809108, 2850741, 749799, -2528073, -1438556, 339468, -2703661, -8477008, -11306987, -10859477, -10446824, -9747361, -6256426, -2014041, -1797223, -5234609, -7179453, -5918199, -4943809, -6161627, -7251601, -6806396, -6571689, -7186198, -6856031, -5811452, -6946617, -10071827, -10640951, -6890425, -3600853, -5448123, -10406923, -13156733, -11912664, -8605647, -5015528, -2049447, -815642, -1473510, -2481874, -2920968, -3657200, -4730828, -4280188, -1852560, 224056]
12943B24056O51876J579584L903422L412879l383k267115k353943l059826m135557
12934b048007j913285K741047L535995j446111n894083m600150l72095K043377
12926g953312K791169L390831K279938j027490k400695Q42024M566684L833795
12918F322944L53901j381534j498811k401359k616059L80564L770595K717045
12910E647286j446520l005183r69436K10108j104193j389434J106880L145577
12902B195085K273893Q16772J426498K480708R31121k612297m373731k178131
12894I59918J752175K754988j301152o677560o890710m85494O290100O818567
12886C220832K066312j852172k094317r72786n70087j93506N35391K56761j354686
$$ y = [224056, 875932, 2455516, 6358938, 9771817, 9768434, 7501319, 5147376, 2087550, -2048007, -3961292, -1220245, 2315750, 869639, -5024444, -9624594, -9996689, -7953312, -5162143, -1771312, 508626, -518864, -2919559, -2077535, 2489149, 6322944, 6676845, 5295311, 3796500, 1395141, -1220918, -840354, 2930241, 5647286, 4200766, 1195583, 226147, 436255, -667938, -2057372, -950492, 2195085, 4468978, 5285750, 6712248, 9192956, 10124077, 7511780, 3138049, 959918, 2712093, 5467081, 4165929, -2511631, -9402341, -9887835, -3597735, 3220832, 5287144, 3434972, 1340655, 367869, -202218, -395724, 139667, 396428, -958258]
12877i58258k547453k229652j226619k16992J158868K645983L066312K026362
12869A718551Q9930k458910m950180n213449j943426K294706L485231J475809
12861e501738j10059P13029K004870J420410o94754k389509k352642q15096M84183
12852g241306j03011j451753m98482K628655L482073K28741k114641R30776N325569
12843A186621M277521p75815k561156J46433J412925j105913k900271j469737
12835a789392j46563o65046J70781L206046L850127K04379k622605o48501K838402
12826D397628L588681K682412K065096M0637l867849n611707l309808j236666
12818a251576j971902j295557L042014M805902o14266o450320m385010J606674
$$ y = [-958258, -3505711, -5735363, -6961982, -7178974, -6020106, -3374123, -307811, 1718551, 1808481, -650429, -5600609, -10814058, -12757484, -10462778, -6977547, -5501738, -5611797, -4898768, -2893898, -1473488, -2168242, -4557751, -6910393, -7725489, -7241306, -7344317, -8796070, -9294552, -6665897, -3183824, -2955083, -5069724, -4138948, 1186621, 5464142, 4688327, 2127171, 2273604, 3686529, 2580616, -319655, -1789392, -1935955, -2601001, -2430220, 775826, 4625953, 4830332, 2207727, 1559226, 4397628, 7986309, 10668721, 12733817, 12774454, 8906605, 3294898, -14910, -1251576, -3223478, -4519035, -1477021, 3328881, 2714615, -3735705, -8120715, -6514041]
12810f514041J881859k826701l602417J074621L897266K041293L08457N72776
12802c166887o41923k665569J8829O307694P174542j03537o438799m670443M12143
12793c773950J602115K55587Q09968J743071j70441k359580j113002Q46424p67425
12784b927233l173922r06857L842973L762766j609056m618989j215184L099986
12776c745516J717374l649106n517196l81554O938787Q749480L342755k765146
12768D689878k774867J556563K769752r56789l315188p55711J182153k420674
12760b4883o267335k911465M106104M967781n82348k764192K134408N830740J815240
12751F304050m486975n228385k125487j491335k869854j055210L633418N463262
$$ y = [-6514041, -4632182, -7458883, -11061300, -9986679, -6089413, -4048120, -3739663, -3166887, -3808810, -6474379, -6455550, -147856, 7026686, 6923149, 484350, -4186093, -3773950, -2171835, -1916248, -1106280, 636791, 466350, -1893230, -3006232, -2159808, -2927233, -6101155, -7008012, -3165039, 597727, -1011329, -5630318, -6845502, -3745516, -2028142, -5677248, -11194444, -11575998, -4637211, 4112269, 7455024, 4689878, 1915011, 3471574, 6241326, 5284537, 1969349, 1213638, 2395791, -24883, -6292218, -9203683, -5097579, -129798, -712146, -3476338, -1341930, 4488810, 6304050, 1817075, -3411310, -5536797, -7028132, -9897986, -10953196, -7319778, -1856516]
12743a856516K761804j42447o91775j063409k294575j863473P02665J621325o67754
12734c494155j989060P01942L523682J700808k244489k318955J162280K317869
12726f40078k96117j405069J740759M307209J489621l879981n799123l579545
12718h062324j044114K82868K011341M090939M261352K360769Q26420L86764p53151
12709D360864k620983k380610Q66140L657250K738727n33976k512529k008368
12701A566515q37388j102445l216546n201161l593432K452573P689728N370288
12693C128132l195087q350210m466897K153399K673510j261367j089224M439967
12685e967777P380712L678780n24425O88377L601446J689245l380392m668138
$$ y = [-1856516, 905288, 762841, 71066, -992343, -3286918, -5150391, -4447726, -2826401, -3494155, -5483215, -4781273, -1257591, 443217, -1801272, -4120227, -2957947, -640078, -936195, -2341264, -600505, 3706704, 5196325, 1316344, -4482779, -8062324, -9106438, -8823570, -6812229, -2721290, 1540062, 3900831, 4727251, 5114015, 4360864, 1739881, -640729, 225411, 3882661, 6621388, 6087412, 3574883, 1566515, 729127, -373318, -3589864, -8791025, -12384457, -9931884, -2242156, 3128132, -66955, -8417165, -12884062, -10730663, -8057153, -9318520, -10407744, -5967777, 1412935, 5091715, 4567290, 5255667, 8857113, 10546358, 7165966, 2497828]
12677B497828j130080J435929K2985j856546j239174m19009j917114l614227k523469
12668h742877R7330J280827J344709K243958L009724J526777l91048R26094L919023
12659E214517K745724l054093n977286j430310M294054K878228l108056l953972
12651b391194K018937N832475J967737l414083k845749R72952Q55691k678155
12643C18611l141777L39790J887039m83107j325257K689944O798474N650565J187234
12634A3921516j561615k012243k360356k169872k45695R10705j464439m414647
12626F03354l005874J089122J515148k382318m288801j205790K329734K795374
12618b550051K992660M676563L257498l703926q916150m757291L831972N526163
$$ y = [2497828, 1367748, 2803677, 2826662, 970116, -269058, -688067, -2605181, -6219408, -8742877, -8645547, -7364720, -6020011, -3776053, -766329, 760448, 369400, 1295494, 5214517, 7960241, 4906148, -1071138, -2501448, 1792606, 4670834, 1562778, -2391194, -372257, 5460218, 7427955, 4013872, 1168123, 2141075, 2996766, 318611, -2823166, -2483376, -596337, -1079444, -2404701, 285243, 7083717, 12734282, 13921516, 12359901, 10347658, 7987302, 5817430, 5571735, 6482440, 5018001, 603354, -2402520, -1313398, 201750, -2180568, -6469369, -7675159, -5345425, -2550051, 442609, 5119172, 8376670, 4672744, -4243406, -9000697, -5168725, 357438]
12610C57438j66820k428121L189109P428258K258631o092385o633418j1319L542792
12601A444165j15873m407599l369749K32984R63031r22736j405245L66228J544801
12592e669993P36101j59993N33562J718390J440058l78174k122838k302097m39681
12583f644665K652774M602254K914747j670489m502004k119488K657694L851463
12575A742286N56790j805478K47926K997018J593320k245845l185547o18582J164320
12566D46208K31095q37752k65766L84806l5275m09362m75026j540943k689285
12557e191300p19052M066334O357030K936702k401542m067492j647023J276588
12549F10245K294101J164750j580302m029351l454015j98993J779049P64881P7383
$$ y = [357438, 190618, -2237503, 951606, 8379864, 10638495, 4546110, -2087308, -2098627, 1444165, 1328292, -3079307, -6449056, -6216072, -5253041, -6175777, -7581022, -7214794, -5669993, -4933892, -5093885, -4560323, -2841933, -1401875, -1780049, -3902887, -6204984, -6644665, -3991891, 610363, 3525110, 1854621, -2647383, -4766871, -2109177, 1742286, 2299076, 493598, 741524, 3738542, 5331862, 3086017, -99530, -718112, 446208, 677303, -160449, -426215, -41409, -76684, -486046, -961072, -2502015, -5191300, -5910352, -1844018, 4513012, 7449714, 5048172, 980680, -666343, 610245, 2904346, 4069096, 2488794, -1540557, -4994572, -5193565, -3414516, -2649635, -2572252]
12540b572252J927787K790168n84985m549896l721595L00249J795491L55472N15321
12531c744240K984010L460961O45586j301143J87326K369526K425750J270980
12523H298756J27087j897071m416083m343932p13703K614913J964225j126230
12515E07962k410475m08436K625123L524041P74750m010367o616862m324025L76325
12506i961964K677635J753868P56996R13173K62171j201345m12940K986456M884503
12497B658553L274312J701433K883012L662064O67920l089530k633276P18046
12489I842534J184341k605820n902658n038706j829154K09155O01742J222993
12481b315573K736943L373512J208541k704024m378475j476906K872955L604666
$$ y = [-2572252, -644465, 2145703, 1560718, -2989178, -6710773, -6410524, -4615033, -4259561, -3744240, -760230, 2700731, 3346317, 2045174, 2232500, 4602026, 7027776, 8298756, 8425843, 6528772, 2112689, -2231243, -2944946, -330033, 1634192, 507962, -1902513, -2310949, 314174, 3838215, 4612965, 602598, -6014264, -10338289, -9961964, -7284329, -5530461, -4773465, -3860292, -3598121, -4799466, -5212406, -2225950, 2658553, 5932865, 7634298, 10517310, 14179374, 14847294, 11757764, 9124488, 9842534, 11026875, 8421055, 2518397, -2520309, -4349463, -4140308, -3538566, -2315573, 421370, 3794882, 5003423, 2299399, -2079076, -3555982, -683027, 2921639]
12473B921639R34882N9266K597140L338239j319607o367674m798789J792578N201400
12464D359074J993622k928867m295093k616887r88744k11166N42510J116817P28339
12455b300395o23294k358119l630179l062543m8041L288645L672804J016660j062070
12446e106532k06848J397765M83344k347879l550832j733540P69830J793816K450049
12437f050827M584680O435411L755849l810063r958913q091893L27778O870284
12429e937694O063003J198616j230249M1891J088172n19274k698845k597843m27428
12420e019651J465263J594102L49657r34018j043758M01444K578859L900705L191306
12411F483909O75603j995845k869312j390137R01918J820460O63461j516194l328424
$$ y = [2921639, 3856521, 3915787, 6512927, 9851166, 8531559, 2163885, -2634904, -842326, 4359074, 6352696, 3423829, -871264, -3488151, -4476895, -4688061, -4145551, -3028734, -2300395, -2923689, -5281808, -8911987, -11974530, -12022571, -8733926, -5061122, -4044462, -5106532, -5313380, -3915615, -3432271, -5780150, -9330982, -11064522, -10294692, -8500876, -6050827, -1466147, 4969264, 8725113, 4915050, -5043863, -13135756, -12807978, -5937694, 125309, 1323925, 93676, 135567, 1223739, 704465, -1994380, -4592223, -5019651, -3554388, -1960286, -1610629, -2544647, -3588405, -3186961, -608102, 3292603, 6483909, 7159512, 5163667, 2294355, 904218, 1806136, 3626596, 4290057, 2773863, -554561]
12402e54561l844100k499973L61121L026528L915543L332266K320213O06356k050544
12393D612849l451761j441676J489076N58945l563028m511660K4053L672003O62498
12384a948701m845502m514255J996041O978243N596548P33376k934456l865693
12376b804399j965350K405005O034727M473409j633780o020592m942295j708507
12368f161782l99355M64364L781080P073330N473055j19942l593572k502894j194915
12359B819369l431072o265566m408247J893917O867367O321197J870291k046242
12351C621014l000258j648060J78747R93909J81006j472741j918847K49389L802837
12342I86996N653025L953218j09675l652634m526149k520350O54154K273769Q25089
$$ y = [-554561, -4398661, -6898634, -6537513, -3510985, 404558, 3736824, 6057037, 6663393, 4612849, 1161088, -280588, 1208488, 1767433, -1795595, -6307255, -6283202, -2611199, -1948701, -6794203, -11308458, -9312417, -2334174, 3262374, 3995750, 1061294, -2804399, -4769749, -2364744, 3669983, 8143392, 6509612, 489020, -4453275, -6161782, -6561137, -6096773, -2315693, 4757637, 10230692, 10110750, 6517178, 4014284, 2819369, -611703, -6877269, -11285516, -9391599, -2524232, 3796965, 5667256, 3621014, 620756, -1027304, -848557, 145352, 326358, -1146383, -3065230, -2815841, 986996, 6640021, 10593239, 10483564, 6830930, 2304781, -215569, 438585, 2712354, 3537443]
12333C537443j899424k164815J123164M327500L154772j882147n838825m936004
12325d578336j77219M421542N452853K091707l321560o209659l627389J739358
12317d208703L764602N66495k635012q85736K956407K347296k764342n572940
12309f431933k861532K44644j055487l276842n61966N209216O810017K624374
12301G00491j525781j668478k68861l8177N12390K324342K210338j657854m991685
12292d403275l038791K004933M120507J887984r13664j581236p53077O41787K319646
12283B84814K941632J321007r72976j557523j082094j714099k761711j738536
12275e279486Q69298K007426R18176l60012j021918j893172k078838K43719L443138
$$ y = [3537443, 1638019, -526796, 596368, 4923868, 8078640, 6196493, 357668, -4578336, -4755555, -334013, 5118840, 7210547, 3888987, -2320672, -5948061, -4208703, -444101, 122394, -2512618, -3398354, -441947, 1905349, -858993, -6431933, -9293465, -9048821, -10104308, -13381150, -13943116, -8733900, -1923883, 700491, -825290, -2493768, -2762629, -2800806, -2288416, 35926, 2246264, 588410, -4403275, -7442066, -5437133, -1316626, 571358, -342306, -1923542, -2676619, -2034832, 284814, 3226446, 4547453, 3574477, 2016954, 934860, -779239, -3540950, -5279486, -4410188, -2402762, -1484586, -1844598, -2866516, -4759688, -6838526, -6594807, -3151669]
12266c151669L455819J5609k425549j121721J537362K211673O38272j658063l383841
12257c882108l288478j042036J192842J141024K25345J333054L259458K120928
12249A060029j623037k979639l31177J840750J49446k540503j765200K325592
12241c863739N743306N151492M86531m618015n343172j499445P29904l003948
12233f217086p689221n722380J092697M294946K140430Q30644K509841K524437
12225f235692R9611O76234M553876M430568j273992l930627N85199L916724m77180
12216B344721n723261l469058K039737K211731j458591k029377K84183P68687
12208e031228k2333P64436Q39976j961175k659967K492700O696492K804748l259389
$$ y = [-3151669, 304150, 319759, -2105790, -3227511, -1690149, 521524, 1159796, -498267, -3882108, -7170586, -8212622, -7019780, -5878756, -5653411, -4320357, -1060899, 1060029, -563008, -3542647, -3873824, -2033074, -1883628, -4424131, -6189331, -3863739, 1879567, 7031059, 7517590, 2899575, -2443597, -3943042, -3213138, -6217086, -13906307, -19628687, -18535990, -14241044, -12100614, -11269970, -8760129, -6235692, -6136081, -5459847, -905971, 3524597, 2250605, -1680022, -1094823, 2821901, 2344721, -3378540, -6847598, -4807861, -2596130, -4054721, -6084098, -5799915, -5031228, -5053561, -4289125, -3449149, -5410324, -8070291, -5577591, 1118901, 3923649, 664260]
12199F64260j897103K949445M56194p123917p116501K010239P601645L032126
12191E76388l480517l716232m64486P29270K05458j9545n55347j067891L98706
12182g394196K445639J578751r48515r62591M72030q20558k930758n59160M129938
12173d989420M243165R31289J378655M508744K327487l868379l765939L046838
12165C812440M509777k862758o791411m17878N281912L62378p175837n618102
12157h899479J251324K641251q20592q88023K751294L757657J409790N7030j64823
12148A095429j937179l299828q05296K811542K424452r23052k632121k351140
12140e617193k159099p90539L202704O249613M571409N72553j575426k266721
$$ y = [664260, -1232843, 1716602, 2172796, -4951121, -12067622, -10057383, -2455738, 576388, -2904129, -6620361, -7084847, -6355577, -6150119, -6169664, -6725011, -7792902, -7394196, -4948557, -3369806, -4318321, -5280912, -4808882, -5629440, -8560198, -9119358, -4989420, -746255, 185034, 1563689, 6072433, 8399920, 4531541, 765602, 3812440, 8322217, 5459459, -1331952, -1749830, 3532082, 3894460, -3281377, -8899479, -7648155, -5006904, -5827496, -6715519, -3964225, -206568, 1203222, 1260252, 1095429, -841750, -4141578, -4946874, -2135332, 289120, -633932, -3266053, -5617193, -7776292, -8566831, -5364127, 885486, 5456895, 6029448, 4454022, 2187301]
12132B187301k707379o76932L535642L689304k324371o082050j209480M893875
12124A305910K474628m152108l938770K352007M437160K37287k300294J2681J827290
12115B255791M82352o34549o12261k146716l519038R2476O470037P723702K780623
12106A2892417j351483j529040j504058k257323k51070L015530R80888n645329
12098D350532p574795j716759L456705J944224q17679J128035L977903J882159
12090F630325k947982n101195m572679l834400j964675J938331M541483L458394
12082a852398J970743L022414L343571n23798m911534m255914j03268J634193
12074a675991o2492r95127P53006K494084J748197o55494k256406j451893R61918
$$ y = [2187301, -520078, -1197010, 2338632, 6027936, 3703565, -2378485, -3587965, 1305910, 3780538, -371570, -4310340, -1958333, 2478827, 2716114, 415820, 428501, 2255791, 2738143, 2103594, 1491333, -655383, -4174421, -4081945, 2388092, 10111794, 12892417, 11540934, 10011894, 8507836, 6250513, 5999443, 9014973, 9995861, 4350532, -3224263, -4941022, -1484317, 459907, -357772, 770263, 4748166, 6630325, 3682343, -1418852, -5991531, -9825931, -11790606, -9852275, -5310792, -1852398, 118345, 3140759, 6484330, 5960532, 1048998, -3206916, -3310184, -1675991, -1738483, -2733610, -1980604, 513480, 2261677, 1606183, -650223, -2102116, -1140198]
12065a140198J743448j190570m604500l100500K599810N472668K292788j661159
12057D11787j233254J014063M69823j429505n74486K236289L130914J813493P30189
12048F569313j10516k069649l662442k745075j155088j900003l317895j504938
12040i896293K628886M342465K530754P31009O67638R2707k164938l669579k271197
12031g008548Q97569L336644L591966J752031q2982J122907M827133N366027p06757
12022A3095990p603606o657222R59234M920624L18138n694951m940508O90203
12014d912098M053557L450569K370671J857422j62861k990880k782513J124665
12006B008532M282989L120268o37469l214901l602510l058334j909213N43789
$$ y = [-1140198, 603250, -587320, -5191820, -8292320, -5692510, -219842, 2072946, 411787, -821467, 192596, 662419, -767086, -1341572, 894717, 4025631, 5839124, 6569313, 6458797, 4389148, 726706, -2018369, -3173457, -5073460, -8391355, -9896293, -7267407, -2924942, -394188, 336821, 1004459, 1097166, -1067772, -4737351, -7008548, -6110979, -2774335, 817631, 2569662, 2486680, 3609587, 8436720, 13802747, 13095990, 5492384, -1164838, -205604, 4715020, 5033158, -661793, -5602301, -4912098, -858541, 2592028, 4962699, 6820121, 6657260, 3666380, 883867, 2008532, 6291521, 9411789, 8774320, 5559419, 1956909, -1101425, -3010638, -2466849]
11998b466849L555823M564090J935027k721500n647275m468389m78658K903523
11990b824208L815298L261694K607372J326593j354276l791455l285746l5131
11982b79859K611182K484526J058901N00670L51236r46308k713959k702470o32974
11973b69055J153245P86253j060175k448976k147727j58240K330019L339956J905482
11964C430782k88820n86006J052554J928739O08442j089211j270192r32163j691751
11955A162374k319565m92662K686580L204391j72711l558632l005610R5902J073090
11946a326843j478776l913385k710598R51493L299278K969110J675073O74440
11938A39792o63889k375960k709397q63705J208087J594336J167641J314052P93658
$$ y = [-2466849, 1088974, 5653064, 7588091, 4866591, -780684, -5249073, -5727731, -2824208, 991090, 4252784, 6860156, 8186749, 6832473, 3041018, -244728, -279859, 2331323, 4815849, 5874750, 6375420, 6726656, 5780348, 3066389, 363919, -269055, 884190, 1670443, 610268, -1838708, -3986435, -4144675, -1814656, 1525300, 3430782, 3141962, 2555956, 3608510, 5537249, 6145691, 5056480, 3786288, 2854125, 1162374, -1157191, -1649853, 1036727, 4241118, 4068407, 509775, -2495835, -2399933, -1326843, -2805619, -6719004, -9429602, -8478109, -5178831, -2209721, -534648, 139792, -524097, -2900057, -5609454, -6473159, -5265072, -3670736, -2503095, -1189043, -395385]
11929c95385j983493m840899l966920M699K222986Q03997l77674J905577M859096
11920a768016M007194K27884j614543P3583J775877O02427j596414j447063Q84516
11911A145445K184100R93783m93665r9045P68400n97417l233703l076705Q23643
11902a585164M150218L467371J092226M43662j07040l539236o777508l932952
11894f788423L397174O556256K295162k345666j005657K726825K070388k205697
11886D700362m065349j967295l7873r24549k825715l228615j615748J141902L181387
11877e641493K560220K34042j183K703315L590776o51267n419830m168256J489786
11868e303890L923389P28458k648361j918530N00150O50999j142013j948738m39740
$$ y = [-395385, -2378878, -7219777, -11186697, -11181998, -8959012, -8155015, -8532689, -6627112, -1768016, 2239178, 2467062, 852519, 926102, 2701979, 3304406, 1707992, 260929, 1145445, 3329545, 4323328, 3829663, 3730618, 4499018, 3901601, 667898, -2408807, -1585164, 2565054, 6032425, 7124651, 7568313, 7461273, 3922037, -2855471, -6788423, -3391249, 3165007, 5460169, 3114503, 2108846, 4835671, 6906059, 4700362, 635013, -1332282, -1370155, -2294704, -5120419, -8349034, -9964782, -8822880, -5641493, -3081273, -2847231, -2848414, -145099, 3445677, 2794410, -2625420, -6793676, -5303890, -1380501, -652043, -3300404, -5218934, -4718784, -4067785, -5209798, -7158536, -7598276]
11859g598276K336094M094304K691275j287805l701899j646240J737331J252835
11851b122381k183513k455810K254770O356983N016291N20779k122909j859853
11843C404357r07295p22002j586722l512706m877505k750496K645853O195534
11835b110982L721296k190810n235576l009824J256676L624132L152563R99613
11827B07088j412196k774186k378520j037971m27506j023561j577555j016681
11819a1441088P1194O10587R94833K527070M815006N306736K560088j260839k948040
11810A235547k390323j780687j433596J94876K257518J565336j711249k874768
11802d937346P6881K447441O3377l477117k231516K259839L132186r04368l640203
$$ y = [-7598276, -5262182, -1167878, 1523397, 235592, -3466307, -5112547, -3375216, -2122381, -4305894, -6761704, -4506934, 1850049, 6866340, 7387119, 5264210, 3404357, 2497062, 1775060, 188338, -3324368, -8201873, -10952369, -8306516, -2110982, 1610314, -580496, -5816072, -8825896, -7569220, -3945088, -792525, 207088, -1205108, -3979294, -6357814, -7395785, -7823291, -8846852, -10424407, -11441088, -11369894, -10759307, -9764474, -7237404, -2422398, 2884338, 5444426, 4183587, 1235547, -1154776, -2935463, -4369059, -4174183, -1916665, -351329, -2062578, -4937346, -4860465, -2413024, -2349647, -5826764, -8058280, -5798441, -2666255, -3570623, -7210826]
11793g210826j126347K822321L149364O55489n23422Q32278K452893K371360Q17357
11784D240467p79351j293198r58117j142816k232530k433180l92634J900132J373306
11775a717921j517897l313344k479418p93296K96487J489502L133473L815667
11767a086747K557353K43609j884612l183825k709319K64546M077324N194453
11759C472782K039985k947115n746089m411898l67096K968923L080891O74442
11751a235175j423382j881092j744194j380042N66544L798611N187332L163698
11743E052300J83908j444004k518643l191959j041996L262245L666267k387701
11735A580417p781087n249010J394691L487366R64934L25339K222481J625221
$$ y = [-7210826, -8337173, -5514852, -2365488, -1709999, -2233421, -1401143, 1051750, 3423110, 4240467, 3461116, 2167918, 1209801, 66985, -2165545, -4598725, -4991359, -3091227, -1717921, -3235818, -6549162, -9028580, -9821876, -9525389, -8035887, -4902414, -1086747, 1470606, 1714215, -170397, -3354222, -6063541, -5798995, -1721671, 3472782, 5512767, 2565652, -3180437, -7592335, -7959431, -4990508, -1909617, -1235175, -2658557, -4539649, -6283843, -7663885, -7097341, -3298730, 1888602, 5052300, 5236208, 3792204, 1273561, -1918398, -2960394, 301851, 3968118, 1580417, -6200670, -11449680, -10054989, -6567623, -5602689, -5277350, -3054869, -1429648]
11727a429648j129957n65689K624908J758334l055914l764857J317466L584453
11719f60904j128117n053456j838763K851424J713596j974828j237182K410057
11711d918173K778981M6609q07550Q14069J443228O16715N90407Q38177q79074
11702E23389l317134l078256j14129K486272L009232J904370j85944k072230j856314
11693b700744J26762Q42587n88021j046779J054957K622470J310613l81772O3732
11684A303805Q88486L24725K62325J539813Q03114l169085n323090j973976K570173
11675b773710L002622J500652K474246L763077R37588l460343l326472Q41277
11667B958937L079729J527140l87743p93180o53301K02107J889252J277722l446453
$$ y = [-1429648, -2559605, -3125294, -500386, 1257948, -1797966, -5562823, -4245357, -660904, -1789021, -6842477, -8681240, -5829816, -4116220, -6091048, -7328230, -4918173, -2139192, -2092583, -2900133, -2086064, -642836, -26121, 564286, 1402463, 523389, -2793745, -5872001, -5986130, -3499858, -490626, 1413744, 1227800, -844430, -2700744, -2573982, -1731395, -2319416, -3366195, -2311238, 311232, 1621845, 1240073, 1303805, 2192291, 2517016, 2779341, 4319154, 5122268, 1953183, -3369907, -5343883, -2773710, 228912, 1729564, 4203810, 7966887, 8904475, 5444132, 2117660, 2958937, 6038666, 7565806, 7178063, 6384883, 5731582, 5933689, 7822941, 9100663, 5654210]
11658E654210p285634m553008J712299L936412J494672r3000L98274p64937l365431
11649b866143k970648J76012J023060p39087N502L618703M095021q4073k679542
11640d21195o16915P95193j910532l492371N47731N031445L130307k054153k117190
11631a107680L415174O435687K324173m023366n644561k303162O42789k57897
11623e18843k900512l346892j124026R42392J372773J536020J886967M55032k666376
11614d363465l295293N47315L983130K031659k097201j725166K558527M072860
11606A712366R10110j888221j150420P09421J577639K190904J756880j731792
11598D086887n341214l004304M173250P164829J915032m555346n129327k323748
$$ y = [5654210, -1631424, -6184432, -4472133, -535721, 958951, 865951, 1264225, 499288, -2866143, -5836791, -5660779, -4637719, -5376806, -5371304, -1752601, 2342420, 2258347, -421195, -1038110, -242917, -2153449, -5645820, -5098089, -66644, 3063663, 1009510, -1107680, 2307494, 8743181, 11067354, 7043988, 1399427, -903735, -260946, -518843, -3419355, -6766247, -7890273, -6947881, -5575108, -4039088, -2152121, -1697089, -4363465, -7658758, -7111443, -3128313, -1096654, -3193855, -4919021, -2360494, 1712366, 2622476, 734255, -416165, 293256, 1870895, 4061799, 5818679, 4086887, -1254327, -4258631, -85381, 7079448, 8994480, 4439134, -690193, -3013941]
11590c013941j685921k220807j30943L008185K911879N9351j835668k198369k702872
11581g809106k373455P51844M677893N325445K331906j150490l160389l766694
11573e173046k876617q14385O14761Q19707J890458M281389M363902L56500l012205
11564D50464j142923K498174J651434k104110j739312L226414N458280J577031
11556I875452k677562j845730J407995J798692n21957j979485j883100k082290
11548B092015k646804k082694o82532l40181j598214l163376l680119k369882
11540a4471787Q97909M547276N761791L858349J761285K099949L269966J757123
11532I481861k694784o691900p215046l844708J949215P049997P313551J572135
$$ y = [-3013941, -4699862, -6920669, -7051612, -4043427, -1131548, -1072197, -2907865, -5106234, -7809106, -10182561, -9430717, -4752824, 572621, 2904527, 1754037, -1406352, -5173046, -8049663, -8864048, -8249287, -7429580, -5539122, -1257733, 3106169, 3462669, 450464, -692459, 1805715, 3457149, 1353039, -386273, 2840141, 8298421, 9875452, 7197890, 5352160, 6760155, 8558847, 8036890, 6057405, 4174305, 2092015, -554789, -2637483, -3320015, -3660196, -5258410, -8421786, -12101905, -14471787, -13573878, -9026602, -3264811, 593538, 2354823, 4454772, 7724738, 9481861, 6787077, 95177, -7119869, -10964577, -9015362, -1965365, 5348186, 6920321]
11524F920321n104367n906059o63464L926072L400186O74375M7049M82301j232636
11515B543778l890144l439734K70297L099533K642635N07581j378539k680839
11507b325432k558765K04981L919171M500942P35194l895473n641212l888813
11499h949407K77464N204060P589515M579098j494502m624682l079842j319034
11491a817330k037811j820180J889761N094064L538095M593n24423Q94626K32486
11482E453881j366396K48445L805382L840603j78070l035082k369068j434609
11474D965086k369808l004771j913066r58623j026211l71467J063782P32257j346539
11465d229360j556470J116898K855886J328204p19108q56658q87418j983441r50292
$$ y = [6920321, 1815954, -4090105, -4753569, -827497, 2572689, 3247064, 3294113, 3776414, 2543778, -1346366, -4786100, -4515803, -1416270, 1226365, 1733946, 355407, -2325432, -4884197, -4679216, -760045, 3740897, 4476091, 580618, -5060594, -8949407, -8671943, -3467883, 4121632, 8700730, 7206228, 2581546, -498296, -1817330, -3855141, -5675321, -3785560, 1308504, 4846599, 4851192, 4326769, 5221395, 5453881, 4087485, 4335930, 8141312, 11981915, 11803845, 8768763, 6399695, 4965086, 2595278, -409493, -2322559, -3281182, -4307393, -4678860, -3615078, -2882821, -4229360, -5785830, -4668932, -1813046, -484842, -1203950, -2060608, -2948026, -4931467, -5881759]
11456e881759M015405P904412M782124l192467p906481n542856k73869K120765
11448c974726O67680j315166o82476K336625M390559K560783j945317m753535
11440b715573l475217k15574J830889K137765J810893R21433j022495l203130
11432c931009l998302k782338k11652K468643L828376L155326J448747K84935
11424B62726l23624j233233j687491k17060J915767J510481j474317l043528r11453
11415e201732K111228K481573P47330l45906o8082M99226R12862J241717J020046
11406C398262K02364l52046o77293j891012l267416j939848K349907N031471K241623
11397E096012l436629n897208k891793K260511N301760M793560J948112r77641
$$ y = [-5881759, -1866354, 6038058, 10820182, 7627715, -278766, -5821622, -6095491, -3974726, -3307046, -4622212, -5304688, -2968063, 1422496, 3983279, 2037962, -2715573, -6190790, -6406364, -4575475, -2437710, -626817, 294616, -727879, -3931009, -7929311, -10711649, -10923301, -8454658, -4626282, -1470956, -22209, 262726, -60898, -1294131, -2981622, -3198682, -1282915, 227566, -1246751, -4290279, -5201732, -3090504, -608931, 138399, -207507, -275589, 223637, 1136499, 2378216, 3398262, 3600626, 3248580, 2571287, 680275, -2587141, -4526989, -2177082, 2854389, 5096012, 1659383, -4237825, -7129618, -4869107, 432653, 5226213, 7174325, 6196684]
11389F196684k260360k026814j676732j646444j089264J5628O66009J142262K550679
11380A871648L393555N46137m684096o005352p89619M892314M115073j448086
11372A891574m758620l306002l25518J870545L737645M396436J748282k635026
11364B619316m009916j233144J394573O39781j319569j093729P55054J275619
11356i72015l13153j928914j524979N73442J816341J14354k798534k200359L167728
11347d066089P364295M022584m102845p584506k844828L344657L922409O19525
11339F75202p15808P46953J507548O41753M07184J081375L56860k025046l349797
11330f73776k239840l44029Q19413J366798R52406j144614k989298j134930L428408
$$ y = [6196684, 3936324, 1909510, 232778, -1413666, -2502930, -2487302, -1821293, -679031, 1871648, 5265203, 5811340, 1127244, -4878108, -5667727, -775413, 3339660, 1891574, -2867046, -6173048, -6498566, -4628021, -890376, 3506060, 5254342, 2619316, -1390600, -2623744, -1229171, -589390, -1908959, -3002688, -2247634, -972015, -1285168, -3214082, -4739061, -4165619, -2349278, -2234924, -5033458, -7233817, -4066089, 3298206, 7320790, 3217945, -4366561, -7211389, -3866732, 55677, 675202, -40606, 706347, 2213895, 2855648, 3262832, 4344207, 4701067, 2676021, -673776, -2913616, -3257645, -2438232, -1071434, -119028, -1263642, -4252940, -5387870, -1959462]
11321a959462M620281m17105n964367m861131J520701N355421L246611k15633
11313A325316j97546K015329K389736J67447k228672l103351k804070k292954
11305d728765k111858j964755n89130K604493N392811M478717K26239k939611
11297C68141k263551o9863M16917k96785k53106j94116j725147l221279j738146
11288h976935J784063L173788Q67166k265393l168063j802989J27635J150885
11280i109843O33560l94215N18333L846372N959673L473529j300527l115232j333620
11271h21970j77153j474254k337951j144575m76585j743878j783614J733674N508409
11262b717897N203009J762069q98964j915803k813760k950660o71342J973782
$$ y = [-1959462, 2660819, 2243714, -3720653, -8581784, -7061083, -1705662, 1540949, 1325316, 1127770, 3143099, 5532835, 5700282, 3471610, 368259, -2435811, -4728765, -6840623, -8805378, -9394508, -6790015, -1397204, 3081513, 3307752, 368141, -1895410, -1965273, -1548356, -1845141, -2098247, -2292363, -4017510, -7238789, -8976935, -7192872, -4019084, -3151918, -5417311, -8585374, -10388363, -10260728, -9109843, -8476283, -8870498, -8352165, -4505793, 1453880, 4927409, 3626882, 511650, -821970, -999123, -2473377, -4811328, -5955903, -6432488, -8176366, -9959980, -8226306, -2717897, 2485112, 4247181, 3348217, 1432414, -1381346, -4332006, -5003348, -3029566]
11254c029566R64787k874886l842974K74421M329977L129909j038891k195150
11246d282373K98878J363749j423617l991940k121279K213693L940355J865555
11238b136979r56540k312726k472083j462122J199949L857927L763465J462449
11230I43340K52499N31080p28588l508172l236731J323122M204824Q50794m147264
11221c515096l672038J264595L959415K460910O53867M31911j51857j303620p96819
11212f68732P72514K90390j681894j138314K041913L225681R61437m39406J518100
11203D881689L276949J549617j398155k234071j831646k398261l035984j877012
11195c066874Q0517N50860n05913j253468l53346K154517M495624L670004p74767
$$ y = [-3029566, -2064779, -4939665, -8782639, -8508218, -4178241, -1048332, -2087223, -4282373, -3983495, -2619746, -4043363, -8035303, -10156582, -7942889, -4002534, -2136979, -3093519, -5406245, -7878328, -9340450, -8140501, -4282574, -519109, 943340, 1195839, 1726919, 998331, -2509841, -5746572, -4423450, -218626, 632168, -3515096, -7187134, -5922539, -1963124, 497786, 1151653, 1583564, 1431707, 128087, -668732, 103782, 394172, -1287722, -2426036, -384123, 2841558, 3802995, 3363589, 4881689, 8158638, 9708255, 8310100, 6076029, 4244383, 1846122, -1189862, -3066874, -2986357, -2435497, -2941410, -4194878, -4548224, -2393707, 2101917, 5771921, 4997154]
11186D997154l950027r20218N272587O294721J67564n652191m864074j63987K486894
11177C668423K000331P93661j20894o64252J4990J273012M58642k368228l129412
11168A926273k18841K045786J69658k653888j910569Q20407R62111j316835j731836
11159a907734J165931M190034M210279J512486j202189j476868L33849O80619
11151G506407k801499o647218n204212P42125M187383K043188r14676o10247K90442
11142a408307j259116k487213j13019L293144L762837K429275K186361J866740
11134H270702o88452l275586k581066J56176J662469J731832J267599j056222
11126E487452n205061o755601k981880J648832J734045q48707q28530J901180
$$ y = [4997154, 1047127, 126909, 5399496, 11694217, 11861781, 6209590, 1345516, 1181529, 3668423, 5668754, 6462415, 6341521, 5677269, 5692259, 6965271, 7423913, 5055685, 1926273, 1707432, 3753218, 3922876, 1268988, -641581, 178826, 1140937, -175898, -1907734, -741803, 3448231, 7658510, 9170996, 7968807, 6491939, 6825788, 7506407, 4704908, -1942310, -7146522, -6404397, -2217014, -173826, -1088502, -1698749, -1408307, -2667423, -5154636, -5267655, -1974511, 1788326, 4217601, 6403962, 8270702, 7582250, 4306664, 1725598, 1881774, 3544243, 5276075, 6543674, 5487452, 282391, -6473210, -9455090, -7806258, -6072213, -6920920, -7749450, -5848270]
11118e848270L794947M326615M688329L101673j724086n457966l642727L61892
11110c99593L59219k243361j045220L981369O200074L031151r45029k106435j949956
11101D882219k180360j776318k02019J185650J557319Q85088j272089l792728
11093g13238l183818J133960M054520K173650k62202J222879K946814j43059m250223
11084B979283k864693J075714J41333l668022k231602L238287L323647k890561
11076h96614n739313j496181K280163J157104N02304L063186K726603k769488
11068a172236m821865K031920R297825P087227p02521l485774p581K324944j16752
11059A0435187m051234n967400n065220j663299K131690K661800l52331k352077
$$ y = [-5848270, -2053323, 2273292, 6961621, 10063294, 8339208, 2881242, -761485, -399593, -40374, -2283735, -3328955, 652414, 6852488, 9883639, 8938610, 6832175, 4882219, 2701859, 925541, 723522, 1909172, 3466491, 4351579, 3079490, -713238, -3897056, -2763096, 1291424, 3465074, 3202872, 4425751, 7372565, 7229506, 2979283, 114590, 1190304, 1331637, -2336385, -4567987, -1329700, 1993947, -896614, -6635927, -8132108, -5851945, -4694841, -4192537, -1129351, 1597252, -1172236, -5994101, -3962181, 5335644, 12422871, 11720350, 8234576, 8226995, 10551939, 10435187, 6383953, 416553, -4648667, -6311966, -4180276, -1518476, -1870807, -4222884]
11051d222884o56686J680153J803315J405790J672653J98768k832229k353114
11043c304234K512675M436629o70527n662418l373936J413951O33636k904062
11035f918286j169108L998935L861786j443509k686177K698762O433939L239719
11027H016061j530484j798634K95829j31807k889611m797051m800655l470366
11019a1106718j161057R32527J362666J332941L089861M924767K917777j518132
11011G74632k041746K630983N633979K312687k478488k357695N63931m5645m003371
11002I89267n251407j924127J085691L89565r49989Q06357L709449L235071m95614
10993A594263k708331j160215L16726k459155p055898o915015p23931M914964
$$ y = [-4222884, -4879570, -3199417, -1396102, 9688, 1682341, 1881109, -951120, -3304234, -791559, 3645070, 2974543, -2687875, -6061811, -4647860, -4014224, -6918286, -8087394, -4088459, -226673, -1670182, -4356359, -1657597, 4776342, 8016061, 6485577, 4686943, 4982772, 4850965, 1961354, -2835697, -7636352, -11106718, -12267775, -11335248, -9972582, -8639641, -5549780, -625013, 2292764, 774632, -1267114, 1363869, 6997848, 9310535, 6832047, 4474352, 5038283, 4992638, 989267, -4262140, -6186267, -5100576, -4711011, -5661000, -4854643, -1145194, 2089877, 1594263, -1114068, -2274283, -1957557, -4416712, -11472610, -18387625, -19111556, -14196592]
10985a4196592M401689R04004Q73132L559192K489686k973189n196016j84294
10977a0322388N189425L428607j678369j088833M846131O850550J415711m256884
10969D383950m245303k121945k613182k796694J440406N922903L670189l304899
10961C35425o331289k974013P88035J266173J396838K789369J895325k318063
10953c152200m270793k73689M801180M755453J086522r09893q69517j885687l376073
10944d094697k113750J140962K253431N25974m71516J019136K655818K245076
10936C160434N15414q67338j203081n48364K75581P4600o52717K44072K613654
10927C612255K853108o36925m083664l858910j883098j375698r99909J502367
$$ y = [-14196592, -9794903, -8890899, -8017767, -4458575, -1968889, -4942078, -10138094, -10322388, -5132963, -1704356, -3382725, -4471558, 374573, 7225123, 8640834, 4383950, 138647, -1983298, -4596480, -7393174, -5952768, -29865, 3640324, 335425, -5995864, -8969877, -8181842, -6915669, -5518831, -2729462, -834137, -3152200, -7422993, -7696682, -2895502, 1859951, 2946473, 2036580, 1167063, -718624, -4094697, -6208447, -5067485, -2814054, -2288080, -2759596, -1740460, 915358, 3160434, 3675848, 2808510, 1605429, 1057065, 1332646, 1407246, 754529, 998601, 3612255, 6465363, 5828438, 1744774, -2114136, -3997234, -5372932, -6372841, -4870474]
10919d870474L448326J335700k056931j584987J447496J541448j620043l365509
10911e724974k301838j030364J36666K537581L638125M80194k783975k58540L994283
10902a312842P66961p773700r152882n06215N969806K430578k885500q11468M034664
10893i240598L599693J144533L841269Q282963N983773j500858n110621l094104
10885C906050j885675l580089l382802J76418K229644M03402j348440J22451K567412
10876g91629K887398J233231q75911k401317k134571O2011J543390J30552j856157
10867b203003r69998J325944R39735j705415k319993Q7396K308029K893245L297109
10858C653049L134547L64824l281622l266385J95176J639248r27410k994917j578515
$$ y = [-4870474, -1422148, -86448, -2143379, -3728366, -2280870, -739422, -2359465, -5724974, -8026812, -9057176, -8920510, -6382929, -2744804, -2264610, -5048585, -5307125, -1312842, -545881, -8319581, -17472463, -17978678, -12008872, -9578294, -12463794, -13275262, -9240598, -5640905, -4496372, -655103, 7627860, 13611633, 12110775, 7000154, 3906050, 2020375, -1559714, -4942516, -4766098, -2536454, -2133052, -3481492, -3359041, -791629, 2095769, 3329000, 2453089, 51772, -2082799, -2020788, -477398, -346846, -2203003, -3173001, -1847057, -907322, -2612737, -4932730, -4845334, -2537305, 355940, 3653049, 6787596, 7152420, 3870798, 604413, 799589, 2438837, 1511427, -1483490, -3062005]
10849c062005o343j221964k217807J36344K684789J108490k161268j429112K865628
10840c303248M547156J132186k913128l301025j340686j93734L22282K146129
10832b904068M526372M413718P56780l810852n693898l613289O19504L688284
10824b017449L510229J276803K85120J874776L418117J808545j975462m102216
10816D078463l299266k036413j788440o67040K225715L492929J90532m312470
10808b115990l952500J055831L873210R30369k534470j21605N785495O544891
10800I465231q35951q992923r302549k419039L633836M179891K163937J379461
10792g28106O87334j795460l226144m20088K947138N93542n585490o805241p08091
$$ y = [-3062005, -3068348, -4290312, -6508119, -6371775, -3686986, -2578496, -4739764, -6168876, -3303248, 1243908, 2376094, -537034, -3838059, -5178745, -5372479, -5050197, -2904068, 1622304, 6036022, 6792802, 2981950, -2711948, -6325237, -5705733, -2017449, 1492780, 2769583, 3054703, 4929479, 8347596, 10156141, 8180679, 4078463, 779197, -1257216, -3045656, -3712696, -1486981, 2005948, 2196480, -2115990, -6068490, -5012659, -1139449, -209080, -2743550, -2865155, 2920340, 9465231, 8629280, -363643, -9666192, -12085231, -8451395, -4271504, -2107567, -728106, -40772, -1836232, -5062376, -5482464, -2535326, -1941784, -7527274, -14332515, -15040606]
10783a5040606M781439M027305J749773L234928M477338q4666o280967o016843
10775i152299k78119L226904K680871K597656L267206J85072n630583o817681
10767i920973j327192L784268L063024l51884j439370l00508O49802P72413j64704
10758e235124k407178l611581j031307K849060K841791k70065o17598K476128
10750e005874L276330K94568q11125K068067L097065q27347l870657j371473J972468
10741a177978O49311k127241q34220K347347J778416j777452l115405j394463
10733e651685k45364j121963k073757j566841N25440L753265N956071M210828
10725C785994n43846l460256k539497r54396p04429K63364K195801J619010j422215
$$ y = [-15040606, -10259167, -6231862, -4482089, -1247161, 3230177, 3145511, -3135456, -9152299, -9430418, -6203514, -3522643, -924987, 2342219, 2527291, -3103292, -9920973, -11248165, -7463897, -4400873, -4752757, -6192127, -6492635, -5842833, -5070420, -5235124, -7642302, -11253883, -12285190, -9436130, -6594339, -6864404, -7482002, -5005874, -1729544, -1434976, -2246101, -178034, 2919031, 2091684, -1778973, -3150446, -1177978, -528667, -2655908, -3490128, -1142781, 635635, -1141817, -4257222, -5651685, -5897049, -7019012, -9092769, -10659610, -10134170, -6380905, -424834, 3785994, 3242148, -218108, -2757605, -3712001, -4416430, -4153066, -1957265, -338255, -1760470]
10716a760470j559653K388627L930525j58439l716539k019014k6620k403761m072537
10707i397881Q7371M306525J535597l087126n92198N566860M935693j859994m318365
10698b823518K3721K607132l59560k076162J833663N672308L555959j754462m475168
10689B203913l552820j009677J866579L574401K385568m30431j523659p29247
10681B784627r42795k236459j383789J778631K961795J53594k983291k502347
10673b370034P39412L191556L046301J335752M01867J389441K218781j57992m196239
10664E598845m286579M22273K882127j330019n860618l070059L245994L791670
10656A393634j053068k603669J095090K876348l05522k854419j652714j146782
$$ y = [-1760470, -3320123, -931496, 2999029, 2840590, -875949, -2894963, -2921583, -5325344, -9397881, -9310510, -5003985, -3468388, -6555514, -7147712, -1580852, 3354841, 1494847, -2823518, -2799797, -192665, -552225, -2628387, -794724, 4877584, 8433543, 6679081, 2203913, -1348907, -2358584, -492005, 3082396, 5467964, 5037533, 3513874, 2784627, 1841832, -394627, -1778416, 215, 2962010, 3115604, 132313, -2370034, -1630622, 1560934, 4607235, 5942987, 6344854, 7734295, 9953076, 9795084, 5598845, 1312266, 1734539, 4616666, 3286647, -2573971, -5644030, -2398036, 1393634, 340566, -2263103, -1168013, 1708335, 1402813, -1451606, -3104320, -4251102]
10648d251102l461581l344330J706089N210314K206882j762877J09265M045405
10640D58065K019914m316670n745208J7217N178067M147236Q27958P08345K225460
10631E520384O82609l436663n387638l491861o27650J124235K725899M401044
10623A510359L991276J062748j050441j17988J124051o51836l691751l820217
10615a643799r11131J462774J561736O36514l01479r71573m00819J161582Q21312
10606A415117k327893l940085r30958K189332J81555l292798j378681L629652
10598d454759L712893r98525k877385n35237n9614k359862j838775J212056K29457
10589g969751l566907j044367P467880R761894J955011m253569j525793J397502
$$ y = [-4251102, -7712683, -11057013, -9350924, -4140610, -1933728, -3696605, -3587340, 458065, 2477979, -1838691, -7583899, -7566682, -2388615, 1758621, 2586579, 3294924, 5520384, 6202993, 2766330, -2621308, -6113169, -6740819, -5616584, -2890685, 1510359, 5501635, 6564383, 5513942, 5395954, 6520005, 5868169, 2176418, -1643799, -2554930, -1092156, 469580, 1106094, 804615, -166958, -567777, 593805, 1415117, -912776, -4852861, -5783819, -3594487, -3412932, -6705730, -8084411, -4454759, -741866, -1740391, -4617776, -5153013, -5212627, -7572489, -9411264, -8199208, -7969751, -11536658, -12581025, -5113145, 4648749, 6603760, 2350191, 824398, 2221900]
10581B221900l039848p278171l231131K680231J616222k166705o35401L355850
10573f477053L137348P23321N29976l02234m079105m548806J927683O932788L256220
10564A100138k348946j372698J939906N45907j689038P69225K879291o56885l669996
10555b503096n25428J757009k709552n474198N61326N863438J462979k880479
10547d448001L236958R048285P47803j1809763j0603605k21926K213565j932259
10539a3768943J425349R872211Q401582k119527o416819j580275J676850J020893
10531a488679K693550M010744j584419p128610k397989M975404J737947n821684
10523e003736l461401L707361J893960l692022k04173M901274k056434j0701446
$$ y = [2221900, -817948, -8096119, -11327250, -8647019, -7030797, -9197502, -9832903, -6477053, -3339705, -2616384, -2086408, -2388642, -6467747, -11016553, -9088870, -2156082, 1100138, -1248808, -2621506, -681600, -135693, -1824731, -1055506, 1823785, 1166900, -2503096, -3028524, -1271515, -3981067, -9455265, -8893939, -3030501, -1567522, -4448001, -1211043, 7837242, 8585045, -3224718, -13828323, -14050249, -11836684, -13768943, -12343594, -2471383, 5930199, 3810672, -2606147, -4186422, -2509572, -1488679, 1204871, 5215615, 3631196, -3497414, -5895403, -919999, 817948, -5003736, -8465137, -4757776, -2863816, -6555838, -6760011, -1858737, -3915171, -14616617]
10515a4616617l556625Q957657O160684l441900P23477R126503O16578j1804649
10507g834892k703709J2824171K969886j7582192j0278970J3060361Q481409j5914868
10499a6978804j2387768J3493114J0045574j8037999j3125926J9030831R163762
10492h797216l6307588k7234706L1625345L559360j45746407k24286250p1129301
10485d78316763J74463438K41458624R8473962l5196211k4961807L1890802J9782282
10478B7594327k1605735j3634133J7124889J0070659j4605312p910896J2460537
10471I494336M179131j6470422j0008294J0551685Q477688p355975m831601Q956040
10463B992588N538498q788934p789237L979251L676323m388276n59775R047197
$$ y = [-14616617, -18173242, -9215585, -3054901, -6496801, -5773324, 3353179, 3969757, -7834892, -10538601, 2285570, 5255456, -12326736, -22605706, -9545345, -1063936, -16978804, -29366572, -15873458, -5827884, -23865883, -36991809, -17960978, -8797216, -45104804, -72339510, -40714165, -37154805, -182901212, -407187462, -478316763, -303853325, -62394701, 36079261, 883050, -24078757, 7812045, 27594327, 5988592, -7645541, 9479348, 19550007, 4944695, -2966201, 9494336, 13673467, -2796955, -12805249, -2253564, 6224124, -1131851, -5963452, 2992588, 8531086, -257848, -8047085, -4067834, -391511, -4779787, -5339562, 3707635]
10455C707635N161191n491590l128422O441842L794579n958483l662180O205855
10447G070427M184937o708565o758821L730103O178806k140545n798217k52048
10439d93923L723764K327637J627627J265867l194978o163693n56112N697644
10431D233833J731922n275829k123949N672872L643179m680787m279865L706407
10423B627783M887851j708383l425965J637426K458640l260507n921404k682019
10415e386578n96056j142317J122390N034853M202708N59036R88425K974184n30394
10406G226251n346364k168585M871364L676307m287652o343345p95295K045564
10398a121755K71660K382995P955244N900591m578862r689820l038876M380171
$$ y = [3707635, 8868826, 3377236, 248814, 6690656, 10485235, 4526752, 864572, 7070427, 11255364, 4546799, -2212022, 1518081, 7696887, 5556342, -241875, -493923, 3229841, 5557478, 7185105, 8450972, 5255994, -907699, -1463811, 4233833, 5965755, 689926, -1434023, 4238849, 7882028, 3201241, -1078624, 2627783, 7515634, 5807251, 2381286, 4018712, 6477352, 3216845, -2704559, -5386578, -5982634, -7124951, -6002561, -967708, 3235000, 3794036, 4782461, 7756645, 7226251, 1879887, -288698, 4582666, 8258973, 3971321, -2372024, -3167319, -1121755, -850095, 1532900, 9488144, 15388735, 10809873, 1120053, -1918823, 2461348]
10390B461348K571184l234818l746251N63678L639331L145439L92608k332078
10382C460441j724437L039861O507474L436359k369385l588458j142156j056493
10374F563206k603717o50903K612860N73543m549141m083372J722632L487442
10366C072550j371975m906020k479056J259277K237479J987267R76250k638515
10358a862743n896990k991800L924931O020540J581550j581225O25316L125343
10350B944922J889356j53769l18802m70223j397646q46491P70950K20491j836313
10341H02475j553086L82905j33635k120594j134479J169654p22629m624701k662895
10332a0596985M352570O550270J109246l262873j229024J637370O22777k71743
$$ y = [2461348, 5032532, 1797714, -1948537, -1384859, 2254472, 5399911, 5792519, 3460441, 1736004, 4775865, 11283339, 14719698, 12350313, 8761855, 7619699, 6563206, 3959489, 3308586, 5921446, 6494989, 1945848, -2137524, -414892, 3072550, 1700575, -3205445, -5684501, -4425224, -2187745, -200478, 775772, -1862743, -7759733, -10751533, -6826602, -806062, 775488, -805737, -180421, 2944922, 4834278, 4680509, 4361707, 3891484, 2493838, 1647347, 2418297, 2638788, 802475, -750611, -367706, -501341, -2621935, -3756414, -2586760, -3309389, -7934090, -10596985, -6244415, 305855, 1415101, -1847772, -3076796, -1439426, -816649, -1088392]
10324a088392K043205K761628j419719m945140k576372J639541J595336j041545
10316c031458r88222J784744L536065L156949J993407N44046p71700n89734Q62214
10307F496311J218818l60895k202796l247044l312862r39609L896058O194374
10299G742355J754729m557590m321287J420032L790838N90826j318306O73330
10291E774927O42555l652570n575824j593495J944000J5545k550480m82485K655907
10282b821920J967870L61702K318258M884982K827442k174283m700162l855865
10274a191976k172599k86865J689498J580199r41147k077928j19038J037431q25896
10265c308321j287869K774152O199334L196863l100208n718259m031916j912621
$$ y = [-1088392, 954813, 3716441, 2296722, -2648418, -5224790, -3585249, -1989913, -3031458, -4019680, -2234936, 1301129, 4458078, 6451485, 6995531, 6223831, 5634097, 6496311, 7715129, 7354234, 5151438, 1904394, -1408468, -2348077, 1547981, 7742355, 9497084, 4939494, 618207, 2038239, 5829077, 6419903, 5101597, 5774927, 6417482, 2764912, -2810912, -4404407, -2460407, -2444862, -4995342, -5477827, -2821920, -854050, -492348, 1825910, 6710892, 9538334, 7364051, 2663889, -1191976, -3364575, -3651440, -1961942, -381743, -1322890, -3400818, -3519856, -2482425, -3308321, -4596190, -1822038, 4377296, 7574159, 4473951, -1244308, -5276224, -7188845]
10257g188845N9283L163609M951299K623945q01179p61423J131419N57304j268549
10248B466863l62202J572729l05640m508851m749581n56425J869740L2738j490933
10239f031562K65454J836792n251k677540k241551Q76401L606839M380500L152824
10230C162906J46383l226976m402276k469265N49974K216217K048920J011994
10222i62123J99605K08255M74200l36208j929685j740587J161748L305396J308690
10213A689291k262945j874395K570519N096476K247261k286267l495881j523066
10205A60993K98769N97587l100j597092m147589n163211j827283M434227Q298426
10196A051727O290504M93828m100547m580732j877381J105270K101560J005555
$$ y = [-7188845, -7129562, -3965953, 985346, 3609291, 2808112, 2046689, 3178108, 3735412, 2466863, 2104661, 3677390, 3371750, -1137101, -5886682, -6443107, -4573367, -4540629, -6031562, -5766108, -3929316, -3934567, -6612107, -8853658, -7977257, -4370418, 10082, 3162906, 3309289, 82313, -4319963, -6789228, -6239254, -4023037, -1974117, -962123, -762518, -554263, -80063, -416271, -2345956, -4086543, -2924795, 380601, 1689291, -573654, -2448049, 122470, 5218946, 7466207, 5179940, 1684059, 160993, 459762, 1057349, 1054249, -542843, -4690432, -9853643, -11680926, -7246699, 1051727, 7342231, 7836059, 3735512, -845220, -2722601, -1617331, 484229, 1489784]
10188A489784k46310L14293K195988K611605k9334l532347m207140j409899J820197
10179i93163K713361J567029J05632j037541k026414k519006k085552r31685Q26433
10170d380906L329070N376453M492365L87457l296800l067532k18345J123351
10162C745113l45549k180575k427514j812192j462137j095236k96328K91447o6342
10153e649313j059400j483131m9026L259022O001040N036001P66447k377159j637284
10144B807197K68648j74451j488222k55002K214954J677211j535906k730576q83445
10135i9592l74052l045706m356691n63985M941262O342559L177557l31467j438405
10126D251480r39134n26464q51423j362024n09070K501882N218334L698985j712804
$$ y = [1489784, 1243474, 1557767, 3753755, 6365360, 6336026, 2803679, -1403461, -2813360, -993163, 1720198, 3287227, 3392859, 2355318, 328904, -2190102, -4275654, -5207339, -4380906, -1051836, 4324617, 8816982, 9204439, 5907639, 2840107, 2621762, 3745113, 3399564, 1218989, -1208525, -3020717, -4482854, -5578090, -5874418, -5582971, -5649313, -6708713, -8191844, -8240870, -4981848, 1019192, 6055193, 6821640, 4444481, 2807197, 3075845, 2901394, 1413172, 1158170, 3373124, 5050335, 3514429, 783853, -99592, -473644, -3519350, -7876041, -8440026, -3498764, 2843795, 6021352, 5689885, 4251480, 3312346, 2785882, 1934459, 572435, 63365, 2565247, 7783581, 11482566, 9769762]
10117I769762n314728l161839J440487K631796n5793k165382j407710k20590j135175
10108C80828l036731l234867j100288J695732L424877L655189K765050J028627
10100E578417j271843k965198k384014K32620J652970q38528m910499m889905
10092i795980Q65419O808318O619014J119773k996059j744206J844753K764078
10084E485110P44751l61900J283932L034430K061515n83190k201689k578535k855781
10075D028643j943974J626654M877225K839461l156032n614113j946538Q85281
10067A596607k490294o164328j757034P337454R622530K024453o212962o871182
10059b914756j975046K148881K841458N98611l102492m761723j375344L602080
$$ y = [9769762, 4455034, 1293195, 2733682, 5365478, 5309685, 3144303, 1736593, 1516003, 380828, -2655903, -5890770, -6991058, -5295326, -1870449, 1784740, 4549790, 5578417, 4306574, 1341376, -1042638, -810018, 842952, 4424, -4906075, -9795980, -8930561, -2122243, 4496771, 5616544, 2620485, 876279, 2721032, 5485110, 6229861, 5867961, 7151893, 10186323, 12247838, 11664648, 9462959, 6884424, 4028643, 2084669, 3711323, 8588548, 11428009, 8271977, 2657864, 711326, 1596607, -893687, -7058015, -8815049, -1477595, 8144935, 10169388, 3956426, -2914756, -4889802, -2740921, 100537, 699148, -2403344, -7165067, -8540411, -4938331]
10051d938331K879849l519187o626501j779736L852377K664146j386004q8770
10043h942157M865794M720329j549819n190386j409587L485053K170076k866759
10035d717456l613089J765936O665948N017889j288088n438321m234395j006463
10027f848039K38830N48697K994408N892047M167849j980892n356608j593200
10019a936908M017306L948172q97685l410969j019033J826552J501832k65971
10011C763296r00938j056393j922653k222073p37135O72255m54779l039016l535460
10002i432896p69520K593768L777921L236738L083512L330919J791877j912901
9994E699418m398694k542194J670598L042819q8060l815416m178129j887963R8074
$$ y = [-4938331, -2058482, -5577669, -12204170, -13983906, -10131529, -7467383, -8853387, -8942157, -4076363, 643966, -905853, -6096239, -7505826, -4020773, -1850697, -4717456, -8330545, -6564609, 101339, 5119228, 3831140, -1607181, -5841576, -6848039, -6609209, -6060512, -3066104, 2825943, 6993792, 5012900, -343708, -1936908, 2080398, 6028570, 5130885, 1719916, 700883, 2527435, 4029267, 3763296, 2862358, 1805965, -116688, -2338761, -3075896, -2403641, -2858420, -5897436, -9432896, -10202416, -7608648, -3830727, -593989, 2489523, 5820442, 7612319, 5699418, 1300724, -1241470, 429128, 3471947, 3383887, -431529, -4609658, -6497621, -6399547]
9985f399547J109688K268321L288980K904151J727284J663819K393512J188579
9977A0144787k874675o616885o173569j766526K316246K494113j83432j452062
9969d112003R56499M432917M694880J242323k088294k200872l86107K69194n48030
9960B260507m65211J480915L000456J529582k115167m245794k549500R15303J878908
9951A689999q66917l580441k115041K538259N249465L266187n53074k025124j109883
9942B493430r80570k619949l051941K58046N162611O882982L798876p62858k983445
9933H197182k870611k720696l014606k406562r30701j05718J57098J498135L430231
9924A233752L217907N58775j313318q87619p57322k361920k679265L09593L062319
$$ y = [-6399547, -5289859, -3021538, 267442, 3171593, 4898877, 6562696, 8956208, 10144787, 7270112, 653227, -5520342, -7286868, -4970622, -2476509, -2659941, -4112003, -3155504, 1277413, 5972293, 7214616, 5126322, 2925450, 2539343, 2808537, 2260507, 1795296, 3276211, 6276667, 7806249, 5691082, 1445288, -1104212, -188909, 1689999, 823082, -2757359, -4872400, -2334141, 2915324, 6181511, 5628437, 3603313, 2493430, 1512860, -1107089, -4159030, -3900984, 1261627, 8144609, 11943485, 11180627, 8197182, 5326571, 2605875, -408731, -2815293, -3745994, -3851712, -3694614, -2196479, 1233752, 4451659, 5010434, 3697116, 2809497, 2052175, -309745, -2989010, -2679417, 382902]
9915C82902K014926j05209Q57709K538706j89049n467999o089303p17484L895587
9906b879214L184209N36103M42424J745744J116732j036969j846805p45423K5545
9897E42346j168250k875813j726621L067704O738793M156561j225811k79239O277522
9888A3507192M373980j2379112k6805899j8158117O500030J8895103Q090313o562258
9880a2538768o370598J891076L200034l54556K297494Q889985P796246j040415
9872C770498n977966k775234R00383K48744o16021Q04104N62626k723637l761937
9863i568440M72057N241630N326973J849895j271320k549232j998727M44965L185667
9854A133468L377722Q63483j384906j547943n57567O61579K022399K411150O33398
$$ y = [382902, 2397828, 2292619, 3150328, 5689034, 5499985, 31986, -6057317, -6774801, -2879214, 304995, 841098, 1283522, 3029266, 4145998, 3109029, 1262224, 516801, 542346, -625904, -3501717, -5228338, -2160634, 4578159, 8734720, 7508909, 7229670, 13507192, 17881172, 5502060, -21303839, -39461956, -32961926, -14066823, -5976510, -12538768, -18909366, -17018290, -13818256, -14172812, -11875318, -2985333, 4810913, 3770498, -2207468, -4982702, -4082319, -3833575, -4449596, -3645492, -3082866, -5806503, -9568440, -9096383, -3854753, 1472220, 3322115, 2050795, -498437, -2497164, -2052199, 1133468, 4511190, 5374673, 3989767, 2441824, 1884257, 2545836, 4568235, 6979385, 7612783]
9845G612783j877311k676923k026455j610602r22940J036139K148947Q5399k752711
9836i83674k499797m93863p31077k098862j22043M122982M461910k49906l812640
9827b406970k220562J174633K137691J025344m29778k032051k653414m21506K679271
9818c147342K141229j321149j716473K331818M636996J566470k099758j764631
9810F27160m32828j946207l278022n24564K660522N98031l902321k902179M081352
9801e019056Q544638M713101l150925o672341k688742M514771P875056M231381
9793A2347883k163943l971244Q8486L249451K45412n016222n621073j980557n8493
9784b880300j490023k276473p03200L79998l8209Q80094L470848L489358m50120
$$ y = [7612783, 5735472, 3058549, 1032094, -578508, -1501448, -465309, 1683638, 1769037, -983674, -3483471, -3977334, -4708411, -6807273, -6929316, -2806334, 1655576, 1405670, -2406970, -4627532, -3452899, -1315208, -289864, -719642, -2751693, -5405107, -5826613, -3147342, -1006113, -2327262, -4043735, -1711917, 2925079, 4491549, 2391791, 627160, 194332, -1751875, -5029897, -5554461, -2893939, -2295908, -6198229, -9100408, -5019056, 3525582, 8238683, 5087758, -1584583, -4273325, 241446, 8116502, 12347883, 10183940, 6212696, 6301182, 9550633, 9796045, 4779823, -841250, -2821807, -2880300, -4370323, -6646796, -7349996, -6969998, -7008207, -6128113, -2657265, 832093, 381973]
9775C81973k999500k2842M194877L097199k029274m259832j773998K05851j315398
9766d520944k303076J046129N299851M589953m45941l557853j839050R95701R33062
9757A97832r98785j684032r00909m99456p09282l79578J57072n22146j872175
9748g211459j381388J814581N188987N473608K107956k255776m154437k477199
9740b895127L66946J183141J2778l98219M16025n84790m213947n851225j946053
9731a3910471L387043L768815M96362L35461L931005M227645j660213o602168
9723f026521l774154L135918N547514J732327k678098l258572o09972K630862
9715c300696L921967J346448l749406o057537k403161L007004L906946R63302
$$ y = [381973, -2617527, -2640369, 1554508, 4651707, 2622433, -1637399, -3411397, -3205546, -4520944, -6824020, -5777891, -478040, 4111913, 3665972, 108119, -1730931, -735230, 197832, -800953, -2484985, -3385894, -3885350, -4594632, -4974210, -4817138, -5339284, -7211459, -8592847, -6778266, -1589279, 3884329, 5992285, 3736509, -417928, -2895127, -2528181, -1345040, -1332262, -1730481, -1314456, -1899246, -6113193, -11964418, -13910471, -10523428, -6754613, -6258251, -5922790, -1991785, 2235860, 575647, -6026521, -9800675, -6664757, -1117243, 615084, -2063014, -5321586, -5931558, -3300696, 621271, 1967719, -1781687, -7839224, -10242385, -7235381, -3328435, -2365133]
9707b365133J54488L094395M999851K783252o82759k032841j982672k135508j684648
9698A48425p0377P20304o47915k269605k060418p31034L16574J096227J168069
9689b329750p16043k859082r26895M667915O626035J112694m452950j251813O601231
9680F471342O820722k627273r919554o642239Q58302K703991K6844M24334M244889
9671B361358M780982L25978k930300j115236J611879L69403k984377l491414o26204
9662a697931J740058J155605r31236k019137j559070q34911r29092j224526j43452
9653f443692K305249L572899J574061j930003k982648n14239K291038K191245
9645F3910m04652k610123k378423K1368K523037K773468L17761k526909l147405
$$ y = [-2365133, -2210645, 883750, 5883601, 8666853, 7984094, 5951253, 3968581, 1833073, 148425, 78048, 798352, 150437, -2119168, -4179586, -4910620, -4594046, -3497819, -2329750, -3045793, -5904875, -6831770, -2163855, 4462180, 5574874, 1121924, -129889, 6471342, 13292064, 10664791, 745237, -5897002, -5038700, -2334709, -2307865, -1883531, 2361358, 7142340, 7468318, 4538018, 3422782, 5034661, 5404064, 2419687, -1071727, -1697931, 42127, 1197732, 266496, -1752641, -3311711, -4146622, -5075714, -6300240, -6443692, -4138443, -565544, 1008517, -921486, -3904134, -4418373, -2127335, 63910, -340742, -2950865, -5329288, -5307920, -2784883, -11415, 306346, -2220563, -5367968]
9636e367968j693351j36567R89708K462609L456161K023683j067590k298764l35979
9627a968058J988058J998316N82153l29955p54702j085919l25477J572381J977069
9618C653866q59649m248255m055743k08514L474059M276568K993491J570135L82168
9609F978126j648188m921447p381431n698706L04511N412479M335702r02326l052260
9600f573540R3219K646812L08655k407235N10358O285704O903246R51928m666008
9591D053139m691583j240579J338450J978884J286403j052410m251975m978518
9583g558189j363216L196656L568336j84246k458542L54227M533242L792356j768282
9574B112342n289077k706341J483171J259632j830331k029125P06362J354202
$$ y = [-5367968, -7061319, -7197886, -6208178, -3745569, -289408, 1734275, 666685, -1632079, -1968058, 20000, 2018316, 2600469, 2270514, 1515812, 429893, 104416, 1676797, 3653866, 2794217, -1454038, -5509781, -5718295, -2244236, 2032332, 5025823, 6595958, 6978126, 5329938, 408491, -6972940, -12671646, -12367135, -6954656, -2618954, -3521280, -6573540, -6480321, -3833509, -3524854, -5932089, -5421731, 863973, 7767219, 8719147, 4053139, -638444, -1879023, -540573, 1438311, 2724714, 1672304, -2579671, -7558189, -8921405, -5724749, -2156413, -2340659, -4799201, -4444974, 88268, 3880624, 2112342, -3176735, -5883076, -4399905, -3140273, -4970604, -6999729, -6293367, -4939165]
9566d939165l17551R30736N076379M604238k729757p718669l106434M321993L791875
9557h6355l030598n729399j619392K260778K201787J942047K931259R31474m596215
9548d794614o766309j640156M668964M542827n92227l493680j367734K007564
9540g435365K529491J90140k125684j916043N99817K640220J996915l50458k059157
9531e930124k637424k555329q19282L073276O134577N055781J416177p52005j511188
9522A474459l735911o048451l702166K664946N948352K626021k055884k133080
9514d961714Q96805J727567p29021k835893j540323K535870N860243M723159r19399
9505D757294o211436o502296l022409j44797J475064L951961N743018L049831
$$ y = [-4939165, -5256716, -4325980, 750399, 5354637, 2624880, -5093789, -8200223, -3878230, -86355, -3116953, -8846352, -10465744, -8204966, -6003179, -4061132, -1129873, -198399, -4794614, -11560923, -13201079, -8532115, -3989288, -4581515, -8075195, -9442929, -7435365, -4905874, -4715734, -6841418, -8757461, -8157644, -5517424, -3520509, -3870967, -5930124, -8567548, -11122877, -11942159, -8868883, -2734306, 2321475, 3737652, 2985647, 1474459, -2261452, -8309903, -12012069, -9347123, -3398771, -772750, -2828634, -4961714, -4064909, -2337342, -3066363, -5902256, -7442579, -4906709, 953534, 5676693, 4757294, -1454142, -7956438, -10978847, -11123644, -9648580, -5696619, 46399, 3096230]
9497C096230k309416l894079p16415J239729n60909j294782J780761M148444K406382
9488C895945N1910J39383k22331k695178k800745J498420L985880L38352l397583
9479G94053j019285K431720l07200m837931k371720L971534L738448k570485m230433
9470d401299Q12371K632860k384511m581215J773593P556222L769240l392478
9462A784783l100065K524389L187206k187920m958802j789483J221805J72831
9454c145256r69269R66569K504143M72994j890164p00660J819840J593368k32359
9445D19206j07809Q29961j232047m940682m507295J037975N297041L435683j233225
9436a001192k769471r36981j91006k626110n567758n240607n16986N929385Q889668
$$ y = [3096230, 786814, -3107265, -3823680, -2583951, -3144860, -4439642, -2658881, 1489563, 3895945, 3947855, 4087238, 3864907, 1169729, -1631016, -132596, 3853284, 4191636, 794053, -225232, 2206488, 1899288, -2938643, -5310363, -1338829, 2399619, -170866, -4401299, -3588928, -956068, -3340579, -7921794, -6148201, 1408021, 5177261, 1784783, -1315282, 1209107, 4396313, 2208393, -2750409, -4539892, -3318087, -3145256, -4114525, -3147956, -643813, -170819, -2060983, -2761643, -941803, 651565, 419206, 311397, 1141358, -90689, -5031371, -9538666, -8500691, -3203650, 232033, -1001192, -3770663, -4707644, -4898650, -7524760, -13092518, -18333125, -18850111, -12920726, -4031058]
9427d031058N175968j730418m628098j847927O54098r55251k109386J753828O105181
9418a613063M169808j290982k177078J410144J984215j645178k462505J492844
9410a31795L062513j070869l862757j18586M091255J578234m064109m925142j203300
9401f644556J243348J223315J747488K603355J451014n691J585481M439301M120003
9392A1763058J154096m64270o86542k493663m954447m311510j316355m98213k258237
9383d066083k442416R082J642436J238977J316477J933491j56105m337476m898579
9374i760196K829M124653J872812l529011n037251j478941K274967K688257R17802
9365g924079l27136J28749K005737M314677N461592L990393Q1403l862009m715412
$$ y = [-4031058, 1144910, -585508, -5213606, -7061533, -6407435, -7362686, -9472072, -7718244, -1613063, 2556745, 1265763, -911315, 498829, 2483044, 837866, -1624639, -131795, 2930718, 1859849, -2002908, -2121494, 1969761, 3547995, -516114, -5441256, -6644556, -5401208, -4177893, -2430405, 172950, 1623964, 1618273, 3203754, 7643055, 11763058, 12917154, 12452884, 11766342, 9272679, 4318232, 6722, -1309633, -1807846, -4066083, -6508499, -6499417, -4856981, -3618004, -2301527, -368036, -524141, -4861617, -9760196, -9757367, -5632714, -3759902, -7288913, -12326164, -13805105, -11530138, -8841881, -7924079, -8251215, -8122466, -6116729, -1802052, 3659540, 7649933, 7731336, 3869327, -846085]
9356h46085j519311K973327M598105K109399j729229l586165k574160L09526L306978
9347C042385L814690L06943m211258m127792J176217N235286K989155k265698
9339E959928m281890k803295k189520l591042l922367j546313J688186L459538
9331g226775K493088j417439n449004m339906K667023Q237244N675083j314234
9323f74920l809311m02057K484552J656992M72340R64001O99807r68893q76965
9314d54454J473686K034826o14263k360520o36351J369972O57418q00442m76217
9305A93655M16911L05649L20066Q68867j68804k609046k247898K171302N091683
9296D342385J915549l546659m634714j432494Q69432P17797J177865L141295L471289
$$ y = [-846085, -2365396, 607931, 5206036, 7315435, 5586206, 2000041, -574119, -264593, 3042385, 6857075, 7164018, 2952760, -1175032, 1185, 5236471, 8225626, 5959928, 1678038, -1125257, -3314777, -6905819, -10828186, -12374499, -10686313, -7226775, -4733687, -6151126, -11600130, -15940036, -13273013, -5035769, 639314, -674920, -4484231, -4886288, -2401736, -744744, -272404, 691597, 1391404, 422511, -454454, 1019232, 3054058, 2439795, 79275, -557076, 812896, 1470314, 669872, 193655, 610566, 916215, 1236281, 2105148, 1936344, -672702, -2920600, -749298, 4342385, 6257934, 2711275, -1923439, -3355933, -2486501, -1768704, -590839, 2550456, 6021745]
9287F021745O81804k200814k118149r8509R84417O24701N17784J085561M23031
9278E921571k510080n187053m133392K6691K899493K432853J331403J592395Q83345
9269C257226j990870k562817K311227O647622K704950n792267p414001k21675
9261c060605N167703K262348k174272q76900K045759o9358l926659k506857J810668
9252a328173J170462l764612m630816M69010L942402J339054k189729j222882
9244f215284J828836K249638O52171K28162P12010K0126r84336l0418K006339
9235D67244K274235P21474m8308O57542O79679j022386k538240k148015p99225
9226a756000n9724L22485R89217P82987j527368m138495l628289K44851L655638
$$ y = [6021745, 6703549, 4502735, 2384586, 2286077, 3270494, 3895195, 4412979, 5498540, 5921571, 3411491, -1775562, -5908954, -5882263, -2982770, -549917, 781486, 2373881, 3257226, 1266356, -1296461, 1014766, 7662388, 10367338, 4575071, -2838930, -3060605, 2107098, 4369446, 2195174, 1318274, 3364033, 3294675, -631984, -3138841, -1328173, -157711, -3922323, -8553139, -8084129, -4141727, -2802673, -4992402, -6215284, -4386448, -2136810, -1484639, -1256477, -544467, -524341, -1508677, -1539095, 467244, 2741479, 3462953, 3414645, 4072187, 4751866, 3729480, 1191240, -956775, -1756000, -1815724, -1493239, -504022, 278965, -1248403, -5386898, -9015187, -8770336, -5114698]
9217e114698L564317J315623j3974r077n92655k298799l072505j008734K909054
9208d321448N337931L895145L5926k212443j324061n53741k771818m815563j568724
9199h298796M900989O430905N12127n462086m897535o45753J606064K259683L754239
9190A59837L314366k000437p083894m781537K278337N070532K028630L3040J853434
9181H72308K477331o28060k929861j298664R10644L37691j583339k786197l172457
9172g800604j396394M048063R109927P192813m13258n147672l928976k401622
9164g37723l478623k888567N67257J279734j881324j716687L848154N979184J98605
9155A170010m317249l28165M120512l3768n841807k186068N856876N115433k805763
$$ y = [-5114698, -1550381, -234758, -248732, -257809, -850464, -3149263, -6221768, -7230502, -4321448, 1016483, 4911628, 4947554, 2735111, 1411050, 857309, -1914509, -6730072, -8298796, -3397807, 3033098, 3545225, -1916861, -6814396, -7460149, -5854085, -3594402, 159837, 3474203, 1473766, -5610128, -10391665, -8113328, -3042796, -1014166, -981126, 872308, 3349639, 2721579, -208282, -1506946, -596302, -258611, -1841950, -4628147, -7800604, -9196998, -5148935, 3960992, 11153805, 10740547, 5592875, 1663899, -737723, -4216346, -7104913, -6537656, -5257922, -7139246, -8855933, -5007779, 971405, 1170010, -3147239, -3475404, 645108, 611340, -5230467, -7416535, -1559659, 3555774, 750011]
9146G50011m382169K484229N631425r640m857786k122797J851406K48485l365270
9137c772106l179329m53327J228404K015660K165318k38710l699948k843513K464945
9128f312606N176239K431628P87206M811436Q452596M674552k919543n883322
9120A1218186l484670j544244j954332j183660K035460M343338L328422M75558
9112A3234058j987360l460127l686894k092343P05378K522283J710096p98305
9104F146786k015547j53690K446480J411586l333738n965802k446100K942806
9096i67219L376369l83693j679371J311157L485651J817772o66200j458288k239671
9087B596507l603080k690160Q33467K558695M30498j772977j388793j121269k579234
$$ y = [750011, -3632158, -1147929, 4483496, 4473856, -383930, -2506727, -655321, -406836, -3772106, -6951435, -7404762, -6176358, -4160698, -1995380, -2234090, -5934038, -8777551, -6312606, -1136367, 1295261, 2082467, 6893903, 15346499, 20021051, 17101508, 11218186, 7733516, 6189272, 4234940, 3051280, 5086740, 9430078, 12758500, 13234058, 11246698, 7786571, 4099677, 2007334, 2712712, 5234995, 6945091, 6146786, 4131239, 3977549, 6424029, 7835615, 4501877, -1463925, -3910025, -967219, 2409150, 2025457, 346086, 1657243, 5142894, 6960666, 6294466, 4836178, 2596507, -1006573, -3696733, -2863266, -304571, 125927, -1647050, -3035843, -4157112, -6736346]
9078f736346k230236J339573K829022j019538m399474j513925L014759J508850
9070g207315l497439l336040K058767M190493N55522j375544K968100P631055
9062A987599N635586q71259m806931l525588M23815M029215N158401K253604l277851
9053G006591o466237m050679J191837M156169L673775K125404N33246k139219
9045F030887n182502n399500j415383L613804N283620K914092j19754o94788O14283
9036E644759Q65585j116308l059212k198027Q93000K678219R16417k681850m682052
9027b739469l852197j787086j68453J033110K239124K611175J123996j255179
9019b794979k113995o36778J262186J509854L70580n38857n32830J58457J610572
$$ y = [-6736346, -8966582, -7627009, -4797987, -5817525, -10216999, -11730924, -8716165, -7207315, -10704754, -14040794, -11982027, -7791534, -7236012, -8611556, -5643456, 1987599, 7623185, 6751926, 1944995, -1580593, -1156778, 2872437, 8030838, 10284442, 7006591, 540354, -3510325, -2318488, 1837681, 5511456, 7636860, 8170106, 6030887, 848385, -4551115, -5966498, -2352694, 2930926, 5845018, 5725264, 5030476, 5644759, 6510344, 5394036, 2334824, 136797, 1029797, 3708016, 4624433, 1942583, -2739469, -6591666, -8378752, -8547205, -7514095, -5274971, -2663796, -1539800, -2794979, -4908974, -5545752, -4283566, -2773712, -2403132, -2941989, -3474819, -3316362, -1705790]
9010a705790L568297M191203J606494l102487o292980n654318k342369R78033
9002h753917K595278J914712p93864l593472l449422N43302N161683O023328K583764
8993B231392j217622j703992L93045J562639M22663q53018k05574J321164J603233
8984C553930N98603o13316k226443m173733l848161L50403M216026K121685l687591
8975c708597m987149l37154K049150j917679m296015J781324Q909742N758516
8967C252138m586452q743481l171752K417127J903862L13068J910777K832034
8959c872679M46786n35005K620078M505220J272568j975241m92546J491726p68412
8950B692495l155364o02827K606424L76145l431284j703951K399215P09110m564641
$$ y = [-1705790, 1862507, 6053710, 7660204, 4557717, -1735263, -7389581, -9731950, -8753917, -6158639, -4243927, -5037791, -8631263, -12080685, -11537383, -6375700, -352372, 2231392, 1013770, -690222, -297177, 1265462, 1688125, 835107, 629533, 1950697, 3553930, 4152533, 3539217, 1312774, -2860959, -6709120, -6358717, -2142691, -21006, -3708597, -8695746, -9032900, -6983750, -8901429, -13197444, -11416120, -2506378, 3252138, -1334314, -10077795, -13249547, -10832420, -8928558, -8615490, -6704713, -3872679, -3425893, -3960898, -1340820, 3164400, 4436968, 2461727, 1969181, 3460907, 2692495, -462869, -1065696, 1540728, 1916873, -1514411, -3218362, -819147, -110037, -4674678]
8941d674678l748581L208574N905269Q85791l011352J755L835957K153850j555212
8932C001373j883051p40040j657028k159009O76060K990926K94499l739529k520013
8923e735812K640838M693894J825287j162480j472729j206646j513991n12283
8915b443922J662667J572096j520004l157075j41935M117846M062323m61491m376381
8906f85876m094795j170198P60304L84346p88944r95742n7378J009531J222911
8897d415841K77841j322253k369717j789162N7191J406977J063567k25053j009886
8888h326336r47177l97138P53860K322555K765761R53996j446918j639355L48359
8879e612393J733050J195351M74494J054189J768115J006131o89844j680268j415984
$$ y = [-4674678, -8423259, -5214685, 690584, 1576375, -1434977, -1433222, 2402735, 4556585, 3001373, 1118322, 378282, -1278746, -3437755, -2761695, 229231, 523730, -3215799, -5735812, -3094974, 1598920, 3424207, 2261727, 788998, -417648, -1931639, -2443922, -781255, 790841, -729163, -3886238, -4028173, 89673, 4151996, 3690505, -685876, -4780671, -5950869, -5190565, -4806219, -5595163, -6590905, -6648283, -5638752, -4415841, -4138000, -5460253, -7829970, -9619132, -9561941, -8154964, -7091397, -7316450, -8326336, -9273513, -9670651, -8916791, -6594236, -3828475, -2874479, -4321397, -5960752, -5612393, -3879343, -2683992, -2209498, -1155309, 612806, 1618937, 929093, -751175, -2167159]
8870b167159m30912N16264M51314j133247k796631k112913Q59109K882389J633190
8861b298596j138437k009219j39298K255975K700765P39082j652710j576948J463582
8852a655804L884714K077019j896878k318619J601262L743700J57838m599121
8844I94111m411910q57873J49325j865021k197783K34947J454888J67133k4954
8835f357137K071215K403610p13352k356339J065018M881241K997377k265767
8827A725866l847135j022459M97603j191973j485588J861042M362384K581182
8819C480922J21477J096732K545755m81880n480103n302583M57901M103606J142031
8810A683858l516138l641448m46967J150118P75802J476783K845037J502103k038962
$$ y = [-2167159, -2598071, -2081807, -1630493, -2763740, -5560371, -7673284, -6814175, -3931786, -2298596, -3437033, -5446252, -5585550, -3329575, -628810, 110272, -1542438, -3119386, -1655804, 2228910, 4305929, 2409051, 90432, 1691694, 5435394, 5593232, 994111, -3417799, -4275672, -4126347, -5991368, -8189151, -7954204, -6499316, -6332183, -6357137, -4285922, -1882312, -2595664, -4952003, -3886985, 994256, 3991633, 1725866, -2121269, -3143728, -2646125, -3838098, -5323686, -3462644, 899740, 3480922, 3602399, 4699131, 7244886, 6763006, 1282903, -4019680, -3561779, 541827, 1683858, -1832280, -5473728, -5920695, -4770577, -3994775, -2517992, 327045, 1829148, -209814]
8801b09814k971067K25113L022711J829737q14261j051133J55390l21683j771347
8792a906354r87057J733731K671739P80455o16656O83798K206907P16214k832194
8783B450583m567742k653904R05589K809938J605608j260879k800010j385444
8775d896261J337996K203017L52686j828784j956638l86193J018484J430469J227316
8766a497908P31048J25849m4374N05173J124367J111216Q06244R45456J376573
8757E183644J265401L07511q25340j005867M07006K412698K417256r62960n077441
8748D121908n500890j847447J335484R19717o32825n0424Q86577j494877n636141
8739g898918n915470p76709N042243P116970N892444L556047O50969k280330l406996
$$ y = [-209814, -3180881, -2955768, 66943, 1896680, 1082419, 31286, 186676, -135007, -1906354, -2893411, -1159680, 1512059, 2292514, 1675858, 2359656, 4566563, 5282777, 2450583, -2117159, -4771063, -3865474, -1055536, 550072, -710807, -3510817, -4896261, -3558265, -1355248, -1002562, -2831346, -4787984, -5174177, -4155693, -2725224, -1497908, -766860, -641011, -685385, -180212, 944155, 2055371, 2861615, 3807071, 5183644, 6449045, 6756556, 5931216, 4925349, 5332355, 7745053, 10162309, 9199349, 4121908, -1378982, -3226429, -1890945, -971228, -1604053, -1654477, -767900, -2262777, -7898918, -13814388, -14591097, -9548854, -2431884, 3460560, 7016607, 7667576, 5387246, 1980250]
8730A980250k305982j026676o19466K92634J809074J476716r16287j494180J387398
8721E83481L175343j4424m297895l400710J619124M258612K440616o6616j252664
8712C044867k930308m841850l678510L57129K400437O94099m27547J862179M144651
8703F25147L205536J559603J930958J441509k823851o612120l847504L112119
8695a408603N717069J281145l782104l782094j058635r88920l789287m687706
8687a2499135p42589N036234O751137K364814l291490l673241J372494N349409
8679F67633L850162j21142j835951j652612k079281j915972Q86343L252594P09259
8670A761033m252940m764164k87416K774142J882473J617126L885650L462944
$$ y = [1980250, -325732, -1352408, -1971874, -1679240, 129834, 1606550, 690263, -803917, 583481, 3758824, 3744400, -553495, -3954205, -2335081, 1923531, 4364147, 4297531, 3044867, 114559, -4727291, -8405801, -8048672, -5648235, -4954136, -5381683, -3519504, 625147, 3830683, 5390286, 7321244, 8762753, 5938902, -673218, -4520722, -1408603, 4308466, 5589611, 1807507, -1974587, -3033222, -4022142, -7811429, -12499135, -13241724, -8205490, -1454353, 910461, -2381029, -6054270, -4681776, 667633, 4517795, 4396653, 2560702, 908090, -1171191, -3087163, -2200820, 1051774, 1761033, -2491907, -7256071, -7543487, -4769345, -2886872, -1269746, 2615904, 6078848]
8662F078848k113988o009684k147610M213440L841892k545548o034377l000022
8654g717049J470741L123465L383393L458085J124585l579226n582889j885446
8646f204341K961402L001891n41368j674678J043495K788435M80245k163243j77237
8637d85399M901519O642395K532059k649785l659182j682735j354381l265875
8629I78616l954206k458657j550141j743535J34930M091120M637754m36016m459512
8620d759647j158538M855130M548736j447227m156190p91370J724524o31119k465393
8611d281094P66167M418800K729536j366242j670974Q33502O74833k110274k534271
8602b540017K04685J627390k0366j397370n22867M29249J45104M41040J705157
$$ y = [6078848, 3964860, -2044824, -4192434, 21006, 3862898, 1317350, -4717027, -7717049, -6246308, -3122843, 260550, 3718635, 4843220, 1263994, -4318895, -6204341, -3242939, -241048, -782416, -2457094, -1413599, 1374836, 1855081, -308162, -485399, 4416120, 11058515, 13590574, 10940789, 7281607, 5598872, 4244491, 978616, -2975590, -5434247, -6984388, -8727923, -8592993, -4501873, 135881, -300135, -4759647, -5918185, -1063055, 3485681, 2038454, -2117736, -2909106, -1184582, -1815701, -4281094, -3514927, 903873, 3633409, 2267167, 596193, 1429695, 2104528, -5746, -2540017, -2335332, -707942, -728308, -2125678, -2648545, -2219296, -2074192, -1633152, 72005]
8593G2005J286403j155780j603490J784490M410681J673690l555252m695738r67929
8584b750920J797324j76540l515619k891832J556783M531252K467722k053380
8576a035210l585755m83210L267970L199505j78022k460986r94610K412109M174867
8567D316658K628114r63879l589875k830904M83736K418603N30989k478834k269705
8558a755097P94319K355495Q78541o78120p61423j682454l894069l048232K972351
8549d818689Q283901N984491j480986n066210j496029L129814K863747n47965
8541F852074j969707l40544J484968J638900N94555j009731k873304l755401k293946
8532a672136L98414R41348k173595n676529m654583J181539O318864N916578J716166
$$ y = [72005, 1358408, 202628, -1400862, 383628, 4794309, 6467999, 2912747, -1782991, -2750920, -953596, -1130136, -4645755, -7537587, -5980804, -1449552, 1018170, -1035210, -4620965, -5104175, -1836205, 1363300, 1185278, -1275708, -2270318, 141791, 4316658, 6944772, 5980893, 2391018, -439886, 43850, 2462453, 2993442, 514608, -1755097, -960778, 1394717, 2273258, 1595138, 833715, -848739, -4742808, -7791040, -4818689, 3465212, 9449703, 7968717, 2902507, 1406478, 4536292, 7400039, 6852074, 4882367, 4541823, 6026791, 7665691, 8260246, 7250515, 4377211, 621810, -1672136, -1273722, -332374, -2505969, -8182498, -12837081, -11655542, -5336678, 579900, 2296066]
8523B296066j015372r91777j317219k701507j667822K540452M720654J390719
8515C254194k861085k102072J445826J233157k571411l491002J90148K665013
8507b237232N63350j642883M02023L598642K589855j871859m454713k722644P65734
8498e009727K432556J175712r95526p12120K594369M431233O80722m953821m505425
8489d862027K289877O496156L166761j633423j782171j045054m472131p045969
8481h887981j499645P139166P066052j678058o564548j854327L632286J957952
8473f89103k010402p86362K921693K221091j651351k304195M57146J243431r59771
8464a557823j863881l83192k58208k382976k594417Q40521L562659J860543j718427
$$ y = [2296066, 1280694, 288917, -1028302, -3729809, -5397631, -2857179, 1863475, 3254194, 393109, -1708963, -263137, 970020, -1601391, -5092393, -4902245, -2237232, -1673882, -3316765, -2914742, 683900, 3273755, 1401896, -3052817, -5775461, -5009727, -2577171, -1401459, -2396985, -3109105, -514736, 3916497, 4597219, -356602, -4862027, -2572150, 3924006, 7090767, 5457344, 3675173, 2630119, -1842012, -8887981, -10387626, -3248460, 3817592, 2139534, -4425014, -6279341, -2647055, -689103, -2699505, -3485867, -564174, 1656917, 5566, -2298629, -1841483, -598052, -1557823, -3421704, -3804896, -4063104, -6446080, -9040497, -8199976, -4637317, -2776774, -4495201]
8455d495201k736259r95909J066917K801622M263662L329076j429301o142319
8447d337712m851523K057679O879172L992297k909239n705759j924473L264734
8439c534824M320572J332715j761463k302932q57103L89842j39900j896177k266644
8430f715914N92992M501494M819528N09370l575771k676441J416240K900955p2475
8421A699978l461064l387846p95158R87064P13602j95026P4401J901897L563772
8412A101620K308901k186205n709672l614839K617724O215086L768388l81807
8404D119196p14368J726277J733623j937424n044915m092518m66153K295860K683060
8395C02638J684383Q97418J061147J406316K47062k647505m507420k243262K979923
$$ y = [-4495201, -7231460, -8227369, -7160452, -4358830, -95168, 3233908, 1804607, -4337712, -9189235, -7131556, -252384, 3739913, 830674, -4875085, -6799558, -3534824, 785748, 2118463, 357000, -1945932, -2803035, -2413193, -2553093, -4449270, -6715914, -6122922, -1621428, 3198100, 3707470, 131699, -2544742, -1128502, 1772453, 1699978, -1761086, -5148932, -5944090, -4957026, -4243424, -4438450, -4364049, -2462152, 1101620, 3410521, 1224316, -4485356, -8100195, -5482471, 732615, 4501003, 4119196, 3404828, 5131105, 6864728, 4927304, -117611, -4210129, -4676282, -2380422, 302638, 1987021, 2884439, 3945586, 5351902, 5598964, 2951459, -1555961, -3799223, -819300]
8386h19300N852170K836208l344773o667267m593022k48147K177734K369976K944658
8377E08237M698683N183723K572780j235423l147798l010863k797925k640259
8369A31155q74686J889626K309430p17757l671128l100855k77616J240060O52082
8360b419689j44394n3760O10468J761465K867605J754718k575665o540193n133625
8351i873070J133804N971730N088512J146692p18860L50976J179664K480j199618
8342C082310n5085K382477K557638q68430m417263l494423J351097M250727J508629
8333F297677l170993l779551m22879J480587k63124j834838k91011J547942R6298
8324c39892k623099j720572L013440O297156M222151r75996l952833k388513J046178
$$ y = [-819300, 5032870, 7869078, 4524305, -2142962, -6735984, -6984131, -4806397, -2436421, 508237, 5206920, 10390643, 12963423, 11728000, 8580202, 5569339, 2771414, 131155, -743531, 1146095, 3455525, 2737768, -933360, -4034215, -4311831, -3071771, -2419689, -2564083, -2617843, -2007375, -245910, 2621695, 4376413, 1800748, -4739445, -9873070, -8739266, -2767536, 2320976, 3467668, 2748808, 3099784, 4279448, 4281928, 3082310, 3027225, 5409702, 7967340, 7098910, 2681647, -812776, 538321, 4789048, 6297677, 3126684, -652867, -1075746, 404841, 141717, -1693121, -1984132, -436190, -339892, -2962991, -4683563, -1670123, 4627033, 8849184, 7873188, 3920355, 1531842, 2578020]
8315B578020K317568O30897j306339j458795j219320k581821m233170l420010
8307h692970q98357j00484j071462K48572N034813Q462243O612328K354383K47384
8298A2196450o89603l663535o343205l376604L783462O653102J255521n875910
8290C939678o421575p20467M231254M263731J486558l88575n86655r19235k879005
8281B005709n553974o061816k648201K557916N245723L730823N07858j326712
8273a542674j251806l98305K88224O4533j174571j557263J063355M928876N103131
8264E523500L68061l992082l336518m36119q82578m094852m256563L86841M615081
8255f105229L819078M6858j799532o21229Q13044O99194K99798J308537K873094
$$ y = [2578020, 4895588, 5526485, 4220146, 2761351, 1542031, -1039790, -5272960, -8692970, -9591327, -9691811, -10763273, -10514701, -5479888, 2982355, 9594683, 11949066, 12196450, 11506847, 7843312, 1500107, -1876497, 1906965, 8560067, 9815588, 3939678, -2481897, -3202364, 1028890, 5292621, 6779179, 6390604, 5803949, 4884714, 2005709, -3548265, -9610081, -12258282, -9700366, -4454643, -723820, -215962, -1542674, -2794480, -3192785, -2904561, -2840028, -4014599, -5571862, -4508507, 420369, 5523500, 5891561, 1899479, -1437039, -1873158, -2755736, -6850588, -11107151, -10720310, -6105229, -2286151, -2239293, -4038825, -4660054, -3847010, -3147816, -2848018, -1539481, 1333613]
8246A333613K283190j287956m634715l801136M06640K834421J196216m35702J675048
8237d30381M156745J636399l526565l499380K811039P015683L295070l243296
8229H215314m613300j183309Q17867m39635j098743O59036J786694J07200j878557
8220B372567q49350K603548M956248L881931K20031l212130m133472k668956q16493
8211B353924Q5588N54293J284760J722598J188855l8391j632649l410099l877948
8202a769069j355976K118455J643977l231876o063813k409842K718418K009666
8194f340060k706472l551403M85627K355828o53004k299814J585198N584584L551154
8185a988362j465829k659454j37289Q55884p06184j177661M47807J519468J462955
$$ y = [1333613, 3616803, 2328847, -2305868, -6107004, -5700364, -2865943, -1669727, -2105429, -430381, 3726364, 5362763, 1836198, -1663182, 1147857, 8163540, 11458610, 8215314, 3602014, 2418705, 3236572, 2796937, 1698194, 2357230, 4143924, 4251124, 2372567, 1523217, 4126765, 9083013, 12964944, 13184975, 9972845, 5839373, 3170417, 2353924, 2439512, 2993805, 4278565, 6001163, 7190018, 7151627, 5518978, 2108879, -1769069, -3125045, -1006590, 637387, -2594489, -8658302, -11068144, -8349726, -6340060, -9046532, -12597935, -12112308, -9756480, -10409484, -12709298, -11124100, -5539516, -1988362, -3454191, -6113645, -6250934, -5395050, -6101234, -7278895, -6831088, -5311620, -3848665]
8176c848665K237608L056852R37516k701289k412594K322340M742803Q08923m031663
8167A111831k899355K128965L759077Q15286j154453M0485r1799l944638o298679
8158f533280k189715M252976M969609r6501k905350M90238M271015K256296k628945
8149A886343l456018k42621P76765k251197l831399k74751M225480M201159J148089
8140B181850N08273L045265M227194J406334k860043n086079m866382l585396
8132e028984j941225k03692R43976J188987J105784J142577J182702J527320K848987
8123B766432M448476M091912Q85111k706922l241354l68183K781797L301139J412021
8114A3370429p30776j985634k799775l387712l049229j784756j000309j406333
$$ y = [-3848665, -1611057, 1445795, 2383311, -317978, -2730572, -408232, 4334571, 5143494, 1111831, -1787524, 341441, 4100518, 4915804, 3761351, 3801836, 3710037, -234601, -6533280, -8722995, -4470019, 499590, 403089, -2502261, -2012023, 2258992, 4515288, 1886343, -1569675, -1812296, -1035531, -3286728, -7118127, -7392878, -3167398, 1033761, 2181850, 2690123, 5735388, 9962582, 11368916, 8508873, 3422794, -1443588, -5028984, -6970209, -7173901, -6229925, -5040938, -3935154, -2792577, -1609875, -82555, 2766432, 7214908, 11306820, 12191931, 9485009, 6243655, 5875472, 8657269, 11958408, 13370429, 12639653, 10654019, 7854244, 4466532, 1417303, -367453, -1367762, -2774095]
8106b774095j567603k83364Q24280l51232k227061j056692L086550N458660L118282
8097D227725j085023k964519k310331j251928l16429O62485K65943k171458l977351
8088h920886k727543m90047k79068k91193L003950P364559O730906Q02938l841529
8079A352087l520147j884920k254383k101724Q59065L132740J495623k76461K595916
8070f02204O573329M155739l672369p243758j746683N806011O255400p3334n481325
8061C970806n412330k299634q4242P45163J612275K311964J408208p07907j540967
8052C336J46570K518852L354578K712814J135634k408687p281309q133964j046470
8043h998646P797537P239248k788962q558237j247151R359497Q435064k385031
$$ y = [-2774095, -4341698, -4625062, -3800782, -4152014, -6379075, -7435767, -4349217, 1109443, 4227725, 3142702, 178183, -2132148, -3384076, -3700505, -3038020, -2772077, -4943535, -8920886, -11648429, -12138476, -12417544, -12708737, -9704787, -2340228, 4390678, 5193616, 1352087, -2168060, -4052980, -6307363, -8409087, -7550022, -4417282, -2921659, -3198120, -602204, 5971125, 10126864, 6454495, -789263, -2535946, 3270065, 9525465, 9452131, 3970806, -1441524, -3741158, -3825400, -3080237, -1467962, 844002, 2252210, 1544303, 3336, 149906, 2668758, 6023336, 8736150, 9871784, 7463097, 181788, -7952176, -8998646, -1201109, 6038139, 3249177, -5309060, -6556211, 2803286, 11238350, 8853319]
8035H853319q244501l300935K688104J309350k911305k630662M86537R98151m78244
8026c230186j96553R72530J4761j612013p05662J073772m1122k591491j848204
8017h164168K082846M291059K703743J17083j157149j496807j023673N84751J564160
8008d98155K04648r73013J527530N265121M341652j014628m012404j641998J322601
7999D521354Q21428p47903m88897k29742j540187j465865J576790K901057j348876
7990C999159o466835n402661L03356L074418J108677Q9365L026774N596928L604565
7981H933746o39875k405677j057114N60645P00319n6403p61657j174966j314836
7972B784182j099582n15632m5412o62235k336178k654184O31566M876455L946720
$$ y = [8853319, 608818, -2692117, -4013, 1305337, -1605968, -4236630, -3750093, -2751942, -3230186, -3426739, -2454209, -2439448, -4051461, -4757123, -3683351, -3724473, -6315964, -8164168, -6081322, -1790263, 913480, 1030563, -126586, -1623393, -2647066, -2062315, -498155, -293507, -1266520, 261010, 5526131, 9867783, 8853155, 4840751, 3198753, 4521354, 5342782, 4594879, 4105982, 3876240, 2336053, 870188, 2446978, 5348035, 3999159, -2467676, -7870337, -7566981, -4492563, -3383886, -3294521, -267747, 5329181, 8933746, 8293871, 5888194, 4831080, 5391725, 6092044, 6035641, 5273984, 4099018, 2784182, 1684600, 1168968, 1123556, 461321, -1874857, -4529041, -3897475, 978980, 4925700]
7963D925700l070390q272652m517627M240099P927197M048518k71798R0757J847343
7954F947147P05104j408216p49563J342521R27761j936207l709908k992372j584932
7945b458665o34865O94276K508154K966855P95301k443660l642009j584194J366489
7936b432318J755157n46030j918131k93203J214506j045412m706508m096104Q41146
7927a1226897L728947J203096k130429r35478L308407N727937N219120L848735
7919H743438K026692r06609l067560j873522J086363J338789k085883n115396
7911A46312m214446p61698J202024j04458k537404k739875j02851K483228K583768
7902d045400J772018K772160M049492J590116l611753n304578j282307K697188
$$ y = [4925700, 1855310, -6417342, -10934969, -6694870, 1232327, 5280845, 5009047, 5099804, 6947147, 7652251, 6244035, 5494472, 6836993, 7764754, 5828547, 2118639, -873733, -2458665, -3093530, -2399254, 108900, 3075755, 3871056, 1427396, -2214613, -3798807, -2432318, -677161, -1223191, -3141322, -3434525, -2220019, -3265431, -7971939, -12068043, -11226897, -7497950, -6294854, -8425283, -9360761, -6052354, -324417, 4894703, 8743438, 10770130, 9863521, 6795961, 4922439, 6008802, 7347591, 5261708, 146312, -4068134, -4829832, -3627808, -3732266, -6269670, -9009545, -9112396, -6629168, -4045400, -2273382, 498778, 4548270, 6138386, 2526633, -2777945, -4060252, -1363064]
7894a363064J786386p47570m6681K013966J451928L91187K676695M817526O51665
7885A1632038o673665p530891j046892K693529j747561p015004n085816Q21018
$$ y = [-1363064, 423322, -324248, -370929, 1643037, 3094965, 3486152, 6162847, 10980373, 11632038, 4958373, -2572518, -3619410, -925881, -2673442, -9688446, -14774262, -13953244]
$$ [...]
##END NTUPLES=NMR SPECTRUM
##END=
