##TITLE=31Pdec_SR73
 d2o, 24 sc
 3.08.2021
##JCAMPDX= 6.0         $$ Bruker NMR JCAMP-DX V2.0
##DATA TYPE= NMR SPECTRUM
##DATA CLASS= NTUPLES
##ORIGIN= UXNMR, Bruker Analytische Messtechnik GmbH
##OWNER= root
$$ XWIN-NMR		Version 3.5
$$ Tue Aug  3 13:04:44 2021 Russian Standard Time (UT+4h)  she@DPX200
##.OBSERVE FREQUENCY= 81.013821
##.OBSERVE NUCLEUS= ^31P
##.ACQUISITION MODE= SIMULTANEOUS
##.ACQUISITION SCHEME= undefined
##.AVERAGES= 24
##.DIGITISER RES= 16
##SPECTROMETER/DATA SYSTEM= spect
##.PULSE SEQUENCE= zgpg30
##.SOLVENT NAME= CDCl3
##.SHIFT REFERENCE= (INTERNAL, CDCl3, 0, 248.564)
##AUDIT TRAIL= $$ (NUMBER, WHEN, WHO, WHERE, WHAT)
$$ ##TITLE= Audit trail, XWIN-NMR		Version 3.5
$$ ##JCAMPDX= 5.01
$$ ##ORIGIN= Bruker BioSpin GmbH
$$ ##OWNER= she
$$ F:/spectra/data/she/nmr/P31/1/pdata/1/auditp.txt
$$ ##AUDIT TRAIL=  $$ (NUMBER, WHEN, WHO, WHERE, WHAT)
(   1,<2021-08-03 13:03:43.84 +0400>,<she>,<DPX200>,
      <created by zg, POWCHK disabled, PULCHK disabled
       configuration hash MD5:
       00 E9 B6 7A A2 85 ED C7 34 08 36 98 17 FE 4E 26
       data hash MD5: 32K
       71 0D 77 F8 CD 80 8D F0 2B DD 60 EA 6B 34 94 55>)
(   2,<2021-08-03 13:03:46.75 +0400>,<she>,<DPX200>,
      <Start of raw data processing
       efp BC_mod = 2 LB = 1 FT_mod = 6 PKNL = 1 PHC0 = -7750.78 PHC1 = 960.8745 SI = 64K 
       data hash MD5: 64K
       63 E7 BC 07 30 8A C9 39 F6 E4 E2 93 C5 63 4D 74>)
(   3,<2021-08-03 13:04:14.65 +0400>,<she>,<DPX200>,
      <pk PHC0 = 48.35985 PHC1 = -143 
       data hash MD5: 64K
       F8 19 99 89 78 F8 09 D9 61 A4 22 34 C3 40 68 99>)
$$ ##END=
$$ 
$$ hash MD5
$$ 7D 73 FC 45 3A FD 61 C7 62 88 20 F6 B7 16 52 E6
##$RELAX= 
##$RELAX= 
##$RELAX= 
##$RELAX= 
##$RELAX= 
##$RELAX= 
##$RELAX= 
##$RELAX= 
$$ Bruker specific parameters
$$ --------------------------
##$DU= <F:/spectra>
##$EXPNO= 1
##$NAME= <P31>
##$PROCNO= 1
##$TYPE= <nmr>
##$USER= <she>
##$AMP= (0..31)
100 100 100 100 100 100 100 100 100 100 100 100 100 100 100 100 100 100 
100 100 100 100 100 100 100 100 100 100 100 100 100 100 
##$AQSEQ= 0
##$AQ_mod= 1
##$AUNM= <au_zg>
##$AUTOPOS= <>
##$BF1= 81.014009
##$BF2= 200.13
##$BF3= 200.13
##$BF4= 200.13
##$BF5= 200.13
##$BF6= 200.13
##$BF7= 200.13
##$BF8= 200.13
##$BYTORDA= 1
##$CFDGTYP= 0
##$CFRGTYP= 5
##$CHEMSTR= <none>
##$CNST= (0..31)
1 1 145 1 1 1 1 1 1 1 1 1 1 1 1 1 1 1 1 1 1 1 1 1 1 1 1 1 1 1 1 1 
##$CPDPRG= <waltz16>
##$CPDPRG1= <>
##$CPDPRG2= <waltz16>
##$CPDPRG3= <>
##$CPDPRG4= <mlev>
##$CPDPRG5= <mlev>
##$CPDPRG6= <mlev>
##$CPDPRG7= <mlev>
##$CPDPRG8= <mlev>
##$CPDPRGB= <>
##$CPDPRGT= <>
##$D= (0..31)
0 1 0 0 0 0 0 0 0 0 0 0.03 2e-05 3e-06 0 0 0 0 0 0 0 0 0 0 0 0 0 0 0 0 
0 0 
##$DATE= 1627981423
##$DBL= (0..7)
120 120 120 11 120 120 24 19 
##$DBP= (0..7)
150 150 150 150 150 150 150 150 
##$DBP07= 0
##$DBPNAM0= <>
##$DBPNAM1= <>
##$DBPNAM2= <>
##$DBPNAM3= <>
##$DBPNAM4= <>
##$DBPNAM5= <>
##$DBPNAM6= <>
##$DBPNAM7= <>
##$DBPOAL= (0..7)
0.5 0.5 0.5 0.5 0.5 0.5 0.5 0.5 
##$DBPOFFS= (0..7)
0 0 0 0 0 0 0 0 
$$ [...]
##$SUBNAM2= <"">
##$SUBNAM3= <"">
##$SUBNAM4= <"">
##$SUBNAM5= <"">
##$SUBNAM6= <"">
##$SUBNAM7= <"">
##$SUBNAM8= <"">
##$SUBNAM9= <"">
##$SW= 501.771253377433
##$SWIBOX= (0..15)
0 1 3 0 0 0 0 0 0 0 0 0 0 0 0 0 
##$SW_h= 40650.406504065
##$TD= 32768
##$TD0= 1
##$TE= 0
##$TE2= 300
##$TE3= 300
##$TEG= 300
##$TL= (0..7)
0 120 53 12 22 120 120 120 
##$TP= (0..7)
150 150 150 150 150 150 150 150 
##$TP07= 0
##$TPNAME0= <>
##$TPNAME1= <>
##$TPNAME2= <>
##$TPNAME3= <>
##$TPNAME4= <>
##$TPNAME5= <>
##$TPNAME6= <>
##$TPNAME7= <>
##$TPOAL= (0..7)
0.5 0.5 0.5 0.5 0.5 0.5 0.5 0.5 
##$TPOFFS= (0..7)
0 0 0 0 0 0 0 0 
##$TUNHIN= 0
##$TUNHOUT= 0
##$TUNXOUT= 0
##$USERA1= <user>
##$USERA2= <user>
##$USERA3= <user>
##$USERA4= <user>
##$USERA5= <user>
##$V9= 5
##$VALIST= <valist>
##$VCLIST= <CCCCCCCCCCCCCCC>
##$VD= 0
##$VDLIST= <DDDDDDDDDDDDDDD>
##$VPLIST= <PPPPPPPPPPPPPPP>
##$VTLIST= <TTTTTTTTTTTTTTT>
##$WBST= 1024
##$WBSW= 4
##$XGAIN= (0..3)
0 0 0 0 
##$XL= 0
##$YL= 0
##$YMAX_a= 1542
##$YMIN_a= -1487
##$ZGOPTNS= <>
##$ZL1= 120
##$ZL2= 120
##$ZL3= 120
##$ZL4= 120
##$ABSF1= 0
##$ABSF2= 0
##$ABSG= 0
##$ABSL= 0
##$ALPHA= 0
##$AQORDER= 0
##$ASSFAC= 0
##$ASSFACI= 0
##$ASSFACX= 0
##$ASSWID= 0
##$AUNMP= <proc_1d>
##$AZFE= 0.1
##$AZFW= 0.5
##$BCFW= 0
##$BC_mod= 2
##$BYTORDP= 0
##$COROFFS= 0
##$CY= -3
##$DATMOD= 1
##$DC= 0
##$DFILT= <>
##$DTYPP= 0
##$F1P= 0
##$F2P= 0
##$FCOR= 1
##$FTSIZE= 65536
##$FT_mod= 6
##$GAMMA= 0
##$GB= 0
##$INTBC= 1
##$INTSCL= 5.30512e-09
##$ISEN= 30
##$LB= 1
##$LEV0= 0
##$LPBIN= 0
##$MAXI= 10000
##$MC2= 0
##$MEAN= 0
##$ME_mod= 0
##$MI= 50
##$NCOEF= 0
##$NC_proc= -8
##$NLEV= 6
##$NOISF1= 182.463
##$NOISF2= 159.3651
##$NSP= 0
##$NTH_PI= 0
##$NZP= 0
##$OFFSET= 248.5645
##$PC= 4
##$PHC0= -7702.42
##$PHC1= 817.8745
##$PH_mod= 1
##$PKNL= yes
##$PPARMOD= 0
##$PSCAL= 0
##$PSIGN= 0
##$REVERSE= no
##$SF= 81.014009
##$SI= 65536
##$SIGF1= 159.3651
##$SIGF2= -187.1042
##$SINO= 113.3802
##$SIOLD= 16384
##$SREGLST= <1H.CDCl3>
##$SSB= 0
##$STSI= 65536
##$STSR= 0
##$SW_p= 40650.406504065
##$SYMM= 0
##$S_DEV= 0
##$TDeff= 32768
##$TDoff= 0
##$TI= <>
##$TILT= no
##$TM1= 0
##$TM2= 0
##$TOPLEV= 0
##$USERP1= <user>
##$USERP2= <user>
##$USERP3= <user>
##$USERP4= <user>
##$USERP5= <user>
##$WDW= 1
##$XDIM= 65536
##$YMAX_p= 495892322
##$YMIN_p= -20649552
$$ End of Bruker specific parameters
$$ ---------------------------------
##NTUPLES= NMR SPECTRUM
##VAR_NAME=  FREQUENCY,     SPECTRUM/REAL,   SPECTRUM/IMAG
##SYMBOL=    X,             R,               I
##VAR_TYPE=  INDEPENDENT,   DEPENDENT,       DEPENDENT
##VAR_FORM=  AFFN,          ASDF,            ASDF
##VAR_DIM=   65536,         65536,           65536
##UNITS=     HZ,            ARBITRARY UNITS, ARBITRARY UNITS
##FACTOR=    0.620285442955139, 1,           1
##FIRST=     20137.2065510759, 0,            0
##LAST=      -20513.1999529892, 0,           0
##MIN=       -20513.1999529892, -20649552,   0
##MAX=       20137.2065510759, 495892322,    0
$$ Real data points
##PAGE= N=1
##DATA TABLE= (X++(R..R)), XYDATA
$$ [...]
##PAGE= N=2
##DATA TABLE= (X++(I..I)), XYDATA
$$ plain form
13019 12325942 12865841 8002264 4447046 4265532 3790152 1515770 388255 1843322
13011 1843322 3179543 2306111 775717 426704 485551 -286201 -1349147 -1758917 -1423678
13002 -1423678 -49004 2580162 4528682 3112697 -537533 -1967909 -138278 440941
12994 440941 -2987061 -6320289 -4997985 -1644909 -1603412 -3538863 -1529565 4220155 6264666
12985 6264666 1104864 -5192312 -5805276 -2248202 -503446 -2029521 -3301331 -2059499
12977 -2059499 227569 1184690 -177094 -3137067 -5172923 -3598971 830287 3775271
12969 3775271 2623379 -360837 -2224888 -3592188 -5694513 -6353365 -3304905 753697
12961 753697 1274558 -1514480 -3987044 -5761551 -9269824 -13139410 -12342907 -6186758 -409946
$$ packed form
13019A2325942N39899m863577l555218j81514m75380k274382j127515J455067
13011A843322J336221q73432j530394l49013N8847p71752j062946m09770L35239
13002a423678J374674K629166J948520j415985l650230j430376J829631N79219
12994D40941l428002l333228J322304L353076M1497j935451K009298N749720K044511
12985F264666n159802o297176o12964L557074J744756j526075j271810J241832
12977b059499K287068R57121j361784k959973k035856J573952M429258K944984
12969C775271j151892k984216j864051j367300k102325o58852L048460M058602
12961G53697N20861k789038k472564j774507l508273l869586P96503O156149N776812
$$ plain form
12952 -409946 833319 -51607 207744 110979 -2633679 -5486482 -4325606 -120330 2297242
12943 2297242 1235602 -103740 1126395 3644543 4155738 1224900 -3344864 -5694068
12935 -5694068 -2745762 4619253 11426370 13067008 9783409 5627506 3565816 3238748
12927 3238748 3173976 2972825 2523843 807934 -2806252 -6521514 -6994620 -3009017 2465155
12918 2465155 4977653 3405411 1049800 1493984 4400828 6425709 5525919 2895404
12910 2895404 780973 -112526 -502188 -806684 -478627 913001 2380210 2012853 -649269
12901 -649269 -3379372 -3706182 -2169770 -1179082 -873475 824015 3366813 2723736 -2321892
12892 -2321892 -6796980 -6235832 -3657506 -4957744 -9424079 -10644091 -6360683 -1591024
$$ packed form
12952d09946J243265q84926K59351r6765k744658k852803J160876M205276K417572
12943B297242j061640j339342J230135K518148N11195k930838m569764k349204
12935e694068K948306P365015O807117J640638l283599m155903k061690l27068
12927C238748o4772k01151m48982j715909l614186l715262m73106L985603N474172
12918B465155K512498j572242k355611M44184K906844K024881q99790k630515
12910B895404k114431q93499l89662l04496L28057J391628J467209l67357k662122
12901f49269k730103l26810J536412R90688L05607J697490K542798o43077n045628
12892b321892m475088N61148K578326j300238m466335j220012M283408M769659
$$ plain form
12884 -1591024 -951241 -2958346 -3806830 -2735228 -1554421 -1898609 -4529792 -8712192 -11317506
12875 -11317506 -9393851 -4330757 -502803 557377 1229276 3012885 4885361 6734877
12867 6734877 9565560 11602261 9760343 6313078 7754033 14438520 17915204 12626640
12859 12626640 4242141 1259792 3654498 5744852 5678691 5266421 3805933 -641028
12851 -641028 -5558283 -6186324 -2677529 440244 1071617 752627 225669 -829897 -557038
12842 -557038 3013339 6870778 5268614 -2493918 -10771506 -14135772 -11595261 -5156448
12834 -5156448 1544167 4020856 917183 -3344563 -3992269 -2639466 -3944145 -7427643
12826 -7427643 -8566880 -6641560 -4707903 -2520849 2901524 9335309 10076705 4418282
$$ packed form
12884a591024O39783k007105q48484J071602J180807l44188k631183m182400k605314
12875a1317506J923655N063094L827954J060180O71899J783609J872476J849516
12867F734877K830683K036701j841918l447265J440955O684487L476684n288564
12859A2626640q384499k982349K394706K090354o6161m12270j460488m446961
12851f41028m917255o28041L508795L117773O31373l18990n26958j055566K72859
12842e57038L570377L857439j602164p762532q277588l364266K540511O438813
12834e156448O700615K476689l103673m261746o47706J352803j304679l483498
12826g427643j139237J925320J933657K187054N422373O433785P41396n658423
$$ plain form
12818 4418282 -301600 149742 1075772 -2168873 -6309912 -6036571 -1993701 2200812 6033561
12809 6033561 9817341 10349505 4608924 -4510820 -10854561 -11753006 -8775683 -4063145
12801 -4063145 642424 3386265 3640279 2989802 2261267 529821 -1385043 -310519 3830210
12792 3830210 6108541 3511377 -174403 -195450 2308307 3512104 3208178 3100184 2257130
12783 2257130 -418553 -2144383 -252807 2383192 1801033 422061 3394004 9006841
12775 9006841 10104204 5071849 297832 304967 1897254 711964 -1783769 -1437913 1965806
12766 1965806 4760799 4297560 1266738 -1957386 -3684686 -3900502 -3442200 -2361239 -93782
12757 -93782 2441334 3035498 1685254 1232498 2511034 1986004 -2713508 -8101313 -9671469
$$ packed form
12818D418282m719882M51342R26030l244645m141039K73341M042870M194513L832749
12809F033561L783780N32164n740581r119744o343741q98445K977323M712538
12801d063145M705569K743841K54014o50477p28535j731446j914864J074524M140729
12792C830210K278331k597164l685780k1047K503757J203797l03926j07994q43054
12783B257130k675683j725830J891576K635999n82159j378972K971943N612837
12775I006841J097363n032355m774017P135J592287j185290k495733L45856L403719
12766A965806K794993m63239l030822l224124j727300k15816M58302J080961K267457
12757i3782K535116N94164j350244m52756J278536n25030m699512n387805j570156
$$ plain form
12748 -9671469 -8365159 -7370375 -5550294 -407470 4539877 2932521 -4110270 -8242533
12740 -8242533 -5487789 -722241 1037725 959629 1324375 614542 -2331015 -4372962 -2749171
12731 -2749171 -149211 -1143179 -5985441 -10840884 -11967448 -7932683 -599699 4609098
12723 4609098 2980027 -3339185 -7226946 -5948327 -3893757 -4302816 -4256628 -1270143 1142720
12714 1142720 -538296 -3317188 -2826807 -829092 -1509724 -3755830 -3594397 -1683699 -1771864
12705 -1771864 -3637280 -4179890 -4051839 -6323847 -9412148 -8509765 -4111987 -1955062 -3616755
12696 -3616755 -4308946 -1636904 766886 1161917 3895076 10974978 15787025 11719364
12688 11719364 2938336 -480099 3775049 8145950 6504846 1356865 -1704543 -1576139
$$ packed form
12748i671469J306310R94784J820081N142824M947347j607356p042791m132263
12740h242533K754744M765548J759966p8096L64746p09833k945557k041947J623791
12731b749171K599960r93968m842262m855443j126564M034765P332984N208797
12723D609098j629071o319212l887761J278619K054570m09059M6188K986485K412863
12714A142720j681016k778892M90381J997715o80632k246106J61433J910698q8165
12705a771864j865416n42610J28051k272008l088301R02383M397778K156925j661693
12696c616755o92191K672042K403790L95031K733159P079902M812047m067661
12688A1719364q781028l418435M255148M370901j641104n147981l061408J28404
$$ plain form
12680 -1576139 -651189 387274 2864350 6195123 7149838 4025821 -400961 -1753690
12672 -1753690 743038 3540758 3346601 758250 -1563493 -2728124 -3657304 -4143264 -2535602
12663 -2535602 1052732 3471729 2062403 -1676654 -3666800 -2296290 -449151 -1885931
12655 -1885931 -6437139 -10083223 -10060353 -8406258 -8792008 -10705842 -9686697 -4021092 1925620
12646 1925620 3330879 1410329 1014281 3275366 4661477 3103551 903203 384014
12638 384014 218247 -1710152 -4225967 -4212181 -830269 3751447 7293716 9442879 10830615
12629 10830615 11448502 10370596 6916818 1965086 -2310777 -4381766 -4480607 -3353382
12621 -3353382 -1162133 1193960 1280445 -2045955 -6148288 -7758500 -7751019 -9339514 -12022396
$$ packed form
12680a576139R24950J038463K477076L330773R54715l124017m426782j352729
12672a753690K496728K797720j94157k588351k321743j164631r29180m85960J607662
12663b535602L588334K418997j409326l739057j990146J370510J847139j436780
12655a885931m551208l646084K2870J654095l85750j913834J019145N665605N946712
12646A925620J405259j920550l96048K261085J386111j557926k200348n19189
12638C84014j65767j928399k515815J3786L381912M581716L542269K149163J387736
12629A0830615O17887j077906l453778m951732m275863k070989r8841J127225
12621c353382K191249K356093Q6485l326400m102333j610212P481j588495k682882
$$ plain form
12612 -12022396 -11707534 -7512099 -3741884 -3187129 -2908407 340274 4500622 5958111
12604 5958111 5689552 6988437 9171144 8588206 5034730 2326098 2388152 3092065 2659295
12595 2659295 2337652 3430864 4869640 5276899 5034219 4983788 5073790 5283665 6002266
12586 6002266 6685942 5999189 3935021 1943679 576433 -885468 -2258985 -2576773 -2729193
12577 -2729193 -4730354 -7472640 -6991203 -2743485 357781 -903823 -2647987 168534
12569 168534 5416823 6708205 3075312 -54251 419058 1306303 -453592 -2462276 -1137045
12560 -1137045 2085395 2554065 -1111816 -5372959 -6163044 -3094340 357359 -83338 -5381069
12551 -5381069 -11495797 -13154326 -9881246 -6303762 -5682721 -5954924 -4050064 -1177535
$$ packed form
12612a2022396L14862M195435L770215N54755K78722L248681M160348J457489
12604E958111k68559J298885K182707n82938l553476k708632O2054P03913m32770
12595B659295l21643J093212J438776M07259k42680n0431R0002K09875P18601
12586F002266O83676o86753k064168j991342j367246j461901j373517l17788j52420
12577b729193k001161k742286M81437M247718L101266j261604j744164K816521
12569A68534N248289J291382l632893l129563M73309Q87245j759895k008684J325231
12560a137045L222440M68670l665881m261143p90085L068704L451699m40697n297731
12551e381069o114728j658529L273080L577484O21041k72203J904860K872529
$$ plain form
12543 -1177535 -620864 -2321750 -3345220 -2560609 -1205400 411595 2868454 4564385
12535 4564385 2804435 -1538223 -4282919 -3736138 -2532742 -2662868 -2664325 -1491878 -1217591
12526 -1217591 -3396043 -6184138 -7642810 -8410479 -8329434 -4596932 2596128 6673058 2761958
12517 2761958 -3715148 -3525527 2636452 4669253 -1917681 -9322917 -8942523 -2868721
12509 -2868721 1052168 727981 186023 1013858 9937 -4294441 -7889531 -6231826 -264629
12500 -264629 4640376 4706487 1156827 -2153500 -3110997 -2411562 -961100 1707384 5576504
12491 5576504 8865294 10632067 12719675 16174203 17560844 13110912 5561548 1740240
12483 1740240 3303294 5483627 5784686 7226373 10478992 9921610 2434267 -5833865
$$ packed form
12543a177535N56671j700886j023470P84611J355209J616995K456859J695931
12535D564385j759950m342658k744696N46781J203396j30126j457J172447K74287
12526a217591k178452k788095j458672p67669Q1045L732502P193060M076930l911100
12517B761958o477106J89621O161979K032801o586934p405236L80394O073802
12509b868721L920889l24187n41958Q27835j003921m304378l595090J657705N967197
12500b64629M905005O6111l549660l310327r57497O99435J450462K668484L869120
12491E576504L288790J766773K087608L454528J386641m449932p549364l821308
12483A740240J563054K180333L01059J441687L252619n57382p487343q268132
$$ plain form
12475 -5833865 -7591630 -4566553 -2987934 -3244962 -1762478 249677 -1066917 -3171830
12467 -3171830 10827 6154908 5621031 -3253932 -9762363 -6256316 620150 550510 -5293528
12458 -5293528 -7438580 -2429158 3697218 4721460 832929 -3722553 -4963426 -1374812
12450 -1374812 4615013 7699788 4997987 -471891 -3776369 -3830615 -2700098 -1384352
12442 -1384352 317697 1455202 1002127 116970 257629 482347 -336973 -542365 1415848
12433 1415848 3041744 1091620 -2708592 -4027869 -2895952 -2947847 -4116498 -2083422
12425 -2083422 3867060 8146899 6542124 2070800 80252 944477 1106662 -736712
12417 -736712 -1897467 289538 4719596 7101472 4175698 -2326159 -6962921 -7077898
$$ packed form
12475e833865j757765L025077J578619k57028J482484K012155j316594k104913
12467c171830L182657O144081n33877q874963o508431L506047O876466o9640n844038
12458e293528k145052N009422O126376J024242l888531m555482j240873L588614
12450a374812N989825L084775k701801n469878l304478n4246J130517J315746
12442a384352J702049J137505m53075q85157J40659K24718q19320k05392J958213
12433A415848J625896j950124l800212j319277J131917n1895j168651K033076
12425b083422N950482M279839j604775m471324j990548Q64225J62185j843374
12417g36712j160755K187005M430058K381876k925774o501857m636762j14977
$$ plain form
12409 -7077898 -6155605 -8077797 -10358854 -7907283 -2259680 -624879 -4851428 -8094100
12401 -8094100 -5431572 -1567512 -3019021 -7447005 -7209606 -1155222 3693192 2248526
12393 2248526 -2218134 -3373515 19239 3538188 3199640 100047 -1474259 172676
12385 172676 2015193 1207967 79370 2749698 7808139 9390914 6175168 3666815
12377 3666815 5356099 7416353 5940770 3782897 4768662 6008493 2897037 -1815714
12369 -1815714 -1893384 1411734 673242 -5629467 -10644170 -10070861 -7677678 -7250208 -6347531
12360 -6347531 -2196810 2320703 3666856 3949200 6726976 9856026 8285931 2306225
12352 2306225 -2300416 -1987566 990021 3025777 3566930 4029684 4842471 5106121 4210790
$$ packed form
12409g077898R22293j922192k281057K451571N647603J634801m226549l242672
12401h094100K662528L864060j451509m427984K37399O054384M848414j444666
12393B248526m466660j155381L392754L518949l38548l099593j574306J646935
12385A72676J842517q07226j128597K670328N058441J582775l215746k508353
12377C666815J689284K060254j475583k157873R85765J239831l111456m712751
12369a815714p7670L305118p38492o302709n014703N73309K393183M27470R02677
12360f347531M150721M517513J346153K82344K777776L129050j570095n979706
12352B306225m606641L12850K977587K035756N41153M62754Q12787K63650q95331
$$ plain form
12343 4210790 2700381 1456974 388299 -1285312 -2941458 -2087724 2272281 7004623
12335 7004623 8350940 7297643 7805428 9844506 8788503 2953741 -2956470 -4410751
12327 -4410751 -2920049 -2273562 -2688405 -2431311 -1956702 -2111395 -869908 3444893 7615033
12318 7615033 7036618 2531144 -1068252 -2206972 -3522254 -5812462 -6333248 -3909903
12310 -3909903 -1050697 471049 2059905 4573083 5763411 3637928 -321901 -3257579
12302 -3257579 -4111527 -3234186 -974559 1876909 4084060 5438941 6339912 5491777 1030492
12293 1030492 -4972104 -6752899 -2181595 3035981 1866087 -5045012 -10278034 -8728839
12285 -8728839 -2567258 2775890 4493485 3305655 749222 -2500051 -5942846 -8181031
$$ packed form
12343D210790j510409j243407j068675j673611j656146Q53734M360005M732342
12335G004623J346317j053297N07785K039078j056003n834762n910211j454281
12327d410751J490702O46487m14843K57094M74609j54693J241487M314801M170140
12318G615033n78415m505474l599396j138720j315282k290208n20786K423345
12310c909903K859206J521746J588856K513178J190328k125483l959829k935678
12302c257579q53948Q77341K259627K851468K207151J354881R00971q48135m461285
12293A030492o002596j780795M571304N217576j169894o911099n233022J549195
12285h728839O161581N343148J717595j187830k556433l249273l442795k238185
$$ plain form
12277 -8181031 -7518526 -4095846 -855036 -1089398 -4812291 -8752765 -10259961 -9738780 -8649530
12268 -8649530 -7043915 -4667406 -2986010 -3771580 -6100597 -6979808 -5328045 -3524010
12260 -3524010 -4018910 -5664650 -4989894 -959750 3127167 3470312 516939 -1882170 -1932643
12251 -1932643 -2160494 -5093215 -9026765 -10577189 -9846730 -9668212 -10227976 -8258895 -2399591
12242 -2399591 4109705 7800123 9223548 10671146 11959287 11191100 8372904 5600462
12234 5600462 4030915 2681721 280823 -2912777 -5155412 -4640690 -1398268 2108649
12226 2108649 3340839 2569411 1742438 752622 -2246076 -6286483 -7106169 -3148228 1506377
12217 1506377 2996751 3058468 4838590 6602905 4815469 1441730 2030749 6724461 9200782
$$ packed form
12277h181031O62505L422680L240810k34362l722893l940474j507196N21181J089250
12268h649530J605615K376509J681396p85570k329017q79211J651763J804035
12260c524010m94900j645740O74756M030144M086917L43145k953373k399109n0473
12251a932643k27851k932721l933550j550424P30459J78518n59764J969081N859304
12242b399591O509296L690418J423425J447598J288141p68187k818196k772442
12234E600462j569547j349194k400898l193600k242635N14722L242422L506917
12226B108649J232190p71428q26973r89816k998698m040407q19686L957941M654605
12217A506377J490374O1717J780122J764315j787436l373739N89019M693712K476321
$$ plain form
12208 9200782 5908014 1031212 -153068 1534110 1786186 -643476 -3458587 -4848212
12200 -4848212 -4812678 -3569426 -1275663 1085614 2283032 1911972 -37910 -3632983 -7924226
12191 -7924226 -10596582 -10030734 -7037738 -3788450 -1882259 -1726799 -2230509 -735711 4476577
12182 4476577 10664343 12201216 7443112 1601834 353994 2625785 2709818 -1823607
12174 -1823607 -7589418 -10249665 -8975225 -6013173 -4196508 -5081326 -7721286 -9327322
12166 -9327322 -8559177 -7336743 -7583318 -7611144 -4660013 124378 3077177 3949614 5970744
12157 5970744 9323143 9372928 3563904 -4116083 -8546818 -9791227 -10471043 -10041299 -6276887
12148 -6276887 -527745 3318619 4286149 4312130 3485122 239114 -3505417 -2786449 3025792
$$ packed form
12208I200782l292768m876802j184280J687178K52076k429662k815111j389625
12200d848212L5534J243252K293763K361277J197418l71060j949882l595073m291243
12191g924226k672356N65848K992996L249288J906191J55460n03710J494798N212288
12182D476577O187766J536873m758104n841278j247840K271791Q4033m533425
12174a823607n765811k660247J274440K962052J816665q84818k639960j606036
12166i327322P68145J222434k46575k7826K951131M784391K952799Q72437K021130
12157E970744L352399M9785n809024p679987m430735j244409o79816M29744L764412
12148f276887N749142L846364R67530K5981q27008l246008l744531P18968N812241
$$ plain form
12139 3025792 7941309 7043158 2633943 -147734 -207865 522591 1663042 3369120 3028410
12130 3028410 -1723996 -7355121 -6945009 816006 9189859 11240205 6984395 1609914
12122 1609914 -484021 1396363 4536238 4545918 -891253 -8628163 -12458667 -9950682 -4657988
12113 -4657988 -775696 1269631 2336537 1243241 -2881711 -7187018 -7536630 -3461737
12105 -3461737 1861412 5648943 7280844 7089735 5725873 4075902 2092563 -1209827
12097 -1209827 -5090664 -6374148 -3722791 -655865 -1335555 -4943239 -7443901 -7423641 -6505107
12088 -6505107 -5222806 -2790322 -551461 -1286336 -4597884 -6701976 -5411863 -2135865
12080 -2135865 1208890 3776085 4237479 1632184 -1723467 -2136652 -13707 607114 -1298300
$$ packed form
12139C025792M915517q98151m409215k781677o0131P30456J140451J706078l40710
12130C028410m752406n631125M10112P761015Q373853K050346m255810n374481
12122A609914k093935J880384L139875R680n437171p736910l830504K507985N292694
12113d657988L882292K045327J066906j093296m124952m305307l49612M074893
12105c461737N323149L787531J631901j91109j363862j649971j983339l302390
12097a209827l880837j283484K651357L066926o79690l607684k500662K0260R18534
12088f505107J282301K432484K238861p34875l311548k104092J290113L275998
12080b135865L344755K567195M61394k605295l355651m13185K122945O20821j905414
$$ plain form
12071 -1298300 -2050495 531525 3782519 4746010 3711128 1479887 -2238370 -5698533
12063 -5698533 -5433040 -2288217 -1938887 -6254122 -9664518 -8008372 -5071417 -5136936 -4997067
12054 -4997067 -384236 4665819 3385563 -2076981 -3615442 -70452 1929262 -373843
12046 -373843 -2517294 -2088443 -2339552 -4096027 -2543004 3933560 9025663 7593966 3538420
12037 3538420 3189249 5631064 5453641 1804923 -1155298 -1172133 -342377 -1239015 -4070177
12028 -4070177 -7202880 -8223456 -5595464 -1098155 1138723 -179014 -1602318 -263684
12020 -263684 1721470 1038259 -1381905 -2429725 -2324252 -3803878 -6614061 -6842095 -2252344
12011 -2252344 4465969 8535423 7736921 4060241 1449457 1467669 1253479 -2479061 -7609731
$$ packed form
12071a298300p52195K582020L250994R63491j034882k231241l718257l460163
12063e698533K65493L144823L49330m315235l410396J656146K936955o5519J39869
12054d997067M612831N050055j280256n462544j538461L544990J999714k303105
12046c73843k143451M28851k51109j756475J553023O476564N092103j431697m055546
12037C538420l49171K441815j77423l648718k960221j6835Q29756q96638k831162
12028d070177l132703j020576K627992M497309K236878j317737j423304J338634
12020b63684J985154o83211k420164j047820J05473j479626k810183k28034M589751
12011b252344O718313M069454p98502l676680k610784J8212k14190l732540n130670
$$ plain form
12002 -7609731 -8311250 -3671375 -197401 -2752971 -7085440 -5823874 1103949 7152169
11994 7152169 8271188 6047808 2879809 -531586 -2924266 -2718781 -1226538 -1559823
11986 -1559823 -3873936 -5481895 -5783429 -6823050 -8588829 -8321483 -5413663 -2490113
11978 -2490113 -402719 3145702 8178595 10450188 7663769 3498995 2160180 2575958
11970 2575958 1695375 288306 1025057 2887120 2072928 -2224168 -6612073 -7883463 -5921046
11961 -5921046 -2673784 -537091 -1062984 -3184441 -3734802 -1715379 -246693 -1520553
11953 -1520553 -2079850 2408769 8953933 9551737 2527425 -4071594 -3169859 2016129 3674886
11944 3674886 978829 113713 3696783 6401430 3159791 -3103875 -5866464 -4282256
$$ packed form
12002g609731p01519M639875L473974k555570m332469J261566O927823O048220
11994G152169J119019k223380l167999l411395k392680K05485J492243l33285
11986a559823k314113j607959l01534j039621j765779K67346K907820K923550
11978b490113K087394L548421N032893K271593k786419m164774j338815M15778
11970B575958q80583j407069P36751J862063q14192m297096m387905j271390J962417
11961e921046L247262K136693n25893k121457n50361K019423J468686j273860
11953a520553n59297M488619O545164N97804p024312o599019R01735N185988J658757
11944C674886k696057q65116L583070K704647l241639o263666k762589J584208
$$ plain form
11936 -4282256 -3115052 -4071870 -2638766 4225655 11404360 10922570 2369066 -6213367
11928 -6213367 -7881114 -3502605 1888369 5614882 7805186 8162852 5991595 2740895
11920 2740895 1331517 2355874 3105344 1338497 -1499158 -2222722 -475373 311096 -2619348
11911 -2619348 -6867768 -6953708 -1629868 3084764 772401 -6686407 -11031183 -8503280
11903 -8503280 -4495785 -5254934 -9090998 -9974225 -7075340 -5199388 -6381639 -6857024 -3998879
11894 -3998879 -1331639 -3282645 -8187577 -10577852 -8890517 -6871815 -7439060 -8813854
11886 -8813854 -7955765 -5105918 -2884016 -2369011 -2267424 -1568979 -1179655 -2572069 -5905166
11877 -5905166 -9712771 -11576119 -9210347 -2408756 5530902 9839438 8936927 6056384
$$ packed form
11936d282256J167204r56818J433104O864421P178705m81790q553504q582433
11928f213367j667747M378509N390974L726513K190304L57666k171257l250700
11920B740895j409378J024357P49470j766847k837655p23564J747349P86469k930444
11911b619348m248420q5940N323840M714632k312363p458808m344776K527903
11903h503280M007495p59149l836064q83227K898885J875952j182251m75385K858145
11894c998879K667240j951006m904932k390275J687335K018702n67245j374794
11886h813854Q58089K849847K221902N15005J01587O98445L89324j392414l333097
11877e905166l807605j863348K365772O801591P939658M308536r02511k880543
$$ plain form
11869 6056384 5118823 6221723 6778189 5834002 4873871 4999123 5889671 7287462 8741741
11860 8741741 8018009 3217371 -2864271 -4290681 381200 5541710 5965828 3420974
11852 3420974 2698264 4181529 4584315 2957841 1315128 342675 -983234 -1892902 -263889
11843 -263889 3238167 5237371 4081979 910013 -3095188 -6504880 -5758739 918300
11835 918300 7905820 7208092 209333 -3002313 1444047 5381446 2711471 579122
11827 579122 7586957 17425037 16155012 3399064 -6118038 -3510844 3173926 3001374
11819 3001374 -2570641 -5241155 -3476473 -2337331 -3685975 -4504844 -3516840 -2800346 -2904120
11810 -2904120 -1737898 1061163 2791690 1473929 -1977124 -5480308 -7132444 -5455193
$$ packed form
11869F056384r37561J102900N56466r44187r60131J25252Q90548J397791J454279
11860H741741p23732m800638o081642j426410M671881N160510M24118k544854
11852C420974p22710J483265M02786j626474j642713r72453j325909r09668J629013
11843b63889L502056J999204j155392l171966m005201l409692P46141O677039
11835I18300O987520o97728o998759l211646M446360L937399k669975k132349
11827E79122P007835R838080j270025j2755948r517102K607194O684770j72552
11819C001374n572015k670514J764682J139142j348644q18869R88004P16494j03774
11810b904120J166222K799061J730527j317761l451053l503184j652136J677251
$$ plain form
11802 -5455193 -1256602 1524458 115706 -2816345 -2920484 -1130156 -1995647 -5413516
11794 -5413516 -5962196 -1704823 2433667 2794819 2716078 5979311 9531840 8240265 3400744
11785 3400744 605788 1442047 3249726 5450178 9547153 13282563 11649102 4938214
11777 4938214 -342185 -562288 688281 -109083 -515491 2506574 6281922 6565334 4446700
11768 4446700 3722441 3990965 2211326 -373705 846933 5875356 8882537 6468018
11760 6468018 2275943 1161670 2803191 3859201 3232787 1973510 188871 -2572249
11752 -2572249 -5008618 -5160468 -3419960 -1993999 -1495602 -354862 2055308 3826994
11744 3826994 3158402 1275845 1239688 4095894 7428154 8175238 6082039 3436348 1814373
$$ packed form
11802e455193M198591K781060j408752k932051j04139J790328q65491l417869
11794e413516n48680M257373M138490L61152p8741L263233L552529j291575m839521
11785C400744k794956Q36259J807679K200452M096975L735410j633461o710888
11777D938214n280399k20103J250569p97364m06408L022065L775348K83412k118634
11768D446700p24259K68524j779639k585031J220638N028423L007181k414519
11760F468018m192075j114273J641521J056010o26414j259277j784639k761120
11752b572249k436369j51850J740508J425961M98397J140740K410170J771686
11744C826994o68592j882557l6157K856206L332260P47084k093199k645691j621975
$$ plain form
11735 1814373 636619 -629247 -687882 1454397 3743723 2899709 -1043133 -4253660 -3797679
11726 -3797679 -1025701 539473 -845959 -4193154 -7262716 -7799335 -4566146 1252342
11718 1252342 6173905 7204243 4482943 688564 -1723857 -2210218 -1642383 -813633 501799
11709 501799 2750916 4678253 3587730 -705167 -3444652 123792 7294215 9587705
11701 9587705 3794527 -2690442 -1196148 6528458 10793917 6825660 -137107 -3084288
11693 -3084288 -1653932 -98477 -478690 -1178539 -586843 665031 1022336 -20898 -1353931
11684 -1353931 -1134164 1298155 4183545 4971433 3409658 1692999 1179755 761805 -559379
11675 -559379 -1484003 -697544 142892 -1686911 -5512547 -7347982 -5068509 -1382334 -381396
$$ packed form
11735A814373j177754j265866n8635K142279K289326q44014l942842l210527M55981
11726c797679K771978J565174j385432l347195l069562n36619L233189N818488
11718A252342M921563J030338k721300l794379k412421m86361N67835Q28750J315432
11709E01799K249117J927337j090523m292897k739485L568444P170423K293490
11701I587705n793178o484969J494294P724606M265459l968257o962767k947181
11693c084288J430356J555455l80213o99849N91696J251874L57305j043234j333033
11684a353931K19767K432319K885390P87888j561775j716659n13244m17950j321184
11675e59379r24624P86459Q40436j829803l825636j835435K279473L686175J000938
$$ plain form
11666 -381396 -2582194 -5028276 -5549929 -4983758 -4914300 -4914359 -3282259 167003 3371593 4129264
11656 4129264 2056625 -1539100 -4696342 -5523288 -3232247 639513 2954536 2053980
11648 2053980 -306402 -919655 1480362 5496010 8821409 9564688 6824045 1837944
11640 1837944 -1819829 -1233772 2441901 5249514 5253261 4182516 3847497 3221991 581798
11631 581798 -3023463 -4382141 -1854459 2679777 5527770 4390124 253264 -3673662
11623 -3673662 -5353494 -5998306 -7809548 -10234057 -10452102 -7597919 -4067982 -1968991
11615 -1968991 -797411 236943 380357 -276815 685633 4377043 7713177 7417435 5077623
11606 5077623 4415509 4822879 2174802 -4016595 -8945672 -9223066 -7171172 -6399697 -6500046
$$ packed form
11666c81396k200798k446082n21653N66171O9458n9J632100L449262L204590P57671
11656D129264k072639l595725l157242q26946K291041L871760K315023r00556
11648B053980k360382o13253K400017M015648L325399P43279k740643m986101
11640A837944l657773N86057L675673K807613L747j070745l35019o25506k640193
11631E81798l605261j358678K527682M534236K847993j137646m136860l926926
11623c673662j679832o44812j811242k424509k18045K854183L529937K098991
11615a968991J171580J034354J43414o57172R62448L691410L336134k95742k339812
11606E077623o62114M07370k648077o191397m929077k77394K051894P71475j00349
$$ plain form
11597 -6500046 -4870197 -1422594 1537269 2937888 3882231 5314549 6465406 5628112
11589 5628112 1928911 -3025789 -5221966 -1711215 5273738 9569940 7589219 1850635
11581 1850635 -2975358 -5210371 -5653215 -4458175 -1470005 1761427 3295234 3440526
11573 3440526 3561286 3073320 538771 -2638313 -2825058 930768 5235677 6630769 5545643
11564 5545643 4801971 5591669 6255207 4627083 930732 -1800309 -602257 3994883 8430771
11555 8430771 10332531 10590509 10513991 9473073 7182785 5517070 5120932 2956735 -2802009
11546 -2802009 -8007205 -7923161 -5375969 -6811447 -10929124 -9259646 345139 8918053
11538 8918053 8850965 3892825 1380200 905854 -2297963 -7482988 -9930706 -9697790 -10876711
$$ packed form
11597f500046J629849L447603K959863J400619R44343J432318J150857q37294
11589E628112l699201m954700k196177L510751O984953M296202j980721n738584
11581A850635m825993k235013m42844J195040K988170L231432J533807J45292
11573C440526J20760m87966k534549l177084j86745L755826M304909J395092j085126
11564E545643p43672P89698O63538j628124l696351k731041J198052M597140M435888
11555H430771J901760K57978p6518j040918k290288j665715l96138k164197n758744
11546b802009n205196Q4044K547192j435478m117677J669478R604785Q572914
11538H918053o7088m958140k512625m74346l203817n185025k447718K32916j178921
$$ plain form
11529 -10876711 -13182591 -11754237 -5556421 658736 3582664 4573186 4713105 2629683
11521 2629683 -1029298 -2425019 -152227 2543839 3209862 3326715 3966200 3145976 335671
11512 335671 -949925 1430486 4091776 3129554 -24562 -1595729 -1365730 -1438972 -1473314
11503 -1473314 470291 3696883 5408444 4619570 2429891 -409133 -3066819 -3121997 978253
11494 978253 6735832 10119890 10524960 10113598 9263484 6477818 2415099 -59012 -363110
11485 -363110 -1099222 -3408897 -4654682 -2402556 1661286 3705361 2381699 47551
11477 47551 -115905 2463911 5060400 4708695 2232906 1889165 5846467 10712923 11721037
11468 11721037 8954225 6502801 6257853 5924635 3275090 -853719 -4484562 -6592766
$$ packed form
11529a0876711k305880J428354O197816O215157K923928R90522J39919k083422
11521B629683l658981j395721K272792K696066O66023J16853O39485q20224k810305
11512C35671j285596K380411K661290r62222l154116j571167K29999p3242l4342
11503a473314J943605L226592J711561p88874k189679k839024k657686n5178M100250
11494I78253N757579L384058M05070m11362q50114k785666m062719k474111l04098
11485c63110p36112k309675j245785K252126M063842K044075j323662k334148
11477D7551j63456K579816K596489l51705k475789l43741L957302M866456J008114
11468A1721037k766812k451424k44948l33218k649545m128809l630843k108204
$$ plain form
11460 -6592766 -6376220 -3088264 2081250 6071302 7207901 6657724 5591159 2956215
11452 2956215 -2180425 -7596814 -9517571 -7113759 -3781023 -3306357 -5477970 -6519707
11444 -6519707 -4176864 -1142389 -1658231 -5259998 -6900418 -4196926 -1183562 -2376209
11436 -2376209 -5973801 -6518071 -2398702 3079257 6643024 7045144 3414852 -3571762
11428 -3571762 -9145482 -7911201 -620245 6405872 8957632 8119549 5913457 2727523
11420 2727523 -249091 -1188062 -1452743 -4139470 -7521148 -5907919 751280 4686947
11412 4686947 1503640 -2759342 -1029352 3904066 4563425 734962 -1236916 1126397
11404 1126397 3986210 4396740 3491481 2469563 1100522 459493 1892143 3042865 293742
$$ packed form
11460f592766K16546L287956N169514L990052J136599n50177j066565k634944
11452B956215n136640n416389j920757K403812L332736M74666k171613j041737
11444f519707K342843L034475n15842l601767j640420K703492L013364j192647
11436b376209l597592n44270M119369N477959L563767M02120l630292o986614
11428c571762n573720J234281P290956P026117K551760q38083k206092l185934
11420B727523k976614r38971k64681k686727l381678J613229O659199L935667
11412D686947l183307m262982J729990M933418O59359l828463j971878K363313
11404A126397K859813M10530r05259j021918j369041o41029J432650J150722k749123
$$ plain form
11395 293742 -4309059 -4265638 1819991 7494569 7701638 5529319 6045565 7737845 5190786
11386 5190786 -1819980 -7046475 -5744116 -181403 4075836 5029961 5553593 8622879
11378 8622879 13001960 14390886 10230772 2415789 -4719128 -8170321 -7905537 -5872911
11370 -5872911 -3949543 -2255645 502477 4229849 5837132 2567554 -3552741 -7564216
11362 -7564216 -7924816 -7448103 -7477767 -5759560 -1820059 511614 -1014572 -3281366 -3486951
11353 -3486951 -3799403 -5816014 -5482906 222902 5928703 4764662 -520355 -1601994
11345 -1601994 2357439 4578732 2670262 1297241 2153450 692893 -4698567 -8680803
11337 -8680803 -7326428 -3233891 642562 4985760 8914675 8469659 4088962 2066374
$$ packed form
11395B93742m602801M3421O085629N674578K07069k172319N16246J692280k547059
11386E190786p010766n226495J302359N562713M257239R54125N23632L069286
11378H622879M379081J388926m160114p814983p134917l451193K64784K032626
11370e872911J923368J693898K758122L727372J607283l269578o120295m011475
11362g564216l60600M76713k9664J718207L939501K331673j526186k266794k05585
11353c486951l12452k016611L33108N705808N705801j164041n285017j081639
11345a601994L959433K221293j908470j373021Q56209j460557n391460l982236
11337h680803J354375M092537L876453M343198L928915m45016m380697k022588
$$ plain form
11329 2066374 4419268 5205915 1710970 480639 5437831 8714607 2625880 -6279623
11321 -6279623 -6022075 2738455 8776085 7635525 5445909 6243319 6609995 4248551 2195769
11312 2195769 2134462 1685253 734850 2900908 8098030 10782593 8569051 5916379 5975636
11303 5975636 5263380 544676 -4673484 -5214756 -1459354 2700002 5265956 5625185 2494516
11294 2494516 -3332226 -7319525 -6373952 -3022371 -842260 1069752 4798668 7902857
11286 7902857 6500891 2420688 1609276 5471025 8704508 6693474 1090844 -3427189
11278 -3427189 -4896025 -4623378 -3966881 -2727760 -507819 1576114 1404331 -1408331 -3862845
11269 -3862845 -2389696 2272308 5022431 2442468 -2960499 -6177812 -5515902 -2822553
$$ packed form
11329B066374K352894P86647l494945j230331M957192L276776o088727q905503
11321f279623K57548Q760530O037630j140560k189616P97410L66676k361444k052782
11312B195769o1307m49209r50403K166058N197122K684563k213542k652672N9257
11303E975636p12256m718704n218160n41272L755402M159356K565954L59229l130669
11294B494516n826742l987299R45573L351581K180111J912012L728916L104189
11286G902857j401966m080203q11412L861749L233483k011034n602630m518033
11278c427189j468836K72647O56497J239121K219941K083933j71783k812662k454514
11269c862845J473149M662004K750123k579963n402967l217313O61910K693349
$$ plain form
11261 -2822553 349325 3703612 6052633 5438946 1785057 -2966615 -7598468 -12034590
11253 -12034590 -14643568 -12250508 -4774781 2291665 2746039 -3538517 -10669167 -13241460
11245 -13241460 -10828129 -6080118 -988152 3530410 6287694 6600849 5873153 6029862
11237 6029862 6336697 4293539 355356 -1146773 2180633 6449075 6110827 1718670
11229 1718670 -534524 2851739 8198005 9749402 6643144 2808362 1526828 2417625
11221 2417625 3593428 4877561 7667508 11903612 14652421 13238980 9330330 7442053
11213 7442053 8663985 8830693 4985825 572563 497799 3424615 3981663 1444827 321873
11204 321873 1944000 1786771 -2525498 -6222658 -4231375 1266914 4485365 4139174 3471889
$$ packed form
11261b822553L171878L354287K349021o13687l653889m751672m631853m436122
11253a2034590k608978K393060P475727P066446M54374o284556p130650k572293
11245a3241460K413331M748011N091966M518562K757284L13155p27696J56709
11237F029862L06835k043158l938183j502129L327406M268442l38248m392157
11229A718670k253194L386263N346266J551397l106258l834782j281534Q90797
11221B417625J175803J284133K789947M236104K748809j413441l908650j888277
11213G442053J221932J66708l844868m413262p4764K926816N57048k536836j122954
11204C21873J622127j57229m312269l697160J991283N498289L218451l46191o67285
$$ plain form
11195 3471889 4383758 5861136 6827730 6671731 4181300 -240989 -2442210 1286207 8346126
11186 8346126 12068770 9751307 4879486 1444183 13941 28507 1931297 5234170
11178 5234170 7382891 6455327 3124262 -1065793 -5133432 -7343735 -5142016 1533305
11170 1533305 8591645 11492548 9699662 6108734 3183424 1194309 -476691 -1767797
11162 -1767797 -1558553 1586002 7475993 12735027 12781321 6713708 -891248 -4592024 -3712866
11153 -3712866 -1854844 -1647563 -2213746 -1838343 -759740 -132740 224737 1468542 3730972
11144 3730972 5690208 5808352 3259936 -1532438 -6090258 -6631746 -1801249 4623235
11136 4623235 7196622 5268574 3313240 4133497 5165981 3518374 1060448 846182
$$ packed form
11195C471889R11869J477378R66594j55999k490431m422289k201221L728417P059919
11186H346126L722644k317463m871821l435303j430242J4566J902790L302873
11178E234170K148721r27564l331065m190055m067639k210303K201719O675321
11170A533305P058340K900903j792886l590928k925310j989115j671000j291106
11162a767797K09244L144555N889991N259034M6294o067613p604956l700776Q79158
11153c712866J858022K07281n66183L75403J078603O27000L57477J243805K262430
11144C730972J959236J18144k548416m792374m557820n41488M830497O424484
11136D623235K573387j928048j955334Q20257J032484j647607k457926k14266
$$ plain form
11128 846182 1331049 -914559 -4373673 -4174495 -258581 2092842 1057913 1433609 6094659
11119 6094659 9809877 6170708 -3002726 -9979427 -10534482 -6764206 -2316668 930145
11111 930145 2438397 2967294 4402991 6908341 7442532 3797458 -1590286 -4851066 -5700519
11102 -5700519 -5815823 -4586067 -1038313 1941108 815004 -2079023 -983867 4290011
11094 4290011 7662305 5933836 2879634 2408829 3116831 2482012 1764823 3033579 4649925
11085 4649925 3402952 -878468 -5601024 -8623715 -9263075 -7982264 -6705570 -7406745
11077 -7406745 -9084970 -8577644 -5543472 -3492649 -4152610 -4294560 -786294 4271585 6572824
11068 6572824 5351266 3040562 1285136 330735 625332 2142582 3579053 4473049 6045643
$$ packed form
11128H46182M84867k245608l459114J99178L915914K351423j034929L75696M661050
11119F094659L715218l639169r173434o976701n55055L770276M447538L246813
11111I30145J508252N28897J435697K505350N34191l645074n387744l260780q49453
11102e700519j15304J229756L547754K979421j126104k894027J095156N273878
11094D290011L372294j728469l054202m70805P08002o34819p17189J268756J616346
11085D649925j246973m281420m722556l022691o39360J280811J276694p01175
11077g406745j678225N07326L034172K050823o59961j41950L508266N057879K301239
11068F572824j221558k310704j755426r54401K94597J517250J436471Q93996J572594
$$ plain form
11059 6045643 7709836 5826716 -622362 -6177335 -5359773 -725602 856792 -1505675
11051 -1505675 -2210732 1249323 4535010 3874848 1565520 1183393 1815674 715420 -1445032
11042 -1445032 -1791955 140316 2361593 3807681 4825737 5023550 3352384 195840
11034 195840 -2689030 -4195262 -4152453 -2047793 2415510 7405106 9713549 8198028 5050055
11025 5050055 3003532 2659773 3320380 4816630 6831225 7367894 4132518 -2233501 -7916998
11016 -7916998 -9706185 -8011107 -5514325 -3903555 -2949985 -1982468 -832559 622513
11008 622513 2715095 5351241 7505126 7607896 4740286 60790 -3150570 -2290724 1218043
10999 1218043 2974288 1021021 -1496188 -698737 2750673 5073014 4601124 2644640
$$ packed form
11059F045643J664193j883120o449078n554973Q17562M634171J582394k362467
11051a505675p05057L460055L285687o60162k309328l82127O32281j100254k160452
11042a445032l46923J932271K221277J446088J018056J97813j671166l156544
11034A95840k884870j506232M2809K104660M463303M989596K308443j515521l147973
11025E050055k046523l43759O60607J496250K014595N36669l235376o366019n683497
11016g916998j789187J695078K496782J610770R53570R67517J149909J455072
11008F22513K092582K636146K153885J02770k867610m679496l211360Q59846L508767
10999A218043J756245j953267k517209P97451L449410K322341m71890j956484
$$ plain form
10991 2644640 165285 -2929437 -5523582 -6018120 -5519225 -6446901 -7359927 -3675598 4549699
10982 4549699 10024840 6919402 -1036227 -5269312 -3258915 -464450 -2056931 -6719818
10974 -6719818 -9370848 -7263648 -2220917 1716572 2024288 -291218 -2149868 -1899475
10966 -1899475 -679733 -221483 -781255 -1907581 -3490035 -4793632 -4007669 -270956 4978591
10957 4978591 9736497 13067652 14155846 11997958 7696255 4765580 4914218 5534619
10949 5534619 3837281 1359028 1239465 2827570 2866582 1162577 1000603 3689898 6286446
10940 6286446 5767625 2838406 487938 622869 2875227 5178543 5002946 1433592 -3455766
10931 -3455766 -6252739 -5446103 -2536903 -426340 -1148228 -3959290 -4946009 -475336 7544397
$$ packed form
10991B644640k479355l094722k594145m94538M98895r27676r13026L684329Q225297
10982D549699N475141l105438p955629m233085K010397K794465j592481m662887
10974f719818k651030K107200N042731L937489L07716k315506j858650K50393
10966a899475J219742M58250n59772j126326j582454j303597P85963L736713N249547
10957D978591M757906L331155J088194k157888m301703k930675J48638O20401
10949E534619j697338k478253j19563J588105L9012j704005j61974K689295K596548
10940F286446n18821k929219k350468J34931K252358K303316j75597l569354m889358
10931c455766k796973Q06636K909200K110563p21888k811062r86719M470673Q019733
$$ plain form
10922 7544397 12157754 9362469 3328107 741763 2350618 4114151 4751099 6777243
10914 6777243 10423110 12063637 9930994 6728832 4777043 2750301 -371098 -1855581
10906 -1855581 941317 5648524 7127594 3632116 -1739919 -5087368 -5224306 -3571025
10898 -3571025 -2263502 -2589314 -4349830 -6223907 -6595178 -4248456 594701 5212718
10890 5212718 5838570 1892539 -2420866 -2932445 -891635 -824948 -3837152 -6537264 -6715255
10881 -6715255 -6329491 -7577044 -9171996 -8607025 -6118003 -4412040 -5343953 -7862463 -8617307
10872 -8617307 -4768058 2376083 6991447 4339065 -3249970 -8427791 -7036233 -1734320
10864 -1734320 2568293 3619101 1542422 -2657066 -6529435 -7160163 -4916998 -3848448
$$ packed form
10922G544397M613357k795285o034362k586344J608855J763533O36948K026144
10914F777243L645867J640527k132643l202162j951789k026742l121399j484483
10906a855581K796898M707207J479070l495478n372035l347449j36938J653281
10898c571025J307523l25812j760516j874077l71271K346722M843157M618017
10890E212718O25852l946031m313405n11579K040810O6687l012204k700112j77991
10881f715255L85764j247553j594952N64971K489022J705963r31913k518510p54844
10872h617307L849249P144141M615364k652382p589035n177821J391558N301913
10864a734320M302613J050808k076679m199488l872369o30728K243165J068550
$$ plain form
10856 -3848448 -6185431 -8546369 -6019047 1423582 8780812 11399127 8913342 4786409
10848 4786409 3337371 6391485 11611640 14543556 12798868 7745485 2577415 181177
10840 181177 2167324 7412194 11675835 11621438 9417250 9949616 12920169 11990639 3821231
10831 3821231 -5965191 -9074432 -4145547 3098888 7231094 7411615 5703294 4235697
10823 4235697 3679686 2682674 -450837 -4480462 -5627032 -2915640 -590660 -2443906
10815 -2443906 -5963627 -5825513 -1882693 581601 -1317219 -3973756 -2628365 1909630
10807 1909630 4243275 1197630 -4344852 -6945868 -4985209 -2204346 -2596096 -5412075
10799 -5412075 -7035005 -6574166 -6453213 -7399375 -6581430 -2448856 1681296 1613896 -2043832
$$ packed form
10856c848448k336983k360938K527322P442629P357230K618315k485785m126933
10848D786409j449038L054114N220155K931916j744688n053383n168070k396238
10840A81177J986147N244870M263641n4397k204188N32366K970553r29530q169408
10831C821231r786422l109241M928885P244435M132206J80521j708321j467597
10823D235697n56011r97012l133511m029625j146570K711392K324980j853246
10815b443906l519721J38114L942820K464294j898820k656537J345391M537995
10807A909630K333645l045645n542482k601016J960659K780863l91750k815979
10799e412075j622930M60839J20953r46162Q17945M132574M130152o7400l657728
$$ plain form
10790 -2043832 -4911842 -4415220 -1909009 60209 474942 139776 764966 3296475 6091834
10781 6091834 5872543 2014154 -1299441 584685 6690480 10854974 8736994 2761056
10773 2761056 -979714 106809 2640003 2429483 351321 500779 2907839 2287432 -3722205
10764 -3722205 -9186350 -7393450 -923173 2055472 367342 1268986 8163115 14519496
10756 14519496 13855673 9498914 8958021 12891025 15620456 14127590 10846101 8543350
10748 8543350 7357125 6936689 7718515 9525836 11275176 12196227 11923472 10229749 8070860
10739 8070860 7500199 8971878 10314794 9897861 8828560 8347111 7412770 4972240 2222034
10730 2222034 277638 -1954297 -5011592 -6541412 -4727440 -1743734 -654612 -1065118
$$ packed form
10790b043832k868010M96622K506211J969218M14733l35166O25190K531509K795359
10781F091834k19291l858389l313595J884126O105795M164494k117980n975938
10773B761056l740770J086523K533194k10520k078162J49458K407060o20407o009637
10764c722205n464145J792900O470277K978645j688130R01644O894129O356381
10756A4519496o63823m356759n40893L933004K729431j492866l281489k302751
10748H543350j186225m20436P81826J807321J749340R21051k72755j693723k158889
10739H070860n70661J471679J342916m16933j069301m81449r34341k440530k750206
10730B222034j944396k231935l057295j529820J813972K983706J089122m10506
$$ plain form
10722 -1065118 -1086880 -1293035 -2904464 -4012555 -1859227 2336358 4927243 5421697 6546224
10713 6546224 9069599 10363887 8490166 4727686 1518025 -403 -269994 -666111
10705 -666111 -2152210 -3446500 -1860093 2606513 5892964 4651999 624808 -1904721
10697 -1904721 -1192718 1633204 5159792 7813358 7270514 2918522 -2076874 -3620633
10689 -3620633 -798696 4243175 8711915 10074598 7137031 2122286 -857202 -1028985
10681 -1028985 -1574326 -3599412 -3885187 -1067932 868635 -1132453 -4148832 -4599585 -3770451
10672 -3770451 -3245437 9579 7727956 13921902 11764023 4116445 149655 3384490
10664 3384490 9424971 13504226 13890611 9839674 2880544 -1334027 1162139 6344613
$$ packed form
10722a065118k1762k06155j611429j108091K153328M195585K590885M94454J124527
10713F546224K523375J294288j873721l762480l209661j518428k69591l96117
10705f66111j486099j294290J586407M466606L286451j240965m027191k529529
10697a904721P12003K825922L526588K653566n42844m351992m995396j543759
10689c620633K821937N041871M468740J362683k937567n014745k979488j71783
10681a028985n45341k025086k85775K817255J936567k001088l016379m50753Q29134
10672c770451N25014L255016P718377O193946k157879p647578l966790L234835
10664C384490O040481M079255L86385m050937o959130m214571K496166N182474
$$ plain form
10656 6344613 7529311 4918907 3633975 4815485 5822008 6863998 9512975 10557001
10648 10557001 5858874 -978197 -2570270 582610 1625350 339 2375502 9971883
10640 9971883 15203371 13511768 9326789 7212692 5772479 3776642 3960829 6633023
10632 6633023 7200749 4453760 4132850 9503012 14958570 14199917 9174666 5708077 4951747
10623 4951747 4176757 2336342 440984 -736457 -222827 2896920 6632427 7109991 4288801
10614 4288801 2583768 4095854 5870483 5800193 6080173 8105725 8962195 6474809 3629716
10605 3629716 4346015 7858689 10310472 9661430 7012106 5059741 6179821 9915571
10597 9915571 12470600 11215924 8532029 7814668 7787854 5648507 3567523 5627085 9870895
$$ packed form
10656F344613J184698k610404j284932J181510J006523J041990K648977J044026
10648A0557001m698127o837071j592073L152880J042740j625011K375163P596381
10640I971883N231488j691603m184979k114097j440213j995837J84187K672194
10632F633023N67726k746989l20910N370162N455558p58653n025251l466589p56330
10623D951747p74990j840415j895358j177441N13630L119747L735507M77564k821190
10614D288801j705033J512086J774629p0290K79980K025552Q56470k487386k845093
10605C629716P16299L512674K451783o49042k649324j952365J120080L735750
10597I915571K555029j254676k683895p17361k6814k139347k080984K059562M243810
$$ plain form
10588 9870895 10673141 8173906 7647319 9787462 9823227 6792412 5386770 7293488 8663879
10579 8663879 7826235 7942659 10303855 12158475 12543193 13165691 12751699 8230589 2321540
10570 2321540 1855895 7514549 13008750 14783116 14303580 11232335 4124816 -2119274
10562 -2119274 -164743 7720318 12129418 11217687 11305337 12764100 8968376 1063112 -524440
10553 -524440 7128591 14597314 15776360 15063062 15317337 12762925 8215391 9054780 15083412
10544 15083412 16614407 11369180 8424947 10683959 9671177 3394802 2139777 9444139
10536 9444139 14692788 12522962 11934827 17513911 19821955 14167007 10641889 15067496
10528 15067496 18240230 14634911 12712519 15867741 13682348 3943113 1475769 11808084
$$ packed form
10588I870895Q02246k499235n26587K140143L5765l030815j405642J906718J370391
10579H663879q37644J16424K361196J854620L84718O22498m13992m521110n909049
10570B321540m65645N658654N494201J774366m79536l071245p107519o244090
10562b119274J954531P885061M409100r11731Q7650J458763l795724p905264j587552
10553e24440P653031P468723J179046p13298K54275k554412m547534Q39389O028632
10544A5083412J530995n245227k944233K259012j012782o276375j255025P304362
10536I444139N248649k169826n88135N579084K308044n654948l525118M425607
10528A5067496L172734l605319j922392L155222k185393r739235k467344J0332315
$$ plain form
10520 11808084 18924403 13738525 10430337 18229676 22930905 15294666 10848010 20017803
10512 20017803 26351357 18301617 13695999 25759398 35037991 25530992 17403773 29322125
10504 29322125 40801394 31347191 23389676 40893806 59347480 49190383 34978272
10497 34978272 51326784 73992854 64656213 50699732 77247585 111790493 99950212
10490 99950212 92016998 180000318 301180125 258769465 17 -263851045 -313672452
10483 -313672452 -191046447 -95441163 -100967437 -117177435 -83610887 -49758388 -56348597
10476 -56348597 -66213582 -47678926 -30698926 -40536681 -50081155 -36499823 -24380046
10469 -24380046 -35839169 -48966611 -40819857 -27876213 -30492978 -35441976 -25942821 -15569567
$$ packed form
10520A1808084P116319n185878l308188P799339M701229p636239m446656R169793
10512B0017803O333554q049740m605618J2063399R278593r506999q127219J1918352
10504B9322125J1479269r454203p957515J7504130J8453674j0157097j4212111
10497C4978272J6348512K2666070r336641j3956481K6547853L4542908j1840281
10490I9950212p933214Q7983320J21179807m2410660k58769448k63851062m9821407
10483c13672452J22626005R5605284n526274j6209998L3566548L3852499o590209
10476e6348597r864985J8534656J6980000r837755r544474J3581332J2119777
10469b4380046j1459123j3127442Q146754J2943644k616765m948998R499155J0373254
$$ plain form
10461 -15569567 -20977617 -29487633 -23640383 -13338581 -15228219 -21548063 -16656150 -6352250
10453 -6352250 -5150217 -9751510 -8908458 -6280798 -11171089 -17990380 -15852935 -9049027
10445 -9049027 -8869299 -13386540 -12976612 -8641219 -8429841 -11686000 -11653525 -8595410 -7370351
10436 -7370351 -7011309 -4315342 -2598279 -6074905 -10623932 -10116182 -6815194 -6248498 -7181022
10427 -7181022 -5816920 -4574468 -7414165 -11149875 -10359854 -6991259 -6854250 -10042350
10419 -10042350 -12298226 -12731184 -13427961 -14226918 -13739251 -12909266 -12769962 -11596117 -8334639
10410 -8334639 -5642598 -6037206 -8267996 -9955734 -10086272 -7536230 -2140914 1747740
10402 1747740 -999611 -7815722 -10743166 -8336969 -6963293 -8668598 -7696772 -2439407
$$ packed form
10461a5569567n408050q510016N847250J0301802j889638o319844M891913J0303900
10453f352250J202033m601293Q43052K627660m890291o819291K137445O803908
10445i049027J79728m517241M09928M335393K11378l256159L2475L058115J225059
10436g370351L59042K695967J717063l476626m549027N07750L300988N66696r32524
10427g181022J364102J242452k839697l735710P90021L368595J37009l188100
10419a0042350k255876m32958o96777p98957M87667Q29985J39304J173845L261478
10410h334639K692041l94608k230790j687738j30538K550042N395316L888654
10402A747740k747351o816111k927444K406197J373676j705305R71826N257365
$$ plain form
10394 -2439407 -343092 -5329138 -9939378 -7028475 -1104520 -418705 -4511938 -7328181
10386 -7328181 -7366009 -7410259 -8131371 -8181296 -7658555 -7084242 -6128407 -6028991 -8763359 -11927356
10376 -11927356 -10630602 -6572998 -7557515 -14860444 -19548572 -15742114 -9006271 -6261554
10368 -6261554 -5976876 -4723580 -4853458 -7826447 -7702405 -373014 6974995 5120402 -3216646
10359 -3216646 -7995121 -6801969 -5797843 -7844428 -8769589 -5560005 -1157552 116017
10351 116017 -2443063 -5993043 -6797863 -3767326 -731515 -2566269 -7952332 -10245378
10343 -10245378 -7082711 -3548213 -3333556 -3313463 -856246 225072 -3336730 -7091416
10335 -7091416 -5230548 151644 2472438 34098 -3776538 -6883566 -9795991 -12507931
$$ packed form
10394b439407K096315m986046m610240K910903N923955O85815m093233k816243
10386g328181l7828m4250p21112m9925N22741N74313R55835R9416k734368l163997
10376a1927356J296754M057604r84517p302929m688128L806458O735843K744717
10368f261554K84678J253296j29878k972989J24042P329391P348009j854593q337048
10359c216646m778475J193152J004126k046585r25161L209584M402453J273569
10351A16017k559080l549980q04820L030537L035811j834754n386063k293046
10343a0245378L162667L534498K14657K0093K457217J081318l561802l754686
10335g091416J860868N382192K320794k438340l810636l107028k912425k711940
$$ plain form
10327 -12507931 -14294723 -14787118 -12773868 -7031356 -239962 2473650 1102297 1377226
10319 1377226 5240589 7199476 3769956 -419955 -715717 156879 -1734818 -4432127
10311 -4432127 -5183578 -6455922 -10389636 -13076988 -11099102 -8218953 -8684760 -9417643 -6191478
10302 -6191478 -2176051 -2403271 -4661584 -4148335 -2623870 -4263413 -6481429 -4143580
10294 -4143580 118817 -907751 -7421790 -12759684 -13729407 -12899949 -11890721 -9935705
10286 -9935705 -8159180 -8497957 -9511287 -9145622 -9304073 -11537827 -11728760 -6563969 -1633861
10277 -1633861 -4044982 -9846151 -9048790 -1727983 1768609 -2858541 -7926736 -6400562
10269 -6400562 -976809 2869880 4788470 6329156 6347063 3940510 1106372 -1088110
$$ packed form
10327a2507931j786792m92395K013250N742512O791394K713612j371353K74929
10319A377226L863363J958887l429520m189911k95762Q72596j891697k697309
10311d432127p51451j272344l933714k687352J977886K880149m65807p32883L226165
10302f191478M015427k27220k258313N13249J524465j639543k218016K337849
10294d143580M262397j026568o514039n337894r69723Q29458J009228J955016
10286i935705J776525l38777j013330L65665j58451k233754j90933N164791M930108
10277a633861k411121n801169P97361P320807L496592m627150n068195J526174
10269f400562N423753L846689J918590J540686J7907k406553k834138k194482
$$ plain form
10261 -1088110 -4757593 -10455643 -14011378 -11565039 -5260013 -958144 -1598893 -4771724
10253 -4771724 -6229285 -4683969 -2862188 -3525665 -5309146 -4813681 -2453880 -2285487 -5339535
10244 -5339535 -7983148 -8427116 -9076435 -9936434 -6585853 1049777 5117197 1063728 -4252822
10235 -4252822 -2861161 2255647 3711210 2349799 3471174 5281668 2175216 -3537850
10227 -3537850 -4460975 -1046436 -696656 -4586884 -6201627 -3298768 -749912 -235565 2644841
10218 2644841 8651233 11645343 8217993 2753868 -38750 -797703 -1339367 -1306589 -1201151
10209 -1201151 -3046222 -6430336 -8877212 -10270672 -11588605 -10524841 -5086181 174019
10201 174019 -332714 -3046976 -33498 7110318 8895918 3612277 -289688 982384
$$ packed form
10261a088110l669483n698050l555735K446339O305026M301869o40749l172831
10253d771724j457561J545316J821781o63477j783481M95465K359801J68393l054048
10244e339535k643613m43968o49319q59999L350581P635630M067420m053469n316550
10235d252822J391661N116808J455563j361411J121375J810494l106452n713066
10227c537850r23125L414539L49780l890228j614743K902859K548856N14347K880406
10218B644841O006392K994110l427350n464125k792618p58953n41664L2778J05438
10209a201151j845071l384114k446876j393460j317933J063764N438660N260200
10201A74019n06733k714262L013478P143816J785600n283641l901965J272072
$$ plain form
10193 982384 1439902 -1933459 -3488386 -701541 51512 -4292578 -6450971 -1518425 3082086
10184 3082086 -900792 -9158680 -12043241 -8797281 -5672110 -4877979 -3967553 -2504129
10176 -2504129 -1590958 432178 5106408 9078060 7983962 2905491 -1805909 -4538161
10168 -4538161 -5938775 -5403950 -2501144 477275 999101 -845691 -4072815 -8024355
10160 -8024355 -10260641 -7886056 -2831453 -444996 -979758 1064302 6908565 10465332
10152 10465332 8534572 5651966 4521020 734665 -7156579 -11663898 -8000712 -2934521
10144 -2934521 -3412288 -4974940 -1574568 1494640 -3122679 -9465729 -6335665 3550917
10136 3550917 7220237 2261441 -792381 2917776 6116665 4091403 2317240 4762788
$$ packed form
10193I82384M57518l373361j554927K786845P53053m344090k158393M932546M600511
10184C082086l982878q257888k884561L245960L125171P94131R10426J463424
10176b504129R13171K023136M674230L971652j094098n078471m711400k732252
10168d538161j400614N34825K902806K978419N21826j844792l227124l951540
10160h024355k236286K374585N054603K386457n34762K044060N844263L556767
10152A0465332j930760k882606j130946l786355p891244m507319L663186N066191
10144b934521m77767j562652L400372L069208m617319o343050L130064R886582
10136C550917L669320m958796l053822L710157L198889k025262j774163K445548
$$ plain form
10128 4762788 6361549 3105370 -228208 997131 2760003 -407812 -6130891 -8630850
10120 -8630850 -7380467 -5434081 -3428382 -730669 1060190 801007 901665 3293958
10112 3293958 5343543 4082659 1576319 1617614 3612127 4222697 2990104 1904794 1204252
10103 1204252 140088 488777 4356278 8966309 8586261 2395441 -3769104 -4892960
10095 -4892960 -2454628 -787605 -875910 -481543 1438901 3373569 3702542 2229501 -463994
10086 -463994 -3173424 -3750546 -941982 3005528 3901828 848874 -2211577 -1652321 1302565
10077 1302565 3255330 3629544 3910983 3600314 916960 -3030046 -4838080 -3746786 -2159101
10068 -2159101 -1045799 830359 2492862 669349 -4052022 -6210695 -3644498 -1675382
$$ packed form
10128D762788J598761l256179l333578J225339J762872l167815n723079k499959
10120h630850J250383J946386K005699K697713J790859k59183J00658K392293
10112C293958K049585j260884k506340M1295J994513O10570j232593j085310p00542
10103A204252j064164L48689L867501M610031l80048o190820o164545j123856
10095d892960K438332J667023q8305L94367J920444J934668L28973j473041k693495
10086d63994k709430n77122K808564L947510Q96300l052954l060451N59256K954886
10077A302565J952765L74214K81439l10669k683354l947006j808034J091294J587685
10068b159101J113302J876158J662503j823513m721371k158673K566197J969116
$$ plain form
10060 -1675382 -4883524 -9151776 -7539557 -1020577 3015800 1681670 -250178 1568392
10052 1568392 5256074 6539712 4383524 907581 -1613169 -2107324 -877484 602554
10044 602554 1286942 2018354 3956689 5959187 5489179 2044217 -2071243 -4238291 -3339406
10035 -3339406 163808 4076648 5228816 2759984 195977 1807101 7028608 10822135
10027 10822135 9634676 4841005 163841 -2169102 -2297226 -1629262 -1540244 -2123407 -2219250
10018 -2219250 -1543133 -1947892 -4929933 -8597482 -9284685 -6117873 -2064694 -259091 -833970
10009 -833970 -1525486 -75388 3948940 8419513 9809045 6438419 687736 -3077541
10001 -3077541 -2863932 -609483 394755 -1133844 -3601112 -4576717 -3683649 -3023648 -4037232
$$ packed form
10060a675382l208142m268252J612219O518980M036377j334130j931848J818570
10052A568392L687682J283638k156188l475943k520750m94155J229840J480038
10044F02554O84388P31412J938335K002498m70008l444962m115460k167048Q98885
10035c339406L503214L912840J152168k468832k564007J611124N221507L793527
10027A0822135j187459m793671m677164k332943j28124O67964Q9018n83163r5843
10018b219250O76117m04759k982041l667549o87203L166812M053179J805603n74879
10009h33970o91516J450098M024328M470573J389532l370626n750683l765277
10001c077541K13609K254449J004238j528599k467268r75605Q93068O60001j013584
$$ plain form
9992 -4037232 -4968183 -3432955 -697523 -271433 -2326565 -3375802 -2255654 -1969930 -3749473
9983 -3749473 -4067220 -736020 2586909 2286704 1034296 2739651 4779829 2008961 -3499895
9974 -3499895 -4216284 1367076 6160469 4961569 1202674 421023 2176852 2298253 -239903
9965 -239903 -2606121 -2684674 -1439124 -1295132 -3685077 -7580227 -9844004 -8075683 -3427642
9956 -3427642 530384 1655533 629303 -876674 -1531286 -503392 1409960 1486883 -1481838
9947 -1481838 -4334676 -3413839 -467582 -393477 -3284630 -3989741 -794740 1147158 -1817754
9938 -1817754 -5081163 -2286718 4696837 8088634 5250107 1740416 2640260 5742918
9930 5742918 5742856 1802436 -2264361 -3625767 -2959472 -1749725 -206535 1248784 1066037
$$ packed form
9992d037232r30951J535228K735432M26090k055132j049237J120148K85724j779543
9983c749473l17747L331200L322929l00205j252408J705355K040178k770868n508856
9974c499895p16389N583360M793393j198900l758895p81651J755829J21401k538156
9965b39903k366218p8553J245550J43992k389945l895150k263777J768321M648041
9956c427642L958026J125149j026230j505977o54612J027894J913352P6923k968721
9947a481838k852838R20837K946257P4105k891153p05111L195001J941898k964912
9938a817754l263409K794445O983555L391797k838527l509691Q99844L102658
9930E742918o2l940420m066797j361406O66295J209747J543190J455319j82747
$$ plain form
9921 1066037 -969888 -2202931 -480874 2148296 2026377 -508017 -1630583 -282287
9913 -282287 150432 -2274222 -4615240 -4064978 -2676107 -3451945 -4699132 -2733203 1641912
9904 1641912 4057470 3210259 2134535 2864900 3861774 3328529 1681218 -96736 -1813466
9895 -1813466 -3120583 -3478689 -3399567 -3771081 -4149062 -3650963 -2750821 -1974896 -175828
9886 -175828 3064474 5046726 3672854 1769902 3041562 5319388 3680454 -710124
9878 -710124 -1914515 482475 472998 -3181378 -3794971 878011 2085049 -6481519 -15758629
9869 -15758629 -12079410 2824860 13558684 12232555 7073701 7490962 10725960 9310287
9861 9310287 4172214 1991310 3423078 2626437 -2178313 -5555265 -3920081 -1077816
$$ packed form
9921A066037k035925j233043J722057K629170j21919k534394j122566J348296
9913b82287M32719k424654k341018N50262J388871p75838j247187J965929M375115
9904A641912K415558q47211j075724P30365R96874n33245j647311j777954j716730
9895a813466j307117l58106P9122l71514l77981M98099R00142P75925J799068
9886a75828L240302J982252j373872j902952J271660K277826j638934m390578
9878g10124j204391K396990r477l654376o13593M672982J207038q566568r277110
9869a5758629L679219J4904270J0733824j326129n158854M17261L234998j415673
9861I310287n138073k180904J431768p96641m804750l376952J635184K842265
$$ plain form
9853 -1077816 -1194045 -1569619 2390197 8403235 9734558 5359079 1564202 2518940 4797696
9844 4797696 3697557 330916 -1184140 -257244 520627 195466 54740 624193 1389336
9835 1389336 2508732 3822814 3392297 260939 -2514907 -1237056 2798064 4744719
9827 4744719 2812899 -362439 -2696141 -4901161 -7358330 -8661744 -8251291 -7188700
9819 -7188700 -5536216 -2259530 1482313 2443566 -84597 -2894803 -3355368 -2342696 -1576175
9810 -1576175 -1105545 -758801 -1077668 -1407502 -33506 2340503 2393743 -773015 -3547626
9801 -3547626 -2965262 -1045837 -1322869 -3503918 -4720252 -4578672 -5761783 -9690909 -13726957
9792 -13726957 -13482656 -7742829 -876639 911825 -3137185 -6706748 -4572888 -184053
$$ packed form
9853a077816j16229l75574L959816O013038J331323m375479l794877R54738K278756
9844D797696j100139l366641j515056R26896P77871l25161j40726N69453P65143
9835A389336J119396J314082m30517l131358k775846J277851M035120J946655
9827D744719j931820l175338k333702k205020k457169j303414M10453J062591
9819g188700J652484L276686L741843R61253k528163k810206m60565J012672P66521
9810a576175M70630L46744l18867l29834J373996K374009N3240l166758k774611
9801c547626N82364J919425k77032k181049j216334J41580j183111l929126m036048
9792a3726957K44301N739827O866190J788464m049010l569563K133860M388835
$$ plain form
9784 -184053 -695278 -6084406 -9433892 -8052856 -7088413 -9945146 -12354896 -10154449 -6621866
9775 -6621866 -6481624 -7742451 -5967214 -2700728 -2460626 -3951256 -1971963 2850519 3924583
9766 3924583 -797614 -5040746 -3354272 1430659 3143551 715992 -1890620 -1791205 130475
9757 130475 1633825 1671841 569779 -909204 -2356838 -3844653 -5187909 -5400318 -3535441
9748 -3535441 93772 4127858 7320404 8975986 8745239 6686874 3315044 -565254
9740 -565254 -3591968 -3978188 -1564687 526184 -1209924 -5682868 -8001550 -6224996 -4056558
9731 -4056558 -5012488 -7335105 -7532683 -5922186 -5027530 -4813235 -3492843 -1429056 -249424
9722 -249424 681581 2924852 5055384 4147863 617878 -2292968 -3297984 -3352132 -1955926
$$ packed form
9784a84053n11225n389128l349486J381036R64443k856733k409750K200447L532583
9775f621866J40242j260827J775237L266486K40102j490630J979293M822482J074064
9766C924583m722197m243132J686474M784931J712892k427559k606612R9415J921680
9757A30475J503350L8016j102062j478983j447634j487815j343256k12409J864877
9748c535441L629213M034086L192546J655582k30747k058365l371830l880298
9740e65254l026714l86220K413501K090871j736108m472944k318682J776554K168438
9731d056558r55930k322617j97578J610497Q94656K14295J320392K063787J179632
9722b49424R31005K243271K130532r07521l529985k910846j005016n4148J396206
$$ plain form
9713 -1955926 1938490 5454412 3822315 -1886754 -4505695 -602872 4391038 4112594
9705 4112594 -146888 -3031929 -3669168 -5203580 -7641323 -6947717 -1728850 3813049 5259502
9696 5259502 3180865 1131557 738169 949514 923593 1454085 3527794 6777718 9639981
9687 9639981 10386479 8013468 2956343 -2652614 -6025747 -5824762 -3377384 -1460327 -1739891
9678 -1739891 -3551271 -5064492 -5170904 -4043554 -2296149 -209351 1970897 3249404
9670 3249404 2117362 -1785215 -6536499 -9460424 -9851406 -9001786 -7468077 -4451946 -938149
9661 -938149 -705089 -5321472 -10027511 -8636466 -2024969 2531098 964193 -3091899 -4928919
9652 -4928919 -5239850 -6709348 -7883067 -5281552 -133954 1769857 -2473477 -8857943
$$ packed form
9713a955926L894416L515922j632097n709069k618941L902823M993910k78444
9705D112594m259482k885041o37239j534412k437743O93606N218867N541899J446453
9696E259502k078637k049308l93388K11345k5921N30492K073709L249924K862263
9687I639981P46498k373011n057125n608957l373133K00985K447378J917057k79564
9678a739891j811380j513221j06412J127350J747405K086798K180248J278507
9670C249404j132042l902577m751284k923925l90982Q49620J533709L016131L513797
9661i38149K33060m616383m706039J391045O611497M556067j566905m056092j837020
9652d928919l10931j469498j173719K601515N147598J903811m243334o384466
$$ plain form
9644 -8857943 -11137299 -7613357 -2039214 1261587 1800179 1992482 2635534 1434354 -2738746
9635 -2738746 -6528227 -6334780 -4235958 -4866421 -6949453 -4257653 3510713 7765636 2868775
9626 2868775 -5293450 -8242426 -7079087 -8408560 -11966525 -11085740 -4198792 2740544
9618 2740544 5924674 7947405 10672121 11153299 7738640 4092867 3347334 3140842 386500
9609 386500 -3125736 -3944899 -2502640 -1414107 -737471 1214340 4104705 6048092 6552452
9600 6552452 6158759 4501050 1442564 -1074590 -942748 1269736 3527414 5109713 5939123
9591 5939123 4691555 621641 -3576403 -4031452 -981183 1028348 -1000838 -4709967
9583 -4709967 -5673348 -2973323 144699 762083 -126530 648126 3834950 6579330 6376062
$$ packed form
9644h857943k279356L523942N574143L300801N38592J92303O43052j201180m173100
9635b738746l789481J93447K098822o30463k083032K691800P768366M254923m896861
9626B868775q162225k948976J163339j329473l557965Q80785O886948O939336
9618B740544L184130K022731K724716M81178l414659l645773p45533k06492k754342
9609C86500l512236q19163J442259J088533O76636J951811K890365J943387N04360
9600F552452l93693j657709l058486k517154J31842K212484K257678J582299Q29410
9591E939123j247568m069914m198044m55049L050269K009531k029186l709129
9583d709967r63381K700025L118022O17384q88613P74656L186824K744380k03268
$$ plain form
9574 6376062 4398453 3161353 2413852 218490 -2681192 -3305098 -1661626 -1583082 -4736874
9565 -4736874 -7496916 -6369449 -3324640 -2314433 -3022605 -2246176 14472 491061 -1420480
9556 -1420480 -2063841 886883 4685585 5334407 2821455 440590 297273 1493518 2167571
9547 2167571 1644707 492848 -455385 -702623 -153125 929636 1860269 1687643 54
9538 54 -2257061 -3361460 -2598574 -1012829 -142775 -669896 -2505849 -5089645 -7040421
9529 -7040421 -6887087 -5192644 -4536941 -5856797 -6272913 -2909577 2152811 3863504 1109053
9520 1109053 -1724247 -1155882 638177 -307481 -3708143 -6086434 -6494659 -7434286 -9872471
9511 -9872471 -10816955 -7545867 -1969871 1539778 1721963 1640998 4230675 8206779 9260129
$$ packed form
9574F376062j977609j237100p47501k195362k899682o23906J643472P8544l153792
9565d736874k760042J127467L044809J010207p08172P76429K260648M76589j911541
9556a420480o43361K950724L798702O48822k512952k380865j43317J196245O74053
9547B167571n22864j151859r48233k47238N49498J082761R30633j72626j687589
9538E4k257115j104399P62886J585745Q70054n27121j835953k583796j950776
9529g040421J53334J694443O55703j319856m16116L363336N062388J710693k754451
9520A109053k833300N68365J794059r45658l400662k378291m08225r39627k438185
9511i872471r44484L271088N575996L509649J82185q0965K589677L976104J053350
$$ plain form
9502 9260129 4909708 -2337596 -6900417 -5432370 -94280 4031505 4578540 3680052 3929488
9493 3929488 4674969 4010826 2685535 3022346 4414729 3338361 -1110455 -4664101 -3011076
9484 -3011076 2415481 6115198 4858849 158987 -4684721 -7458285 -7153214 -3882936
9476 -3882936 349634 2473731 1151112 -1846095 -3533657 -2512356 65903 1560171
9468 1560171 123563 -3016140 -3985035 -655010 3570944 2806881 -3622849 -9058548 -7150882
9459 -7150882 175728 5218895 4023372 43865 -1921955 -1702513 -1606740 -1311653 1478335
9450 1478335 6338376 9743904 9679347 7609713 5242112 2491656 8734 379970 4148420
9441 4148420 7235188 5723190 1473808 -683257 -83279 -280015 -2370778 -3006864 -119206
$$ packed form
9502I260129m350421p247304m562821J468047N338090M125785N47035q98488K49436
9493C929488P45481o64143j325291L36811J392383j076368m448816l553646J653025
9484c011076N426557L699717j256349m699862m843708k773564L05071L270278
9476c882936M232570K124097j322619k997207j687562J021301K578259J494268
9468A560171j436608l139703r68895L330025M225954p64063o429730n435699J907666
9459g150882P326610N043167j195523l979507j965820K19442R5773K95087K789988
9450A478335M860041L405528o4557k069634k367601k750456k482922L71236L768450
9441D148420L086768j511998m249382k157065N99978j96736k090763o36086K887658
$$ plain form
9432 -119206 3581482 4760851 3773896 2792446 2565375 3097282 4710397 6217100 4915412
9423 4915412 1003174 -885383 2176994 6224969 5262643 -384890 -4716096 -4182016 -1118111
9414 -1118111 805411 737809 -369462 -1767157 -2840536 -3217992 -3595625 -4665251 -5177008
9405 -5177008 -3278517 35805 1341192 -475154 -2077446 172332 5126684 7530372
9397 7530372 3851440 -3358335 -7709710 -5897133 -1388950 187280 -1737382 -3005763
9389 -3005763 -1924646 -1665450 -3952832 -5160297 -2251843 1350881 588389 -3386958 -5371156
9380 -5371156 -4099890 -2588247 -1823463 21044 2497351 2893697 1712255 2451541 4981026
9371 4981026 4748923 232356 -4164266 -4875972 -3890971 -4063082 -4416853 -3448125 -3002070
$$ packed form
9432a19206L700688J179369r86955r81450k27071N31907J613115J506703j301688
9423D915412l912238j888557L062377M047975r62326n647533m331206N34080L063905
9414a118111J923522o7602j107271j397695j073379l77456l77633j069626n11757
9405e177008J898491L314322J305387j816346j602292K249778M954352K403688
9397G530372l678932p209775m351375J812577M508183J576230j924662j268381
9389c005763J081117K59196k287382j207465K908454L602724p62492l975347j984198
9380e371156J271266J511643P64784J844507K476307L96346j181442P39286K529485
9371D981026k32103m516567m396622p11706R85001j72111l53771R68728M46055
$$ plain form
9362 -3002070 -4928546 -6936956 -5788893 -2571298 -1152096 -2663201 -4515869 -4043689
9354 -4043689 -850285 3639555 7197422 8183013 7134970 6000447 5257082 3603841 1158638
9345 1158638 581175 3662143 8691897 12382972 12738009 9491490 3994539 -715756 -2251002
9336 -2251002 -1887770 -2581949 -3796730 -2064827 2519783 4883740 2127248 -2022594 -2709282
9327 -2709282 -383833 1365613 1497377 1787622 3500340 6384194 9158425 9308661 4952310
9318 4952310 -1473501 -4464829 -2121783 1878480 4577302 7444750 11269383 12506241
9310 12506241 8824996 3854756 1746096 974449 -1504699 -3819984 -2549990 827174
9302 827174 2844580 4422651 7897473 10325558 7052234 482757 -2066227 1264092
$$ packed form
9362c002070j926476k008410J148063L217595J419202j511105j852668M72180
9354d043689L193404M489840L557867R85591j048043j134523p43365j653241k445203
9345A158638n77463L080968N029754L691075L55037l246519n496951m710295j535246
9336b251002L63232o94179j214781J731903M584610K363957k756492m149842o86688
9327b709282K325449J749446J31764K90245J712718K883854K774231J50236m356351
9318D952310o425811k991328K343046M000263K698822K867448L824633J236858
9310A2506241l681245m970240k108660p71647k479148k315285J269994L377164
9302H27174K017406J578071L474822K428085l273324o569477k548984L330319
$$ plain form
9294 1264092 5595409 7914623 9485331 9527399 4844051 -2191526 -3273544 4284335 12062118
9285 12062118 11259229 3943277 -1228264 -626275 2081366 2742725 853817 -2176221 -4912092
9276 -4912092 -5891045 -4211753 -530813 3464894 6236145 6785434 5117790 2779118 1661699
9267 1661699 2034459 3048676 4647117 6665816 6644784 2183392 -3942023 -5085375 722422
9258 722422 6906424 6148920 -190675 -4131952 -1754027 1954816 154348 -6494016 -10344416
9249 -10344416 -6549697 485132 2672016 -1361810 -5243875 -4291694 -1271893 -525844
9241 -525844 -963021 765579 3469691 3244221 284296 -1618219 -1515743 -1867774 -3015489
9232 -3015489 -2552233 -523795 58786 -1254654 -1307937 1082289 3141790 2753247 628421
$$ packed form
9294A264092M331317K319214J570708M2068m683348p035577j082018P557879P777783
9285A2062118q02889p315952n171541O01989K707641O61359j888908l030038k735871
9276d912092r78953J679292L680940L995707K771251N49289j667644k338672j117419
9267A661699L72760J014217J598441K018699k1032m461392o125415j143352N807797
9258G22422O184002p57504o339595l941277K377925L708843j800468o648364l850400
9249a0344416L794719P034829K186884m033826l882065R52181L019801P46049
9241e25844m37177J728600K704112k25470k959925j902515J02476l52031j147715
9232c015489M63256K028438N82581j313440n3283K390226K059501l88543k124826
$$ plain form
9223 628421 -2594107 -6409243 -7446044 -2709074 3344784 2335252 -5324500 -9240550
9215 -9240550 -4274323 1336324 -1057481 -7103202 -7049737 -953985 2996039 1869891 355515
9206 355515 1309645 2781167 4299863 7977071 12381198 12612595 8232833 4870865 6005019
9197 6005019 8742041 9692961 9583546 9667518 8729692 6572913 5886243 7405879 7355393
9188 7355393 3346993 -775781 -174150 3572356 4724299 1576841 -1789167 -1574452 1353013
9179 1353013 3442639 2406172 -1176673 -4539437 -4918628 -2245322 620592 1199648 -6567
9170 -6567 -1260910 -2266696 -3061557 -1906597 2387953 6609465 5551419 -799894 -6101506
9161 -6101506 -5661317 -2436304 -2051048 -4476205 -5023104 -2428596 -731289 -2178566 -3240029
$$ packed form
9223F28421l222528l815136j036801M736970O053858j009532p659752l916050
9215i240550M966227N610647k393805o045721N3465O095752L950024j126148j514376
9206C55515R54130J471522J518696L677208M404127K31397m379762l361968J134154
9197F005019K737022R50920j09415Q3972r37826k156779o86670J519636n0486
9188G355393m008400m122774O01631L746506J151943l147458l366008K14715K927465
9179A353013K089626j036467l582845l362764l79191K673306K865914N79056j206215
9170f567j254343j005786p94861J154960M294550M221512j058046o351313n301612
9161f101506M40189L225013L85256k425157n46899K594508J697307j447277j061463
$$ plain form
9152 -3240029 -584447 2733174 1210618 -4980145 -10051300 -10057183 -6479884 -2542145 314663
9143 314663 1763813 1841641 1882690 3382416 5123951 4329602 1421235 314932 2823268
9134 2823268 6313328 8474972 10395490 12425738 11221679 4870175 -2306225 -4656705
9126 -4656705 -2627132 -758576 -454183 -30728 -402203 -4377829 -10143199 -11619081 -6922640
9117 -6922640 -1210991 930279 934688 1471027 1165779 -1915496 -5366002 -5738587 -4302716
9108 -4302716 -4813159 -6992801 -6885103 -3319444 162410 316002 -2148440 -4527996 -5080383
9099 -5080383 -3564036 -1233089 -544063 -2482307 -4235857 -2453652 1111376 970378 -4036445
9090 -4036445 -8079412 -6174601 -1267000 -132235 -4602934 -10460320 -13367829 -12256333
$$ packed form
9152c240029K655582L317621j522556o190763n071155n883L577299L937739K856808
9143C14663J449150P7828M1049J499726J741535p94349k908367j106303K508336
9134B823268L490060K161644J920518K030248j204059o351504p176400k350480
9126d656705K029573J868556L04393M23455l71475l975626n765370j475882M696441
9117f922640N711649K141270M409N36339l05248l081275l450506l72585J435871
9108d302716n10443k179642J07698L565659L481854J53592k464442k379556n52387
9099e080383J516347K330947O89026j938244j753550J782205L565028j40998n006823
9090d036445m042967J904811M907601J134765m470699n857386k907509J111496
$$ plain form
9082 -12256333 -8111374 -3402445 -2122261 -6292706 -12247095 -14035839 -10730568 -6668374
9074 -6668374 -4454308 -2363061 507351 1801543 881283 1276588 4936134 8451646 8778571
9065 8778571 8441300 10419602 11834470 8505351 2794122 453103 1526753 1044861 -2200470
9056 -2200470 -4361919 -3906699 -3554574 -4228906 -3667216 -2264795 -3725884 -8029730 -10161734
9047 -10161734 -8200804 -6322707 -6983660 -6694835 -3187834 -210252 -569148 -611897 2875809
9038 2875809 5972291 4056696 -83317 -1284233 -585126 -1525909 -2156464 879085 3638942
9029 3638942 -248798 -7693993 -8977473 -2588722 2369651 280239 -3553568 -2756624
9021 -2756624 864698 2327750 1235118 -356044 -2737648 -6231982 -7828068 -4918294
$$ packed form
9082a2256333M144959M708929J280184m170445n954389j788744L305271M062194
9074f668374K214066K091247K870412J294192r20260L95305L659546L515512L26925
9065H778571l37271J978302J414868l329119n711229k341019J073650m81892l245331
9056b200470k161449M55220L52125o74332N61690J402421j461089m303846k132004
9047a0161734J960930J878097o60953K88825L507001K977582l58896m2749L487706
9038B875809L096482j915595m140013j200916O99107r40783o30555L035549K759857
9029C638942l887740p445195j283480O388751M958373k089412l833807P96944
9021b756624L621322J463052j092632j591162k381604l494334j596086K909774
$$ plain form
9013 -4918294 -13529 2141024 538341 -1719489 -1445847 2079954 6706850 8253372
9005 8253372 4071485 -3140722 -7663126 -7599089 -6229459 -6034473 -5639879 -4005089 -2916590
8996 -2916590 -3020701 -1871644 1243232 2832916 832182 -1376670 -314141 1962935
8988 1962935 1748060 -66055 -176595 1218709 1274303 -447678 -1790020 -1499201 297799
8979 297799 3244534 5362717 3108447 -3505222 -8486064 -6846078 -1711901 69617
8971 69617 -2706651 -5566385 -5848310 -4805305 -3287017 -777093 1577086 1890398 1235950
8962 1235950 1869358 2558826 803235 -1198536 973813 5528606 5404694 -939289 -6468267
8953 -6468267 -5998595 -3343376 -4041631 -6321247 -4530857 1831286 7673872 9210392 7238272
$$ packed form
9013d918294M904765K154553j602683k257830K73642L525801M626896J546522
9005H253372m181887p212207m522404O4037J369630J94986L94594J634790J088499
8996b916590j04111J149057L114876J589684k000734k208852J062529K277076
8988A962935k14875j814115j10540J395304N5594j721981j342342K90819J797000
8979B97799K946735K118183k254270o613669m980842J639986N134177J781518
8971F9617k776268k859734k81925J043005J518288K509924K354179L13312o54448
8962A235950O33408O89468j755591k001771K172349M554793j23912o343983n528978
8953f468267M69672K655219o98255k279616J790390O362143N842586J536520j972120
$$ plain form
8944 7238272 4551384 3243912 3889587 5113855 4688493 2421259 573601 335173 65877
8935 65877 -1523656 -3007071 -3022947 -2862475 -3862882 -4570283 -3264740 -1303999 -1035063
8926 -1035063 -2064735 -2528259 -2499869 -3072382 -3482085 -2496578 -1446978 -2100909 -2293385
8917 -2293385 1873278 8983824 11919666 6648445 -1824943 -5184848 -1624932 3078095
8909 3078095 3581895 923964 -394825 1222221 3318057 3678359 3009596 2658645 2111578
8900 2111578 549707 -981929 -1418420 -2228224 -4991663 -7433781 -5872204 -1554106 19314
8891 19314 -2798057 -5157156 -3593730 -1840544 -4719380 -9971200 -11518427 -8843173 -7416439
8882 -7416439 -10053293 -13083351 -12295671 -8535057 -5436158 -4460965 -4220617 -2945371 33881
$$ packed form
8944G238272k686888j307472O45675J224268m25362k267234j847658k38428k69296
8935F5877j589533j483415j5876J60472j000407p07401J305543J960741K68936
8926a035063j029672m63524K8390n72513m09703R85507J049600o53931j92476
8917b293385M166663P110546K935842n271221q473388l359905L559916M703027
8909C078095N03800k657931j318789J617046K095836L60302o68763l50951n47067
8900B111578j561871j531636m36491q09804k763439k442118J561577M318098J573420
8891A9314k817371k359099J563426J753186k878836n251820j547227K675254J426734
8882g416439k636854l030058P87680L760614L098899R75193K40348J275246K979252
$$ plain form
8873 33881 4168818 7886655 9583012 9058697 7485073 5893860 4389686 2722002 862039
8864 862039 -821706 -1424599 -122560 2490978 4611870 5421355 5702628 5416104 2768795
8855 2768795 -2393750 -6250284 -4940705 153102 3818789 3122960 -409663 -4061985
8847 -4061985 -6457735 -6894620 -4992198 -1770937 718717 1406682 871806 325000 852553
8838 852553 2699837 4291632 3619324 1831833 2796378 6916456 8698861 4162418 -2416757
8829 -2416757 -4112533 -1283966 -33918 -2347174 -4447258 -4482733 -4645570 -4834485 -1556724
8820 -1556724 4641793 7571530 4549430 1015973 2093019 5170241 5553498 4440537
8812 4440537 5593612 7717936 6238363 911479 -3565120 -4029381 -2228801 -1978250 -5162789
$$ packed form
8873C3881M134937L717837J696357n24315j573624j591213j504174j667684j859963
8864H62039j683745o02893J302039K613538K120892Q09485K81273k86524k647309
8855B768795n162545l856534J309579N093807L665687o95829l532623l652322
8847d061985k395750m36885J902422L221261K489654O87965n34876n46806N27553
8838H52553J847284J591795o72308j787491R64545M120078J782405m536443o579175
8829b416757j695776K828567J250048k313256k100084l5475j62837j88915L277761
8820a556724O198517K929737l022100l533457J077046L077222L83257j112961
8812D440537J153075K124324j479573n326884m476599m64261J800580K50551l184539
$$ plain form
8803 -5162789 -9820810 -11272592 -7218940 -2079767 -2408022 -7170706 -8148983 -2276471 3078752
8794 3078752 1561180 -2223850 -1054128 2304358 -161820 -7648450 -11008178 -6690497
8786 -6690497 -1052523 510732 512081 2609217 4734641 3212246 -638538 -2119133 737386
8777 737386 5242933 7002401 3704442 -2773189 -7785573 -8510534 -6309923 -3483639 -200957
8768 -200957 2958519 2814185 -1726197 -5644198 -3967426 118167 -537710 -6083292 -9578895
8759 -9578895 -7444217 -3143658 -81747 2320911 4363924 4529193 3818719 5335315 7854695
8750 7854695 6252677 289397 -3813290 -3126872 -2309433 -4678238 -6103792 -2678790 1837721
8741 1837721 2110045 -246278 -298266 1964193 2992936 2269086 1866542 1700829 323309
$$ packed form
8803e162789m658021j451782M053652N139173l28255m762684r78277N872512N355223
8794C078752j517572l785030J169722L358486k466178p486630l359728M317681
8786f690497N637974J563255J349K097136K125424j522395l850784j480595K856519
8777G37386M505547J759468l297959o477631n012384p24961K200611K826284L282682
8768b00957L159476j44334m540382l918001J676772M085593o55877n545582l495603
8759i578895K134678M300559L061911K402658K043013J65269p10474J516596K519380
8750G854695j602018n963280m102687O86418Q17439k368805j425554L425002M516511
8741A837721K72324k356323n1988K262459J028743p23850m02544j65713j377520
$$ plain form
8732 323309 -1389523 -1858783 -2361111 -4896860 -8290417 -10106518 -10425761 -10171373 -8093456
8723 -8093456 -3357081 1036941 1373786 -2031184 -6462713 -10673347 -13696240 -12950095 -7948926
8714 -7948926 -3233379 -2999636 -5239078 -5751728 -5047300 -5713250 -5565788 -234862 8430705
8705 8430705 13262455 11523258 8081901 7852686 9804616 9786503 5762632 -647163 -5319063
8696 -5319063 -4672101 -71550 2277643 -1017473 -5162690 -3649911 2178557 5402941
8688 5402941 3659749 874031 -268090 -988553 -1360901 851849 5001772 7028396 5810568
8679 5810568 4858699 6077779 6949736 5698467 4175731 3418468 1217966 -3154978 -6088077
8670 -6088077 -4519629 -339248 2720584 3674043 3594956 3142476 2738877 2784539 2404061
$$ packed form
8732C23309j712832m69260n02328k535749l393557j816101l19243K54388K077917
8723h093456M736375M394022L36845l404970m431529m210634l022893P46145N001169
8714g948926M715547K33743k239442n12650P04428o65950J47462N330926Q665567
8705H430705M831750j739197l441357k29215J951930j8113m023871o409795m671900
8696e319063O46962M600551K349193l295116m145217J512779N828468L224384
8688E402941j743192k785718j142121p20463l72348K212750M149923K026624j217828
8679E810568r51869J219080Q71957j251269j522736p57263k200502m372944k933099
8670f088077J568448M180381L059832R53459p9087m52480m03599M5662l80478
$$ plain form
8661 2404061 534783 -1162487 111347 3133785 3171436 -1033761 -4861525 -4118069 64610
8652 64610 4345852 7321561 8616577 7589278 5156199 3799540 4170741 4790417 5750243
8643 5750243 8378682 10434074 7136285 -1134696 -7875835 -9752739 -10860845 -14251950
8635 -14251950 -15492076 -9825483 -605438 5245454 6255427 5316223 3239903 -579607
8627 -579607 -3793829 -3311287 -191366 2399361 3909997 4609422 2138326 -4655210 -11111875
8618 -11111875 -11919671 -8653409 -6192866 -4076663 1482689 8630744 10938166 7491629
8610 7491629 4320722 4699526 5219935 3415823 2395194 4710509 7301846 6302899 2694397
8601 2694397 -195292 -1399476 -1544840 -392157 1921591 3386089 2285246 -580687
$$ packed form
8661B404061j869278j697270J273834L022438L7651m205197l827764P43456M182679
8652F4610M281242K975709J295016j027299k433079j356659L71201O19676R59826
8643E750243K628439K055392l297789q270981o741139j876904j108106l391105
8635a4251950j240126N666593R220045N850892J009973r39204k076320l819510
8627e79607l214222M82542L119921K590727J510636O99425k471096o793536o456665
8618a1111875q07796L266262K460543K116203N559352P148055K307422l446537
8610G491629l170907L78804N20409j804112j020629K315315K591337r98947l608502
8601B694397k889689j204184j45364J152683K313748J464498j100843k865933
$$ plain form
8593 -580687 -3026067 -3188258 36691 5612657 9368321 7817425 3346767 1822070 4589682
8584 4589682 7263654 7168181 6604807 6922086 5233568 458354 -2816450 -1180501 1467927
8575 1467927 130157 -2660383 -776448 5324848 9208121 8427544 7129095 8034980 8220282
8566 8220282 5182147 1865942 2126971 4656086 5137308 2542870 -18182 32550 1771541
8557 1771541 2447352 614329 -2473715 -3959474 -2232978 1049527 2657073 1669608 232657
8548 232657 -17577 -219139 -1563772 -2313008 -60725 4010685 5917528 3906608 339624
8539 339624 -1701480 -1463401 175868 1978203 2121276 -701113 -4627010 -5687559 -3330435
8530 -3330435 -2080219 -5025486 -8469900 -6984016 -1622807 1793205 1349151 285683
$$ packed form
8593e80687k445380j62191L224949N575966L755664j550896m470658j524697K767612
8584D589682K673972r5473n63374L17279j688518m775214l274804J635949K648428
8575A467927j337770k790540J883935O101296L883273p80577j298449R05885J85302
8566H220282l038135l316205K61029K529115M81222k594438k561052N0732J738991
8557A771541O75811j833023l088044j485759J726496L282505J607546r87465j436951
8548B32657k50234k01562j344633p49236K252283M071410J906843k010920l566984
8539C39624k041104K38079J639269J802335J43073k822389l925897j060549K357124
8530c330435J250216k945267l444414J485884N361209L416012m44054j063468
$$ plain form
8522 285683 -254723 -3131546 -8130333 -9665592 -5370900 -1249538 -3046720 -7188303 -6776173
8513 -6776173 -3197628 -3992326 -10275837 -14282126 -10797996 -4134784 -737183 -412287 873384
8504 873384 3206795 2609680 -2518508 -8613652 -10879470 -8032364 -2861991 864116 1699912
8495 1699912 856617 -404396 -2325003 -4592261 -4569115 -275167 5697575 8348924 6314622
8486 6314622 2868689 888799 35567 -662281 -855754 -498414 -229288 957276 5128623
8477 5128623 11141989 14393740 12673060 8957693 6380376 4115323 1095127 -26533
8469 -26533 3028114 6764206 5696347 529268 -2207191 1034201 6297981 7414645 2989143
8460 2989143 -2975359 -5550099 -3282655 539344 937877 -3225369 -7320415 -6201571
$$ packed form
8522B85683n40406k876823m998787j535259M294692M121362j797182m141583M12130
8513f776173L578545p94698o283511m006289L484130O663212L397601L24896J285671
8504H73384K333411n97115n128188o095144k265818K847106N170373L726107Q35796
8495A699912q43295j261013j920607k267258K3146M293948N972742K651349k034302
8486F314622l445933j979890q53232o97848j93473L57340K69126J186564M171347
8477E128623O013366L251751j720680l715367k577317k265053l020196j121660
8469b6533L054647L736092j067859n167079k736459L241392N263780J116664m425502
8460B989143n964502k574740K267444L821999L98533m163246m095046J118844
$$ plain form
8452 -6201571 -595928 4109537 5020108 4696455 6339006 8829703 8500205 4472438 249988
8443 249988 -80052 3727921 7947069 9100772 7647900 6477831 6134433 3800827 -1842486
8434 -1842486 -7047860 -6959661 -2124368 1951592 1919115 594062 2705483 8372553 12453635
8425 12453635 10205687 2900541 -2615602 -619014 7054525 12445096 10129973 3032378
8417 3032378 -1826568 -1750989 -15471 -32413 -1230070 -1380083 -237689 742518 727847
8408 727847 39855 -802845 -1469843 -1644003 -1069934 381510 2585526 4618069 4870093
8399 4870093 2795928 128483 -1072038 -1290825 -2673914 -5183428 -5758427 -2285731 3187731
8390 3187731 6579467 6302909 4523711 4181387 5530879 5828883 2560695 -3000666 -6321725
$$ packed form
8452f201571N605643M705465R10571l23653J642551K490697l29498m027767m222450
8443B49988l30040L807973M219148J153703j452872j170069l43398k333606n643313
8434a842486n205374Q8199M835293M075960l2477j325053K111421N667070M081082
8425A2453635k247948p305146n516143J996588P673539N390571k315123p097595
8417C032378m858946P5579J735518j6942j197657j50013J142394R80207j4671
8408G27847o87992q42700o66998j74160N74069J451444K204016K032543K52024
8399D870093k074165k667445j200521k18787j383089k509514n74999L472696N473462
8390C187731L391736k76558j779198l42324J349492K98004l268188n561361l321059
$$ plain form
8381 -6321725 -4547399 -47078 2362940 962883 -1946112 -3938498 -4699420 -4496052 -3449170
8372 -3449170 -3009591 -5057856 -8139629 -7701729 -2307869 3270469 4327956 3209634 5763638
8363 5763638 11921610 14770073 9938034 1652832 -2824397 -1703742 1209644 2638338
8355 2638338 2550701 1652613 -116468 -1837835 -1286762 1956723 4937891 4790959 2549916
8346 2549916 1355735 1591493 500424 -2955895 -5598820 -4206230 -456843 760518
8338 760518 -2494631 -7004062 -8600384 -6627352 -3387436 -778066 1077924 2690012
8330 2690012 4267994 5940460 7770228 9161132 8937250 6597864 3340057 1413001
8322 1413001 2280287 5417508 8801810 10366768 9089949 5330179 719757 -2537133
$$ packed form
8381f321725J774326M500321K410018j400057k908995j992386p60922K03368J046882
8372c449170M39579k048265l081773M37900N393860N578338J057487j118322K554004
8363E763638O157972K848463m832039q285202m477229J120655K913386J428694
8355B638338q7637q98088j769081j721367N51073L243485K981168j46932k241043
8346B549916j194181K35758j091069l456319k642925J392590L749387J217361
8338G60518l255149m509431j596322J973032L239916K609370J855990J612088
8330B690012J577982J672466J829768J390904k23882k339386l257807j927056
8322A413001Q67286L137221L384302J564958j276819l759770m610422l256890
$$ plain form
8314 -2537133 -3067720 -1286622 1295245 3405090 4112879 2388355 -1817338 -6155698 -7548498
8305 -7548498 -5898491 -4289771 -4693676 -5655814 -5578902 -5736287 -7519748 -8841089 -6756748
8296 -6756748 -2548677 -462988 -1664293 -3090158 -2575631 -1431864 -1026680 -377605 1218926
8287 1218926 2227317 1553472 726439 1389260 2633391 2608106 889829 -2179895 -6191700
8278 -6191700 -9120412 -7888788 -2825397 1038418 -107897 -3988061 -6211887 -6522540
8270 -6522540 -7338632 -8391079 -7515321 -5446499 -4862971 -5221803 -3618447 -783746 -737136
8261 -737136 -3412355 -3183084 2878843 10132966 12835423 11199153 8420975 4803575 -225662
8252 -225662 -3256821 -136659 6753622 10099313 7170723 2903269 2059917 2862728 1207806
$$ packed form
8314b537133n30587J781098K581867K109845P07789j724524m205693m338360j392800
8305g548498J650007J608720m03905r62138P6912j57385j783461j321341K084341
8296f756748M208071K085689j201305j425865N14527J143767M05184O49075J596531
8287A218926J008391o73845q27033O62821J244131k5285j718277l069724m011805
8278f191700k928712J231624N063391L863815j146315l880164k223826l10653
8270f522540q16092j052447Q75758K068822N83528l58832J603356K834701M6610
8261g37136k675219K29271O061927P254123K702457j636270k778178l617400n029237
8252b25662l031159L120162O890281L345691k928590m267454q43352Q02811j654922
$$ plain form
8243 1207806 -2302584 -3534612 -1437314 558171 -105829 -1738892 -1760360 -981723 -2198683
8234 -2198683 -5542125 -7742026 -6366382 -2985903 -1282207 -3174653 -7490611 -11219471
8226 -11219471 -11324859 -6973915 -1426072 -61857 -4318917 -8892168 -7771630 -2118132
8218 -2118132 1417820 -71038 -2583602 -2338722 -1399527 -3266540 -6628747 -7665916 -6261086
8209 -6261086 -5418960 -5583639 -4046892 -134939 3042678 3034880 1111942 -263807 -414050
8200 -414050 261634 1543352 2576085 1924961 -26800 -550007 1914221 5189546 6001088
8191 6001088 4004833 1517590 196508 -185751 -148001 520331 1974169 3559291 4077502
8182 4077502 2460916 -1341576 -5589620 -7639218 -6670665 -4993736 -5316506 -6945473 -6339323
$$ packed form
8243A207806l510390j232028K097298J995485o64000j633063k1468P78637j216960
8234b198683l343442k199901J375644L380479J703696j892446m315958l728860
8226a1219471j05388M350944N547843J364215m257060m573251J120538N653498
8218b118132L535952j488858k512564K44880R39195j867013l362207j037169J404830
8209f261086Q42126j64679J536747L911953L177617p798j922938j375749j50243
8200d14050O75684J281718J032733o51124j951761n23207K464228L275325Q11542
8191F001088j996255k487243j321082l82259L7750O68332J453838J585122N18211
8182D077502j616586l802492m248044k049598R68553J676929l22770j628967O06150
$$ plain form
8173 -6339323 -2005893 2583751 2443427 -2934232 -8569447 -9544803 -6371969 -3583938 -3752014
8164 -3752014 -4952886 -4488895 -2853932 -2340396 -3159757 -3178777 -1070764 2216968 5082154
8155 5082154 6758132 7308734 7659203 9343300 12497898 14480048 12575672 7870317 4118336
8146 4118336 3017524 3413439 4922328 8366404 11827405 10891906 5237991 783247 1797852
8137 1797852 4561585 3306418 -595850 -945714 3549171 7932443 9059918 8893932 8787595
8128 8787595 6454867 1140702 -3215095 -3395801 -1636676 -1404799 -1866131 -713679 204634
8119 204634 -2886478 -8922024 -12345705 -10632408 -7472634 -7250338 -9419767 -10074051 -7114974
8110 -7114974 -2194205 1442443 1865550 -218785 -2367558 -2782140 -1646537 229875 3054808
$$ packed form
8173f339323M333430M589644j40324n377659n635215r75356L172834K788031j68076
8164c752014j200872M63991J634963N13536q19361j9020K108013L287732K865186
8155E082154J675978N50602L50469J684097L154598J982150j904376m705355l751981
8146D118336j100812L95915J508889L444076L461001r35499n653915m454744J014605
8137A797852K763733j255167l902268l49864M494885M383272J127475j65986j06337
8128H787595k332728n314165m355797j80706J759125K31877m61332J152452R18313
8119B04634l091112o035546l423681J713297L159774K22296k169429o54284K959077
8110g114974M920769L636648M23107k084335k148773m14582J135603J876412K824933
$$ plain form
8101 3054808 6890046 9688963 8849376 4895222 1376512 406199 359526 -923479 -2661337
8092 -2661337 -2565176 -278527 2588323 4904048 6439445 6470120 4324700 1428589 471049
8083 471049 1696045 1998081 -920429 -5047279 -6541545 -4747851 -2602081 -2277782 -2634062
8074 -2634062 -1605729 642872 2056892 1102326 -2045959 -5760219 -7678182 -6387278
8066 -6387278 -3347010 -1784790 -2480287 -2302806 1198597 5440875 5758031 1480588 -4117510
8057 -4117510 -8883746 -12664511 -13614696 -9112048 -1763596 1072636 -3093527 -7649062
8049 -7649062 -6368522 -2458065 -2580836 -5960624 -6812609 -5129081 -6300814 -10127179 -9353708
8040 -9353708 -1652323 5252982 4801461 906010 528582 2918613 3023025 1181570 1783715
$$ packed form
8101C054808L835238K798917q39587l954154l518710r70313m6673j283005j737858
8092b661337R6161K286649K866850K315725J535397L0675k145420k896111r57540
8083D71049J224996L02036k918510m126850j494266J793694K145770L24299l56280
8074b634062J028333K248601J414020r54566l148285l714260j917963J290904
8066f387278L040268J562220o95497J77481L501403M242278L17156m277443n598098
8057d117510m766236l780765r50185M502648P348452K836232m166163m555535
8049g649062J280540L910457j22771l379788q51985J683528j171733l826365P73471
8040i353708P701385O905305m51521l895451l77428K390031J04412j841455O02145
$$ plain form
8031 1783715 4692562 5436728 2999987 716280 -201461 -1531671 -2419098 324320 5198571
8022 5198571 6020924 1312807 -2402650 1819 4794654 5288982 932001 -3868941 -6715058
8013 -6715058 -8426985 -9332278 -8508550 -5812489 -1871349 2760809 6431274 6473192 2828015
8004 2828015 -623975 -761052 1165636 2844812 4391624 5388019 2588464 -4420216 -8768571
7995 -8768571 -3984913 5872641 10640743 7703965 3979151 4062833 4290795 996578 -2544448
7986 -2544448 -1813955 1474936 2373308 -179303 -3284248 -4562303 -3344415 166465 3867446
7977 3867446 4312983 1207816 -1171651 52942 1833653 141445 -3389913 -4258213 -2679134
7968 -2679134 -3520869 -9151454 -16464236 -21007517 -20664009 -15426546 -7027209 897107 5270873
$$ packed form
8031A783715K908847P44166k436741k283707r17741j330210q87427K743418M874251
8022E198571Q22353m708117l715457K404469M792835M94328m356981m800942k846117
8013f715058j711927r05293Q23728K696061L941140M632158L670465M1918l645177
8004B828015l451990j37077J926688J679176J546812R96395k799555p008680m348355
7995h768571M783658R857554M768102k936778l724814Q3682K27962l294217l541026
7986b544448P30493L288891Q98372k552611l104945j278055J217888L510880L700981
7977C867446M45537l105167k379467J224593J780711j692208l531358q68300J579079
7968b679134q41735n630585p312782m543281L43508N237463Q399337P924316M373766
$$ plain form
7959 5270873 6654076 7561781 8052229 5836681 633532 -4738144 -7986921 -9152810 -8336890
7950 -8336890 -4790593 524105 4194220 3958765 1305765 -1021843 -2669359 -5161111
7942 -5161111 -8423484 -9421199 -5073399 3350319 9558394 7779511 -493036 -7401414
7934 -7401414 -7653149 -4101107 -2233027 -1986559 881469 6967864 11728807 11829194 8601510
7925 8601510 4559180 572996 -2348353 -2282898 858295 4665891 7543082 9921275 11445908
7916 11445908 10441822 7470045 5890642 7147644 8717271 8400268 7246229 6432722
7908 6432722 5017441 3059670 2950813 4659264 3755993 -1843824 -6858150 -5228239 1094872
7899 1094872 5257035 5266679 4779536 5206258 3439674 -1709955 -6375305 -7005321 -4805055
$$ packed form
7959E270873J383203R07705M90448k215548n203149n371676l248777j165889Q15920
7950h336890L546297N314698L670115k35455k653000k327608j647516k491752
7942e161111l262373r97715M347800Q423718O208075j778883q272547o908378
7934g401414k51735L552042J868080K46468K868028O086395M760943J00387l227684
7925H601510m042330l986184k921349O5455L141193L807596K877191K378193J524633
7916A1445908j004086k971777j579403J257002J569627l17003j154039q13507
7908F432722j415281j957771j08857J708451r03271n599817n014326J629911O323111
7899A094872M162163R644m87143M26722j766584n149629m665350o30016K200266
$$ plain form
7890 -4805055 -2662285 -921934 1405994 3538021 3405323 358798 -3741015 -5561217
7882 -5561217 -2717826 3270407 6967819 4385628 -1721749 -4615995 -1836809 2295497
7874 2295497 3121531 1307789 415070 1617702 3236857 3735776 2807111 503492 -2636890
$$ packed form
7890d805055K142770J740351K327928K132027j32698l046525m099813j820202
7882e561217K843391N988233L697412k582191o107377k894246K779186M132306
7874B295497Q26034j813742q92719J202632J619155M98919r28665k303619l140382
$$ [...]
##END NTUPLES=NMR SPECTRUM
##END=
