##TITLE=31Pdec_SR73 AcCl:Ac2O
 , 124 sc
 24.08.2021
##JCAMPDX= 6.0         $$ Bruker NMR JCAMP-DX V2.0
##DATA TYPE= NMR SPECTRUM
##DATA CLASS= NTUPLES
##ORIGIN= UXNMR, Bruker Analytische Messtechnik GmbH
##OWNER= root
$$ XWIN-NMR		Version 3.5
$$ Tue Aug 24 12:17:31 2021 Russian Standard Time (UT+4h)  she@DPX200
##.OBSERVE FREQUENCY= 81.013821
##.OBSERVE NUCLEUS= ^31P
##.ACQUISITION MODE= SIMULTANEOUS
##.ACQUISITION SCHEME= undefined
##.AVERAGES= 124
##.DIGITISER RES= 16
##SPECTROMETER/DATA SYSTEM= spect
##.PULSE SEQUENCE= zgpg30
##.SOLVENT NAME= CDCl3
##.SHIFT REFERENCE= (INTERNAL, CDCl3, 0, 248.564)
##AUDIT TRAIL= $$ (NUMBER, WHEN, WHO, WHERE, WHAT)
$$ ##TITLE= Audit trail, XWIN-NMR		Version 3.5
$$ ##JCAMPDX= 5.01
$$ ##ORIGIN= Bruker BioSpin GmbH
$$ ##OWNER= she
$$ F:/spectra/data/she/nmr/P31/1/pdata/1/auditp.txt
$$ ##AUDIT TRAIL=  $$ (NUMBER, WHEN, WHO, WHERE, WHAT)
(   1,<2021-08-24 12:16:15.46 +0400>,<she>,<DPX200>,
      <continue with go, POWCHK disabled, PULCHK disabled
       configuration hash MD5:
       00 E9 B6 7A A2 85 ED C7 34 08 36 98 17 FE 4E 26
       data hash MD5: 32K
       C4 9A ED 85 E6 7F B6 F5 DB 8E 7D 34 E1 3B 9B 59>)
(   2,<2021-08-24 12:16:18.26 +0400>,<she>,<DPX200>,
      <Start of raw data processing
       efp BC_mod = 2 LB = 1 FT_mod = 6 PKNL = 1 PHC0 = -7468.765 PHC1 = 509.2736 SI = 64K 
       data hash MD5: 64K
       92 E3 AE 86 0A A0 4B 2D DB 66 D9 62 4C 36 1E 4A>)
(   3,<2021-08-24 12:16:52.28 +0400>,<she>,<DPX200>,
      <pk PHC0 = -10.10495 PHC1 = 148.8 
       data hash MD5: 64K
       57 40 23 2A 7E 13 11 62 F7 72 A8 C5 95 FC AC 50>)
(   4,<2021-08-24 12:16:55.20 +0400>,<she>,<DPX200>,
      <abs ABSG = 5 
       data hash MD5: 64K
       1A 27 D9 8A 3C BA E3 59 A4 87 FF CE 79 56 E7 7A>)
$$ ##END=
$$ 
$$ hash MD5
$$ 1A 7F 4C C5 07 AF AC F4 D6 65 9D 50 4C 80 1A 29
##$RELAX= 
##$RELAX= 
##$RELAX= 
##$RELAX= 
##$RELAX= 
##$RELAX= 
##$RELAX= 
##$RELAX= 
$$ Bruker specific parameters
$$ --------------------------
##$DU= <F:/spectra>
##$EXPNO= 1
##$NAME= <P31>
##$PROCNO= 1
##$TYPE= <nmr>
##$USER= <she>
##$AMP= (0..31)
100 100 100 100 100 100 100 100 100 100 100 100 100 100 100 100 100 100 
100 100 100 100 100 100 100 100 100 100 100 100 100 100 
##$AQSEQ= 0
##$AQ_mod= 1
##$AUNM= <au_zg>
##$AUTOPOS= <>
##$BF1= 81.014009
##$BF2= 200.13
##$BF3= 200.13
##$BF4= 200.13
##$BF5= 200.13
##$BF6= 200.13
##$BF7= 200.13
##$BF8= 200.13
##$BYTORDA= 1
##$CFDGTYP= 0
##$CFRGTYP= 5
##$CHEMSTR= <none>
##$CNST= (0..31)
1 1 145 1 1 1 1 1 1 1 1 1 1 1 1 1 1 1 1 1 1 1 1 1 1 1 1 1 1 1 1 1 
##$CPDPRG= <waltz16>
##$CPDPRG1= <>
##$CPDPRG2= <waltz16>
##$CPDPRG3= <>
##$CPDPRG4= <mlev>
##$CPDPRG5= <mlev>
##$CPDPRG6= <mlev>
##$CPDPRG7= <mlev>
##$CPDPRG8= <mlev>
##$CPDPRGB= <>
##$CPDPRGT= <>
##$D= (0..31)
0 1 0 0 0 0 0 0 0 0 0 0.03 2e-05 3e-06 0 0 0 0 0 0 0 0 0 0 0 0 0 0 0 0 
0 0 
##$DATE= 1629792789
##$DBL= (0..7)
120 120 120 11 120 120 24 19 
##$DBP= (0..7)
150 150 150 150 150 150 150 150 
##$DBP07= 0
##$DBPNAM0= <>
##$DBPNAM1= <>
$$ [...]
##$SUBNAM3= <"">
##$SUBNAM4= <"">
##$SUBNAM5= <"">
##$SUBNAM6= <"">
##$SUBNAM7= <"">
##$SUBNAM8= <"">
##$SUBNAM9= <"">
##$SW= 501.771253377433
##$SWIBOX= (0..15)
0 1 3 0 0 0 0 0 0 0 0 0 0 0 0 0 
##$SW_h= 40650.406504065
##$TD= 32768
##$TD0= 1
##$TE= 0
##$TE2= 300
##$TE3= 300
##$TEG= 300
##$TL= (0..7)
0 120 53 12 22 120 120 120 
##$TP= (0..7)
150 150 150 150 150 150 150 150 
##$TP07= 0
##$TPNAME0= <>
##$TPNAME1= <>
##$TPNAME2= <>
##$TPNAME3= <>
##$TPNAME4= <>
##$TPNAME5= <>
##$TPNAME6= <>
##$TPNAME7= <>
##$TPOAL= (0..7)
0.5 0.5 0.5 0.5 0.5 0.5 0.5 0.5 
##$TPOFFS= (0..7)
0 0 0 0 0 0 0 0 
##$TUNHIN= 0
##$TUNHOUT= 0
##$TUNXOUT= 0
##$USERA1= <user>
##$USERA2= <user>
##$USERA3= <user>
##$USERA4= <user>
##$USERA5= <user>
##$V9= 5
##$VALIST= <valist>
##$VCLIST= <CCCCCCCCCCCCCCC>
##$VD= 0
##$VDLIST= <DDDDDDDDDDDDDDD>
##$VPLIST= <PPPPPPPPPPPPPPP>
##$VTLIST= <TTTTTTTTTTTTTTT>
##$WBST= 1024
##$WBSW= 4
##$XGAIN= (0..3)
0 0 0 0 
##$XL= 0
##$YL= 0
##$YMAX_a= 6542
##$YMIN_a= -2908
##$ZGOPTNS= <>
##$ZL1= 120
##$ZL2= 120
##$ZL3= 120
##$ZL4= 120
##$ABSF1= 248.5645
##$ABSF2= -253.2056
##$ABSG= 5
##$ABSL= 3
##$ALPHA= 0
##$AQORDER= 0
##$ASSFAC= 0
##$ASSFACI= 0
##$ASSFACX= 0
##$ASSWID= 0
##$AUNMP= <proc_1d>
##$AZFE= 0.1
##$AZFW= 0.5
##$BCFW= 0
##$BC_mod= 2
##$BYTORDP= 0
##$COROFFS= 0
##$CY= -3
##$DATMOD= 1
##$DC= 0
##$DFILT= <>
##$DTYPP= 0
##$F1P= 0
##$F2P= 0
##$FCOR= 1
##$FTSIZE= 65536
##$FT_mod= 6
##$GAMMA= 0
##$GB= 0
##$INTBC= 1
##$INTSCL= 5.30512e-09
##$ISEN= 30
##$LB= 1
##$LEV0= 0
##$LPBIN= 0
##$MAXI= 10000
##$MC2= 0
##$MEAN= 0
##$ME_mod= 0
##$MI= 50
##$NCOEF= 0
##$NC_proc= -9
##$NLEV= 6
##$NOISF1= 182.463
##$NOISF2= 159.3651
##$NSP= 0
##$NTH_PI= 0
##$NZP= 0
##$OFFSET= 248.5645
##$PC= 4
##$PHC0= -7478.87
##$PHC1= 658.0736
##$PH_mod= 1
##$PKNL= yes
##$PPARMOD= 0
##$PSCAL= 0
##$PSIGN= 0
##$REVERSE= no
##$SF= 81.014009
##$SI= 65536
##$SIGF1= 159.3651
##$SIGF2= -187.1042
##$SINO= 113.3802
##$SIOLD= 16384
##$SREGLST= <1H.CDCl3>
##$SSB= 0
##$STSI= 65536
##$STSR= 0
##$SW_p= 40650.406504065
##$SYMM= 0
##$S_DEV= 0
##$TDeff= 32768
##$TDoff= 0
##$TI= <>
##$TILT= no
##$TM1= 0
##$TM2= 0
##$TOPLEV= 0
##$USERP1= <user>
##$USERP2= <user>
##$USERP3= <user>
##$USERP4= <user>
##$USERP5= <user>
##$WDW= 1
##$XDIM= 65536
##$YMAX_p= 390691376
##$YMIN_p= -89798726
$$ End of Bruker specific parameters
$$ ---------------------------------
##NTUPLES= NMR SPECTRUM
##VAR_NAME=  FREQUENCY,     SPECTRUM/REAL,   SPECTRUM/IMAG
##SYMBOL=    X,             R,               I
##VAR_TYPE=  INDEPENDENT,   DEPENDENT,       DEPENDENT
##VAR_FORM=  AFFN,          ASDF,            ASDF
##VAR_DIM=   65536,         65536,           65536
##UNITS=     HZ,            ARBITRARY UNITS, ARBITRARY UNITS
##FACTOR=    0.620285442955139, 1,           1
##FIRST=     20137.2065510759, 0,            0
##LAST=      -20513.1999529892, 0,           0
##MIN=       -20513.1999529892, -89798726,   0
##MAX=       20137.2065510759, 390691376,    0
$$ Real data points
##PAGE= N=1
##DATA TABLE= (X++(R..R)), XYDATA
$$ [...]
57840H634656J3562377K157189j5133441k2093819j3433638m489521l257162P74932
57832c3278427Q626910M852009p737068l116078J9762027K4064852m269200k4620698
57824a5715673m522842K4998891J9194322r409867j8109437m820297L79524n349874
57816a3355253k52811J2626405J0813328j160793q86803M358706q250608k2635359
57808a8743188l093382L3087437K8990395j5641953l2167788P393603L8591155
57801C8416279N892030m5897930m1788030P482563L0391749R475342l483551J7449559
57793A7938011L3010898J0354773k4034324l1281038j7146802r349598q816086
57786b9324166Q21930J4510123J2591012j903584n389581P374762J5432339P573410
$$ plain form
57840 8634656 22197033 24354222 9220781 -12873038 -26306676 -30796197 -34053359 -33278427
57832 -33278427 -24651517 -19799508 -27536576 -30652654 -10890627 13174225 8905025 -15715673
57824 -15715673 -20238515 4760376 23954698 14544831 -3564606 -8384903 -8005379 -13355253
57816 -13355253 -13608064 -981659 9831669 8670876 7784073 12142779 3892171 -18743188
57808 -18743188 -21836570 11250867 40241262 24599309 -7568479 -174876 38416279
57801 38416279 44308309 -1589621 -43377651 -35895088 -5503339 3972003 488452 17938011
57793 17938011 50948909 61303682 37269358 5988320 -11158482 -20508080 -29324166
57786 -29324166 -28502236 -13992113 -1401101 -3304685 -8694266 -1319504 14112835 21686245
57778B1686245m85196L964155P105206o647776k4016142k0675757J30238J2675106
57770f263921R354108Q670512J8496946K0034632K251850j3361746n036878J1417605
57762D5563108N382991j9114673k8373799j1224515N466198j97360j5576030j9973695
57754c8047775j5663760j3587231p710331J2245052L3626603L1852444O695071
57747I410073j4140316j1550635J811834K221567j3241242k5160933j7070786
57740f7720438N607292K2103121J8520057J648969j0268374q311474R77403R356312
57732b8087132J6062195J8562422P606890j5271065k6194283n698724K6800393
57725f219304L0113607k407154k9274242j7473020J0966436J2910048j2296165
$$ plain form
57778 21686245 21201049 25165204 32270410 25622634 1606492 -19069265 -18939027 -6263921
57770 -6263921 3090187 11760699 30257645 50292277 52544127 39182381 34145503 45563108
57762 45563108 50946099 31831426 3457627 -7766888 -2300690 -2498050 -18074080 -38047775
57754 -38047775 -53711535 -67298766 -75009097 -62764045 -29137442 2715002 9410073
57747 9410073 -4730243 -16280878 -14469044 -12247477 -25488719 -50649652 -67720438
57740 -67720438 -62113146 -40010025 -21489968 -19840999 -30109373 -38420847 -37443444 -28087132
57732 -28087132 -12024937 6537485 14144375 -1126690 -27320973 -33019697 -6219304
57725 -6219304 23894303 21487149 -7787093 -25260113 -14293677 -1383629 -13679794
57718a3679794k5541090r263331R026926L174637j2446890r507681J0226485K1689617
57710b6321121J5208394L975362j970103n937430q216110q63551J4865521K2507014
57702A3247976J1179491q191685j5764500n138159J2603874K1153719J1983536
57695D1074252p941273j9106846q827590R762172R568892j4068144l2009240j7745153
57687c9292930J5323019K9405055J0859103j4472969j7005475J455395J7092264
57680C363462J7142661R991904O238796M363581m99958m567668j758277L397402
57672C7671903O01297q940773j1530759q51289J1613084J2794229N724666J720297
57664D8802655K175568q726n212426o422027k835541j859356o280813j0098462
$$ plain form
57718 -13679794 -39220884 -48484215 -39457289 -36282652 -48729542 -58237223 -48010738 -26321121
57710 -26321121 -11112727 -7137365 -9107468 -15044898 -23261008 -24124559 -9259038 13247976
57702 13247976 24427467 16235782 471282 -4666877 7936997 29090716 41074252
57695 41074252 33132979 14026133 5198543 14960715 24529607 10461463 -21547777 -39292930
57687 -39292930 -23969911 5435144 16294247 1821278 -15184197 -13728802 3363462
57680 3363462 20506123 30498027 36736823 41100404 40600446 36032778 34274501 37671903
57672 37671903 38273200 29332427 17801668 16950379 28563463 41357692 47082358 48802655
57664 48802655 50978223 50969497 45757071 39335044 36499503 34640147 28359334 18260872
57656A8260872q808579m257475J602576P622153P999316j586477j1206577n199345
57648D426464J2251689J6868961j334683j9760448j3580160Q952539J9952007
57641B7776369J1854976K450675K444972N56831j3159283k7791607k7104637j2938258
57633c5909962o00023K408291J379427J955096M174095Q153889J5130687K1076246
57625A7767746J8210324N883928p329513j4578858j5580669r078760O878768K1792386
57617B3965352J5812037j1422132l0346401j9004493K478711J192696j5030133
57610c2354363r026236K1707761L4549138Q374150k0631771j5495421N199737
57603g677005L105784j5818834j6018630O039171J9851983J3170669L760445N42694
$$ plain form
57656 18260872 9452293 5194818 6797394 14419547 22418863 20832386 9625809 4426464
57648 4426464 16678153 33547114 32212431 12451983 -1128177 7824362 27776369
57641 27776369 39631345 42082020 44526992 45083823 31924540 4132933 -22971704 -35909962
57633 -35909962 -36509985 -34101694 -32722267 -30767171 -26593076 -18439187 -3308500 17767746
57625 17767746 35978070 41861998 34532485 19953627 4372958 -4705802 2172966 23965352
57617 23965352 39777389 28355257 -1991144 -20995637 -18516926 -17324230 -32354363
57610 -32354363 -41380599 -19672838 14876300 23250450 2618679 -12876742 -7677005
57603 -7677005 -4571221 -20390055 -36408685 -30369514 -10517531 2653138 6413583 6956277
57595F956277o432842j4783201p911739R319200J0507043p603750j6515499l448891
57587b9913402Q405737J869862o808556j152393P161645M499611R14562P273746
57579g749188J3160033R501807P015514R838480o97212k9112355m1253305j0929544
57571e0225770L1746990L6702118L374517k3609481j8311739L259584J8272901
57564A209120K0406797Q495253j6146637l6683180l1145999k123234K2707786
57557c3280094K2972503M105366j4732616j7196878M51007K1464934J9086860
57550B871082q842812k7940294j0874175K0517733K4095060j965679j9762820
57543b1901905q783097J1114485J6360479Q173511k795434j3164174j8285258
$$ plain form
57595 6956277 523435 -14259766 -22171505 -12852305 -2345262 -9949012 -26464511 -29913402
57587 -29913402 -21507665 -19637803 -26446359 -27598752 -20437107 -15937496 -15022934 -7749188
57579 -7749188 5410845 14912652 21928166 31766646 31069434 1957079 -39296226 -50225770
57571 -50225770 -18478780 18223338 21597855 -2011626 -20323365 -17063781 1209120
57564 1209120 21615917 30111170 13964533 -22718647 -53864646 -55987880 -33280094
57557 -33280094 -10307591 -6202225 -20934841 -38131719 -37680712 -16215778 2871082
57550 2871082 -5971730 -33912024 -44786199 -24268466 -173406 -2139085 -21901905
57543 -21901905 -30685002 -19570517 -3210038 4963473 2168039 -10996135 -29281393
57536b9281393r275308J1017925K5801878K5043619J4150282P9977j4384858k1613919
57528A538203j3492957K696075J0556759P635084M055647K48199j1028596k1285498
57520a9077084j2239272J0950442K0286643O425865p974508o874229m514992j4483944
57512b7501079k1378390n761360K1458111L3093940K2401851N473611m390642
57505B3396042o641380m073218M68141J356809l789226q330853n202345L335578
57497E19548J0929556J5209377J4312765M199134j2190328k1207340j3609925
57490a837213K203231J0448535O899247N31192J47907N276839P962895R77771
57482C2610404j2636408j8952336q561977Q793502J4330936M171153p976095j1621275
$$ plain form
57536 -29281393 -38556701 -27538776 -1736898 23306721 37457003 37536980 23152122 1538203
57528 1538203 -11954754 -9258679 1298080 8933164 12988811 13237010 2208414 -19077084
57520 -19077084 -31316356 -20365914 -79271 6346594 -1627914 -8502143 -13017135 -27501079
57512 -27501079 -48879469 -54640829 -33182718 -88778 22313073 27786684 23396042
57505 23396042 16754662 12681444 13149585 14506394 10717168 2386315 -2816030 519548
57497 519548 11449104 26658481 40971246 45170380 32980052 11772712 -1837213
57490 -1837213 366018 10814553 17713800 18244992 18392899 23669738 31632633 32610404
57482 32610404 19973996 1021660 -7540317 1253185 15584121 19755274 11779179 157904
57474A57904r464851n578896P77947N829079J814559p153966n714963Q386203
57466a0946984J6640385P097228n944225l477681R616436J3939229N164605k788908
57458B9300085p62754M636225L814251l009248q376633o918352n29497L416053
57450B1570130M2579o298147p092962j562843K841072K457674J482803K038375
57442A5478681J32607m345770l970015L463413Q161925K632114n580882n426076
57434A0545997k73847k630557j3507752j8883976r314512N447974P636255n540264
57426b6520682j6868492j0251617P753548J5712658O410498l398600J520342J1575796
57418a4066549P815381p083771j1007228N157219K3975871K4667921P192786j2205042
$$ plain form
57474 157904 -9306947 -14885843 -14107896 -8278817 -6464258 -13618224 -19333187 -10946984
57466 -10946984 5693401 12790629 6846404 3368723 12985159 26924388 32088993 29300085
57458 29300085 28537331 33173556 36987807 33978559 25601926 18683574 18154077 21570130
57450 21570130 21612709 15314562 8221600 6658757 9499829 11957503 13440306 15478681
57442 15478681 15611288 11265518 7295503 10758916 18920841 21552955 15972073 10545997
57434 10545997 10272150 7641593 -5866159 -24750135 -34064647 -28616673 -20980418 -26520682
57426 -26520682 -43389174 -53640791 -45887243 -30174585 -23764087 -27162687 -25642345 -14066549
57418 -14066549 -6251168 -13334939 -24342167 -19184948 4790923 29458844 36651630 24446588
57410B4446588j9913118j4379198l914359Q92795k529777n093886K266980J5007151
57402c216824K0127587J2899920N62424q431021j0864484p647600m362854q081563
57394i014415j5117151j0099671J0934855K6767056J7357952n220672j3487802
57387B120152m941116m84110o448477p160139K743361Q179779K975918J215910
57379a798722Q360473P811012q796092k2008602j3514911N200181J2321240P141391
57371e284030K422583l97368p248334j2723474o406635P103624J2732636P524002
57363b276996L646327Q803975J5524002J1945058l758761k1065435k6230983j4846503
57355b8259316L317697J4124490J3085600O508156K104023L927672J1523753J6538119
$$ plain form
57410 24446588 4533470 -9845728 -13760087 -12867292 -15397069 -20490955 -18223975 -3216824
57402 -3216824 16910763 29810683 30373107 21942086 11077602 3430002 -932852 -9014415
57394 -9014415 -24131566 -34231237 -23296382 3470674 20828626 15607954 2120152
57387 2120152 -2820964 -3305074 -9753551 -16913690 -14170329 -5990550 -3014632 -1798722
57379 -1798722 6561751 14372763 5576671 -16431931 -29946842 -24746661 -12425421 -5284030
57371 -5284030 -2861447 -3258815 -10507149 -23230623 -29637258 -22533634 -9800998 -2276996
57363 -2276996 1369331 10173306 25697308 37642366 33883605 12818170 -13412813 -28259316
57355 -28259316 -24941619 -10817129 2268471 8776627 10880650 14808322 26332075 42870194
57347D2870194P190683j3876691k5525660j5626761j679669n360173j8035410
57340c0043487j6234300j352107O657617Q256492K0546084L5795895K4759492
57333D8385686j0902133l0169485j1837496J4971437J8438119P063588J955263
57326C7904979j082471j3252635k3150950j5628981n35448M531679L001556O307896
57318a904375R206600K635252m286221R85260J1009704J0972555J671865q136489
57310B2154151j6901229k1145436j0511241R803434J3657081p630788k4493837
57303c5067865j1326913J3667742J9039621Q243187M825675Q530687K007154j1628646
57295a709358j3052061r46674Q415407R004915O079101j486798j4337756j8720123
$$ plain form
57347 42870194 50060877 36184186 10658526 -4968235 -6647904 -12008077 -30043487
57340 -30043487 -46277787 -47629894 -40972277 -32715785 -12169701 23626194 48385686
57333 48385686 37483553 7314068 -4523428 10448009 28886128 35949716 37904979
57326 37904979 36822508 23569873 418923 -15210058 -15745506 -11213827 -8212271 -1904375
57318 -1904375 7302225 9937477 5651256 6636516 17646220 28618775 30290640 22154151
57310 22154151 5252922 -15892514 -26403755 -16600321 -2943240 -10574028 -35067865
57303 -35067865 -46394778 -32727036 -13687415 -5444228 -618553 7912134 9919288 -1709358
57295 -1709358 -14761419 -15708093 -7292686 1712229 7791330 6304532 -8033224 -26753347
57287b6753347m927717J1699259J2653480N185651M686457N756704j534223o211933
57279E54331J831333N925575p070840j4462603L478469J7801848n270440l6898432
57271c4110759k3232466K2735352L5254027O26580k3201313l923916J8229681
57264g622814O732669j1625855j123862K0642318J8849647J211592k604617O373983
57256C0833061N867622m911445r195133o130991q122940j3872992j1353252j412354
57248a8298424L680163L88135m265146n730806m047906P24713N841973O286974
57240a5420324L626501M187650N734397Q56006m620909K816834J6182941J0461688
57232B3824784j6722597l2706324j4287691J7869735K9204742J7446513O651886
$$ plain form
57287 -26753347 -31681064 -19981805 -7328325 -2142674 2543783 8300487 6766264 554331
57279 554331 2385664 8311239 1240399 -13222204 -9743735 8058113 2787673 -34110759
57271 -34110759 -57343225 -34607873 646154 1272734 -21928579 -25852495 -7622814
57264 -7622814 -890145 -12516000 -13639862 7002456 25852103 27063695 24459078 30833061
57256 30833061 36700683 31789238 22594105 16463114 8340174 -5532818 -16886070 -18298424
57248 -18298424 -14618261 -14230126 -18495272 -24226078 -28273984 -27549271 -21707298 -15420324
57240 -15420324 -11793823 -7606173 -1871776 -1015770 -5636679 -2819845 13363096 23824784
57232 23824784 7102187 -25604137 -39891828 -22022093 7182649 24629162 31281048
57225C1281048P580711P141026o242987k4279959k8374285j0792579J4445418
57218i241607K3097678P833310j1314226j3157586l460223q16185m472611m57005
57210a1988455P285863K221361j0245470o887147J1689465J8104674M159329n548682
57202H790938K654312R354321p40986j2811098j1576622n964079n128828p7658
57194a5499700J1445919J2632973K15546l395636P780664N800351j9469012l0859478
57186c1348373l069914K6234057J1362924k5718671k8519849N636797K7434473
57179a7988556J5862686J24147J212594M686944J56819R97279J1243992J2882020
57171B9177925P33014n594624J011677M64338j5275194k1776730k613724J9206799
$$ plain form
57225 31281048 38861759 46002785 39759798 15479839 -12894446 -23687025 -9241607
57218 -9241607 13856071 21689381 10375155 -2782431 -6242654 -7058839 -11531450 -11988455
57210 -11988455 -4702592 -2481231 -12726701 -19613848 -7924383 10180291 14339620 8790938
57202 8790938 11445250 20799571 20058585 7247487 -4329135 -10293214 -15422042 -15499700
57194 -15499700 -4053781 8579192 8794738 5399102 13179766 18980117 -488895 -31348373
57186 -31348373 -34418287 -8184230 3178694 -22539977 -51059826 -45423029 -17988556
57179 -17988556 -2125870 -2001723 -789129 3897815 4054634 5051913 16295905 29177925
57171 29177925 29910939 24316315 25327992 25792330 10517136 -11259594 -13873318 5333481
57163E333481J6192274o60517k326235J1268837J4436137j997597j8849575j8616659
57155D780146n954324M857401O768361L01287j0154141j5505837p588032Q459984
57147a4035155J5161762L043186j5148102j8412010l135319J3627105J6310064
57140b588469P123051k402003o417481n136385J026853Q738034J0094715L357857
57132A3796172j478505J843202L716462m147206r588183K136013J9325458J7418168
57124D3021581k233263j4572628j1394763r390241j3970121q500215R889747J7226135
57116A0076232K291906j1437142m117217Q535150N117705n925592o524591n23292
57108b506841K146931Q817551K1990690J8875109j1464064l3801704j2314355
$$ plain form
57163 5333481 21525755 20865238 18539003 29807840 44243977 42246380 23396805 4780146
57155 4780146 -1174178 3683223 10451584 10752871 598730 -14907107 -22495139 -14035155
57147 -14035155 1126607 4169793 -10978309 -29390319 -32525638 -18898533 -2588469
57140 -2588469 4534582 2132579 -4284902 -9421287 -8394434 343600 10438315 13796172
57132 13796172 12317667 14160869 17877331 13730125 4141942 6277955 25603413 43021581
57124 43021581 40788318 26215690 14820927 5430686 -8539435 -17039650 -7149903 10076232
57116 10076232 12368138 930996 -3186221 5348929 10466634 4541042 -1983549 -2506841
57108 -2506841 -359910 8457641 30448331 49323440 37859376 4057672 -8256683
57101h256683K7417804L0371921m276783k4126602p557633Q195840m726012k0416509
57093c374657q441213J4661989J6624717K360865n82520Q848607O735101j1930464
57085B4902425k2981549j0115256J1710984J8729540Q568217k961721o182240
57078B1670400n568219n110267L20090J1438666J3474169n584653l0075261l0364808
57070b9799883m659785J4338579M218650j6569366j8220194r77855J2785825J3044628
57062b5839401O800859n39429o608918l627969J0715623K1845110J7038191O215756
57054B5999822M693552P240623J434287o589864n649637n048213j6364894k2853121
57046a7137445l036874K4781747K2690618n722091j7927503Q53665J7486724P259254
$$ plain form
57101 -8256683 19161121 49533042 45256259 21129657 13572024 21767864 17041852 -3374657
57093 -3374657 -11815870 2846119 19470836 21831701 21249181 30097788 36832889 24902425
57085 24902425 1920876 -8194380 3516604 22246144 30814361 27852640 21670400
57078 21670400 16102181 10991914 11312004 22750670 36224839 30640186 564925 -29799883
57070 -29799883 -34459668 -20121089 -15902439 -32471805 -50691999 -51669854 -38884029 -25839401
57062 -25839401 -19038542 -19577971 -26186889 -29814858 -19099235 2745875 19784066 25999822
57054 25999822 30693374 37933997 39368284 32778420 27128783 22080570 5715676 -17137445
57046 -17137445 -20174319 4607428 27298046 21575955 3648452 4502117 21988841 29248095
57038B9248095j1729538j6286852j2132314j0700150n542661O720547J1000416
57031i422457N33634o648123K280638J2915597R954533R36948m176758j1272107
57023d898095k1023557j6804421M448129J5981791N86279j8736647j3921871N827581
57015d8540811J4977596J2781334J3124269J2944870K663263q067182n779036
57008e895697Q61607j45093K650625J9508823K7445689K451618l1713377l1804514
57000a6640319k999065R089777q364252j9938161n487042J0339383P425129L829486
56992b2745064J6736234K7681524J5259967o490798j1880468m122177l618144
56985A0821074j1500336j1996424j339366R202379J3234932J3265373R453486
$$ plain form
57038 29248095 17518557 1231705 -10900609 -21600759 -27143420 -20422873 -9422457
57031 -9422457 -8888823 -15536946 -13256308 -340711 9613822 10550770 6374012 -4898095
57023 -4898095 -25921652 -42726073 -38277944 -22296153 -21709874 -40446521 -54368392 -48540811
57015 -48540811 -33563215 -20781881 -7657612 5287258 7950521 -116661 -5895697
57008 -5895697 -5034090 -5179183 -2528558 16980265 44425954 46877572 15164195 -16640319
57000 -16640319 -19639384 -10549607 -18913859 -38852020 -44339062 -33999679 -26574550 -22745064
56992 -22745064 -6008830 21672694 36932661 30441863 18561395 14439218 10821074
56985 10821074 -679262 -12675686 -14015052 -4812673 8422259 21687632 31141118
56978C1141118j68532j1725976j8899851j9798941j3513767J065318J5815873
56971a6084758J5416266j209570j4595999j1314234k664378k947089m286636P762733
56963b9923665K5329086K7114040J0159297p499501j2543335p155496K079439
56956G559865Q844535M715569j0294974j9102373p978174R341161R168835n268760
56948c014316j0146834k155154k467446j4937594j3985712J1079450L0439164
56941e188442J5729322j5741850k5624231p299177J3028378J6963333Q992796
56934H60129j996676j0257255n914951J4758468L2657085K3386732o976408k6187155
56926B0329969j8647063j867942L960333L25946k924889m244744m011890P56493
$$ plain form
56978 31141118 30972586 19246610 346759 -19452182 -32965949 -31900631 -16084758
56971 -16084758 -668492 -1878062 -16474061 -27788295 -30452673 -33399762 -37686398 -29923665
56963 -29923665 -4594579 22519461 32678758 25179257 12635922 5480426 7559865
56956 7559865 16404400 21119969 10824995 -8277378 -16255552 -6914391 2254444 -3014316
56948 -3014316 -13161150 -15316304 -17783750 -32721344 -46707056 -35627606 -5188442
56941 -5188442 10540880 -5200970 -30825201 -38124378 -25096000 -8132667 860129
56934 860129 -1136547 -11393802 -17308753 -2550285 30106800 53493532 46517124 20329969
56926 20329969 1682906 -185036 3775297 4101243 1176354 -3068390 -7080280 -6323787
56918f323787O453834M086105l134179k258602L757414k769773j8269318j2913424
56910c1371730K0264291M1795911J9989551j7203482k1577138K819213J0632512
56903B5349128r657668k0066879J139114K3457729J3513074j4836539k5629643
56896f731684j1789960N447277J2196036J2152800J0260628P178133N351329N126939
56888C9191498j98213j2930395k1533222j5571591l042660R57621l331105l543565
56880b0001632M065732J1601460J3936940J2209563N518771o872221j6657608
56873C801005j3939723l250699J565621j467079j030059O350975R942160M534094
56865F506295N23689N151823P611312l975304k0234193k0389512o88703K0689835
$$ plain form
56918 -6323787 130047 4216152 1081973 -1176629 2580785 -188988 -18458306 -31371730
56910 -31371730 -11107439 30688472 50678023 33474541 11897403 14716616 25349128
56903 25349128 15691460 -4375419 -3236305 20221424 33734498 18897959 -6731684
56896 -6731684 -18521644 -13074367 -878331 11274469 21535097 28713230 34064559 39191498
56888 39191498 38993285 26062890 4529668 -11041923 -14084583 -13126962 -16458067 -20001632
56880 -20001632 -15935900 -4334440 9602500 21812063 27330834 20458613 3801005
56873 3801005 -10138718 -13389417 -11823796 -13290875 -14320934 -7969959 1972201 6506295
56865 6506295 7029984 12181807 19793119 15817815 -4416378 -24805890 -25494593 -4804758
56857d804758K6935206J9152988P906890q68710o347063p333586m075155k078722
56849B8487090o796960j4574428j4835524l637744R274234J1462050L906564k12793
56841A3072489N351551Q994779l130758k4090246k9909887r403981J9558390L0863795
56833A1306132J9980722L457617n767374r327487j0871818p663882n6070L002936
56825D060776l132576q947975l577838Q449604J3136048N792875n279785j0897523
56817c96394q207747J128762J1207330J3448388O811488K185284O077462N881712
56809C8136285j2893150l8343480m1594412j6996322Q208128J2142989N681841
56802d5658121Q657947J7594788J6312762N438097q00225k58640l314177r798565
$$ plain form
56857 -4804758 22130448 41283436 49190326 48321616 41974553 34640967 30565812 28487090
56849 28487090 21690130 7115702 -7719822 -11357566 -2083332 9378718 13285282 13072489
56841 13072489 18424040 27418819 24288061 197815 -29712072 -39116053 -19557663 11306132
56833 11306132 31286854 34744471 28977097 19649610 8777792 1113910 1057840 4060776
56825 4060776 928200 -8019775 -11597613 -3148009 9988039 15780914 10501129 -396394
56817 -396394 -8604141 -7475379 3731951 17180339 23991827 26177111 32254573 38136285
56809 38136285 25243135 -13100345 -54694757 -71691079 -63482951 -51339962 -45658121
56802 -45658121 -37000174 -19405386 -3092624 2345473 1545248 1286608 -2027569 -11826134
56794a1826134o932387O982966J5945362R649932k434223q204676r544790j1358048
56786a7721998p408280P313769J8693768P724881j7767116k5692540k127665K5849445
56778a1135736K5137806K208681q336661M158597J3311965M46440j6292013j4747606
56770e248527n299930q066620j3501430p1427K1337972K0684610J874094j444265
56762A0264477J3115112Q208443k5482950m2654611j3639667K3650851K2422290
56755d116055j49090J400036K1037975J5810409j4729581k5708579l709196J2519470
56747B355389k97255j5144995p705754L571152j864892o332770J1724055L3706090
56739B0011020K7821230m14025j9336810j8826478j4145537j1446323j979464
$$ plain form
56794 -11826134 -18758521 -11775555 4169807 13819739 11385516 3180840 -6363950 -17721998
56786 -17721998 -25130278 -17816509 877259 8602140 -9164976 -34857516 -36985181 -11135736
56778 -11135736 14002070 16210751 7874090 12032687 25344652 25791092 9499079 -5248527
56770 -5248527 -10548457 -18615077 -32116507 -32187934 -10849962 9834648 11708742 10264477
56762 10264477 23379589 31588032 6105082 -36549529 -50189196 -26538345 -4116055
56755 -4116055 -4265145 -2865109 18172866 33983275 19253694 -6454885 -10164081 2355389
56747 2355389 2058134 -13086861 -20792615 -17221463 -19086355 -25419125 -13695070 20011020
56739 20011020 47832250 47418225 28081415 9254937 -4890600 -16336923 -18316387
56732a8316387J1395347J1390130n301517j9359090j5675574k123723N679249
56725c2311565N291500N133413J0061822J6908695J9657168J3631482j709910
56718C6662605j8826755k3933585j0474917Q673866J1944924k295213q825708
56711g074783Q890047K6460729P895978l4197823m3458534M79919M3713432L0451556
56703C3160521j6691424l2312543l969919K0068169J1758746m396645o869864
56696G47041r799888k0965530j7189215R740743K5642338O591986j7617390j0615676
56688c3465591J1550449J1241499o282526o866637R831840J1324485q596098j8749778
56680c0012357l702735J3003996J0462672J119584L623272J1460098Q062297l876003
$$ plain form
56732 -18316387 -6921040 4469090 -832427 -20191517 -35867091 -37990814 -32311565
56725 -32311565 -27020065 -21886652 -11824830 5083865 24741033 38372515 36662605
56718 36662605 17835850 -6097735 -16572652 -7898786 4046138 1750925 -7074783
56711 -7074783 1815264 28275993 36171971 1974148 -41484386 -41004467 2708965 33160521
56703 33160521 16469097 -15843446 -19813365 254804 12013550 7616905 747041
56696 747041 -9052847 -30018377 -47207592 -37466849 -11824511 -5232525 -22849915 -33465591
56688 -33465591 -21915142 -10673643 -16956169 -23822806 -13990966 -2666481 -11262579 -30012357
56680 -30012357 -33715092 -20711096 -10248424 -9128840 -5505568 5954530 14016827 10140824
56672A0140824p141676L409823J3122726O152909j4330340k7332921j7815366
56665c3794021K635891Q612319m133581j2186106o38581J3118078P632242p893333
56657b6647092r603106K691177Q820518K974352p86849M495538J0208255J1153668
56649C306461J1359280R547850p45280j3984324j4546136L59990J5729864J9481930
56641C0509635J3889201N689582q40018j570680K183365j356841j8036953l0704263
56633b36972j8687238Q587374K0704953R126697l937976l035054N38292m560164
56625H499912p973582J774660J3704574R798192o625288j4417163k847601J4437645
56617A6351349J4265058r638417l4958811l1284169K200230K9857103K2927942
$$ plain form
56672 10140824 2999148 6408971 19531697 25684606 11354266 -15978655 -33794021
56665 -33794021 -31158130 -22545811 -26679392 -38865498 -39504079 -26386001 -18753759 -26647092
56657 -26647092 -36250198 -33559021 -24738503 -21764151 -22551000 -18055462 -7847207 3306461
56649 3306461 14665741 24213591 23468311 9483987 -5062149 -4702159 11027705 30509635
56641 30509635 44398836 50088418 49248400 47677720 49861085 48504244 30467291 -236972
56633 -236972 -18924210 -10336836 10368117 19494814 15556838 12521784 13060076 8499912
56625 8499912 526330 2300990 16005564 25803756 19178468 4761305 1913704 16351349
56617 16351349 30616407 20977990 -13980821 -45264990 -43064760 -13207657 9720285
56610I720285k325733r932665L573263J1149424L866143J933525J2761886J4651654
56602D5397782l298256j7579878p379397J1401837J2890179K12090p394385q388193
56594B5861779j2749349j5378262m283511J1646551J0667919o638771j4167932
56587e041576L060768K6758334K7298578j494986l4542256l9826113j1571089
56580c5358340K0610646K2992343j490144j7539614o145923J1103784Q142215
56573B314967o293770o631275Q167237J7196758J2344084L761973m484125j6887343
56565I488506k5392819j4097356J0021509J8091638J108403j3983445m580903
56558a9344467J3388425J2026461m631409q934069O057658J7441012R432216m352270
$$ plain form
56610 9720285 7394552 -2538113 1035150 12184574 16050717 17984242 30746128 45397782
56602 45397782 42099526 24519648 17140251 28542088 41432267 41644357 34249972 25861779
56594 25861779 13112430 -2265832 -6549343 5097208 15765127 9126356 -5041576
56587 -5041576 -1980808 24777526 52076104 50581118 16038862 -23787251 -35358340
56580 -35358340 -14747694 8244649 6754505 -10785109 -16931032 -5827248 2314967
56573 2314967 -3978803 -10610078 -2442841 14753917 27098001 30859974 26375849 9488506
56565 9488506 -15904313 -30001669 -19980160 -1888522 -780119 -14763564 -19344467
56558 -19344467 -5956042 6070419 1439010 -7495059 -1437401 16003611 25435827 21083557
56550B1083557m900296M389170Q044543L712419l53238n154705j7625206k8767171
56542a9570927j8281394J1375297K7534858R915839j7154416j7598677M117856
56535a9661564J2273472l702049j5500280m465979R175984K532403j2040974j0017031
56527d1406018L668805N002823p349278j0119413O087861K2408907K0893184P857875
56519G044746J42802K535062P240796O295416k237057j4112517k0582851j5071153
56511b8744756r07314J0880916J2068150L279763q211363j3946937j1169169o559810
56503d3310520p492831q710656J382536J8548570K3377225J1870940N149448J4101343
56495A4916055J6984185l825484k4355026j2781350J4886173J5738823r912799
$$ plain form
56550 21083557 16183261 20572431 28616974 32329393 31976155 26821450 9196244 -19570927
56542 -19570927 -37852321 -26477024 1057834 10973673 -6180743 -23779420 -19661564
56535 -19661564 -7388092 -11090141 -26590421 -31056400 -21880416 -19348013 -31388987 -41406018
56527 -41406018 -37737213 -32734390 -40083668 -50203081 -44115220 -21706313 -813129 7044746
56519 7044746 7187548 9722610 16963406 23258822 21021765 6909248 -13673603 -28744756
56511 -28744756 -29652070 -18771154 -6703004 -3423241 -11634604 -25581541 -36750710 -43310520
56503 -43310520 -50803351 -59514007 -58131471 -39582901 -16205676 -4334736 814712 14916055
56495 14916055 31900240 28074756 3719730 -9061620 5824553 21563376 11650577
56488A1650577j8108291M354206J7003448m363711k4713651q488597K1367545
56481a298474K4281911Q079575O345515J4614088K681677k2808741k3973021J657826
56473I580356J4151575j355703j1912129K190883J2880376k756850j8555813m205848
56465A6847J9784294J3895727j5987204k9183015j3479517L532333L176163k165119
56457b0409491M81640M785526M313804M968623Q166321M118494p303317r010384
56449i888784P247105K3583536J8820789k875053j9305832j8261322o748158K504050
56441d923669L677745j068695o317773q433762p120558k046626P721011J6842563
56433a669764J3519580m257722j9079383j4291397J682002P791396K592684L045873
$$ plain form
56488 11650577 -6457714 -2103508 14899940 10536229 -14177422 -22666019 -1298474
56481 -1298474 22983437 31063012 37408527 52022615 54704292 31895551 7922530 9580356
56473 9580356 23731931 22376228 10464099 12654982 25535358 22778508 4222695 16847
56465 16847 19801141 33696868 17709664 -11473351 -24952868 -21420535 -18244372 -20409491
56457 -20409491 -19927851 -15142325 -10828521 -5859898 2306423 6424917 -878400 -9888784
56449 -9888784 -2641679 20941857 39762646 36887593 17581761 -679561 -7427719 -4923669
56441 -4923669 -1245924 -2314619 -8632392 -17066154 -24186712 -26233338 -18512327 -1669764
56433 -1669764 11849816 7592094 -11487289 -25778686 -24096684 -16305288 -13712604 -10666731
56425a0666731J2329165J3527517K32758j1132242q923758l288701l837002k768473
56417a4527467N053811P033199l897220j0700916K013960K0436909K1900527Q214151
56409C5526954l858873j1398244j9941822k1743944o677659J3596797J9004673
56402D507882J1945037R178389J0473807L524472o480385l687761N405801r08238
56394C3959004j9245057k2514258n681535N007059l176096j0516944l523886J733286
56386b3958427p092172j3240341p48094J6763105K0114248J4036270R942437K207538
56378A8024564j3359117j9165976k846989J3418757K225339k3461078k7178320
56371e2342820m269389J3169853O890388k871327P904843L0025620L2251677Q89651
$$ plain form
56425 -10666731 1662434 15189951 15422709 4290467 -4633291 -7921992 -11758994 -14527467
56417 -14527467 -9473656 -2440457 -6337677 -17038593 -15024633 5412276 27312803 35526954
56409 35526954 31668081 20269837 328015 -21415929 -28093588 -14496791 4507882
56402 4507882 16452919 25631308 36105115 39629587 33149202 29461441 34867242 33959004
56394 33959004 14713947 -7800311 -13481846 -8474787 -11650883 -22167827 -25691713 -23958427
56386 -23958427 -31050599 -44290940 -45039034 -28275929 -8161681 5874589 15817026 18024564
56378 18024564 4665447 -14500529 -17347518 -3928761 -1703422 -25164500 -52342820
56371 -52342820 -56612209 -43442356 -36551968 -39423295 -31518452 -1492832 30758845 31648496
56363C1648496l9769257m7963176r834588L7716874M4704820J0463639j5724296
56356A1242512n406879J0403089k987741k3390082q563295K9010554L6194877
56349D6503035J768093k7351974j9334878J176248J667086r914480r876480L02712
56341a5060638M898322L037773K139337l07082o855429p430483L586182J2037231
56333c954787N300756m700081n43599J0159162O055237j2477412k1400489o658523
56325b8219736J7502689K7400198J6232415k338478j1715831j0149968r094680
56318c83391j3118785j0479538N721972J7321878L636338k0774870j9722227J0211729
56310b7586894L0734613J8145096l932259o492537J502255k141184j1652024q531154
$$ plain form
56363 31648496 -8120761 -56083937 -65918525 -28201651 16503169 26966808 11242512
56356 11242512 5835633 16238722 13250981 -10139101 -18702396 10308158 46503035
56349 46503035 48271128 20919154 1584276 2760524 4427610 -5486870 -15363350 -15060638
56341 -15060638 -10162316 -7124543 -4985206 -5292288 -12147717 -19578200 -15992018 -3954787
56333 -3954787 1345969 -3354112 -3897711 6261451 12316688 -160724 -21561213 -28219736
56325 -28219736 -10717047 16683151 32915566 30577088 18861257 8711289 -383391
56318 -383391 -13502176 -23981714 -18259742 -937864 2698474 -18076396 -37798623 -27586894
56310 -27586894 3147719 21292815 17360556 10868019 12370274 10229090 -1422934 -9954088
56302i954088K333607M729972L335428J0717740J6005247J637926j9403184j9722089
56294a0319441l136651L418901k181069J762473J3583158O556219j9254167k7518149
56286c7088726k480788K4144065K1922875K536614q832740j0888942j1798419
56279b2486061o219857P933818J4405489N095189j294415Q283322J4101473k396479
56271A7422479k0125171q414032K0510130K6310462K50236k4884427k3256783
56264a2187106l662901J3425792J9850470J5920541M093330p719626j1606384
56257A8114116j0371999j0588310q381276L194230J7172242J9589834R949274
56250C8678111m19785n487434n251067K460640J3575618J1182725j1426280l0998259
$$ plain form
56302 -9954088 -7620481 -2890509 444919 11162659 27167906 28805832 9402648 -10319441
56294 -10319441 -13456092 -10037191 -12218260 -10455787 3127371 9683590 -9570577 -37088726
56286 -37088726 -39569514 -15425449 6497426 9034040 201300 -10687642 -22486061
56279 -22486061 -28705918 -20772100 -6366611 -1271422 -2565837 5717485 19818958 17422479
56271 17422479 -2702692 -11116724 9393406 35703868 35954104 11069677 -12187106
56264 -12187106 -15850007 -2424215 17426255 33346796 37440126 29720500 18114116
56257 18114116 7742117 -2846193 -11227469 -8033239 9139003 28728837 38678111
56250 38678111 38258326 32770892 27519825 29980465 43556083 54738808 43312528 12314269
56242A2314269k2550117J367064Q217356m563759j0029937O10691O955189n36798
56234h216042n889957j796297k949425j2033191p194707J7769804L2855098J5421232
56226B7966515j2673682j7931474k981788O056820J900381k625913k376515j768277
56218d433933J255999Q294554O974539j0634991k5100729j2614114J4967180K2630065
56210A338570L941972j0031016O98154J6425428J1258718q103143j6504556q325302
56202i301175L70468J565907N636812J8457575K5447434J0362663j8261941l3610883
56194F66860k3171919k393994P709681M583146j295897l941028k620049M648878
56186a5814322J4147764J2054507o025648j9249892n886387K2268396L3023926
$$ plain form
56242 12314269 -10235848 -8868784 -651428 -5215187 -15245124 -14634433 -7679244 -8216042
56234 -8216042 -14105999 -15902296 -18851721 -30884912 -38079619 -20309815 12545283 27966515
56226 27966515 15292833 -2638641 -5620429 436391 2336772 -289141 -2665656 -4433933
56218 -4433933 -3177934 5116620 12091159 1456168 -23644561 -36258675 -21291495 1338570
56210 1338570 5280542 -4750474 -4052320 12373108 23631826 15528683 -975873 -9301175
56202 -9301175 -8930707 -7364800 -1727988 16729587 42177021 52539684 34277743 666860
56194 666860 -22505059 -24899053 -17189372 -12606226 -13902123 -17843151 -20463200 -15814322
56186 -15814322 -1666558 10387949 4362301 -14887591 -20773978 1494418 34518344
56179C4518344J7951118j831956j2135122j9055813k4057488j7213943k401362
56172b4226222J558731n919289m161218Q888349R429637n607240m904259K2036820
56164b904691L7093995J2533750k0316471k0466266j192925J209009o904662M208981
56156C260720K3517631J3483258k0009265l0414710m949180J7872834J3037755
56149A5799043O84164m32832l606290j8127311k3474300m300243K0198692K5311877
56141A2052800J4411569M010113k449356q440063j1721450j2443091j6249426
56134b0828904j9790632j2712588j09028J202678n522758J763005K2461501K6916119
56126f620607N599342j0647407m97727J2178495N87347j7799825j1269710J2053737
$$ plain form
56179 34518344 52469462 50637506 38502384 19446571 -4610917 -21824860 -24226222
56172 -24226222 -22667491 -28586780 -32747998 -23859649 -14430012 -20037252 -24941511 -2904691
56164 -2904691 34189304 46723054 26406583 5940317 4747392 5956401 -948261 3260720
56156 3260720 26778351 40261609 20252344 -10162366 -15111546 2761288 15799043
56149 15799043 16483207 16050375 12444085 -5683226 -29157526 -33457769 -13259077 12052800
56141 12052800 26464369 30474482 28025126 19585063 7863613 -4579478 -20828904
56134 -20828904 -40619536 -53332124 -53441152 -52238474 -57761232 -55998227 -33536726 -6620607
56126 -6620607 -1021265 -11668672 -12166399 12096 599443 -17200382 -28470092 -16416355
56118a6416355J8438986K785129q675945l150074N617354P656832R180896J1346682
56110B6783505L578221j4132145k3273124j1449213Q954982J6506890P001820
56103A3970936m292764l921105K523539j349478j7133557k3251881l079453K4920606
56095a1613157K4801252p275739l2874082k0529023J3987699L1272181J7366597
56088A5135728p444438j8982776j2058296K041042Q669328K957357m420336k76358
56080a4378749J0507842R637308n858421j6203639q281128M938451O533377R93376
56072a2111583J840640P052489M651399n074705r117572L621J6427601K7975270
56064C1647160K4793782P177652j1005285j4971056p268394k483872m243150m007327
$$ plain form
56118 -16416355 2022631 4807760 -3868185 -7018259 -1400905 6255927 15436823 26783505
56110 26783505 30361726 16229581 -7043543 -18492756 -9537774 6969116 13970936
56103 13970936 9678172 5757067 8280606 6931128 -10202429 -33454310 -36533763 -11613157
56095 -11613157 13188095 5912356 -26961726 -47490749 -33503050 -2230869 15135728
56088 15135728 7691290 -11291486 -23349782 -21308740 -12639412 -9682055 -14102391 -14378749
56080 -14378749 -3870907 5766401 -92020 -16295659 -24576787 -19638336 -13104959 -12111583
56072 -12111583 -10270943 -3218454 1432945 -3641760 -12759332 -12755711 3671890 31647160
56064 31647160 56440942 63618594 52613309 37642253 30373859 27889987 23646837 19639510
56056A9639510k570897j0234251k2197825j9767933l067716N745528J427505N354183
56048b5671896K1978800K2732721k768860j7234637P487726L6922059K1924647
56041F5370560k3237348m0704956j4846859J2353857J0545643k168822r56717
56034F355358P433313M950055o983282j3600406p317117P110599J6718013R555085
56026B4221618q133204j1538988Q588262K3675430N158514k6705674k6616829
56019a1350871P417411K8667655J0204473j8939193k0558360J441106J6371240
56012A3253461J0499396m797241j4291070j2289890l330365J900570j069740j529693
56004a1654572J0629382K3310699J5898999o902360j8897988j1753610l735519
$$ plain form
56056 19639510 17068613 6834362 -15363463 -35131396 -38199112 -32453584 -31026079 -25671896
56048 -25671896 -3693096 19039625 16270765 -963872 6523854 43445913 65370560
56041 65370560 42133212 1428256 -13418603 -1064746 9480897 7312075 6355358
56034 6355358 13788671 18738726 11755444 -1844962 -9162079 -2051480 14666533 24221618
56026 24221618 16088414 4549426 13137688 36813118 41971632 15265958 -11350871
56019 -11350871 -3933460 24734195 34938668 15999475 -4558885 -3117779 13253461
56012 13253461 23752857 18955616 4664546 -7625344 -10955709 -9055139 -10124879 -11654572
56004 -11654572 -1025190 22285509 38184508 31282148 12384160 630550 -3104969
55997c104969m027840J705265J8411723K4237266N400134j6444948j5225178M18870
55989A1370323M337615n137316p757447J539950N370466n225939j5199285q158682
55981a8860315R768315J7738476N541527j5073117k3020127r715852J2114719
55974b1506374K2490261J5750823L843574j358460j610475m759911j0177718r068812
55966f397092J460328J0861358O476769q245941j3955415j49624J6288515J0631144
55958A6970042j3053371k3092179l673433K2319886K6009346R705316n699058
55951B9486549j3628893j9476080j8328631k083873J7323483J8436388K788558
55944A4517501p005636j903302L728098j159767r577830j2586605j1123038p485232
$$ plain form
55997 -3104969 -7132809 -5427544 12984179 37221445 42621579 26176631 10951453 11370323
55989 11370323 15707938 10570622 2813175 4353125 9723591 4497652 -10701633 -18860315
55981 -18860315 -9092000 8646476 14188003 -885114 -23905241 -33621093 -21506374
55974 -21506374 983887 16734710 20578284 19219824 17609349 12849438 2671720 -6397092
55966 -6397092 -4936764 5924594 12401363 4155422 -9799993 -9949617 6338898 16970042
55958 16970042 3916671 -19175508 -22848941 -529055 25480291 35185607 29486549
55951 29486549 15857656 -3618424 -21947055 -24030928 -6707445 11728943 14517501
55944 14517501 7511865 5608563 9336661 8176894 -1400936 -13987541 -25110579 -32595811
55936c2595811j010296N274486P630955R968111J5002799J3010977k166069j3942119
55928A173033m038924J4185745J2638766n386724r518071O774893J6066145M322281
55920C6217144q667080q378484q610791j7594630j5875484P522275K6834665J6513621
55912B7961236o939196j0846139L319318P200446p207752j8301603j0663235M884345
55904a0592580J0084847J598163q786221p405859P534201K1274406J7083560j515628
55896B9274889j3308715q014986J563289K386108j82905K655767N137771j300342
55888A8210876r913034q274784P58362J984492j0288503k2579149j5277919J5344065
55880c0035594M6230370M5382660R930324k3467634k3144845n762417q401573
$$ plain form
55936 -32595811 -33606107 -28331621 -20700666 -10732555 4270244 17281221 15115152 1173033
55928 1173033 -2865891 11319854 23958620 18571896 9053825 15828718 31894863 36217144
55920 36217144 27550064 19171580 10560789 -7033841 -22909325 -15387050 11447615 27961236
55912 27961236 21022040 10175901 13495219 20695665 13487913 -4813690 -15476925 -10592580
55904 -10592580 -507733 1090430 -7695791 -15101650 -7567449 13706957 30790517 29274889
55896 29274889 15966174 7951188 9514477 11900585 11717680 14373447 19511218 18210876
55888 18210876 8297842 23058 781420 2765912 -7522591 -30101740 -45379659 -30035594
55880 -30035594 16194776 61577436 71507760 48040126 24895281 19132864 10731291
55873A0731291k7296058k3713727Q464787K7086229Q469747j4487795p021182
55866a7766708J3612059J3263297j685082k190394J0282058J0564518k590693
55859B3489055n745142O448379J2547833l1878j7964771k3615186j3873118L013062
55851a5731766J4502566J1491420J098593K208087J6147935J8126671m839706
55844D3003800k7104845k0078058L356796J0366264j60228j807138J1924642K0019460
55836C9520693J2017971P80921m838725j0708592j7189297j4586084l308916M105764
55828E793735L774451K432064n54778j0168283j6486086m685591J5216159J6300077
55820A1621748m060776j8308297r931857N974962J1491395R642240Q557853M741795
$$ plain form
55873 10731291 -16564767 -40278494 -31813707 -4727478 3742269 -10745526 -17766708
55866 -17766708 -4154649 9108648 7423566 5233172 15515230 26079748 23489055
55859 23489055 17743913 24192292 36740125 36708247 18743476 -4871710 -18744828 -15731766
55851 -15731766 -1229200 10262220 11360813 13568900 29716835 47843506 43003800
55844 43003800 15898955 -4179103 -822307 9543957 9383729 7576591 19501233 39520693
55836 39520693 51538664 52319585 47480860 36772268 19582971 4996887 1687971 5793735
55828 5793735 9568186 12000250 11445472 1277189 -15208897 -19894488 -4678329 11621748
55820 11621748 7560972 -10747325 -20679182 -14704220 -3212825 6429415 14987268 19729063
55812A9729063n079985j3472264j4251491r544644Q63150J8789125L1538884J9544367
55804D8116205j0973198k6349587r361148J6400651K0451108L687550j3493270
55797B8478311k2021287k3125143j2597750J0491824K8917850K3714828J435956
55790C5294589j3606187j1495680m077251k032405k072858P34184K938806P70209
55782F453407k044253o07535L463942N514917M469326K198733l5440j131147M96179
55773A8778129L332108J824993n601831j0330853l669839P364819O391825o056744
55765A2032607p902310J0560011K3824318N232213k6642386k8117491L513830
55758g499208K2081438K921283j8393280m493451K1812072J5113021j6654318
$$ plain form
55812 19729063 14649078 1176814 -13074677 -22619321 -21756171 -2967046 28571838 48116205
55804 48116205 37143007 10793420 1432272 17832923 38284031 41971581 28478311
55797 28478311 6457024 -16668119 -29265869 -18774045 10143805 33858633 35294589
55790 35294589 21688402 10192722 6115471 4083066 2010208 2744392 5683198 6453407
55782 6453407 4409154 3801619 7265561 12780478 17249804 19448537 19413097 18281950 18778129
55773 18778129 22110237 23935230 18333399 8002546 4332707 11697526 18089351 12032607
55765 12032607 4130297 14690308 38514626 43746839 17104453 -11013038 -7499208
55758 -7499208 14582230 17503513 -889767 -5383218 16428854 31541875 14887557
55751A4887557k4127205L458281K2343166O018941j5272793p748026J3085393
55744A2645314J3818635r31975j157105J4418591J5277265r417903k9790104j8552011
55736c689293Q446938J5627232r49599j0665722L283750J8443511R665927r854231
55728C0308513r457189Q609400J2290520p255179k1376293j3033155m298158j3799196
55720a8010737k0059041J270515L0223331L0883104Q583677k533443K517502j870114
55712C1004794j9201494k1968978j194024J6353053J2431801L056662N219833
55705B5701647R484458K956110o808350q221927m662938k570064K99542L381914
55697A9560392p22304r705345j0959261m249493k560894n411379J282908J2784981
$$ plain form
55751 14887557 -9239648 -5781367 16561799 22580740 7307947 -440079 12645314
55744 12645314 26463949 25531974 24374869 38793460 54070725 44652822 14862718 -3689293
55736 -3689293 4757645 20384877 19435278 8769556 12053306 30496817 40162744 30308513
55728 30308513 20851324 29460724 41751244 34496065 13119772 86617 -4211541 -18010737
55720 -18010737 -38069778 -36799263 -6575932 24307172 32890849 30357406 32874908 31004794
55712 31004794 11803300 -10165678 -11359702 4993351 17425152 20481814 25701647
55705 25701647 35186105 38142215 31333865 23111938 18449000 15878936 16178478 19560392
55697 19560392 18838088 9132743 -1826518 -6076011 -8636905 -14048284 -12765376 19605
55689A9605O131649j6187698k0136370M700308K2159950P153288j1064411K336602
55681d887077K8025984K3727192p697746k6210961j7258940l160923J638665N895246
55673G1440J2698419J1554696K319783l314504n822545j4849688k2527944j0399241
55665c0269584J5232042K6232857J5456814N532380Q249142P415572o559148j6718618
55657B4571457j0908787m574019j1459794j6290228j304606J9444064J9509725
55650A8987812R30468j0974691n989683L036666O657734Q998287J1239744P076329
55642C9962666j659886l793644J863693L092481m216487q130785k007181L129455
55634B8240312j472285o084088j300500J460349j1192010k5398232j5441584J3756116
$$ plain form
55689 19605 6151254 -10036444 -30172814 -25472506 -3312556 3840732 -7223679 -4887077
55681 -4887077 23138907 46866099 39168353 12957392 -4301548 -7462471 -5823806 71440
55673 71440 12769859 24324555 26644338 23329834 17507289 2657601 -19870343 -30269584
55665 -30269584 -15037542 11195315 26652129 32184509 40433651 47849223 41290075 24571457
55657 24571457 13662670 9088651 -2371143 -18661371 -19965977 -521913 18987812
55650 18987812 19918280 8943589 2953906 5990572 12648306 21646593 32886337 39962666
55642 39962666 38302780 34509136 36372829 39465310 35248823 27118038 25110857 28240312
55634 28240312 26768027 20683939 19383439 20843788 9651778 -15746454 -31188038 -17431922
55626a7431922K7035678Q826389j2970525q086979J1820756J2305125j2262850
55619I235672l1253224k0701096P516857K4987255K0532601O406324j205615M55741
55611A5974515K110850k599023p654323m483599K270056M51363p191453k787170
55603c908784J6812912K8107911J3864720q286274j0829227K859615P461650l122074
55595D2960449j1192797q422934n121621m961869J664284J3594672J4445838P31478
55587D3697500r163079l673261O030541Q164573O572953M937826k628883j3382505
55579D0555665j1204625N695484J4805596L755457p140589L146643K1616415K1763886
55571I2993932L420378j1821020j3480463p817108L1135P857140P926942l094910
$$ plain form
55626 -17431922 9603756 18430145 5459620 -2627359 9193397 21498522 9235672
55619 9235672 -22017552 -42718648 -35201791 -10214536 10318065 16724389 15518774 15974515
55611 15974515 18085365 15486342 7832019 3348420 5618476 6069839 -1121614 -3908784
55603 -3908784 12904128 41012039 54876759 46590485 35761258 38620873 46082523 42960449
55595 42960449 31767652 23344718 18223097 13261228 14925512 28520184 42966022 43697500
55587 43697500 34534421 30861160 36891701 45056274 51629227 56567053 53938170 40555665
55579 40555665 29351040 35046524 49852120 53607577 46466988 49613631 71230046 92993932
55571 92993932 96414310 84593290 71112827 63295719 63326854 71183994 79110936 76016026
55563G6016026j2446988p818672K263071K981785j328013K446723R168848L793386
55555G5076166q034211m584313J5548761K6962766J4036403o895945j1807003
55548A00302624L558J0167124P215962j647647k031141R343536J9064598J2297895
55540A54716509o688551j7548762j0492071J637017M924219M836826J3414210
55533A44799397K7884820L6374450L5215011K6538753R341079j1363610j8179205
55526B50610695l261953J3907365J2189065K364852R544544K8946076K9176255
55519C43476899M13624k9226449l2339317j3938065L712239Q646952L461267k459537
55511B81747613O43201J1030958J0053198j4251676m0479255l5019241j715002
$$ plain form
55563 76016026 63569038 55750366 58013437 60995222 59667209 62113932 71282780 75076166
55555 75076166 67041955 62457642 78006403 104969169 119005572 112109627 100302624
55548 100302624 100306182 110473306 117689268 116041621 114010480 123354016 142418614 154716509
55540 154716509 148027958 130479196 119987125 121624142 126548361 131385187 144799397
55533 144799397 172684217 209058667 244273678 270812431 280153510 268789900 250610695
55526 250610695 247348742 261256107 273445172 275810024 285354568 314300644 343476899
55519 343476899 343890523 314664074 282324757 268386692 272098931 280745883 284207150 281747613
55511 281747613 282390814 293421772 303474970 289223294 248744039 213724798 212009796
55504B12009796J7786131J633509k2904477k2618210m245047M274121k798342
55497A83137481r995829j1224225j3088012j4472421o803735O695074J1748507
55490A45996840M199190n079569p791790p409647q754830r731322o663195k30231
55482A04535446N796593O636821j493967j5754591k5425179k2807945j2864899
55475C8622279n454145j740448L252936Q109618N854947l424378j1069083j1479283
55467B2672443n965087M486773J8536997K5760707J3716681j0174067j9128037
55460D9906410j222048J9657408J3609052j3505356k8595020j7911066j591228
55453B0348152J427212j502099K180791O302776J277944l619993M534523J6293200
$$ plain form
55504 212009796 229795927 231429436 208524959 185906749 181661702 185935823 183137481
55497 183137481 173141652 161917427 148829415 134356994 127553259 134248333 145996840
55490 145996840 150196030 145116461 137324671 129915024 121160194 111428872 104765677 104535446
55482 104535446 110332039 116968860 115474893 99720302 74295123 51487178 38622279
55475 38622279 33168134 31427686 34680622 42790240 48645187 45220809 34151726 22672443
55467 22672443 16707356 21194129 39731126 65491833 79208514 69034447 49906410
55460 49906410 48684362 68341770 81950822 68445466 39850446 21939380 20348152
55453 20348152 21775364 20273265 22454056 28756832 30034776 26414783 30949306 47242506
55445D7242506J2662092l263756j1753785r104949r172123j3723646r038283M761857
55437H609913R216735k22083n162739J910885L012784j1111684k0169704q435948
55429b2351841N930917J256526r956145l451246J3757940J5644541J748087l954640
55421a375861N624987J2262417O113453p44545R76300L731749J64660n217530
55413B1535630p071590o406274l595486K032328N213869R43558m185747j047599
55405G418689N312788L663257l504402n119700j035948J930041O343332J5509909
55397C0517966J6649288j931714k3679745k2780540n683842j563629j3272528
55390b1744744j3668512N970852K1504684J8840142J4162739J7394091J1639346
$$ plain form
55445 47242506 59904598 56640842 44887057 35782108 26609985 12886339 3848056 8609913
55437 8609913 17826648 17604565 12441826 14352711 17365495 6253811 -13915893 -22351841
55429 -22351841 -16420924 -15164398 -25120543 -28571789 -14813849 830692 2578779 -1375861
55421 -1375861 4249126 16511543 22624996 21880451 22856751 26588500 26753160 21535630
55413 21535630 14464040 8057766 4462280 6494608 11708477 12652035 8466288 7418689
55405 7418689 12731477 16394734 12890332 7770632 6734684 8664725 15008057 30517966
55397 30517966 47167254 45235540 21555795 -1224745 -6908587 -8472216 -21744744
55390 -21744744 -35413256 -29442404 -7937720 10902422 25065161 42459252 54098598
55383E4098598j1288961k7712562j8445730p29801J153583o845754o169262R30005
55375a5009884K241853J723892P886466J1127403n94059j5400186j2781590L543884
55367a7262221J1876620M725490o646056j3334570j4228312o093605J2278815
55360b8683839K9426131L0748427J5859740m281108k0144045k3970863j0033703
55353a1079260J2289177J9072123R52219k0717794k1986999p017331N059466Q536893
55345a4891506Q199432L715721k862480M64137J4456369J6751801m743675k4371934
55337c282135j3562668J2821576J8176012j5103j1800062m601496M861094N251824
55329G849042K655429j032961r554068j3875859m007570M997358o433096k1645176
$$ plain form
55383 54098598 42809637 15097075 -3348655 -4078456 -2924873 -9770627 -15939889 -15009884
55375 -15009884 -12768031 -11044139 -3157673 7969730 7375671 -8024515 -20806105 -17262221
55367 -17262221 -5385601 -660111 -7306167 -20640737 -34869049 -40962654 -28683839
55360 -28683839 742292 31490719 47350459 43069351 22925306 -1045557 -11079260
55353 -11079260 1209917 20282040 21234259 516465 -21470534 -28487865 -23428399 -14891506
55345 -14891506 -6692074 -2976353 -5838833 -5374696 9081673 25833474 21089799 -3282135
55337 -3282135 -16844803 -4023227 14152785 14137682 2337620 -2263876 2597218 7849042
55329 7849042 10504471 9471510 -82558 -13958417 -17965987 -12968629 -19401725 -41046901
55321d1046901q828958K0541162K2869683m427212j4516285J0746052K9398199
55314A4735740J0637263j4804904j0254832O965535L246993j1923390j0759708
55307a2157303o25401l690003p480066J2543295L8152313K9772569n962984k2970298
55299B7582122q297039L839094m668746r795776L745080J3010952J06797j4913589
55291A0608895j0603533p69774o064332j5670112q059707R635049J3965582M114560
55283b843372o27452N001989P376076P77310m309758j394935J893887k240594
55275C633151j0162843j2422724m060798J0171289J7108231P864283o793657n843202
55267e06270R815599J2236185j0923417k8067890n353649L6557708M3711313N281492
$$ plain form
55321 -41046901 -49875859 -29334697 -6465014 -10892226 -25408511 -14662459 14735740
55314 14735740 25373003 10568099 313267 7278802 10525795 -1397595 -12157303
55307 -12157303 -12782704 -16472707 -23952773 -11409478 26742835 56515404 50552420 27582122
55299 27582122 19285083 23124177 18455431 8659655 12404735 25415687 25522484 10608895
55291 10608895 5362 -764412 -6828744 -22498856 -30558563 -20923514 -6957932 -2843372
55283 -2843372 -3470824 1531165 8907241 9684551 5374793 3979858 5873745 3633151
55275 3633151 -6529692 -18952416 -23013214 -12841925 4266306 12130589 5336932 -506270
55267 -506270 9309329 21545514 10622097 -17445793 -22799442 13758266 57469579 62751071
55259F2751071k9799423k2853351M497609J1483115j712451o439255K113030K206751
55251B2247096j1122311j5379038J022844J7734913J2470908o894136j4878610
55244E201666k549047J3832799J4468388k008860j8037118j6392769j84697R931591
55236D261953K184647r804026o376782R284919J6428855O985992p084087j5805927
55228G5544k0498708j8472700j094516K3993611L0617818Q739299j6562686j7772671
55220a0975009j329185P504075K763034j238321K010697N303450N839152Q202199
55212A8080092J0762969P305427L42219l825722q840950j8617649k0748096l709365
55204a9251075J4464356M999947k3414336k9326159k04179K5369178J4860676
$$ plain form
55259 62751071 32951648 10098297 14595906 26079021 24366570 17927315 20040345 22247096
55251 22247096 11124785 -4254253 -3231409 14503504 26974412 20080276 5201666
55244 5201666 2652619 16485418 30953806 28944946 10907828 -5484941 -5669638 4261953
55236 4261953 6446600 -3357426 -9734208 -449289 15979566 22965558 15881471 75544
55228 75544 -20423164 -38895864 -39990380 -15996769 14621049 23360348 6797662 -10975009
55220 -10975009 -12304194 -4800119 -2037085 -3275406 -1264709 4038741 9877893 18080092
55212 18080092 28843061 36148488 36490707 32664985 23824035 5206386 -15541710 -19251075
55204 -19251075 -4786719 213228 -23201108 -52527267 -52731446 -27362268 -12501592
55197a2501592j1139303j5234112j2542N117755l269985o08302J9441780L1156150
55189A2949849J4958411j5333077l1538949k1033614O553982K8373601K3057037
55182A7987240q109158l3871853k3679831J2371870L2325036J5491443j2251007
55175B63740j5574080M961158J9429243J0130128r468215j5655310k921556J1976727
55167C141835J0747438n047734j6669042j2690542k946906j406649m043994K731727
55159b6183867J7076001K2416031J2579385r42501q727399j3287329j5842618
55152a2912297j1337958k590070j318665p127170l864695J2696496K2358322R723571
55144E627534j1187308j8030809j0499924j483999P220889J8344580K0261388
$$ plain form
55197 -12501592 -23640895 -38875007 -38887549 -33769794 -37039779 -37648081 -18206301 12949849
55189 12949849 27908260 12575183 -18963766 -39997380 -33443398 -5069797 17987240
55182 17987240 9878082 -23993771 -47673602 -35301732 -2976696 12514747 263740
55175 263740 -15310340 -10349182 9080061 19210189 9741974 -5913336 -8834892 3141835
55167 3141835 13889273 8841539 -7827503 -20518045 -23464951 -24871600 -28915594 -26183867
55159 -26183867 -9107866 13308165 25887550 24945049 16217650 2930321 -12912297
55152 -12912297 -24250255 -26840325 -28158990 -35286160 -39150855 -26454359 -4096037 5627534
55144 5627534 -5559774 -23590583 -34090507 -35574506 -28353617 -10009037 10252351
55137A0252351M92934k7262326l4262323j4407232R684224J7926336J1389927
55130b6186109P77610m886916J089463J5339126J9549635L050274j3914429m473824
55122i655170K0055830K1175384p232450k5707528q847520J6431071J4899137
55115B1118754m660151j1376957l925364m705438j5292213j4415733K389943J4182363
55107a6684796R250573L87975o91567P44923N10431O155054J7723660J8655142
55099C6051395J542521j3969625p805487Q427770P616414j0912849j9310849l104665
55091a465375J7063869J6002516q61480r221123k376258L999854P87294j981213
55083B1948084L488198P850516K211591m758630j648140O082898P293196M765905
$$ plain form
55137 10252351 10745285 -16517041 -50779364 -65186596 -55502372 -37576036 -26186109
55130 -26186109 -25408499 -30295415 -29205952 -13866826 5682809 8733083 -5181346 -9655170
55122 -9655170 10400660 31576044 24343594 -1363934 -10211454 6219617 21118754
55115 21118754 16458603 5081646 1156282 -3549156 -18841369 -33257102 -30867159 -16684796
55107 -16684796 -7434223 -7046248 -7737815 -6992892 -6482461 -327407 17396253 36051395
55099 36051395 37593916 23624291 15818804 24246574 31862988 20950139 1639290 -1465375
55091 -1465375 15598494 31601010 30739530 21518407 19142149 23142003 23929297 21948084
55083 21948084 25436282 33286798 35498389 30739759 29091619 35174517 42467713 47233618
55075D7233618N297494J361329j4257549k4980050j0390609J5289238J7637889
55068C7191360m749795j7562353o947113J281402q260826j3163535J501613J1654874
55060I45627n67724q672914J0987465K8691175P491435k7864219k5456448Q431215
55052f014388K0550664o41281j2660435J585741Q013473r833703j9070077m09785
55044a8479791J3880296j616306j8869651o608590J6018832J7468739P719753
55037I513282R996097J1836993p568765k7951070j6097191J5885103K9065009
55030B4679458J8828997R495372K140675k0153720m3542204l4427236J090218
55023d1888440K0632972J1900257M459261R133704N04672k5189765k9766519L236632
$$ plain form
55075 47233618 52531112 53892441 39634892 14654842 4264233 19553471 37191360
55068 37191360 32441565 14879212 7932099 9213501 952675 -12210860 -10709247 945627
55060 945627 377903 -8295011 2692454 31383629 38875064 11010845 -14445603 -6014388
55052 -6014388 14536276 13894995 1234560 2820301 10833774 1000071 -18070006 -18479791
55044 -18479791 -4599495 -6215801 -25085452 -31694042 -15675210 1793529 9513282
55037 9513282 19509379 31346372 23777607 -4173463 -20270654 -4385551 24679458
55030 24679458 43508455 53003827 55144502 34990782 -8551422 -42978658 -41888440
55023 -41888440 -21255468 -9355211 -4895950 4237754 4742426 -20447339 -50213858 -46977226
55015d6977226L3502351K5617868L654821O007254K1685880J5705454q500785
55008E0695617j9013652j1858278j1540374k1808932j9106097K571115J7873697
55001a2186904J0137773m425628m572021N911799Q668379l009573j8668840k3280438
54993d1425453j0582570J0155817K1097542J5869472P801773R573473J3297115
54986B5787169N117591q642895r603121K329032Q111239l08245r493361p743873
54978E553536j66390M351287M142064j776153j3504334j8612478q05707L1140570
54970A0322395M3299782J8247671k0644274m0107666l4692540j8287820K296400
54963c9566052K2672822K6634912N964877j5147784p223222J7062050J7071053
$$ plain form
55015 -46977226 -13474875 12142993 15797814 21805068 43490948 59196402 50695617
55008 50695617 31681965 19823687 8283313 -13525619 -32631716 -30060601 -12186904
55001 -12186904 -2049131 -6474759 -11046780 -5134981 3533398 523825 -18145015 -41425453
54993 -41425453 -52008023 -41852206 -20754664 -4885192 2916581 12490054 25787169
54986 25787169 30904760 22261865 12658744 14987776 23099015 22790770 13297409 5553536
54978 5553536 5387146 9738433 13880497 12104344 -1399990 -20012468 -20818175 10322395
54970 10322395 53622177 71869848 51225574 11117908 -23574632 -41862452 -39566052
54963 -39566052 -16893230 9741682 15706559 558775 -6664447 10397603 27468656
54956B7468656j1798952k6675301l434872K3289604J3028880j8340870k6475155
54949b2938010q611561j501060j5646798j8536047O981447L0159568K0791510
54942i300951k962579n336885J1820030J8983612R950024N636087J0768383M258739
54934D3816460j9772433l4269959j8606102R342017K0216872J3674415R741128
54927B4142398J2501258P393768q895419j9017151j0515921N089054P324026p161996
54919A0860017k1131983j7349248J740360J6962882J5288488N442502M425334
54912A6238352J2179795J2336931r42055j2978378j2088596o668633p342375p804895
54904g069854N42421Q739622M874121k503982K093504J2585214J0858898r99401
$$ plain form
54956 27468656 15669704 -11005597 -14440469 8849135 21878015 3537145 -22938010
54949 -22938010 -31549571 -33050631 -48697429 -67233476 -60252029 -30092461 -9300951
54942 -9300951 -12263530 -17600415 -5780385 13203227 23153251 28789338 39557721 43816460
54934 43816460 24044027 -10225932 -28832034 -19490017 726855 14401270 24142398
54927 24142398 36643656 44037424 35142005 16124854 5608933 10697987 18022013 10860017
54919 10860017 -10271966 -27621214 -25880854 -8917972 6370516 11813018 16238352
54912 16238352 28418147 40755078 39813023 26834645 14746049 8077416 735041 -7069854
54904 -7069854 -6527433 2212189 7086310 4582328 6675832 19261046 30119944 29120543
54896B9120543m542616K081597L316392k441550j530758K984972p113269k4615499
54888b740188j6858712J7983965L4713109P352873k5632162j8314380J1829116
54881H333621J4991461j0613186k0777521K87197J8767633R645842q591604j1213185
54873H30258k962430N06373j176442k180142m082689o874480m735249m274k585701
54864b3264776r304227n651319O186091O392359p745762j4164636l845152L723744
54856d7673678k069147j610081J7460434L1352943J6432396j0564778j9012953
54849a5684864r983481l204323K704261K0468221L7674166K8893491o01070j9031961
54841D1234440j5054568p319558o523013j788603R531012J0990699k588456j1434071
$$ plain form
54896 29120543 24577927 26659524 29975916 27534366 26003608 28988580 21875311 -2740188
54888 -2740188 -19598900 -1614935 33098174 40451047 14818885 -3495495 8333621
54881 8333621 23325082 12711896 -8065625 -7778428 10989205 20635047 12043443 830258
54873 830258 -2132172 -1625799 -2802241 -4982383 -9065072 -15939552 -20674801 -20679075 -23264776
54864 -23264776 -32569003 -38220322 -32034231 -25641872 -33387634 -47552270 -51397422 -47673678
54856 -47673678 -49742825 -51352906 -33892472 -2539529 13892867 3328089 -15684864
54849 -15684864 -25668345 -28872668 -26168407 -5700186 31973980 60867471 60266401 41234440
54841 41234440 26179872 18860314 12337301 10548698 20079710 31070409 28481953 17047882
54833A7047882k059332R960300M575631j2024510j8124552p896261L162842J239732
54825d118268p933738p501590O313305J4606805l42691k4580553k5067398K071733
54817d6552395K0914274Q305921j0476008m447451J1260697L804720j7345546
54810c4535788j5115254J0530588K2363067R461450Q60905R009235R692940p011410
54802E255733j3742503M415098K0652124J3243557K712573J2480598K6482650
54795G1499830J8038947p049743k6351573l4382368l3337235j7380775O456702
54788b2506215J0832454r043034j6525747R183739L1267671J2496305j9383039
54781c677866j5513733J2280271J4395082r331159j2138195J3943570K2734097
$$ plain form
54833 17047882 14988550 24948850 29524481 17499971 -624581 -8520842 -5358000 -4118268
54825 -4118268 -12052006 -19553596 -13240291 1366514 1023823 -23556730 -48624128 -46552395
54817 -46552395 -25638121 -17332200 -27808208 -32255659 -20994962 -17190242 -34535788
54810 -34535788 -49651042 -39120454 -16757387 -7295937 -6435032 2574203 12267143 5255733
54802 5255733 -8486770 -4071672 16580452 29824009 32536582 45017180 71499830
54795 71499830 89538777 82489034 56137461 21755093 -11582142 -28962917 -22506215
54788 -22506215 -11673761 -20716795 -37242542 -28058803 3208868 15705173 -3677866
54781 -3677866 -19191599 -6911328 7483754 -1847405 -13985600 -42030 22692067
54774B2692067n131627k8175131j3132425J4455521J6894221p48631j2149540
54767e295545j2005714p637243L499026J9772602K2259213K455562j6290817j0133925
54759c376841R094095J3145843q78748j1588986o988593L705385P074453o95977
54751I490631j2902532j6035125j489272J9932627K5559069Q885784j2177518
54744B1263664k0153711j5818276n874798P790714J7434670Q863421j4503810
54737i98126k5600930q264912J7788310K3377202P491279q416286j1487430n589693
54729a1700586J721775M673624R5067m997859K527453J9144362K1187527j126659
54721C1524704k2872324j7335227M859444J2816093M54079j0963957q901748k274342
$$ plain form
54774 22692067 17560440 -10614691 -23747116 -9291595 7602626 6853995 -5295545
54767 -5295545 -17301259 -24938502 -21439476 -1666874 20592339 23047901 6757084 -3376841
54759 -3376841 5717254 18863097 17984349 6395363 -593230 3112155 10186608 9490631
54751 9490631 -3411901 -19447026 -20936298 -1003671 24555398 33441182 21263664
54744 21263664 1109953 -14708323 -20583121 -12792407 4642263 13505684 -998126
54737 -998126 -26599056 -34863968 -17075658 6301544 13792823 5376537 -6110893 -11700586
54729 -11700586 -9978811 -5305187 -5210120 -10207979 -7680526 11463836 32651363 31524704
54721 31524704 8652380 -8682847 -3823403 8992690 9446769 -1517188 -10418936 -12693278
54713a2693278N88778L028732O281246L988687m960698j2459250j3307388j0461871
54705c9995042p572296n360886l264272K991999J8520007L4710058K9467270k436474
54697B7060364l1160637k5290361M839958K1291877J0726279l808983k285024
54690A373473Q209812J2925151Q485586l658336k0235445k6294470n826187K8677709
54682C657293M0494991J5218567j7628438k3885864o645404P561783P188365N31466
54674B6492759n341627r951076j0477935m896667L59478l45339l92822P935767
54666C382538J6812322J2250812l449854j3169128p894462L920076R490510M014675
54658B5357489r220971k1544592k2554969r784141N886364J1503109O655723K9495
$$ plain form
54713 -12693278 -12104500 -9075768 -2794522 1194165 -3766533 -16225783 -29533171 -39995042
54705 -39995042 -47567338 -52928224 -56192496 -53200497 -34680490 29568 29496838 27060364
54697 27060364 -4100273 -29390634 -24550676 -3258799 7467480 3658497 1373473
54690 1373473 9583285 22508436 30994022 27335686 7100241 -19194229 -25020416 3657293
54682 3657293 44152284 59370851 41742413 17856549 11211145 18772928 25961293 26492759
54674 26492759 21151132 11200056 722121 -4174546 -3815068 -4160407 -4553229 3382538
54666 3382538 20194860 32445672 28995818 15826690 7932228 11852304 21342814 25357489
54658 25357489 16136518 -5408074 -27963043 -37747184 -31860820 -20357711 -13701988 -13672493
54650a3672493m484142q733781j0357050l415573R947942J8036022J3479435L154884
54642C955244N14503R215737J6412235O095808j7511324k6829469l868225K8068053
54634A6052562K7284284q005392l1142610j1431097K0384702J7856936j2399795
54627A8599590k5094948p141414R327026N119401P30138J1657862J7066976k350529
54619B7914102k5425677j9544861J0027121K8727597J9991609q69510j3355932
54612B7464449j0790404K926189J6733268J5395170m893142k6030771k6452784
54605e648025p423362J0298475J2047388J056394j0516883j2572814l799025N671150
54597a0886702N404453J738253R176248K0554956J0040886k1278187l2410533
$$ plain form
54650 -13672493 -18156635 -26890416 -37247466 -40663039 -30715097 -12679075 800360 3955244
54642 3955244 4469747 13685484 30097719 36193527 18682203 -8147266 -12015491 16052562
54634 16052562 43336846 35331454 4188844 -7242253 13142449 30999385 18599590
54627 18599590 -6495358 -13636772 -4309746 809655 1539793 13197655 30264631 27914102
54619 27914102 2488425 -17056436 -7029315 21698282 41689891 40820381 27464449
54612 27464449 16674045 19600234 36333502 51728672 46835530 20804759 -5648025
54605 -5648025 -13071387 -2772912 9274476 10330870 -186013 -12758827 -16557852 -10886702
54597 -10886702 -5482249 -3743996 5432252 25987208 36028094 14749907 -17660626
54590a7660626q48106L3656247K1428366k1110914l4036563l144967K4133749
54583B417186J5194898n617145o841554K669114J092830o381836l803164L852848
54575B583177K482482n032435p246271m167434l92777O867453J6551771J6703495
54567B8349461M418647m678201k524380l754247j6448334k0805317j934445J7271865
54559a04951P579561j7345200j8396093Q913672K7034138J1448733j7174818k5076933
54551b3121891p739114J1181713J0518069p358123k0645746j1363577J2684825
54544c5843844K4523984J1304673q849563j1598210L252003J7176869J7631313
54537A7597225N214818j2582466k2455527j2518159Q860933J5904932O57263j2513169
$$ plain form
54590 -17660626 -18508732 15147515 36575881 15464967 -18571596 -21716563 2417186
54583 2417186 17612084 11994939 5153385 7822499 8915329 2533493 -1269671 2583177
54575 2583177 5065659 33224 -7213047 -11380481 -11773258 -4905805 11645966 28349461
54567 28349461 32768108 28089907 25565527 21811280 5362946 -15442371 -17376816 -104951
54559 -104951 7474610 -9870590 -28266683 -19353011 7681127 19129860 1955042 -23121891
54551 -23121891 -30861005 -19679292 -9161223 -16519346 -37165092 -48528669 -35843844
54544 -35843844 -11319860 -15187 -8864750 -20462960 -17210957 -34088 17597225
54537 17597225 22812043 10229577 -12225950 -24744109 -15883176 21756 679019 -11834150
54529a1834150m453621P807782J045536j3870856j2007176J531575J922330j1281087
54521d1139667j5277093l526779R134074J6857201K5501312K8247000J2444453
54514C2240501j0008979j3124937J275532N894226n674003r950200L798095J6502226
54506B0952461J3245936K566078o344250j5041309j7518037k798961J6647408
54499A1709326J3163527j0587049k0484760o094651K666615r974426j6288122
54492c5889540M768089K6163178J4482618j6011882k5402621m234119K2505579
54485a3618698L1969877J9395799p073928k6586940j7765258J0650204K1756146
54478A8727202J461777j7725472o464651J5676373J4235427n344855j2721067
$$ plain form
54529 -11834150 -16287771 -8479989 -7434453 -21305309 -33312485 -31780910 -29858580 -41139667
54521 -41139667 -56416760 -59943539 -50809465 -33952264 -8450952 19796048 32240501
54514 32240501 22231522 9106585 10382117 16276343 10602340 652140 4450235 20952461
54506 20952461 34198397 36764475 30420225 15378916 -2139121 -4938082 11709326
54499 11709326 24872853 14285804 -6198956 -12293607 -9626992 -19601418 -35889540
54492 -35889540 -31121451 -4958273 9524345 -6487537 -31890158 -36124277 -13618698
54485 -13618698 18351179 37746978 30673050 4086110 -13679148 -3028944 18727202
54478 18727202 20188979 2463507 -4001144 11675229 25910656 20565801 7844734
54471G844734l900396J86193n415054o443428p14579o7706m400661k100109O171085
54462h839921Q708129M361283J190334r04333n755014p149908k03669L474026
54454e119073o022938j4734554m907595J3793387J8654271R194099K045126Q16208
54446A3718931k118177l999211O98313J968153q225521j3391598J175862J4978760
54438D805512K898996j6004338o425923J7335139Q576559k9445409l8811393J726535
54430e5344322L9376215K8041255n631601j3602190j75135Q60812r171693l068753
54422a8715412J5263032J3420971j2088683k5197503n981606J7971845J2578127
54415b749229j4300829k5986376o671886K1594634K9997028J5832810j131569
$$ plain form
54471 7844734 3944338 4130531 -1284523 -7727951 -8442530 -8510236 -12910897 -15011006 -8839921
54462 -8839921 -131792 4229491 5419825 4515492 -1239522 -8389430 -8593099 -5119073
54454 -5119073 -11142011 -25876565 -30784160 -16990773 1663498 10857597 12902723 13718931
54446 13718931 11600754 7601543 8299856 10268009 2042488 -11349110 -10173248 4805512
54438 4805512 7704508 -8299830 -14725753 2609386 11185945 -18259464 -57070857 -55344322
54430 -55344322 -15968107 12073148 6441547 -7160643 -7335778 -6474966 -15646659 -18715412
54422 -18715412 -3452380 9968591 -2120092 -27317595 -33299201 -15327356 -2749229
54415 -2749229 -17050058 -43036434 -49708320 -28113686 1883342 17716152 16584583
54408A6584583n422798J184496R830976J5412726J4967802O557247m697387r094158
54400D5323487o315790o235194j0637627q797448R19728L396624o789826j1782216
54392i18262j133361O025029n794710j5112227L309127K9940577K5879658l843809
54384C8352022j6879135p43622J2252345K054890j1692503j0668285n221287n259689
54376B194736j177407R049716Q683137m374414p692641L920689L794299j6811266
54368b413151k3002321Q216279M1278496L0051786j2872224l6198210k2800994
54361a7740339k385068J27158q073930j0945057m874621N641881J3841126J2744234
54353a1664616M707088K331516Q621287R243285k484825j0704857m012090K911047
$$ plain form
54408 16584583 11161785 12346281 22177257 37589983 52557785 59115032 54417645 45323487
54400 45323487 39007697 32772503 22134876 13337428 14257156 17653780 10863954 -918262
54392 -918262 -2051623 3973406 -1821304 -16933531 -13624404 16316173 42195831 38352022
54384 38352022 21472887 20729265 32981610 35036500 23343997 12675712 7454425 2194736
54376 2194736 1017329 10067045 18750182 14375768 6683127 10603816 14398115 -2413151
54368 -2413151 -25415472 -17199193 24079303 54131089 41258865 5060655 -17740339
54361 -17740339 -20125407 -19998249 -28072179 -39017236 -43891857 -38249976 -24408850 -11664616
54353 -11664616 -6957528 -4626012 3995275 13238560 10753735 48878 -3963212 -1052165
54345a052165l802107r651607K052878J5966775Q554849r248068q057591J1581987
54337F344951K2036766J3665128K749002k249850q415026j2737743k113155J7295466
54329C6575539K0892644K077065j7583194j9765062q655128L576413Q711083j17155
54321B5712205k0032868k8919837r133257K1339284K8328388R671233n987092
54314B0978056o473311p355264j4137450j1227762L237778Q590606n33449l222662
54306a0143458P356635R372853m956840j0042763O934632J7610447n62206k2295459
54298f726159j4283427J0485604J6297361J672071o125180J202592Q303144R072943
54290A9898949R276798M325962j2205345k4854549j4046336Q219861J3211879
$$ plain form
54345 -1052165 -4854272 -14505879 -12453001 3513774 12068623 2820555 -5237036 6344951
54337 6344951 28381717 42046845 44795847 42545997 34130971 21393228 19280073 36575539
54329 36575539 57468183 59545248 41962054 22196992 13541864 17118277 25829360 25712205
54321 25712205 5679337 -23240500 -32373757 -11034473 17293915 26965148 20978056
54314 20978056 14504745 7149481 -6987969 -18215731 -14977953 -6387347 -6920796 -10143458
54306 -10143458 -2786823 6586030 1629190 -8413573 -1478941 16131506 15569300 -6726159
54298 -6726159 -21009586 -10523982 5773379 7445450 1320270 2522862 10826006 19898949
54290 19898949 29175747 33501709 21296364 -3558185 -17604521 -9384660 3827219
54283C827219N09630n811657r88126k027893q452037j711357J2811140O696342
54275D853261j8212560k1639857J0730449L6413562J7914247j9997568k9443728
54268a9382194q548456P163052L927626p3357M900840P749953M265820M483502
54260D486786Q347652K254233j3790298k0619757j0144576Q72564k017953r095001
54252c9706350m889678O608490J0037047K373833n316284m870723J101774N739613
54244b8922278M881357j61226k283655M757190J5760365J7052455N586317l328779
54236A3341746L050254J3576743P204056j4179837k4254548q983276J1017048
54229G72186P837683j4195327k4333101q560372J2240853J3522782l6680n883729
$$ plain form
54283 3827219 4336849 -1474808 -2462934 -4490827 -12942864 -14654221 -1843081 4853261
54275 4853261 -13359299 -34999156 -24268707 12144855 30059102 10061534 -19382194
54268 -19382194 -27930650 -20767598 -16839972 -16913329 -12012489 -4262536 3284 4486786
54260 4486786 12834438 15088671 1298373 -19321384 -29465960 -28593396 -30611349 -39706350
54252 -39706350 -44596028 -37987538 -27950491 -25576658 -30892942 -35763665 -34661891 -28922278
54244 -28922278 -24040921 -24202147 -26485802 -21728612 -5968247 11084208 16670525 13341746
54236 13341746 16392000 29968743 37172799 22992962 -1261586 -10244862 772186
54229 772186 8609869 -5585458 -29918559 -38478931 -26238078 -12715296 -12751976 -18635705
54221a8635705L043487J2759346J1760027M157810j112545j041656L126655P127935
54213B1185354K719968j2632821k5276746j8820724J163338J2449703Q255129
54206a0956799M257697Q594883Q404469k607416p839962K876798J0526409k356595
54198A0899484j7781160q725081J4966016K0352558K666623j1929328j1595145
54191a146033j0671141j3561380l608018K1047425L3599581J7580248o687518
54184C6553164j3021011n166336k907040r859330j3967160q373586K850706J0823597
54176c066996N880648j2127219k3491922p405420K3636791L2455095R828605r416513
54168A6293069Q07431J8082132R618843j4693854j9730587j29987J5383051Q313596
$$ plain form
54221 -18635705 -15592218 -2832872 8927155 13084965 11972420 10930764 14057419 21185354
54213 21185354 23905322 11272501 -14004245 -32824969 -31661631 -19211928 -10956799
54206 -10956799 -6699102 1895781 10300250 7692834 -147128 2729670 13256079 10899484
54198 10899484 -6881676 -15606757 -640741 19711817 22378440 10449112 -1146033
54191 -1146033 -11817174 -25378554 -28986572 -7939147 25660434 43240682 36553164
54184 36553164 23532153 18365817 15458777 5599447 -8367713 -16741299 -13890593 -3066996
54176 -3066996 2813652 -9313567 -32805489 -40210909 -16574118 15880977 25709582 16293069
54168 16293069 17100500 35182632 44801475 30107621 10377034 10247047 25630098 33943694
54160C3943694r452986j8335388j2003185L347385J4629050J0557401l255269
54153A9430702o915351M900190J1933380L72867j3840770j3185937q083243j2700694
54145a8088856j3628480M653496K2963066J4896783m507199j252032J7058274
54138B2095052J1690537j8916561l2256128j0128325J4652334J4223332L923562
54131E283803N174046R917260N269959m83479k61537n984241k0650842k2107125
54123b3842156J99286J9934907J2534940n914774p029942N511741J0433921P327355
54115A9155278P763037M711953j3753992l1466206k1194642R912476K6066826
54108A194730J4219740j809836k474900K015940l083722j1386430r392826L22968
$$ plain form
54160 33943694 24490708 6155320 -5847865 -2500480 12128570 22685971 19430702
54153 19430702 12515351 17415541 29348921 29721788 15881018 2695081 -5388162 -18088856
54145 -18088856 -31717336 -27063840 -4100774 10796009 6288810 5036778 22095052
54138 22095052 33785589 14869028 -17387100 -27515425 -12863091 1360241 5283803
54131 5283803 10457849 20375109 25645068 25161589 24900052 18915811 -1735031 -23842156
54123 -23842156 -23642870 -3707963 8826977 2912203 -4117739 1394002 11827923 19155278
54115 19155278 26918315 31630268 17876276 -13589930 -34784572 -24872096 1194730
54108 1194730 15414470 13604634 11129734 13145674 10061952 -1324478 -10717304 -10394336
54100a0394336M226973k806167j3341182j7341174j0684310J686114Q667296M382500
54092c5604286k662676J070389J4681486K1648122J2046144k579701m577640M689074
54084H710912O577476o576928j7343645p339872J3260068J7827559L205339m917147
54076A3403762N966971J2500896o295702k9903240k4796403J727993J1560106
54069a5835617m765285j5903392j803622J7658019J8550310O453884k034822n011304
54061b691829n222833K144751J3907609J2847312m815230j6862638q349007M067749
54053d974116J631663m418909M559804J8535143J4271806n239030j5142648n930954
54045C292759Q046911J2659424O136918p608930j9660328j6848929R71798J3060799
$$ plain form
54100 -10394336 -6167363 -8973530 -22314712 -39655886 -50340196 -48654082 -39986786 -35604286
54092 -35604286 -38266962 -37196573 -22515087 -866965 11179179 8599478 4021838 8710912
54084 8710912 15288388 8711460 -8632185 -15972057 -2711989 15115570 18320909 13403762
54076 13403762 19370733 31871629 25575927 -4327313 -29123716 -27395723 -15835617
54069 -15835617 -20600902 -36504294 -38307916 -20649897 -2099587 4354297 2319475 -2691829
54061 -2691829 -7914662 -5769911 8137698 20985010 16169780 -692858 -9041865 -4974116
54053 -4974116 -3342453 -7761362 -3201558 15333585 29605391 24366361 9223713 3292759
54045 3292759 11339670 23999094 30136012 22527082 2866754 -13982175 -13010377 50422
54037E0422M722924q610729m128552J2772966J8792201R165284j403031p179617
54029B4181868j4130831j8348897r210459O263254Q765297j144614j992727J2103041
54021F485932J9129821M109155j5130764j2914622P083784J6558637K80822k4092869
54013A509896k7397012m582871J8431744J7082854j03999m788566R638771K0011540
54005B9802357J1282319q91130J276802Q129257J598076j2814015j5863733n130185
53997A7389748N618968Q727497N531232l042418j0768534l672585J6924239K3726140
53989F0434287m47008l0784240l2461085j0732944K687175J311856M868567J5552322
53981A0428930J4099171M31329k111180R508986Q332325j5516201l2883915j9276871
$$ plain form
54037 50422 4773346 -3837383 -7965935 4807031 23599232 32764516 31361485 24181868
54029 24181868 10051037 -8297860 -17508319 -11245065 -2479768 -3624382 -5617109 6485932
54021 6485932 25615753 29724908 14594144 1679522 8763306 25321943 25602765 1509896
54013 1509896 -25887116 -30469987 -12038243 5044611 4940612 152046 9790817 29802357
54005 29802357 41084676 40193546 41470348 49599605 51197681 38383666 22519933 17389748
53997 17389748 23008716 31736213 37267445 34225027 23456493 19783908 36708147 60434287
53989 60434287 59987279 29203039 -3258046 -13990990 -11303815 -9991959 -5123392 10428930
53981 10428930 24528101 24959430 22848250 32357236 40689561 25173360 -7710555 -26987426
53973b6987426Q112174J8151853Q463831j176947k228394k937998q256634j0684691
53965a7544232o92501J9644345L3078957K1466577r911347l1108216k3170893
53958h237310m042915p00678q382332l856944J1457368J5086505N089035J435519
53950G848248O005652j83623j5717564j5587594J622511N757581j0906052j5248035
53942c6408876R181484K9292543J7002977l515748n20253R477480l765402k2937649
53934b193444j0298077K1053180K1011396j5296127l5828507j2738909J6616119
53927a7674369J2527277o951037k775777J9192979K0778672m113320j9799964
53920A184461n829530J2656693O897288j0171803n721639J9908074L1387912R849839
$$ plain form
53973 -26987426 -18875252 -723399 7740432 6563485 4335091 1397093 -6859541 -17544232
53965 -17544232 -18236733 1407612 34486569 55953146 46041799 14933583 -8237310
53958 -8237310 -12280225 -12980903 -21363235 -25220179 -13762811 1323694 6412729 7848248
53950 7848248 13853900 13670277 -2047287 -17634881 -16012370 -10254789 -21160841 -36408876
53942 -36408876 -27227392 2065151 19068128 15552380 15032127 24509607 20744205 -2193444
53934 -2193444 -12491521 8561659 29573055 14276928 -21551579 -34290488 -17674369
53927 -17674369 -5147092 -12098129 -14873906 4319073 25097745 20984425 1184461
53920 1184461 -4645069 8011624 14908912 4737109 -984530 18923544 50311456 60161295
53912F0161295k0260483k6142502q400517P434781O772336m103492j4214223j6266015
53904a5018820n526259J2695557K0168726P139113r620905q451290M390921N666931
53896A1443974o256848j0007131J650668J0458182L954965o438804o993679m41611
53888b630284M884436O030154m28300j5966855k7109765j6254816R041100K0615773
53880b1818557J0028513n99564L571767Q761716J878971o039192l221750K65239
53872g172857o604635j3141616o020737O243746P833841R9957n483623m455860
53864b8701784M209541K1102665L2763826J7669271j7596691l3487045j0535583
53857a4575800J8538970J6644275l509522p213693K740690l067242k3182178k4525101
$$ plain form
53912 60161295 39900812 13758310 5357793 12792574 19564910 15461418 1247195 -15018820
53904 -15018820 -20545079 -7849522 12319204 19458317 9837412 1386122 5777043 11443974
53896 11443974 5187126 -4820005 -3169337 7288845 11243810 4805006 -2188673 -2630284
53888 -2630284 2254152 8284306 7856006 -8110849 -35220614 -51475430 -42434330 -21818557
53880 -21818557 -11790044 -12389608 -8817841 -56125 1822846 -4216346 -7438096 -7172857
53872 -7172857 -13777492 -26919108 -32939845 -26696099 -18862258 -18762301 -24245924 -28701784
53864 -28701784 -24492243 -3389578 29374248 47043519 29446828 -4040217 -14575800
53857 -14575800 3963170 20607445 17097923 9884230 12624920 9557678 -13624500 -38149601
53849c8149601J632969K4647327K2284236Q121350J114425j271961o394567q613071
53841C371107k854269L619882N498162Q193698J1538781K727791k0775187l6873875
53833b5553910k4309557O902547K6406163K0004743J606164q817105o079923K813322
53825g027556J0479929J2174509M611825r001845j5759503n540480J2222624J6073072
53817A8232575J965432q002127K994745J9358931J4596587r542042k6880679k4424437
53809a1701015j2836520j935050Q714562J4113638N772883p012772n201480O301766
53801c783988L285870j3438581j4117905P500425J7207309l123923k0982935n286473
53793c2740201K1774666K1927889J437209o347328K692023O666799J120451k091657
$$ plain form
53849 -38149601 -36516632 -11869305 10414931 18536281 19650706 18378745 11984178 3371107
53841 3371107 516838 4136720 9634882 17828580 29367361 32095152 11319965 -25553910
53833 -25553910 -49863467 -42960920 -16554757 3449986 5056150 -3760955 -9840878 -7027556
53825 -7027556 3452373 15626882 20238707 11236862 -4522641 -10063121 2159503 18232575
53817 18232575 20198007 12195880 15190625 34549556 49146143 39604101 12723422 -11701015
53809 -11701015 -24537535 -26472585 -17758023 -3644385 2128498 -4884274 -10085754 -3783988
53801 -3783988 -498118 -13936699 -28054604 -20554179 -3346870 -6470793 -27453728 -32740201
53793 -32740201 -10965535 10962354 12399563 6052235 8744258 15411057 16531508 14439851
53785A4439851o336034j9511549k3671488P55255K8999210J7833527k4569990
53778a2061218m3408395j7292908J4080154J5056016J920196M638672J8645323
53771a8422160K1890410J2864691M893279Q39534l749234n667848j196589J881007
53763A3333090n072394j6112289j7593529n687899R547439J3712432J238781j5052011
53755b1686380j2489825J2674044L2844839K2096283o056401j6160216j130257
53748A0092087J1453076L227155j2658881j8127054j2864152k683299J0582457
53741a0978611J8542106Q763845j1699509j7209842K40870J6293063Q936227j0900815
53733A987334j8532071r685566L85375J118031l982237n761079J539168J4370077
$$ plain form
53785 14439851 8103817 -11407732 -35079220 -34323965 -5324755 12508772 -12061218
53778 -12061218 -55469613 -72762521 -58682367 -43626351 -41706155 -37067483 -18422160
53771 -18422160 3468250 16332941 21226220 22065754 18316520 12648672 11452083 13333090
53763 13333090 8260696 -7851593 -25445122 -31133021 -21585582 -7873150 -6634369 -21686380
53755 -21686380 -34176205 -21502161 11342678 33438961 27382560 11222344 10092087
53748 10092087 21545163 24772318 12113437 -6013617 -18877769 -21561068 -10978611
53741 -10978611 7563495 16327340 4627831 -12582011 -12341141 3951922 12888149 1987334
53733 1987334 -16544737 -26230303 -25844928 -24726897 -28709134 -34470213 -32931045 -18560968
53725a8560968K0187095J1634017m77363o38848P037826M868435q965852j7625346
53717b541004j4387124j1747219j5784630j3763636K550419K0162093K2873841
53710a2637260J1554433k267618j0059192q196220J38643K546133p701163j5382210
53702d2004454k501765J7998836J5334756r644866k0130875J696165K7488335
53695a1763868K6611561P924671k669135j150298R43202J424990L537189L032165
53687B7890477j811405k371204K683900J34752j1977509j2953331O979037K3716761
53679C2291478J3177096j1506262k1845728j5467351q948401m769871N380051
53672a1688988J5305948J1347233j547551o291708j263879J150863j817342k666114
$$ plain form
53725 -18560968 1626127 13260144 12782781 12143933 19181759 24050194 15084342 -2541004
53717 -2541004 -16928128 -28675347 -44459977 -58223613 -55673194 -35511101 -12637260
53710 -12637260 -1082827 -3350445 -13409637 -21605857 -21467214 -18921081 -26622244 -42004454
53702 -42004454 -44506219 -26507383 -11172627 -20817493 -40948368 -39252203 -11763868
53695 -11763868 14847693 22772364 20103229 18952931 19896133 21321123 24858312 27890477
53687 27890477 26079072 23707868 26391768 26526520 14549011 1595680 8574717 32291478
53679 32291478 45468574 33962312 12116584 -3350767 -12299168 -17069039 -11688988
53672 -11688988 3616960 14964193 13416642 7124934 5861055 7011918 5194576 2528462
53664B528462j263190k844697l751976K066504Q714781Q133394N710816Q445410
53656B7739504Q653195r70884r143261n329611k754172j5147158k5123987q979444
53648c1055818J8125641K0319814p26735p568537J0410319J9374911j624274k5826118
53640A429203k2580166l092970M223916p74939J116825J0139816Q942740l529577
53632d125152p212914O593243J8870527Q873996j5350107k4854168n974571K2156284
53624a022862L1340237J7684812K71931q895784j5776793k2783604j8578075j488960
53616a9249098P826584l301921j4236798q20794K3564622K6230737N494931r766280
53608A5741983p462839m878505j1051638j0976005K602620J2479664O761112o15247
$$ plain form
53664 2528462 1265272 -1579425 -5331401 -3264897 5449884 13583278 19294094 27739504
53656 27739504 36392699 35421815 26278554 20948943 18194771 3047613 -22076374 -31055818
53648 -31055818 -12930177 7389637 6662902 -905635 9504684 28879595 27255321 1429203
53640 1429203 -21150963 -24243933 -20020017 -20794956 -19678131 -9538315 -595575 -4125152
53632 -4125152 -11338066 -4744823 14125704 22999700 7649593 -17204575 -23179146 -1022862
53624 -1022862 30317375 48002187 48274118 39378334 23601541 817937 -17760138 -19249098
53616 -19249098 -11422514 -14724435 -28961233 -29782027 -6217405 20013332 25508263 15741983
53608 15741983 8279144 3400639 -7650999 -18627004 -16024384 -3544720 3216392 2601145
53600B601145M477971J2257895P844157m132921j0688754j1240196j1933975j2344851
53592b3159529j0933580j0985110j0034395K076492K3198718L2774195J9013179
53585B1949970k570842j1049830n946128J417753O107324N197443o907289k2365907
53577a4167506j8105000R754531K8828534J2926697j5761037j7381361N927689
53570g977453J6625901J950354j0844893l138310P611826K043300r296089o727198
53562i752562P155030J5757223J3842207P830345J036392o457398r964235m729929
53554A4717073N350400J1675674J0209268K554701o708066j0921094o895523j718232
53546A8264201n014364j2863118j1301624J359212J0058807O150214n93256j281915
$$ plain form
53600 2601145 7079116 19337011 27181168 23048247 12359493 1119297 -10814678 -23159529
53592 -23159529 -34093109 -45078219 -55112614 -53036122 -29837404 2936791 21949970
53585 21949970 19379128 8329298 2383170 3800923 9908247 15105690 8198401 -14167506
53577 -14167506 -32272506 -22517975 6310559 19237256 3476219 -13905142 -7977453
53570 -7977453 8648448 10598802 -246091 -3384401 4227425 6270725 -3025364 -9752562
53562 -9752562 -2597532 13159691 27001898 34832243 35868635 29411237 19447002 14717073
53554 14717073 20067473 31743147 41952415 44507116 37799050 26877956 19982433 18264201
53546 18264201 13249837 386719 -10914905 -9555693 503114 6653328 6060072 4778157
53538D778157k546927r766715j2100349j100528R701226M221682p966106o182380
53530b0961940N862156N740981q245534j2105576L457656J5612351O060329q816218
53522a3395795m644117J1839477J5087235K291749m214895M603318R408968n297172
53514A5678768k3969381k0965874K191425J8471542J2107528l011958p031498
53507f529448k310020m768289j4010387j0851203J0788798K6971652J3924804
53500A3215907j4643658k1110656N166514L1284831K4043987o856632k4131648
53493F968645j1796111R192754J2853158l13911r845903m011978P307589Q235789
53485A8590032p80799l373674P774688J5284831j085367l0506382l8040059j1321262
$$ plain form
53538 4778157 2231230 -7535485 -19635834 -20736362 -11035136 -6813454 -14779560 -20961940
53530 -20961940 -15099784 -9358803 -17604337 -29709913 -26252257 -10639906 -4579577 -13395795
53522 -13395795 -18039912 -6200435 8886800 11178549 6963654 11566972 20975940 15678768
53514 15678768 -8290613 -29256487 -27065062 -8593520 3514008 502050 -6529448
53507 -6529448 -8839468 -13607757 -27618144 -38469347 -27680549 -708897 13215907
53500 13215907 -1427751 -22538407 -17371893 13912938 37956925 31100293 6968645
53493 6968645 -4827466 4365288 17218446 16904535 7058632 3046654 10354243 18590032
53485 18590032 17809233 14435559 22210247 37495078 36409711 5903329 -32136730 -43457992
53477d3457992J9172463K0291535j86915j0232375j152152P335872M168636O53143
53469c407785M004670L788580n363006r866895J19764J1594858P904198n674125
53461C100259j0861928k002959J0679508J6575019J2410390J186928p616942m823655
53453A8646620L879240J589998j3015517j8421695l544384R668872j578036k1749019
53445b4523921j8667505N392640J7721972P783601j94459P131810J0656797k170453
53437C130482j0717383K966809J9478518J2223382q543343j3374199o24700O866588
53429A1406154K216397k003243m818082j5967497k5276447j0712668J7879910
53422b7275476K2218760m650393k0899756Q20532K9380998K4389958k014682j0494368
$$ plain form
53477 -43457992 -24285529 -3993994 -4180909 -14413284 -15565436 -8229564 -4060928 -3407785
53469 -3407785 596885 4385465 -977541 -10844436 -10724672 870186 8774384 3100259
53461 3100259 -7761669 -9764628 914880 17489899 29900289 31087217 23470275 18646620
53453 18646620 22525860 24115858 11100341 -7321354 -10865738 -1196866 -2774902 -24523921
53445 -24523921 -43191426 -37798786 -20076814 -12293213 -12487672 -5355862 5300935 3130482
53437 3130482 -7586901 -4620092 14858426 27081808 18538465 5164266 4539566 11406154
53429 11406154 13622551 11619308 6801226 -9166271 -34442718 -45155386 -27275476
53422 -27275476 -5056716 -9707109 -30606865 -29786333 -405335 23984623 21969941 11475573
53414A1475573J676410N464712m761681o558432L362253J711765j5620392k0850722
53406b4100514k14938K1768538K0036383K291975j1372831j5990797j2909411
53399b0491595R81920J7775026J6777268l224521j4246021j625200R738155l416583
53391B268449k1016864j1432697J5500403K4164126Q846148l962520k050629R02885
53383A3219301j402557J209241P960907L702433j0369177j2908732J353497R462493
53375A2227406l473089k0121210j7537441J108618J5461681J4359102K199369
53368D224436r290921q408237N623170J5345308L203200k0262621k4727007k075410
53360c6368082J9883787J5730581l631027r233755O769826K4927267K4915573
$$ plain form
53414 11475573 13151983 18616695 13855014 7296582 10658835 12370600 -3249792 -24100514
53406 -24100514 -24315452 -2546914 17489469 19781444 8408613 -7582184 -20491595
53399 -20491595 -19509675 -1734649 15042619 11818098 -2427923 -4053123 5685032 2268449
53391 2268449 -18748415 -30181112 -14680709 9483417 18329565 14367045 12316416 13219301
53383 13219301 11816744 13025985 20986892 24689325 14320148 1411416 2764913 12227406
53375 12227406 8754317 -11366893 -28904334 -27795716 -12334035 2025067 4224436
53368 4224436 -5066485 -13474722 -7851552 7493756 10696956 -9565665 -34292672 -36368082
53360 -36368082 -16484295 -753714 -4384741 -13618496 -6848670 18078597 42994170
53353D2994170O902046j1408636j3815036k304104O724159M467981p26762j853358
53345C0980460o556511j8055799j9853626j922812J4194551O338799p080711M901937
53337B946288K7848310J9961665j4394884k4574764K616144J7063792j1576978
53330A9889573l9737218j8810280K5968490L4826823K149110k4905034j9970101
53323b0588637k352507N372075M196092K431876K904092P788375J5325962J5326789
53315C0404117M381175m561398l994056p035173k1212100k7264182j0002345R682852
53307b9601110N222925j0428731n824646J5662084K2626745R187015J890196J1890588
53299B0625066J6913957n93556k5773198l2560738j4299231J3033070K6242076
$$ plain form
53353 42994170 49896216 38487580 24672544 22368440 29092599 33560580 32833818 30980460
53345 30980460 24423949 6368150 -13485476 -15408288 -1213737 5125062 -1955649 2946288
53337 2946288 30794598 50756263 36361379 11786615 14402759 31466551 19889573
53330 19889573 -19847645 -38657925 -12689435 22137388 24286498 -618536 -20588637
53323 -20588637 -22941144 -17569069 -13372977 -10941101 -8037009 -248634 15077328 30404117
53315 30404117 34785292 30223894 26229838 19194665 -2017435 -29281617 -39283962 -29601110
53307 -29601110 -24378185 -34806916 -40631562 -24969478 -2342733 6844282 8734478 20625066
53299 20625066 37539023 36945467 11172269 -21388469 -35687700 -22654630 3587446
53292C587446J4502755p145450j2390210k19410J904389j5140246k0571301N453629
53284c0018398L0126111J5841581j6175984j8107296P181494J5188644l702016
53277C34136j3811854J71514J3235759J2312300J4491537K1408651Q272844k3945802
53269C2469085l5369849r265351J7928045J4265533j846365k082291M278195l185861
53261A7191141j3750699n710068J3004105J6799771P76406j7651258k3584573
53254a2925175j3926018M715099J5737363O603103r780372r119019N110239N686966
53246g897814j0645122j6137993j600568Q678639N405172J1306104K9091658K2845666
53238D1045742j7490827m2718561j6499799K4106513K7648732O476217J527740
$$ plain form
53292 3587446 18090201 10944751 -1445459 -1664869 239520 -14900726 -35472027 -30018398
53284 -30018398 107713 15949294 -226690 -18333986 -11152492 4036152 334136
53277 334136 -13477718 -13306204 -70445 12241855 26733392 48142043 56414887 32469085
53269 32469085 -2900764 -12166115 5761930 20027463 18181098 16098807 20377002 17191141
53261 17191141 3440442 -2269626 10734479 27534250 28310656 10659398 -12925175
53254 -12925175 -26851193 -22136094 -6398731 204372 -9576000 -18695019 -13584780 -7897814
53246 -7897814 -18542936 -34680929 -36281497 -27602858 -22197686 -10891582 18200076 41045742
53238 41045742 23554915 -19163646 -35663445 -11556932 16091800 22568017 24095757
53231B4095757O054750j1536614l5541427k3459420J4742306K6570376L078380
53224D004108j0748103L849258J2800154l413794j5226150k92244J5820170M280736
53216A1074135k0355691k7007264j2498068N449396J5915651J5586592L159064
53209h676185j1171835j0847665J173766M090840n042243n369767P825948J0199395
53201a7817746q014130j9250172l509965J5145892P592484j0886501o317181J6929561
$$ plain form
53231 24095757 30150507 18613893 -16927534 -40386954 -25644648 925728 4004108
53224 4004108 -6743995 -2894737 9905417 6491623 -8734527 -9026771 6793399 11074135
53216 11074135 -9281556 -36288820 -48786888 -43337492 -27421841 -11835249 -8676185
53209 -8676185 -19848020 -30695685 -29521919 -25431079 -30473322 -35843089 -28017141 -17817746
53201 -17817746 -25831876 -45082048 -48592013 -33446121 -25853637 -36740138 -43057319 -26127758
$$ [...]
##END NTUPLES=NMR SPECTRUM
##END=
