##TITLE=31Pdec_SR72_oil
 d2o, 124 sc
 3.08.2021
##JCAMPDX= 6.0         $$ Bruker NMR JCAMP-DX V2.0
##DATA TYPE= NMR SPECTRUM
##DATA CLASS= NTUPLES
##ORIGIN= UXNMR, Bruker Analytische Messtechnik GmbH
##OWNER= root
$$ XWIN-NMR		Version 3.5
$$ Tue Aug  3 12:52:45 2021 Russian Standard Time (UT+4h)  she@DPX200
##.OBSERVE FREQUENCY= 81.013821
##.OBSERVE NUCLEUS= ^31P
##.ACQUISITION MODE= SIMULTANEOUS
##.ACQUISITION SCHEME= undefined
##.AVERAGES= 124
##.DIGITISER RES= 16
##SPECTROMETER/DATA SYSTEM= spect
##.PULSE SEQUENCE= zgpg30
##.SOLVENT NAME= CDCl3
##.SHIFT REFERENCE= (INTERNAL, CDCl3, 0, 248.564)
##AUDIT TRAIL= $$ (NUMBER, WHEN, WHO, WHERE, WHAT)
$$ ##TITLE= Audit trail, XWIN-NMR		Version 3.5
$$ ##JCAMPDX= 5.01
$$ ##ORIGIN= Bruker BioSpin GmbH
$$ ##OWNER= she
$$ F:/spectra/data/she/nmr/P31/1/pdata/1/auditp.txt
$$ ##AUDIT TRAIL=  $$ (NUMBER, WHEN, WHO, WHERE, WHAT)
(   1,<2021-08-03 12:51:11.48 +0400>,<she>,<DPX200>,
      <continue with go, POWCHK disabled, PULCHK disabled
       configuration hash MD5:
       00 E9 B6 7A A2 85 ED C7 34 08 36 98 17 FE 4E 26
       data hash MD5: 32K
       12 03 60 19 66 EF 30 41 AF 73 C1 81 CE 9E 65 94>)
(   2,<2021-08-03 12:51:29.96 +0400>,<she>,<DPX200>,
      <Start of raw data processing
       efp BC_mod = 2 LB = 1 FT_mod = 6 PKNL = 1 PHC0 = -7590.267 PHC1 = 590.0743 SI = 64K 
       data hash MD5: 64K
       81 93 8B 68 94 E3 E0 1B 3B F9 43 EB E0 FB BA B7>)
(   3,<2021-08-03 12:52:05.37 +0400>,<she>,<DPX200>,
      <pk PHC0 = -160.5129 PHC1 = 370.8002 
       data hash MD5: 64K
       00 42 DE 7C E2 70 95 F9 80 00 6C 96 65 80 99 CF>)
$$ ##END=
$$ 
$$ hash MD5
$$ 20 BD 0C 51 20 8B E1 D5 E1 23 E5 6C 42 2B CC DC
##$RELAX= 
##$RELAX= 
##$RELAX= 
##$RELAX= 
##$RELAX= 
##$RELAX= 
##$RELAX= 
##$RELAX= 
$$ Bruker specific parameters
$$ --------------------------
##$DU= <F:/spectra>
##$EXPNO= 1
##$NAME= <P31>
##$PROCNO= 1
##$TYPE= <nmr>
##$USER= <she>
##$AMP= (0..31)
100 100 100 100 100 100 100 100 100 100 100 100 100 100 100 100 100 100 
100 100 100 100 100 100 100 100 100 100 100 100 100 100 
##$AQSEQ= 0
##$AQ_mod= 1
##$AUNM= <au_zg>
##$AUTOPOS= <>
##$BF1= 81.014009
##$BF2= 200.13
##$BF3= 200.13
##$BF4= 200.13
##$BF5= 200.13
##$BF6= 200.13
##$BF7= 200.13
##$BF8= 200.13
##$BYTORDA= 1
##$CFDGTYP= 0
##$CFRGTYP= 5
##$CHEMSTR= <none>
##$CNST= (0..31)
1 1 145 1 1 1 1 1 1 1 1 1 1 1 1 1 1 1 1 1 1 1 1 1 1 1 1 1 1 1 1 1 
##$CPDPRG= <waltz16>
##$CPDPRG1= <>
##$CPDPRG2= <waltz16>
##$CPDPRG3= <>
##$CPDPRG4= <mlev>
##$CPDPRG5= <mlev>
##$CPDPRG6= <mlev>
##$CPDPRG7= <mlev>
##$CPDPRG8= <mlev>
##$CPDPRGB= <>
##$CPDPRGT= <>
##$D= (0..31)
0 1 0 0 0 0 0 0 0 0 0 0.03 2e-05 3e-06 0 0 0 0 0 0 0 0 0 0 0 0 0 0 0 0 
0 0 
##$DATE= 1627980504
##$DBL= (0..7)
120 120 120 11 120 120 24 19 
##$DBP= (0..7)
150 150 150 150 150 150 150 150 
##$DBP07= 0
##$DBPNAM0= <>
##$DBPNAM1= <>
##$DBPNAM2= <>
##$DBPNAM3= <>
##$DBPNAM4= <>
##$DBPNAM5= <>
##$DBPNAM6= <>
##$DBPNAM7= <>
##$DBPOAL= (0..7)
0.5 0.5 0.5 0.5 0.5 0.5 0.5 0.5 
##$DBPOFFS= (0..7)
$$ [...]
##$SUBNAM2= <"">
##$SUBNAM3= <"">
##$SUBNAM4= <"">
##$SUBNAM5= <"">
##$SUBNAM6= <"">
##$SUBNAM7= <"">
##$SUBNAM8= <"">
##$SUBNAM9= <"">
##$SW= 501.771253377433
##$SWIBOX= (0..15)
0 1 3 0 0 0 0 0 0 0 0 0 0 0 0 0 
##$SW_h= 40650.406504065
##$TD= 32768
##$TD0= 1
##$TE= 0
##$TE2= 300
##$TE3= 300
##$TEG= 300
##$TL= (0..7)
0 120 53 12 22 120 120 120 
##$TP= (0..7)
150 150 150 150 150 150 150 150 
##$TP07= 0
##$TPNAME0= <>
##$TPNAME1= <>
##$TPNAME2= <>
##$TPNAME3= <>
##$TPNAME4= <>
##$TPNAME5= <>
##$TPNAME6= <>
##$TPNAME7= <>
##$TPOAL= (0..7)
0.5 0.5 0.5 0.5 0.5 0.5 0.5 0.5 
##$TPOFFS= (0..7)
0 0 0 0 0 0 0 0 
##$TUNHIN= 0
##$TUNHOUT= 0
##$TUNXOUT= 0
##$USERA1= <user>
##$USERA2= <user>
##$USERA3= <user>
##$USERA4= <user>
##$USERA5= <user>
##$V9= 5
##$VALIST= <valist>
##$VCLIST= <CCCCCCCCCCCCCCC>
##$VD= 0
##$VDLIST= <DDDDDDDDDDDDDDD>
##$VPLIST= <PPPPPPPPPPPPPPP>
##$VTLIST= <TTTTTTTTTTTTTTT>
##$WBST= 1024
##$WBSW= 4
##$XGAIN= (0..3)
0 0 0 0 
##$XL= 0
##$YL= 0
##$YMAX_a= 6164
##$YMIN_a= -7097
##$ZGOPTNS= <>
##$ZL1= 120
##$ZL2= 120
##$ZL3= 120
##$ZL4= 120
##$ABSF1= 0
##$ABSF2= 0
##$ABSG= 0
##$ABSL= 0
##$ALPHA= 0
##$AQORDER= 0
##$ASSFAC= 0
##$ASSFACI= 0
##$ASSFACX= 0
##$ASSWID= 0
##$AUNMP= <proc_1d>
##$AZFE= 0.1
##$AZFW= 0.5
##$BCFW= 0
##$BC_mod= 2
##$BYTORDP= 0
##$COROFFS= 0
##$CY= -3
##$DATMOD= 1
##$DC= 0
##$DFILT= <>
##$DTYPP= 0
##$F1P= 0
##$F2P= 0
##$FCOR= 1
##$FTSIZE= 65536
##$FT_mod= 6
##$GAMMA= 0
##$GB= 0
##$INTBC= 1
##$INTSCL= 5.30512e-09
##$ISEN= 30
##$LB= 1
##$LEV0= 0
##$LPBIN= 0
##$MAXI= 10000
##$MC2= 0
##$MEAN= 0
##$ME_mod= 0
##$MI= 50
##$NCOEF= 0
##$NC_proc= -7
##$NLEV= 6
##$NOISF1= 182.463
##$NOISF2= 159.3651
##$NSP= 0
##$NTH_PI= 0
##$NZP= 0
##$OFFSET= 248.5645
##$PC= 4
##$PHC0= -7750.78
##$PHC1= 960.8745
##$PH_mod= 1
##$PKNL= yes
##$PPARMOD= 0
##$PSCAL= 0
##$PSIGN= 0
##$REVERSE= no
##$SF= 81.014009
##$SI= 65536
##$SIGF1= 159.3651
##$SIGF2= -187.1042
##$SINO= 113.3802
##$SIOLD= 16384
##$SREGLST= <1H.CDCl3>
##$SSB= 0
##$STSI= 65536
##$STSR= 0
##$SW_p= 40650.406504065
##$SYMM= 0
##$S_DEV= 0
##$TDeff= 32768
##$TDoff= 0
##$TI= <>
##$TILT= no
##$TM1= 0
##$TM2= 0
##$TOPLEV= 0
##$USERP1= <user>
##$USERP2= <user>
##$USERP3= <user>
##$USERP4= <user>
##$USERP5= <user>
##$WDW= 1
##$XDIM= 65536
##$YMAX_p= 537939877
##$YMIN_p= -31169942
$$ End of Bruker specific parameters
$$ ---------------------------------
##NTUPLES= NMR SPECTRUM
##VAR_NAME=  FREQUENCY,     SPECTRUM/REAL,   SPECTRUM/IMAG
##SYMBOL=    X,             R,               I
##VAR_TYPE=  INDEPENDENT,   DEPENDENT,       DEPENDENT
##VAR_FORM=  AFFN,          ASDF,            ASDF
##VAR_DIM=   65536,         65536,           65536
##UNITS=     HZ,            ARBITRARY UNITS, ARBITRARY UNITS
##FACTOR=    0.620285442955139, 1,           1
##FIRST=     20137.2065510759, 0,            0
##LAST=      -20513.1999529892, 0,           0
##MIN=       -20513.1999529892, -31169942,   0
##MAX=       20137.2065510759, 537939877,    0
$$ Real data points
##PAGE= N=1
##DATA TABLE= (X++(R..R)), XYDATA
$$ [...]
$$ plain form
12995 4939532 4018544 2402632 114173 -1894002 -608981 3446389 4659529 1016632
12987 1016632 -957587 4039883 10336050 8858185 774920 -4848490 -4635538 -3192162
12979 -3192162 -2879886 -733583 3422461 4526287 556375 -3771897 -4281083 -2332183
12971 -2332183 -381221 1486711 2283082 -680917 -6533722 -10096818 -9008543 -6604505
12963 -6604505 -5645524 -4774084 -3424279 -4004329 -6220955 -5657193 -1682726 -252164 -4294737
12954 -4294737 -7797140 -4997874 668835 3322861 4588274 8908379 13423577 11592324
12946 11592324 4697947 988299 3722853 7638683 7728502 4969395 2439553 1262355
12938 1262355 1361768 1868150 651839 -2485918 -3134021 2279597 9443209 10446957 4751365
$$ packed form
12995D939532r20988j615912k288459k008175J285021M055370J213140l642897
12987A016632j974219M997470O296167j477865q083265n623410K12952J443376
12979c192162L12276K146303M156044J103826l969912m328272n09186J948900
12971b332183J950962J867932P96371k963999n852805l563096J088275K404038
12963f604505R58981Q71440J349805n80050k216626N63762L974467J430562m042573
12954d294737l502403K799266N666709K654026J265413M320105M515198j831253
12946A1592324o894377l709648K734554L915830Q9819k759107k529842j177198
12938A262355R9413N06382j216311l137757o48103N413618P163612J003748n695592
$$ plain form
12929 4751365 -270123 15458 2600499 3441566 2555914 761618 -2655466 -6564245 -7533078
12920 -7533078 -5274585 -3786582 -4768128 -4792657 -1657928 1235446 -57923 -4662372 -9275804
12911 -9275804 -11965646 -11373979 -6794219 -1594553 -1534370 -6622687 -9883356 -7658245 -5346317
12902 -5346317 -8406904 -13585889 -14893058 -12855877 -11021398 -8194485 -2140331 2914251
12894 2914251 1377849 -3584606 -4034592 143484 1773256 -1272814 -3927985 -4419417
12886 -4419417 -6699231 -10514385 -9391659 -2375680 1825159 -2273842 -8461464 -9409919
12878 -9409919 -7753721 -9158302 -11403636 -9424249 -6067726 -7945328 -13412505 -14308268
12870 -14308268 -8647766 -2787915 -973582 -1032579 -1376425 -4200852 -9284631 -11545811
$$ packed form
12929D751365n021488K85581K585041Q41067q85652j794296l417084l908779r68833
12920g533078K258493J488003r81546k4529L134729K893374j293369m604449m613432
12911i275804k689842N91667M579760N199666O0183n088317l260669K225111K311928
12902e346317l060587n178985j307169K037181J834479K826913O054154N054582
12894B914251j536402m962455m49986M178076J629772l046070k655171m91432
12886d419417k279814l815154J122726P015979M200839m099001o187622r48455
12878i409919J656198j404581k245334J979387L356523j877602n467177q95763
12870a4308268N660502N859851J814333n8997l43846k824427n083779k261180
$$ plain form
12862 -11545811 -8244370 -3404407 -1805515 -2894322 -3655155 -3553361 -3434693 -2836862 -1581902
12853 -1581902 -1376542 -2940639 -3910332 -2318537 47177 490518 -469788 -824614 -1216940
12844 -1216940 -3871391 -8001309 -9642117 -6745179 -2166362 -402210 -2511698 -5449371
12836 -5449371 -6061897 -4463534 -2745579 -1419905 776777 3513337 4129146 1723148
12828 1723148 -780357 -1074131 -1259696 -3771793 -6114146 -4455810 -768174 -688868 -4816266
12819 -4816266 -8090626 -8083361 -7531144 -7486535 -4839872 721957 3980045 2285112 274249
12810 274249 1723718 2462241 -2476222 -9353724 -10577904 -6061271 -2461675 -2690690 -3308530
12801 -3308530 -2123323 -1738239 -4309896 -7910919 -9723462 -9239005 -7274713 -4738193
$$ packed form
12862a1545811L301441M839963J598892j088807p60833J01794J18668N97831J254960
12853a581902K05360j564097r69693J591795K365714M43341r60306l54826l92326
12844a216940k654451m129918j640808K896938M578817J764152k109488k937673
12836e449371o12526J598363J717955J325674K196682K736560O15809k405998
12828A723148k503505k93774j85565k512097k342353J658336L687636P9306m127398
12819d816266l274360P265N52217M4609K646663N561829L258088j694933k010863
12810B74249J449469P38523m938463o877502j224180M516633L599596k29015o17840
12801c308530J185207L85084k571657l601023j812543M84457J964292K536520
$$ plain form
12793 -4738193 -2808505 -1864829 -529307 1878790 3187456 1630792 -417655 290323
12785 290323 2576863 3301643 3675865 7690405 14553494 18080712 14337064 5559922 -3758034
12776 -3758034 -10348514 -11846212 -7987773 -2755710 -943713 -2380487 -3757565 -5020524
12768 -5020524 -7962319 -9590408 -5111565 1780487 909896 -9008943 -16170512 -12026282
12760 -12026282 -3409858 -1345584 -5099185 -6235065 -3165135 -1487527 -2433490 -1010678
12752 -1010678 4385287 9080473 9932284 8819531 7060319 3198954 -1730522 -3263547
12744 -3263547 -685347 603648 -2587427 -5603291 -2914044 3290014 6299805 3959627
12736 3959627 -275099 -3520362 -5743322 -6667011 -5472777 -4154186 -6505839 -12003087
$$ packed form
12793d738193J929688R43676J335522K408097J308666j556664k048447P07978
12785B90323K286540P24780L74222M014540O863089L527218l743648q777142r317956
12776c758034o590480j497698L858439N232063J811997j436774j377078j262959
12768e020524k941795j628089M478843O892052q70591r918839p161569M144230
12760a2026282Q616424K064274l753601j135880L069930J677608r45963J422812
12752a010678N395965M695186Q51811j112753j759212l861365m929476j533025
12744c263547K578200J288995l191075l015864K689247O204058L009791k340178
12736C959627m234726l245263k222960r23689J194234J318591k351653n497248
$$ plain form
12728 -12003087 -14619233 -10443272 -3437914 -268242 -1649557 -2932532 -2117183 -2455725
12720 -2455725 -6409786 -11427434 -13790926 -13304067 -11713166 -9326108 -6069518 -3542510
12712 -3542510 -2808191 -1991611 589422 2542096 452260 -4205154 -6245868 -3702354
12704 -3702354 58919 1351718 107554 -1517762 -1747813 -243175 1254203 -18312
12696 -18312 -3935143 -6347869 -4875002 -3325221 -5882154 -9535098 -8537196 -4472303 -4078857
12687 -4078857 -7464520 -7146767 -246883 6922813 9127491 8785965 8791551 7135141 3355697
12678 3355697 2117502 4449962 3291412 -5113224 -12743353 -11172250 -4915143 -3722445
12670 -3722445 -6832486 -5912307 -401998 1739107 -2108837 -5443150 -3773095 -181858
$$ packed form
12728a2003087k616146M175961P005358L169672j381315j282975Q15349l38542
12720b455725l954061n017648k363492M86859J590901K387058L256590K527008
12712c542510P34319Q16580K581033J952674k089836m657414k040714K543514
12704c702354L761273J292799j244164j625316k30051J504638J497378j272515
12696a8312l916831k412726J472867J549781k556933l652944R97902M064893L93446
12687d078857l385663L17753O899884P169696K204678l41526N586j656410l779444
12678C355697j238195K332460j158550q404636p630129J571103O257107J192698
12670c722445l110041R20179N510309K141105l847944l334313J670055L591237
$$ plain form
12662 -181858 2020582 4020886 6771199 8595666 9335120 10419689 9683035 3131312 -6648862
12653 -6648862 -11203019 -7622123 -2314944 -888477 -1306901 -263888 744654 49485
12645 49485 276397 3272095 5761911 4969282 3893091 5903887 8232265 6247971 949401
12636 949401 -3115985 -4780547 -5996038 -6812086 -5735150 -3711950 -3050922 -3313688 -2568844
12627 -2568844 -1903715 -4244095 -8745195 -10534961 -7015082 -1451133 839103 -1909668
12619 -1909668 -6640987 -8540872 -5413827 -15698 2601043 978424 -1070521 -340792
12611 -340792 389580 -3613911 -10630688 -12813626 -6486875 1730399 2498947 -4533781 -10774538
12602 -10774538 -10362295 -7313285 -8598010 -13620863 -15153325 -9509696 -796505 5512753
$$ packed form
12662a81858K202440K000304K750313J824467P39454J084569p36654o551723r780174
12653f648862m554157L580896N307179J426467m18424J043013J008542o95169
12645D9485K26912K995698K489816p92629j076191K010796K328378j984294n298570
12636I49401m065386j664562j215491q16048J076936K023200O61028k62766P44844
12627b568844O65129k340380m501100j789766L519879N563949K290236k748771
12619a909668m731319j899885L127045N398129K616741j622619k048945P29729
12611c40792P30372m003491p016777k182938O326751Q217274P68548p032728o240757
12602a0774538M12243L049010j284725n022853j532462N643629Q713191O309258
$$ plain form
12594 5512753 8406494 9023878 7289004 3986583 2240292 3163571 3326212 318378 -2735919
12585 -2735919 -2703388 -2655925 -6668032 -11598949 -11168501 -6266782 -3608712 -5013068 -5825015
12576 -5825015 -3957263 -2424097 -1974614 575537 4697957 4901460 96637 -3340886
12568 -3340886 -1463555 1409750 768625 -1112533 -965819 -746565 -2700995 -4136117 -2881447
12559 -2881447 -2623050 -6573187 -10345228 -7548939 916110 8790811 12425681 11812533
12551 11812533 7475043 1736085 -598723 1661614 2902685 -1029149 -5520373 -4200782
12543 -4200782 985663 3670350 3170886 3037192 2788216 -400796 -3908712 -2381835 2488857
12534 2488857 3145822 -2673781 -9147145 -10942436 -8056196 -2377016 3847410 6372393
$$ packed form
12594E512753K893741O17384j734874l302421j746291R23279J62641l007834l054297
12585b735919L2531M7463m012107m930917M30448M901719K658070j404356q11947
12576e825015J867752J533166M49483K550151M122420K03503m804823l437523
12568c340886J877331K873305o41125j881158J46714K19254j954430j435122J254670
12559b881447K58397l950137l772041K796289Q465049P874701L634870o13148
12551A1812533m337490n738958k334808K260337J241071l931834m491224J319591
12543d200782N186445K684687m99464j33694k48976l189012l507916J526877M870692
12534B488857O56965n819603o473364j795291K886240N679180O224426K524983
$$ plain form
12526 6372393 2704461 -2458771 -2174772 2602948 4737310 2241140 51151 421735
12518 421735 93444 -1811518 -1721588 418252 -423210 -4906752 -6389069 -1484138 3705361
12509 3705361 2642658 -2414399 -5009769 -3387595 -518730 661046 -1306719 -5839022
12501 -5839022 -8876381 -6315588 -435283 2192245 228198 -1333965 -567402 -1099358
12493 -1099358 -3276173 -2180936 1968923 1462820 -5523600 -9462566 -4658479 302706
12485 302706 -3176424 -8493183 -4988988 3360804 4560117 -1018874 -2143069 3163477
12477 3163477 4517810 -2100391 -6846437 -1976501 6432578 8959514 5888080 3175911
12469 3175911 2447344 1684129 911704 1133521 825592 -1805126 -5444167 -7728336 -8172246
$$ packed form
12526F372393l667932n163232K83999M777720K134362k496170k189989L70584
12518D21735l28291j904962Q9930K139840q41462m483542j482317M904931N189499
12509C705361j062703n057057k595370J622174K868865J179776j967765m532303
12501e839022l037359K560793N880305K627528j964047j562163P66563n31956
12493a099358k176815J095237M149859n06103o986420l938966M804087M961185
12485C02706l479130n316759L504195Q349792J199313n578991j124195N306546
12477C163477J354333o618201m746046M869936Q409079K526936l071434k712169
12469C175911p28567p63215p72425K21817l07929k630718l639041k284169m43910
$$ plain form
12460 -8172246 -6904584 -3751484 -664548 -1329063 -5763948 -8757679 -6458343 -1596656
12452 -1596656 375086 -2263708 -6966324 -10164208 -9274197 -4301127 823873 1230002
12444 1230002 -3194441 -7869367 -9873487 -10366369 -10040775 -7373710 -3352448 -2525049 -6206167
12435 -6206167 -9483310 -8438220 -5601664 -4444490 -3458838 -435224 2170303 1724435
12427 1724435 922167 2560868 2896900 -2366342 -8685809 -7854013 -986555 2567418 -766206
12418 -766206 -4755081 -4615353 -3412798 -4219405 -4147086 -882496 1682568 -187064 -3628325
12409 -3628325 -4712334 -5407193 -8690668 -11009276 -7108383 171885 2688473 -1274697
12401 -1274697 -5385405 -5544400 -4594722 -5340423 -5755519 -4036066 -2507638 -2754363 -1875893
$$ packed form
12460h172246J267662L153100L086936o64515m434885k993731K299336M861687
12452a596656J971742k638794m702616l197884Q90011M973070N125000M06129
12444A230002m424443m674926k004120m92882L25594K667065M021262Q27399l681118
12435f206167l277143J045090K836556J157174R85652L023614K605527m45868
12427A724435q02268J638701L36032n263242o319467Q31796O867458L553973l333624
12418g66206l988875J39728J202555q06607P2319L264590K565064j869632l441261
12409c628325j084009o94859l283475k318608L900893P280268K516588l963170
12401a274697m110708j58995R49678p45701m15096J719453J528428k46725Q78470
$$ plain form
12392 -1875893 2055319 5133583 3288608 -642916 -1236054 632340 -335043 -4196004
12384 -4196004 -4905361 61933 5485144 5901466 2114049 -2203185 -5417798 -6470199
12376 -6470199 -3427886 2388743 5016885 1253678 -4160056 -5690300 -5453030 -8099248
12368 -8099248 -10742815 -6648814 2231107 6020113 1647515 -2519092 -283649 3095169
12360 3095169 1089491 -2509272 -586728 3977537 1709964 -8578845 -17217674 -16473095
12352 -16473095 -8840180 -1475456 1522328 -197899 -4730357 -7969292 -6546360 -2633672
12344 -2633672 -2141288 -6769102 -11605342 -11869607 -8172062 -3855264 -1212446 -1630341 -4957078
12335 -4957078 -7089472 -3177592 4511536 7371793 2336499 -2799329 -738540 4206299
$$ packed form
12392a875893L931212L078264j844975l931524n93138J868394r67383l860961
12384d196004p09357M967294N423211M16322l787417m317234l214613j052401
12376f470199L042313N816629K628142l763207n413734j530244K37270k646218
12368h099248k643567M094001Q879921L789006m372598m166607K235443L378818
12360C095169k005678l598763J922544M564265k267573j0288809q638829P44579
12352a6473095P632915P364724K997784j720227m532458l238935J422932L912688
12344b633672M92384m627814m836240k64265L697545M316798K642818m17895l326737
12335d957078k132394L911880P689128K860257n035294n135828K060789M944839
$$ plain form
12327 4206299 3252989 -2662337 -4367955 1225302 6918963 6650717 3681829 4131790 7845040
12318 7845040 9917568 8107285 4800272 3052382 3598377 5358666 7136990 8633776
12310 8633776 10005426 10308801 7621642 2304759 -1252370 865831 6332855 8664912
12302 8664912 5321422 368822 -1642750 -970010 -421072 -1062372 -2346512 -4138088 -6446023
12293 -6446023 -8826274 -11584165 -15600617 -19414396 -18858061 -12079311 -3399971 383467
12285 383467 -2992310 -9560873 -13716513 -13156614 -9997385 -8153435 -9158543 -10313846
12277 -10313846 -8101475 -3265584 -217612 -999005 -2693350 -1995092 554949 2530676
12269 2530676 2940953 1684717 -1277167 -3935496 -2807293 1422216 2326630 -3938012
$$ packed form
12327D206299r53310n915326j705618N593257N693661k68246k968888M49961L713250
12318G845040K072528j810283l307013j747890N45995J760289J778324J496786
12310H633776J371650L03375k687159n316883l557129K118201N467024K332057
12302H664912l343490m952600k011572O72740N48938o41300j284140j791576k307935
12293f446023k380251k757891m016452l813779N56335O778750Q679340L783438
12285C83467l375777o568563m155640N59899L159229J843950j005108j155303
12277a0313846K212371M835891L047972p81393j694345O98258K550041J975727
12269B530676M10277j256236k961884k658329J128203M229509R04414o264642
$$ plain form
12261 -3938012 -11663928 -12161512 -5435088 287716 -192838 -3973303 -6280135 -6143801 -4715425
12252 -4715425 -2867459 -2142728 -3999426 -6661342 -6551455 -3944271 -2963646 -4809520 -5891614
12243 -5891614 -4597283 -4653147 -8685201 -13303740 -14409143 -12972524 -11287528 -7923634
12235 -7923634 -1853017 2201282 -770246 -7459107 -9961311 -7091284 -5040381 -6608902
12227 -6608902 -6867313 -1462829 6866333 13041892 16031560 17176491 16142201 12325726
12219 12325726 7695007 4867872 3968849 3584376 2914282 1220064 -2272091 -5812539
12211 -5812539 -5412417 -480796 3673183 2433830 -1618470 -3000112 -1954406 -3463963
12203 -3463963 -8390114 -11426789 -9154105 -5109681 -4266654 -6299896 -7608586 -7287457
$$ packed form
12261c938012p725916m97584O726424N722804m80554l780465k306832J36334J428376
12252d715425J847966P24731j856698k661916J09887K607184R80625j845874j082094
12243e891614J294331n5864m032054m618539j105403J436619J684996L363894
12235g923634O070617M054299k971528o688861k502204K870027K050903j568521
12227f608902k58411N404484Q329162O175559K989668J144931j034290l816475
12219A2325726m630719k827135q99023l84473o70094j694218l492155l540448
12211e812539M00122M931621M153979j239353m052300j381642J045706j509557
12203c463963m926151l036675K272684M044424Q43027k033242j308690L21129
$$ plain form
12195 -7287457 -7208543 -7468191 -5824694 -2149103 -95444 -2435451 -6673844 -7827830 -4980982
12186 -4980982 -2348455 -3163492 -5353533 -5600331 -5375305 -8848115 -15412893 -19088637 -16525215
12177 -16525215 -11050648 -6640522 -2686180 1743439 3389164 67605 -3495726 -1969904
12169 -1969904 1306629 -545421 -5259039 -3630731 4977737 10002592 6068005 1616759
12161 1616759 4827092 10214921 8274890 1315376 -1114704 1908843 2921831 173542
12153 173542 -198016 3373496 4345219 -283535 -4618148 -4218740 -2964731 -4310545 -3656201
12144 -3656201 3537929 11972830 12730100 5853999 -466077 -1274955 1033629 2758353
12136 2758353 2907724 1261633 -2267722 -5577021 -5739659 -3218566 -1571741 -2605196
$$ packed form
12195g287457P8914k59648J643497L675591K053659k340007m238393j153986K846848
12186d980982K632527q15037k190041k46798K25026l472810o564778l675744K563422
12177a6525215N474567M410126L954342M429619J645725l321559l563331J525822
12169a969904L276533j852050m713618J628308Q608468N024855l934587m451246
12161A616759L210333N387829j940031o959514k430080L023547J012988k748289
12153A73542l71558L571512R71723m628754m334613L99408J254009j345814O54344
12144c656201P194130Q434901P57270o876101o320076q08878K308584J724724
12136B758353J49371j646091l529355l309299j62638K521093J646825j033455
$$ plain form
12128 -2605196 -4720925 -6241789 -7425024 -8693704 -9405777 -9037813 -7902513 -6722797
12120 -6722797 -6933163 -10318139 -15988577 -18874492 -14569129 -5405518 1606533 3054849
12112 3054849 2019922 2238224 3055106 1842282 -1547569 -5083123 -7458430 -8513803
12104 -8513803 -7908950 -5355374 -1727226 1466277 3596703 5125800 6501052 7354715
12096 7354715 6729807 4111148 510681 -1919056 -2219956 -2222439 -4453920 -8269883 -9498956
12087 -9498956 -4984512 3033217 8158840 6040111 -851526 -5477598 -3836087 676820
12079 676820 1904625 -1189247 -4152117 -4310053 -4302142 -6736159 -9467204 -9580470 -8711833
12070 -8711833 -9805368 -10864607 -7428711 -461449 3940626 3299415 1776040 2778524
$$ packed form
12128b605196k115729j520864j183235j268680p12073L67964J135300J179716
12120f722797k10366l384976n670438k885915M305363R163611P012051J448316
12112C054849j034927K18302Q16882j212824l389851l535554k375307j055373
12104h513803O04853K553576L628148L193503K130426J529097J375252Q53663
12096G354715o24908k618659l600467k429737l00900k483k231481l815963j229073
12087i498956M514444Q017729N125623k118729o891637m626072J641511M512907
12079F76820J227805l093872k962870j57936P911k434017k731045j13266Q68637
12070h711833j093535j059239L435896O967262M402075o41211j523375J002484
$$ plain form
12062 2778524 3730038 1270046 -2587180 -3723449 -2711982 -3773266 -7851255 -10891583
12054 -10891583 -9598458 -5792667 -3589612 -4132322 -4933416 -3725124 -1124465 913403
12046 913403 1700867 1486505 -295909 -3930707 -6789823 -5105853 463230 4413482 3752010
12037 3752010 2372502 4697509 8198125 7154196 1654872 -3000274 -4928135 -7359123
12029 -7359123 -11319639 -13003851 -10254197 -5947201 -2477775 1738549 7158653 9705936
12021 9705936 6699348 2064485 988230 2497650 2034638 -969900 -2852580 -1621023
12013 -1621023 1201508 3838774 5687561 6039653 4592535 2863151 2448650 2420646 855853
12004 855853 -1674448 -2493509 -417011 2667254 3467797 -8443 -5963141 -8824741 -4677181
$$ packed form
12062B778524R51514k459992l857226j136269J011467j061284m077989l040328
12054a0891583J293125L805791K203055n42710q01094J208292K600659K037868
12046I13403P87464k14362j782414l634798k859116J683970N569083L950252o61472
12037C752010j379508K325007L500616j043929n499324m655146j927861k430988
12029g359123l960516j684212K749654M306996L469426M216324N420104K547283
12021I705936l006588m634863j076255J509420m63012l004538j882680J231557
12013a621023K822531K637266J848787L52092j447118j729384m14501k8004j564793
12004H55853k530301q19061K076498L084265Q00543l476240n954698k861600M147560
$$ plain form
11995 -4677181 2544825 4248726 -1640846 -7274602 -5570981 664692 4689589 5843827
11987 5843827 7218598 7230305 1733926 -6685475 -9542643 -3667663 4471750 7004732
11979 7004732 2513120 -4903893 -9779383 -8234961 -1611832 2606689 -1530368 -9670166
11971 -9670166 -11493462 -4295898 3669464 4598615 -140086 -4648562 -6048035 -4638933
11963 -4638933 -1613183 347484 -1630914 -6206493 -8562629 -7127655 -4996824 -3562631
11955 -3562631 -794225 2310337 918757 -4404729 -5277326 2221750 9809432 8357049
11947 8357049 788389 -4420976 -7142902 -12978901 -20014322 -19373111 -9254434 1357676
11939 1357676 5127319 4485630 4586347 5278402 4064474 1776332 973528 1792440 2570593
$$ packed form
11995d677181P222006J703901n889572n633756J703621O235673M024897J154238
11987E843827J374771J1707n496379q419401k857168N874980Q139413K532982
11979G004732m491612p417013m875490J544422O623129M218521m137057q139798
11971i670166j823296P197564P965362R29151m738701m508476j399473J409102
11963d638933L025750J960667j978398m575579k356136J434974K130831J434193
11955c562631K768406L104562j391580n323486q72597P499076P587682j452383
11947H357049p568660n209365k721926n835999p035421O41211J0118677J0612110
11939A357676L769643o41689J00717O92055j213928k288142q02804Q18912P78153
$$ plain form
11930 2570593 2394240 980964 -1844510 -5054253 -6732153 -6410374 -5330534 -4342605 -3740433
11921 -3740433 -4585711 -7124665 -8497758 -5817696 -1193911 635061 -318122 789854
11913 789854 5570813 9427822 8319308 3705339 -1270114 -5774682 -8991309 -8571810
11905 -8571810 -4604576 -953502 666948 3708011 10017996 14376884 11032857 2677365
11897 2677365 -2690462 -2105993 374658 867659 -350324 -1829726 -3299794 -4591491
11889 -4591491 -5774945 -8358345 -12899046 -15824976 -12804250 -5544277 -872163 -1884799
11881 -1884799 -4101082 -2355181 2174243 4737454 4138630 3413296 4310852 4596182 1772584
11872 1772584 -2664391 -4602656 -2596264 30586 -505728 -3153331 -3284753 644464
$$ packed form
11930B570593j76353j413276k825474l209743j677900L21779J079840R87929O02172
11921c740433q45278k538954j373093K680062M623785J828972r53183J107976
11913G89854M780959L857009j108514m613969m975453m504568l216627M19499
11905h571810L967234L651074J620450L041063O309985M358888l344027q355492
11897B677365n367827N84469K480651M93001j217983j479402j470068j291697
11889d591491j183454k583400m540701k925930L020726P259973M672114j012636
11881a884799k216283J745901M529424K563211n98824p25334Q97556K85330k823598
11872A772584m436975j938265K006392K626850n36314k647603j31422L929217
$$ plain form
11864 644464 4321637 2929203 -2754538 -7615366 -8136259 -5065713 -1462081 -284068
11856 -284068 -2852006 -7352130 -9585389 -7273924 -2773119 406738 2268632 4855376
11848 4855376 7587230 7587159 4086116 -737201 -4827941 -7065567 -6003181 -1781041 1366435
11839 1366435 -772250 -5683065 -6554916 -2076335 1679229 754537 -1173976 141261
11831 141261 2460372 1653645 -957925 -1307464 135781 -768896 -5154170 -10117131 -13415272
11822 -13415272 -14914330 -14266245 -11483970 -9249068 -10242464 -12310059 -10733472 -5760950
11814 -5760950 -3420869 -7418788 -13982584 -16721378 -13748755 -8015005 -2885789 385860
11806 385860 2032291 2447254 1410456 -1535852 -5471158 -7794077 -7116837 -5434849 -5106492
$$ packed form
11864F44464L677173j392434n683741m860828n20893L070546L603632J178013
11856b84068k567938m500124k233259K311465M500805L179857J861894K586744
11848D855376K731854p1l501043m823317m090740k237626J062386M222140L147476
11839A366435k138685m910815q71851M478581L755564r24692j928513J315237
11831A41261K319111q06727k611570l49539J443245r04677m385274m962961l298141
11822a3415272j499058O48085K782275K234902r93396k067595J576587M972522
11814e760950K340081l997919o563796k738794K972623N733750N129216L271649
11806C85860J646431M14963j036798k946308l935306k322919O77240J681988L28357
$$ plain form
11797 -5106492 -4786918 -1681052 2824460 4022287 793627 -2741914 -3726235 -4238202 -6391134
11788 -6391134 -8206280 -7442171 -5470171 -3560511 738519 8477707 13819603 10161543
11780 10161543 398771 -5611220 -4031516 -953835 -1886864 -4005129 -2481329 963850
11772 963850 1187748 -1928388 -3685357 -1846472 1162712 2889499 3256699 2102922 -1461246
11763 -1461246 -6096165 -8233145 -6774361 -4916818 -5361849 -6292719 -4593775 -1070224
11755 -1070224 566765 -979133 -3150361 -3333232 -1662384 331344 1729060 1985053
11747 1985053 321451 -3265244 -7066649 -8882294 -8237268 -6921792 -7139006 -9034580
11739 -9034580 -10114286 -7611909 -1773239 3774312 5533689 3545565 653720 -918173
$$ packed form
11797e106492L19574L105866M505512J197827l228660l535541r84321n11967k152932
11788f391134j815146P64109J972000J909660M299030P739188N341896l658060
11780A0161543r762772o009991J579704L077681r33029k118265J523800L445179
11772I63850K23898l116136j756969J838885L009184J726787L67200j153777l564168
11763a461246m634919k136980J458784J857543m45031r30870J698944L523551
11755a070224J636989j545898k171228j82871J670848J993728J397716K55993
11747A985053j663602l586695l801405j815645O45026J315476k17214j895574
11739i034580j079706K502377N838670N547551J759377j988124k891845j571893
$$ plain form
11731 -918173 -1110697 -622220 447605 2128673 3745170 4162198 2680926 -239263 -2978806
11722 -2978806 -4071992 -3991710 -4787407 -7233535 -9426706 -9268406 -7063961 -4270568 -1313427
11713 -1313427 1206892 928786 -3290523 -7823947 -7654649 -3217472 79828 -583946 -2743188
11704 -2743188 -4337490 -7070720 -11806931 -15308371 -14934588 -12707528 -11050646 -8267428
11696 -8267428 -2722678 1890941 1033560 -3102910 -4299276 -1401973 1105305 1083683 1089421
11687 1089421 2085973 1014616 -3138758 -6101972 -4287261 -58051 2212125 2225353 2586930
11678 2586930 3907993 4484386 3581621 2185075 1078804 255431 -150662 192240 1134431
11669 1134431 1881689 1038912 -2805190 -8944866 -13409486 -12495810 -7558811 -3324143 -1146177
$$ packed form
11731i18173j92524M88477J069825J681068J616497M17028j481272k920189k739543
11722b978806j093186Q0282p95697k446128k193171J58300K204445K793393K957141
11713a313427K520319k78106m219309m533424J69298M437177L297300o63774k159242
11704b743188j594302k733230m736211l501440L73783K227060J656882K783218
11696h267428N544750M613619q57381m136470j196366K897303K507278k1622N738
11687A089421R96552j071357m153374k963214J814711M229210K270176J3228L61577
11678B586930J321063N76393r02765j396546j106271q23373m06093L42902R42191
11669A134431P47258q42777l844102o139676m464620R13676M936999M234668K177966
$$ plain form
11660 -1146177 2158324 7592733 10813832 8733996 5182118 5564075 8810328 9706484
11652 9706484 7324139 5387195 4739770 1593510 -5171041 -10432469 -9978322 -7455810
11644 -7455810 -9700007 -16611582 -20009972 -13222089 1023485 13617132 18275677 16140382
11636 16140382 12150752 9112908 6232892 2136742 -2486471 -5381383 -4729228 -473013
11628 -473013 5291338 9074292 8537257 4975621 2128872 1864493 2408202 1733572 860883
11619 860883 1819052 3646573 3169395 -351399 -3861606 -4433450 -2565067 -695146 -115374
11610 -115374 -462121 -836345 -108350 2658295 6492640 8219215 5829072 1572031 -524888
11601 -524888 15194 -5213 -1849535 -2544293 -127342 2149775 568729 -2432739 -1409690
$$ packed form
11660a146177L304501N434409L221099k079836l551878L81957L246253Q96156
11652I706484k382345j936944o47425l146260o764551n261428M54147K522512
11644g455810k244197o911575l398390O787883J4245574J2593647M658545k135295
11636A6140382l989630l037844k880016m096150m623213k894912O52155M256215
11628d73013N764351L782954n37035l561636k846749k64379N43709o74630q72689
11619H60883R58169J827521m77178l520794l510207n71844J868383J869921N79772
11610a15374l46747l74224P27995K766645L834345J726575k390143m257041k096919
11601e24888N40082k0407j844322o94758K416951K277117j581046l001468J023049
$$ plain form
11592 -1409690 3106373 4617237 749232 -2766915 -1495811 -135726 -5363092 -14478822
11584 -14478822 -18111412 -13191955 -6518048 -4448016 -4995778 -2854534 2135316 5359198
11576 5359198 4329226 1985845 2962612 7680094 10757225 6472437 -3613758 -10892445
11568 -10892445 -9744084 -4518057 -2727184 -4336475 -3923240 -1499851 -2865929 -8511464
11560 -8511464 -11035648 -6981071 -3081985 -5381804 -9209516 -7034607 -849382 1438356
11552 1438356 -1541512 -4316258 -5087173 -8014598 -14392892 -18865071 -16615384 -9279653
11544 -9279653 -1967639 1615901 244337 -4465938 -7884651 -6503098 -2872567 -2371499
11536 -2371499 -4799459 -4349373 814986 4679478 2131605 -3245884 -4468111 -1002847
$$ packed form
11592a409690M516063J510864l868005l516147J271104J360085n227366r115730
11584a4478822l632590M919457O673907K070032n47762K141244M989850L223882
11576E359198j029972k343381R76767M717482L077131m284788j0086195p278687
11568a0892445J148361N226027J790873j609291M13235K423389j366078n645535
11560h511464k524184M054577L899086k299819l827712K174909O185225K287738
11552A438356k979868k774746p70915k927425o378294m472179K249687P335731
11544i279653P312014L583540j371564m710275l418713J381553L630531N01068
11536b371499k427960M50086N164359L864492k547873n377489j222227L465264
$$ plain form
11528 -1002847 1413101 -659387 -4290305 -4754188 -1162711 3218168 4750350 3044079
11520 3044079 1319203 2902115 7182173 9963032 8120409 2716433 -2772306 -5638881
11512 -5638881 -4823772 -862108 3437627 4070644 -37701 -4727254 -4706530 41218 3949360
11503 3949360 2478002 -2743934 -6471740 -5941215 -2381726 2516611 8216486 12578064
11495 12578064 11391665 4067824 -2825360 -2562578 2304282 3088211 -2383846 -6833578
11487 -6833578 -5109325 -1496469 -1158934 -1160158 3130441 8064307 6868876 1622189 630072
11478 630072 4919741 6913797 3292895 -247415 421633 1263038 -2053089 -7320542 -11305694
11469 -11305694 -14928545 -17767933 -14456227 -3434057 6445372 6069678 -1027305 -3956475
$$ packed form
11528a002847K415948k072488l630918m63883L591477M380879J532182j706271
11520C044079j724876J582912M280058K780859j842623n403976n488739k866575
11512e638881Q15109L961664M299735O33017m108345m689553K0724M747748L908142
11503C949360j471358n221936l727806N30525L559489M898337N699875M361578
11495A2578064j186399p323841o893184K62782M866860P83929n472057m449732
11487f833578J724253L612856L37535j224M290599M933866j195431n246687r92117
11478F30072M289669J994056l620902l540310O69048Q41405l316127n267453l985152
11469a1305694l622851k839388L311706J1022170R879429l75694p096983k929170
$$ plain form
11461 -3956475 -45973 3177373 501643 -4680202 -7380335 -7254625 -5948637 -3820598
11453 -3820598 -1482455 -287650 429806 2805694 5924134 5817483 1413870 -3295946
11445 -3295946 -4550575 -2654036 861392 5764826 10587748 11554592 7337380 1985467
11437 1985467 -210664 -429203 -2377383 -5465736 -5040799 748311 7688492 10019493
11429 10019493 6395604 700825 -2048973 -331850 2846306 3609720 1642792 -336447
11421 -336447 -1374646 -3717744 -7954455 -9770515 -4997615 3741087 9521069 9970087
11413 9970087 9509453 11902126 14668843 13374856 8408472 4036563 2243208 1054005
11405 1054005 -1256306 -3481413 -3786749 -2323092 -379435 1393685 2782676 3445007
$$ packed form
11461c956475L910502L223346k675730n181845k700133J25710J305988K128039
11453c820598K338143J194805P17456K375888L118440j06651m403613m709816
11445c295946j254629J896539L515428M903434M822922R66844m217212n351913
11437A985467k196131k18539j948180l088353M24937N789110O940181K331001
11429A0019493l623889n694779k749798J717123L178156P63414j966928j979239
11421c36447j038199k343098m236711j816060M772900Q738702N779982M49018
11413I970087m60634K392673K766717j293987m966384m371909j793355j189203
11405A054005k310311k225107l05336J463657J943657J773120J388991O62331
$$ plain form
11397 3445007 3731874 4787385 6472388 6456397 3207197 -1061996 -2704669 -1524163 -860304
11388 -860304 -2625641 -5005353 -6110041 -7110470 -9555600 -11729247 -10778331 -7567239
11380 -7567239 -6200558 -8430102 -11165962 -10422693 -5842579 -454101 2507341 1802135
11372 1802135 -1328931 -4109769 -4733008 -4096466 -3732253 -2636968 1010565 5019454 4179132
11363 4179132 -2300209 -8442003 -9369881 -7423886 -6412261 -4016727 3606385 12213829
11355 12213829 12571761 3525188 -5606163 -7757831 -6353820 -7617944 -11126650 -12724922
11347 -12724922 -11644301 -9335868 -5290411 388804 3575223 1102999 -3401400 -4376087
11339 -4376087 -2601589 -2485714 -3274021 -262181 5928793 8743407 5214506 -405419
$$ packed form
11397C445007K86867J055511J685003j5991l249200m269193j642673J180506O63859
11388h60304j765337k379712j104688j000429k445130k173647R50916L211092
11380g567239J366681k229544k735860P43269M580114N388478K961442p05206
11372A802135l131066k780838o23239O36542L64213J095285L647533M008889q40322
11363D179132o479341o141794r27878J945995J011625K395534P623112Q607444
11355A2213829L57932r046573r131351k151668J404011j264124l508706j598272
11347a2724922J080621K308433M045457N679215L186419k472224m504399r74687
11339d376087J774498J15875p88307L011840O190974K814614l528901n619925
$$ plain form
11331 -405419 -3754635 -5038913 -5236314 -3754201 -1831475 -2438436 -4527045 -3155765 2053950
11322 2053950 4545118 340888 -5749672 -7654392 -6589213 -7143871 -9193736 -9243220 -6769418
11313 -6769418 -3998779 -1593878 792374 1637399 -374825 -2960484 -2822461 -284287
11305 -284287 1838521 2240233 1089299 -1697596 -5001223 -5852945 -3674106 -2585922 -5784210
11296 -5784210 -10113042 -10203510 -5803269 -1125771 895813 -100905 -3981839 -9384058 -12892010
11287 -12892010 -12647548 -10804443 -9524536 -7747207 -5054318 -4270047 -5893163 -4902700
11279 -4902700 1264486 6488785 4496820 -1031887 -2646531 -1026228 -1720958 -3759738
11271 -3759738 -1820869 2606965 3095100 128848 70405 2712961 1415115 -3865437 -5882299
$$ packed form
11331d05419l349216j284278j97401J482113J922726o06961k088609J371280N209715
11322B053950K491168m204230o090560j904720J065179n54658k049865m9484K473802
11313f769418K770639K404901K386252Q45025k012224k585659J38023K538174
11305b84287K122808M01712j150934k786895l303627q51722K178839J088184l198288
11296e784210m328832r0468M400241M677498K021584r96718l880934n402219l507952
11287a2892010K44462J843105J279907J777329K692889P84271j623116R90463
11279d902700O167186N224299j991965n528707j614644J620303o94730k038780
11271c759738J938869M427834M88135k966252n8443K642556j297846n280552k016862
$$ plain form
11262 -5882299 -4057109 -6067218 -12045588 -10959781 811131 10237567 6206269 -3399194
11254 -3399194 -4009880 4516904 10749022 9884200 7196949 6178914 4205503 -270024
11246 -270024 -4774646 -7560947 -8952311 -7987739 -3108100 3978355 9406352 11421274
11238 11421274 10245285 5814505 -540569 -4662139 -4081748 -1731925 -1311791 -1856990
11230 -1856990 -1056769 -441709 -2099617 -3454117 -1138974 2532510 2926894 676733 -97853
11221 -97853 971475 1362931 1781553 4371111 6086773 1549279 -7347125 -12149334 -9447591
11212 -9447591 -4928421 -3855415 -3963399 -963979 4229740 7645571 7886325 6074982
11204 6074982 2902715 -1081182 -4160704 -5171334 -5252258 -5765687 -5542781 -2246927 3844369
$$ packed form
11262e882299J825190k010109n978370J085807J1770912R426436m031298r605463
11254c399194o10686Q526784O232118q64822k687251j018035j973411m475527
11246b70024m504622k786301j391364R64572M879639P086455N427997K014922
11238A1421274j175989m430780o355074m121570N80391K349823M20134n45199
11230a856990Q00221O15060j657908j354500K315143L671484L94384k250161p74586
11221i7853J069328L91456M18622K589558J715662m537494q896404m802209K701743
11212i447591M519170J073006j07984K999420N193719L415831K40754j811343
11204F074982l172267l983897l079522j010630q0924n13429K22906L295854O091296
$$ plain form
11195 3844369 8987609 9464766 5648590 2025778 2426981 5476099 6338291 3240484 -84599
11186 -84599 254598 2930836 3674633 1199567 -1784030 -2526558 -919898 1160666 1458256
11177 1458256 -953386 -4197373 -4972793 -2617053 -191927 -201663 -1269662 -886937 503741
11168 503741 359614 -2303055 -5621586 -6166787 -1426374 6476933 9981695 3693866 -6562746
11159 -6562746 -8509253 342005 8178609 5208401 -2586068 -3259876 3263505 6641476
11151 6641476 2418696 -3121471 -4261192 -2970961 -2924148 -3680480 -3513514 -2695204 -1666455
11142 -1666455 8640 1646480 2236584 3423040 7073708 9820149 5766862 -4120547
11134 -4120547 -11104301 -9550378 -3732185 -903065 -2073866 -3377292 -3215440 -3726281
$$ packed form
11195C844369N143240M77157l816176l622812M01203L049118Q62192l097807l325083
11186h4599L39197K676238P43797k475066k983597p42528J606660K080564K97590
11177A458256k411642l243987p75420K355740K425126r736j067999L82725J390678
11168E03741j44127k662669l318531n45201M740413P903307L504762o287829j0256612
11159f562746j946507Q851258P836604k970208p794469o73808O523381L377971
11151F641476m222780n540167j139721J290231M6813p56332J66966Q18310J028749
11142a666455J675095J637840N90104J186456L650668K746441m053287r887409
11134d120547o983754J553923N818193K829120j170801j303426J61852n10841
$$ plain form
11126 -3726281 -6432126 -9674773 -10298807 -6530667 193658 5596926 5943104 1797946
11118 1797946 -2623561 -4244400 -4025719 -4689792 -6802121 -7926824 -5393887 281103
11110 281103 5089762 5618581 3220860 2219136 3837182 4708998 2352506 -1045376 -2084913
11101 -2084913 -438190 2324605 5216710 6980944 5832477 2364138 -308369 -1159611
11093 -1159611 -2298015 -3861936 -3119103 -939113 -2557831 -8132905 -9963265 -4621739
11085 -4621739 28796 -2509015 -5614134 -579220 7394189 6714900 -1552182 -5748002
11077 -5748002 -2630258 -506161 -3431330 -5918206 -5165567 -5526963 -7699193 -5871893
11069 -5871893 242123 2498559 -1499885 -2996552 2811208 7527609 3562497 -2588843
$$ packed form
11126c726281k705845l242647o24034L768140O724325N403268L46178m145158
11118A797946m421507j620839K18681o64073k112329j124703K532937N674990
11110B81103M808659N28819k397721j001724J618046Q71816k356492l397882j039537
11101b084913J646723K762795K892105J764234j148467l468339k672507q51242
11093a159611j138404j563921P42833K179990j618718n575074j830360N341526
11085d621739M650535k537811l105119N034914P973409o79289q267082m195820
11077e748002L117744K124097k925169k486876P52639l61396k172230J827300
11069e871893O114016K256436l998444j496667N807760M716401l965112o151340
$$ plain form
11061 -2588843 -835600 6411524 8953966 4433520 -471740 -1230670 597767 2466738
11053 2466738 2928452 476205 -3977094 -5698560 -2356421 1142619 -659036 -5148158
11045 -5148158 -5528537 -1072800 2470591 1495016 -1814349 -4000536 -4125464 -3098532 -2301142
11036 -2301142 -2567873 -2719562 -550099 3260817 4772646 2203028 -1230039 -2073152 -1146985
11027 -1146985 -979366 -1969421 -3515926 -5645332 -7154558 -5681710 -1973282 -220427
11019 -220427 -1772127 -2835110 -1054455 414852 -1393205 -4343070 -5552556 -5852770
11011 -5852770 -6315772 -5569184 -4406635 -7023885 -12826939 -13591063 -5260579 3597272 2979751
11002 2979751 -4186042 -7609178 -5077813 -2484527 -1639506 1048461 4849578 4545184
$$ packed form
11061b588843J753243P247124K542442m520446m905260p58930J828437J868971
11053B466738M61714k452247m453299j721466L342139L499040j801655m489122
11045e148158l80379M455737L543391r75575l309365k186187j24928J026932P97390
11036b301142k66731j51689K169463L810916J511829k569618l433067q43113R26167
11027a146985J67619r90055j546505k129406j509226J472848L708428J752855
11019b20427j551700j062983J780655J469307j808057k949865j209486l00214
11011e852770m63002P46588J162549k617250n803054p64124Q330484Q857851o17521
11002B979751p165793l423136K531365K593286Q45021K687967L801117l04394
$$ plain form
10994 4545184 653194 -460830 1517117 -909454 -9403700 -14323827 -8877670 -613247
10986 -613247 -964029 -8781686 -12759538 -7537463 804288 4967881 4762934 3404321 1457717
10977 1457717 -1825942 -4698716 -4573133 -2026358 236193 1517227 2811057 2897402 -933701
10968 -933701 -7400285 -11056998 -9948566 -8986653 -11912492 -14054976 -8736398 1794415
10960 1794415 8318585 6473217 412456 -4823825 -8107869 -9190352 -7596536 -5776569
10952 -5776569 -7191703 -10031119 -9129425 -5267240 -5203693 -10195269 -12282158 -5937603 3543554
10943 3543554 7977932 6618890 3823485 1901327 1131795 2032225 3117905 1039052
10935 1039052 -3219345 -3541124 2079809 7368350 7006254 3669615 1261462 -1680334
$$ packed form
10994D545184l891990j114024J977947k426571q494246m920127N446157Q264423
10986f13247l50782p817657l977852N222075Q341751M163593k04947j358613j946604
10977A457717l283659k872774J25583K546775K262551J281034J293830Q6345l831103
10968i33701o466584l656713J108432R61913k925839k142484N318578J0530813
10960A794415O524170j845368o060761n236281l284044j082483J593816J819967
10952e776569j415134k839416R01694L862185O3547m991576k086889O344555R481157
10943C543554M434378j359042k795405j922158p69532R00430J085680k078853
10935A039052m258397l21779N620933N288541l62096l336639k408153k941796
$$ plain form
10927 -1680334 -5962367 -6457069 -178460 6760003 7942016 6311275 7022371 7091483 1833926
10918 1833926 -3890069 -1823958 5897304 9961822 8548765 8232564 11535410 13734937
10910 13734937 11942723 8414450 4787460 933306 -1040502 628815 1882112 -2102525
10902 -2102525 -7770147 -7619441 -2494176 -311374 -3162288 -5104695 -3082074 -1007959
10894 -1007959 -2112737 -5278177 -9278014 -12911862 -11778907 -3743267 3540062 773777
10886 773777 -7985053 -9935440 -3313680 407462 -3763794 -6358207 -461655 6287867
10878 6287867 4680836 -1692093 -4183785 -3065065 -4367723 -8412238 -10078562 -7014342
10870 -7014342 -1131578 4880757 7811523 4709262 -2343131 -6605117 -5474995 -3739192
$$ packed form
10927a680334m282033m94702O278609O938463J182013j630741P11096O9112n257557
10918A833926n723995K066111P721262M064518j413057l16201L302846K199527
10910A3734937j792214l528273l626990l854154j973808J669317J253297l984637
10902b102525n667622J50706N125265K182802k850914j942407K022621K074115
10894a007959j104778l165440l999837l633848J132955Q035640P283329k766285
10886G73777q758830j950387O621760L721142m171256k594413N896552O749522
10878F287867j607031o372929k491692J118720j302658m044515j666324L064220
10870g014342N882764O012335K930766l102261p052393m261986J130122J735803
$$ plain form
10862 -3739192 -4675402 -4611043 -982523 1439011 -1247657 -4258660 -2097021 1245567 -1456091
10853 -1456091 -8363474 -11402077 -8800660 -6123818 -5991475 -5084592 -1734412 805932
10845 805932 252153 -1127863 -628548 1289692 2920279 3576421 2852891 344585 -2827688
10836 -2827688 -4165771 -2445034 709897 2315238 1001024 -1146906 -317909 4084588
10828 4084588 7379134 5264731 399428 -970870 1636753 2729402 604734 432995
10820 432995 4947850 8968923 7715895 4561412 4884709 7247203 6983206 4454015 3004159
10811 3004159 2035073 -754739 -2817651 -193148 3867967 1786857 -6522908 -12259603
10803 -12259603 -9755083 -3253791 634960 1226851 1277655 1317479 576890 56876 671314
$$ packed form
10862c739192r36210O4359L628520K421534k686668l011003K161639L342588k701658
10853a456091o907383l038603K601417K676842J32343R06883L350180K540344
10845H05932n53779j380016M99315J918240J630587O56142p23530k508306l172273
10836b827688j338083J720737L154931J605341j314214k147930Q28997M402497
10828D084588L294546k114403m865303j370298K607623J092649k124668j71739
10820D32995M514855M021073j253028l154483L23297K362494k63997k529191j449856
10811C004159r69086k789812k062912K624503M061115k081110q309765n736695
10803a2259603K504520O501292L888751N91891N0804L9824p40589n20014O14438
$$ plain form
10794 671314 726513 -1198384 -2879791 -1614405 731576 -121972 -4068411 -6045214 -3173201
10785 -3173201 1107734 2082536 190920 -540016 1173495 2705039 2383952 1829224 2383776
10776 2383776 2497544 711462 -1314604 -1323975 -84459 335304 401666 1982982 4136298
10767 4136298 3372003 -1651684 -8284845 -13034837 -14440674 -12724223 -8754926 -3867071
10759 -3867071 680424 4172898 5637394 3740971 -1000281 -5242548 -6038018 -4018353
10751 -4018353 -1807185 -967909 -2269052 -6466517 -12155797 -15338860 -14229067 -11980728
10743 -11980728 -11516400 -10989290 -8344160 -6228965 -6692946 -5126307 2897965 11853979
10735 11853979 12409847 5761347 1943356 3967527 4444502 80197 -1572449 5053895
$$ packed form
10794F71314N5199j924897j681407J265386K345981q53548l946439j976803K872013
10785c173201M280935R74802j891616p30936J713511J531544l21087n54728N54552
10776B383776J13768j786082k026066r371J239516M19763O6362J581316K153316
10767D136298p64295n023687o633161m749992j405837J716451L969297M887855
10759c867071M547495L492474J464496j896423m741252m242267p95470K019665
10751d018353K211168Q39276j301143m197465n689280l183063J109793K248339
10743a1980728M64328N27110K645130K115195m63981J566639Q024272Q956014
10735A1853979N55868o648500l817991K024171M76975m364305j652646O626344
$$ plain form
10727 5053895 13278233 13555093 6311215 -1346717 -6329663 -10127499 -12609053 -11924856
10719 -11924856 -8647346 -5159265 -2511105 -1061788 -1686161 -3461136 -3296447 -867422
10711 -867422 -576912 -5482923 -12521702 -16689919 -16603780 -13319430 -7745642 -2316924 -925744
10702 -925744 -3588455 -5290183 -3694294 -3359241 -7920859 -12774410 -11162653 -4050695
10694 -4050695 1794539 2974669 1354721 -915607 -2915288 -3129825 -1048259 670584
10686 670584 -128433 -848105 2129339 7019555 8443990 4639810 -1174307 -5588544 -7273028
10677 -7273028 -5596031 -1181167 2528740 1936132 -2401456 -6683277 -8501814 -8206147
10669 -8206147 -6698207 -4567825 -2787510 -2082751 -2158747 -2732764 -3824800 -4113905 -1710444
$$ packed form
10727E053895Q224338K76860p243878p657932m982946l797836k481554O84197
10719a1924856L277510L488081K648160J449317o24373j774975J64689K429025
10711h67422K90510m906011p038779m168217Q6139L284350N573788N428718J391180
10702i25744k662711j701728J595889L35053m561618m853551J611757P111958
10694d050695N845234J180130j619948k270328j999681k14537K081566J718843
10686F70584p99017p19672K977444M890216J424435l804180n814117m414237j684484
10677g273028J676997M414864L709907n92608m337588m281821j818537K95667
10669h206147J507940K130382J780315P04759p5996n74017j092036k89105K403461
$$ plain form
10660 -1710444 1956957 2436227 -1269748 -4230846 -2818295 -729477 -3460543 -9651753
10652 -9651753 -12904807 -10538504 -5836154 -2569308 -1640463 -2743868 -5492259 -8747495
10644 -8747495 -11530739 -14179557 -16397194 -15572707 -10029746 -2727572 1623211 2404839
10636 2404839 2782372 4071745 4031718 1344782 -1276879 -127721 4737510 9191193 9327510
10627 9327510 5394843 897699 -2003861 -4467251 -7169501 -6962921 -886932 7551094
10619 7551094 10671729 5932350 -931612 -3170437 151853 5701025 10345787 12169058
10611 12169058 10327162 6183111 2457495 107770 -1643585 -1945253 1489842 7941409
10603 7941409 12947566 13194733 9204493 2921665 -3592993 -6926233 -4521864 847857
$$ packed form
10660a710444L667401M79270l705975k961098J412551K088818k731066o191210
10652i651753l253054K366303M702350L266846R28845j103405k748391l255236
10644h747495k783244k648818k217637Q24487N542961P302174M350783P81628
10636B404839L77533J289373m0027k686936k621661J149158M865231M453683J36317
10627I327510l932667m497144k901560k463390k702250K06580O075989Q438026
10619G551094L120635m739379o863962k238825L322290N549172M644762J823271
10611A2169058j841896m144051l725616k349725j751355l01668L435095O451567
10603G941409N006157K47167l990240o282828o514658l333240K404369N369721
$$ plain form
10595 847857 3315546 1636049 57588 674692 463684 -2223732 -3860916 -1645173 1144033
10586 1144033 -790811 -7881392 -15146248 -16871940 -11492090 -3887336 -1759466 -6755105
10578 -6755105 -11336515 -8495013 -1354892 2579173 2904626 4193070 5866600 4052302
10570 4052302 1290006 3374078 7559040 5679958 -937798 -2090596 4526091 9698088
10562 9698088 8123859 5086701 4881406 4901283 4416673 6825789 9891907 6543642 -1285649
10553 -1285649 -3182791 1901482 2981681 -3703581 -8584866 -7029529 -6787078 -10619929
10545 -10619929 -9382229 -1042577 1512803 -7615778 -15208527 -10863346 -4083522 -6011917
10537 -6011917 -10458672 -7878105 -2965832 -2854969 -2029397 5286199 11150989 7867109
$$ packed form
10595H47857K467689j679497j578461O17104k11008k687416j637184K215743K789206
10586A144033j934844p090581p264856j725692N379850P604754K127870m995639
10578f755105m581410K841502P140121L934065L25453J288444J673530j814298
10570D052302k762296K084072M184962j879082o617756j152798O616687N171997
10562I698088j574229l037158k05295J9877m84610K409116L066118l348265p829291
10553a285649j897142N084273J080199o685262m881285J555337K42451l832851
10545a0619929J237700Q339652K555380r128581p592749M345181O779824j928395
10537f011917m446755K580567M912273J10863Q25572P315596N864790l283880
$$ plain form
10529 7867109 2889733 4787437 7724759 4805209 2661028 7432086 10962949 6494594
10521 6494594 2422790 4686537 2934021 -8688589 -15907722 -8333384 744346 -1230381
10513 -1230381 -3335484 4797910 9384940 -1406149 -11368345 -4610802 4263908 -1012297
10505 -1012297 -5532977 6376253 15884144 4130234 -7304225 4806546 17092791
10498 17092791 2081301 -13841199 3452310 25376024 10392652 -9254599 17842047
10491 17842047 51653507 24556933 3387386 135342556 394622092 537939877 404377641
10484 404377641 136789287 -11257639 7766775 46497680 19161302 -13923376 -857817
10477 -857817 15785362 -2265797 -20353601 -6300148 11114694 3111069 -7592924
$$ packed form
10529G867109m977376J897704K937322k919550k144181M771058L530863m468355
10521F494594m071804K263747j752516j1622610p219133P574338R077730j974727
10513a230381k105103Q133394M587030j0791089r962196O757543Q874710n276205
10505a012297m520680J1909230R507891j1753910j1434459J2110771J2286245
10498A7092791j5011490j5922500J7293509K1923714j4983372j9647251K7096646
10491A7842047L3811460k7096574k1169547J31955170K59279536J43317785j33562236
10484D04377641k67588354j48046926J9024414L8730905k7336378l3084678J3065559
10477h57817J6643179j8051159j8087804J4053453J7414842q003625j0703993
$$ plain form
10470 -7592924 2674747 13269678 3394537 -6892743 3055126 14853863 7129050 -4984053
10462 -4984053 -377192 9279934 3979210 -8093510 -9240308 -4653765 -7478169 -11333663
10454 -11333663 -4647855 4607526 3224233 -3147809 -2523741 934136 -2092014 -6104172
10446 -6104172 -2316075 2075618 -3738678 -13002865 -11886718 -2542063 2283734 483747
10438 483747 -178050 1805321 1511942 -807369 -783006 1190881 2354389 4316518 8716282
10429 8716282 11603216 9942185 7631425 8121522 8130775 5244490 3586662 5146695 4440465
10420 4440465 -775143 -2901770 2925974 8713639 5377810 -3265205 -7561408 -6067384
10412 -6067384 -3692460 -2254327 -1360962 -2918836 -7058426 -8982209 -6362643 -3897421
$$ packed form
10470g592924J0267671J0594931r875141j0287280R947869J1798737p724813j2113103
10462d984053M606861R657126n300724j2072720j146798M586543k824404l855494
10454a1333663O685808R255381j383293o372042O24068L457877l026150m012158
10446f104172L788097M391693n814296r264187J116147R344655M825797j799987
10438D83747o61797J983371k93379k319311K4363J973887J163508J962129M399764
10429H716282K886934j661031k310760M90097R253k886285j657828J560033p06230
10420D440465n215608k126627N827744N787665l335829q643015m296203J494024
10412f067384K374924J438133Q93365j557874m139590j923783K619566K465222
$$ plain form
10404 -3897421 -4780176 -4892391 -1666947 -662342 -5813810 -10693114 -7774833 -35860
10396 -35860 4723051 5422888 5933518 7010947 7275863 7620137 8323758 6439837 1496953
10387 1496953 -1473764 224879 1912873 -490941 -3617866 -3096815 -545399 1251647
10379 1251647 3709213 7579015 9236912 7131050 5261665 5319291 2974026 -2747429
10371 -2747429 -5047066 -832151 2211771 -2216143 -8242341 -7950004 -4374046 -4536695
10363 -4536695 -6437497 -3800050 1411553 2132890 -1552733 -3342954 -1655827 -797922
10355 -797922 -2846175 -5898947 -8683114 -10313449 -7734104 134402 7856576 9140712
10347 9140712 5124196 1941259 2453612 5006100 7479649 8159500 5682588 1990714
$$ packed form
10404c897421q82755j12215L225444J004605n151468m879304K918281P738973
10396c5860M758911O99837N10630J077429K64916L44274P03621j883921m942884
10387A496953k970717J698643J687994k403814l126925N21051K551416J797046
10379A251647K457566L869802J657897k105862j869385N7626k345265n721455
10371b747429k299637M214915L043922m427914o026198K92337L575958j62649
10363d536695j900802K637447N211603P21337l685623j790221J687127Q57905
10355g97922k048253l052772k784167j630335K579345P868506P722174J284136
10347I140712m016516l182937N12353K552488K473549O79851k476912l691874
$$ plain form
10339 1990714 1733189 5485826 8136953 6933695 5206221 4884117 2625072 -2349160
10331 -2349160 -4618632 -2088803 -722780 -3588399 -4251923 1289509 5395867 911708
10323 911708 -6122511 -6491585 -2620746 -1790750 -1979689 2418976 6963351 3727109 -2786442
10314 -2786442 -1398173 6319193 7639314 -343953 -6219255 -2961468 2499982 2491797 -410436
10305 -410436 -889606 181475 66856 267941 3102046 7253527 10346850 11759556 10859500
10296 10859500 6848785 1721477 -1000971 -1210007 -1507212 -1718987 662879 4573539
10288 4573539 5602724 2812275 145214 298409 1888387 3163985 4007834 3883826 1923823
10279 1923823 -854515 -2912496 -4849377 -7199765 -7653129 -4847237 -2438805 -4126930
$$ packed form
10339A990714k57525L752637K651127j203258j727474l22104k259045m974232
10331b349160k269472K529829J366023k865619o63524N541432M106358m484159
10323I11708p034219l69074L870839Q29996j88939M398665M544375l236242o513551
10314b786442J388269P717366J320121p983267n875302L257787N461450q185k902233
10305d10436m79170J071081j14619K01085K834105M151481L093323J412706r00056
10296A0859500m010715n127308k722448k09036k97205k11775K381866L910660
10288D573539J029185k790449k667061J53195J589978J275598Q43849j24008j960003
10279A923823k778338k057981j936881k350388m53364K805892K408432j688125
$$ plain form
10271 -4126930 -7086678 -6288388 -3005640 -2385603 -4427825 -4493037 -1718389 -17323 -1262819
10262 -1262819 -3683103 -6138676 -8122572 -7198839 -2658290 612391 -1241638 -3575683
10254 -3575683 -467285 4023821 1862244 -4431735 -5222353 -681848 -939894 -7938372
10246 -7938372 -10975065 -4646655 1799716 -152978 -4829996 -2860701 3753509 6486796
10238 6486796 3911555 1293555 700999 -89948 -1131394 141101 3770038 6749610
10230 6749610 6992960 4654753 976007 -1813581 -1563044 945279 2786944 3638282 5834795
10221 5834795 8431010 6503372 -813420 -6816380 -5790574 -760627 1716458 800838
10213 800838 402783 1458126 475424 -4484227 -10090133 -10920117 -5217781 2749909 6605751
$$ packed form
10271d126930k959748P98290L282748O20037k042222o5212K774648J701066j245496
10262a262819k420284k455573j983896R23733M540549L270681j854029k334045
10254c575683L108398M491106k161577o293979p90618M540505k58046o998478
10246g938372l036693O328410O446371j952694m677018J969295O614210K733287
10238F486796k575241k618000n92556p90947j041446J272495L628937K979572
10230F749610K43350k338207l678746k789588K50537K508323J841665Q51338K196513
10221E834795K596215j927638p316792o002960J025806N029947K477085r15620
10213H00838l98055J055343r82702m959651n605906q29984N702336P967690L855842
$$ plain form
10204 6605751 4990267 3026834 4483569 5527663 1073360 -5513010 -6409734 -1833192
10196 -1833192 180660 -2913501 -4534444 -1134077 1697988 -235733 -2320277 -323989
10188 -323989 1446150 -1381399 -4179871 -1420671 2591848 898067 -3156854 -875371
10180 -875371 6884248 10731822 7621461 4053524 3831943 2887043 -1189842 -3583553 -385886
10171 -385886 4729998 6364958 4523245 1983895 -583000 -2871640 -2667149 250518
10163 250518 1333403 -3011639 -9271475 -10786518 -6380108 -1016909 1191577 671987
10155 671987 -720409 -2625079 -4958693 -6682231 -7439955 -8653127 -11323268 -13750476
10147 -13750476 -13024344 -8549928 -2994228 265454 -133724 -3207185 -6867996 -9030966
$$ packed form
10204F605751j615484j963433J456735J044094m454303o586370q96724M576542
10196a833192K013852l094161j620943L400367K832065j933721k084544J996288
10188c23989J770139k827549k798472K759200M012519j693781m054921K281483
10180h75371P759619L847574l110361l567937k21581r44900m076885k393711L197667
10171c85886N115884J634960j841713k539350k566895k288640K04491K917667
10163B50518J082885m345042o259836j515043M406410N363199K208486n19590
10155F71987j392396j904670k333614j723538p57724j213172k670141k427208
10147a3750476P26132M474416N555700L259682l99178l073461l660811k162970
$$ plain form
10139 -9030966 -8481263 -5881187 -3857900 -4969245 -8854392 -11801395 -10030674 -3750044
10131 -3750044 2634839 5100628 4410473 4491869 6227195 5368988 -1115522 -8650453 -9296435
10122 -9296435 -2610206 2272157 -2291062 -12763808 -19039826 -16270375 -8456039 -1853308
10114 -1853308 1176523 2015691 2866525 4477410 4875025 902125 -6995714 -12859013 -11121306
10105 -11121306 -3571298 2852141 4519035 3602170 2419560 -95966 -4768137 -8716995
10097 -8716995 -8156131 -3043328 2755024 5216773 3666241 1382174 2343567 6317469
10089 6317469 8443272 5477445 584713 -1031769 535209 997575 -886881 -2098954
10081 -2098954 -1353526 -1265125 -3382688 -5436685 -5191970 -3560448 -2537123 -3145363 -6140987
$$ packed form
10139i030966N49703K600076K023287j111345l885147k947003J770721O280630
10131c750044O384883K465789o90155Q1396J735326q58207o484510p534931o45982
10122i296435O686229M882363m563219j0472746o276018K769451P814336O602731
10114a853308L029831Q39168Q50834J610885L97615l972900p897839n863299J737707
10105a1121306P550008O423439J666894r16865j182610k515526m672171l948858
10097h716995N60864N112803N798352K461749j550532k284067R61393L973902
10089F317469K125803k965827m892732j616482J566978M62366j884456j212073
10081b098954P45428Q8401k117563k053997K44715J631522J023325o08240k995624
$$ plain form
10072 -6140987 -11222880 -14886208 -12971871 -6252499 329004 4366978 7263530 8448771
10064 8448771 4623979 -3093871 -7606658 -5062570 -191292 1602007 2016374 4679031
10056 4679031 7332822 5784232 2077613 1625597 4233306 4980042 3026915 2406030 3719457
10047 3719457 2212105 -3605822 -7558965 -4045625 3354110 6049620 1239908 -5647632
10039 -5647632 -8744658 -8013867 -6644420 -5415405 -2676175 1174147 2826600 851336
10031 851336 -1526414 -916141 967466 -72858 -3743286 -4909651 -835006 4755811
10023 4755811 6438788 3433098 -417111 -1188655 1877338 6212215 8077664 6040546
10015 6040546 2484667 376878 -746377 -3276861 -6873437 -8637310 -7758142 -6402424
$$ packed form
10072f140987n081893l663328J914337O719372O581503M037974K896552J185241
10064H448771l824792p717850m512787K544088M871278J793299M14367K662657
10056D679031K653791j548590l706619m52016K607709P46736j953127o20885J313427
10047C719457j507352n817927l953143L513340P399735K695510m809712o887540
10039e647632l097026P30791J369447J229015K739230L850322J652453j975264
10031H51336k377750O10273J883607j040324l670428j166365M074645N590817
10023D755811J682977l005690l850209p71544L065993M334877J865449k037118
10015F040546l555879k107789j123255k530484l596576j763873Q79168J355718
$$ plain form
10007 -6402424 -5804154 -5216740 -5042910 -6815487 -9362224 -9453465 -7378638 -7134891 -9427316
9998 -9427316 -9543384 -4839947 386738 1022690 -1645170 -2519875 219996 3755523 4321113
9989 4321113 377377 -5537685 -7348442 -1554111 6474605 7338520 66363 -6318296
9981 -6318296 -5878280 -3277171 -4203397 -5614561 -1861717 5246802 9694384 10324229 9686008
9972 9686008 7501978 2532568 -1858523 -1264989 2488952 4165184 3321861 3215476 3317859
9963 3317859 -87295 -6606396 -11447638 -12207376 -10581440 -8039633 -4958500 -3004744
9955 -3004744 -3270208 -3369314 -1367020 -446567 -3947348 -8211103 -7207328 -2408133 -680673
9946 -680673 -3574502 -6281453 -6495093 -6483653 -6501234 -4004624 79744 1822744 1628333
$$ packed form
10007f402424N98270N87414J73830j772577k546737r1241K074827K43747k292425
9998i427316j16068M703437N226685O35952k667860q74705K739871L535527N65590
9989D321113l943736n915062j810757N794331Q028716Q63915p272157o384659
9981f318296M40016K601109r26226j411164L752844P108519M447582O29845o38221
9972I686008k184030m969410m391091N93534L753941J676232q43323j06385J02383
9963C317859l405154o519101m841242p59738J625936K541807L081133J953756
9955c004744k65464r9106K002294R20453l500781m263755J003775M799195J727460
9946f80673k893829k706951k13640J1440j7581K496610M084368J743000j94411
$$ plain form
9937 1628333 3693448 7532696 7726124 3119114 -1428620 -3680274 -6515631 -10235813
9929 -10235813 -10464911 -6006028 -1212249 1606900 4499621 6792731 4360545 -1349311
9921 -1349311 -2563637 2851530 7431348 6226985 3884831 4748258 5209675 2252859 719483
9912 719483 4332089 7241551 3076631 -3948121 -5564257 -1718913 2030596 4467228
9904 4467228 7489021 9028562 5806851 366527 -2060310 -1039851 890863 3681838
9896 3681838 7109546 7477049 4020049 3201102 8503541 11815922 4905933 -5877616
9888 -5877616 -7983479 -1718333 1683244 -1513077 -4302485 -3142106 -1927601 -1295726
9880 -1295726 2781826 8248737 7919142 3031027 2064161 3844863 -1837127 -11690649 -5643266
$$ packed form
9937A628333K065115L839248J93428m607010m547734k251654k835357l720182
9929a0235813k29098M458883M793779K819149K892721K293110k432186n709856
9921a349311j214326N415167M579818j204363k342154Q63427M61417k956816j533376
9912G19483L612606K909462m164920p024752j616136L845344L749509K436632
9904D467228L021793J539541l221711n440324k426837J020459J930714K790975
9896C681838L427708L67503l457000q18947N302439L312381o909989j0783549
9888e877616k105863O265146L401577l196321k789408J160379J214505O31875
9880a295726M077552N466911l29595m888115r66866J780702n681990r853522O047383
$$ plain form
9871 -5643266 22435048 47030802 40731633 10995970 -10702141 -9996485 -1322867 -693936
9863 -693936 -5676846 -6646235 -3081372 -910253 -2592006 -6575526 -10926490 -12775989 -8971937
9854 -8971937 -1087352 4314192 3321946 -1228818 -5209717 -8020106 -9674179 -8442470
9846 -8442470 -5135070 -5039181 -10797357 -16796094 -15844103 -9208738 -4633811 -5325120 -6346270
9837 -6346270 -2840444 2659759 3614385 -2044903 -9111552 -10422725 -4190248 3870808
9829 3870808 6057822 866445 -5268210 -5584577 -938464 2268011 948011 -1760715
9821 -1760715 -2680999 -2921919 -3620416 -1905753 4166792 9676628 8077938 1506477 -921506
9812 -921506 3696334 7372844 3151654 -4378670 -5904681 -236486 6138338 9273466
$$ packed form
9871e643266K8078314K4595754o299169k9735663k1698111P05656Q673618O28931
9863f93936m982910r69389L564863K171119j681753l983520m350964j849499L804052
9854h971937P884585N401544r92246m550764l980899k810389j654073J231709
9846h442470L307400R5889n758176n998737R51991O635365M574927o91309j021150
9837f346270L505826N500203R54626n659288p066649j311173O232477Q061056
9829C870808K187014n191377o134655l16367M646113L206475j320000k708726
9821a760715r20284k40920o98497J714663O072545N509836j598690o571461k427983
9812i21506M617840L676510m221190p530324j526011N668195O374824L135128
$$ plain form
9804 9273466 10160766 8458816 2179909 -5377611 -6403432 397580 5985070 2515272
9796 2515272 -6424354 -11951229 -12024903 -11713510 -13930098 -15874029 -14196186 -9096060 -3102487
9787 -3102487 1011021 1417124 -849636 -1900503 355860 2726351 930983 -4140612
9779 -4140612 -8034741 -9183601 -9158831 -7362883 -1284003 6884351 9521042 2600613 -8230764
9770 -8230764 -13791495 -11138782 -4611728 495188 2197251 1261007 -386029 -733491 830876
9761 830876 2904539 3790716 3468603 3261241 4163444 5851299 6593051 4347255 -568947
9752 -568947 -4275259 -3292719 77233 -497433 -7077010 -14141671 -15615543 -12195147 -8988772
9743 -8988772 -8527149 -9373891 -9484240 -7384446 -1951135 5014449 7795717 3161669 -3413571
$$ packed form
9804I273466Q87300j701950o278907p557520j025821O801012N587490l469798
9796B515272q939626n526875p3674L11393k216588j943931J677843N100126N993573
9787c102487M113508M06103k266760j050867K256363K370491j795368n071595
9779d140612l894129j148860K4770J795948O078880Q168354K636691o920429j0831377
9770h230764n560731K652713O527054N106916J702063r36244j647036l47462J564367
9761H30876K073663Q86177l22113k07362R02203J687855P41752k245796m916202
9752e68947l706312R82540L369952n74666o579577p064661j473872L420396L206375
9743h988772M61623q46742j10349K099794N433311O965584K781268m634048o575240
$$ plain form
9734 -3413571 -3563158 2131881 4549625 -357986 -5331139 -3006173 2852663 3579542 -852006
9725 -852006 -1939872 4718203 13765501 18077475 16805247 13322363 9648953 6023999
9717 6023999 3205061 1987239 1477947 -184381 -3893609 -8909691 -12959317 -13088809 -8654401
9708 -8654401 -3585553 -2623963 -4701001 -3908546 1434252 5354635 3158391 -804530 237723
9699 237723 4338869 3456931 -3594307 -8354473 -4791765 2153622 3735766 -1382797 -7316035
9690 -7316035 -9511673 -8850270 -8350915 -9203813 -10115806 -8936961 -5276438 -2008392 -2586688
9681 -2586688 -6268638 -8465194 -6932539 -4543110 -4004087 -3332633 85789 3904931 3815750
9672 3815750 559874 -865093 1139950 2324841 -1113180 -7099039 -10333382 -8696660
$$ packed form
9734c413571j49587N695039K417744m907611m973153K324966N858836P26879m431548
9725h52006j087866O658075R047298M311974j272228l482884l673410l624954
9717F023999k818938j217822n09292j662328l709228n016082m049626j29492M434408
9708h654401N068848R61590k077038P92455N342798L920383k196244l962921J042253
9699B37723M101146q81938p051238m760166L562708O945387J582144n118563n933238
9690g316035k195638O61403M99355q52898r11993J178845L660523L268046n78296
9681b586688l681950k196556J532655K389429N39023O71454L418422L819142q9181
9672C815750l255876j424967K005043J184891l438021n985859l234343J636722
$$ plain form
9664 -8696660 -5622081 -6355559 -11845880 -16561367 -14157893 -5871835 -313547 -2965890
9656 -2965890 -9174221 -10844101 -6911029 -2550707 -612469 306029 674281 -579278 -1492401
9647 -1492401 1725118 7803863 10591410 7717372 3637494 2438630 3381816 5533522
9639 5533522 10201308 15328863 14132251 4709344 -4228809 -3413147 4918310 11045028
9631 11045028 10737121 7740283 5412073 2785921 -1200891 -5286158 -8310674 -9897164
9623 -9897164 -8832301 -4821192 -1389418 -2591648 -6910084 -8843639 -6745446 -4591443
9615 -4591443 -5309362 -6809836 -6093854 -3566831 -1506312 -1010554 -1789228 -2712191 -2012920
9606 -2012920 538149 1585385 -2411485 -9279993 -12292402 -8398447 -1971813 1036739
$$ packed form
9664h696660L074579p33478n490321m715487K403474Q286058N558288k652343
9656b965890o208331j669880L933072M360322J938238R18498L68252j253559r13123
9647a492401L217519O078745K787547k874038m079878j198864R43186K151706
9639E533522M667786N127555j196612r422907q938153Q15662Q331457O126718
9631A1045028l07907k996838k328210k626152l986812m085267l024516j586490
9623i897164J064863M011109L431774j202230m318436j933555K098193K154003
9615d591443p17919j500474P15982K527023K060519M95758p78674r22963O99271
9606b012920K551069J047236l996870o868508l012409L893955O426634L008552
$$ plain form
9598 1036739 -559963 -4264831 -7872776 -9897868 -8870494 -5379669 -3243544 -5633642
9590 -5633642 -10485553 -12063980 -7432877 -231872 2517177 -2442590 -10526240 -13362048
9582 -13362048 -7930925 -258005 2030153 -753988 -1756528 2216847 6527880 5901048
9574 5901048 1581545 -1267955 -451063 1790729 2456580 546563 -2778901 -5030758 -4199829
9565 -4199829 -853472 2427457 4102908 4697887 4646550 3472768 1803964 1549061 2781194
9556 2781194 3001710 1202269 215819 2773317 7093562 8866186 6525999 2426536 -565842
9547 -565842 -1881309 -2881958 -4785812 -7026370 -7768574 -6527147 -5282912 -5469279 -5240684
9538 -5240684 -2560778 229078 -893565 -4675488 -5263211 -673512 4469544 6244178
$$ packed form
9598A036739j596702l704868l607945k025092J027374L490825K136125k390098
9590e633642m851911j578427M631103P201005K749049m959767q083650k835808
9582a3362048N431123P672920K288158k784141j002540L973375M311033o26832
9574E901048m319503k849500Q16892K241792O65851j910017l325464k251857Q30929
9565d199829L346357L280929J675451N94979n1337j173782j668804k54903J232133
9556B781194K20516j799441r86450K557498M320245J772624k340187m099463k992378
9547e65842j315467j000649j903854k240558p42204J241427J244235j86367K28595
9538e240684K679906K789856j122643l781923n87723M589699N143056J774634
$$ plain form
9530 6244178 6156686 6089668 4102734 -774137 -4361001 -2725755 1900717 5094291 6512343
9521 6512343 7549820 6575265 2130075 -2313303 -2801146 -1436671 -2351162 -3856766 -1612760
9512 -1612760 2566230 2960508 -118755 -918745 1401544 1656020 -1233140 -2014468 616785
9503 616785 554465 -4847769 -8868767 -6001657 -1152109 -1521788 -5310511 -6150287 -4298986
9494 -4298986 -5100386 -8790934 -9941598 -6417864 -1953031 381786 1320679 1615118 569472
9485 569472 -878694 -572332 456039 -1286447 -5434535 -6863081 -3045734 1744256 2002106
9476 2002106 -2409557 -7468857 -9935133 -8737329 -4050735 2121432 6039043 5613887
9468 5613887 3130418 2854746 6385224 11251219 13181039 9253494 536098 -7467213
$$ packed form
9530F244178q7492o7018j986934m876871l586864J635246M626472L193574J418052
9521F512343J037477r74555m445190m443378m87843J364475r14491j505604K244006
9512a612760M178990L94278l079263p99990K320289K54476k889160p81328K631253
9503F16785o2320n402234m020998K867110M849548l69679l788723q39776J851301
9494d298986q01400l690548j150664L523734M464833K334817R38893K94439j045646
9485E69472j448166L06362J028371j742486m148088j428546L817347M789990K57850
9476B002106m411663n059300k466276J197804M686594O172167L917611m25156
9468E613887k483469k75672L530478M865995J929820l927545q717396q003311
$$ plain form
9460 -7467213 -9003502 -4230740 499121 -21163 -4181417 -6974063 -6669909 -5141494 -3430762
9451 -3430762 -953681 1464403 1801271 633719 1177357 4439020 7497313 7978920 7048786
9442 7048786 6045021 3543965 -1065440 -3955909 -1281268 4195697 5837353 2485240
9434 2485240 -21895 1865483 3739780 399491 -5340666 -6349630 -1882611 1377669
9426 1377669 -500447 -3165096 -1384310 2524995 2276853 -2728625 -6617211 -5831546 -3794746
9417 -3794746 -4994934 -8297592 -9316682 -7137599 -5005466 -5026568 -5568362 -4449544 -2187411
9408 -2187411 -1033085 -2300365 -5281586 -7554120 -6302848 -1188467 3852870 3944124 -928815
9399 -928815 -5963747 -8386380 -10992579 -16529388 -21799949 -21459322 -15791383 -9946216 -6095804
$$ packed form
9460g467213j536289M772762M729861n20284m160254k792646L04154J528415J710732
9451c430762K477081K418084L36868j167552N43638L261663L058293M81607r30134
9442G048786j003765k501056m609405k890469K674641N476965J641656l352113
9434B485240k507135J887378J874297l340289n740157j008964M467019L260280
9426A377669j878116k664649J780786L909305k48142n005478l888586P85665K036800
9417c794746j200188l302658j019090K179083K132133k1102n41794J118818K262133
9408b187411J154326j267280k981221k272534J251272N114381N041337R1254m872939
9399i28815n034932k422633k606199n536809n270561L40627N667939N845167L850412
$$ plain form
9390 -6095804 -1592318 4207917 6695548 2666908 -3606863 -5012732 -300495 5533804
9382 5533804 8275667 8025484 6030358 2160191 -2830835 -5482675 -2945602 2656774
9374 2656774 5597358 2854757 -2438520 -4956374 -3580526 -1914994 -2472397 -3063357 -800855
9365 -800855 2550625 2747423 -19527 -381510 4916171 12302593 15829661 13583061 7535647
9356 7535647 -97830 -7064302 -9814104 -6446527 -596997 1524419 -1387771 -4482171
9348 -4482171 -3918557 -1980838 -3008016 -6840444 -9347841 -8397832 -6261263 -5740952 -6214315
9339 -6214315 -4784197 -233251 5463547 9225205 9448568 6564026 2084354 -2274030
9331 -2274030 -5056481 -5564677 -4252307 -2510905 -1740350 -2035183 -1464161 2396660 8816954
$$ packed form
9390f095804M503486N800235K487631m028640o273771j405869M712237N834299
9382E533804K741863k50183j995126l870167m991026k651840K537073N602376
9374B656774K940584k742601n293277k517854J375848J665532n57403n90960K262502
9365h00855L351480J96798k766950l61983N297681P386422L527068k246600o047414
9356G535647p633477o966472k749802L367577N849530K121416k912190l094400
9348d482171N63614J937719j027178l832428k507397R50009K136569N20311m73363
9339f214315J430118M550946N696798L761658K23363k884542m479672m358384
9331b274030k782451n08196J312370J741402P70555k94833N71022L860821O420294
$$ plain form
9322 8816954 12464885 8210750 -1952792 -9520374 -8685783 -2411198 2926765 5897749
9314 5897749 9033759 11810505 10286463 3712676 -3665887 -8276794 -10066101 -9014671
9306 -9014671 -4420649 542728 -237090 -6624197 -9654263 -3350550 5599301 6463452 -629683
9297 -629683 -5942354 -4745595 -2542338 -4609886 -7732752 -6001592 -6939 4032133
9289 4032133 2028626 -4309122 -10375480 -12847863 -11419246 -7949537 -4325499 -1275928
9281 -1275928 745983 967128 -158578 -379844 1279461 2364200 687669 -1218803 765944
9272 765944 5222654 5685016 -554615 -7934623 -9077808 -3212905 3947649 6900878 4858312
9263 4858312 677030 -2670299 -4277122 -4638644 -3631051 -558787 3315068 4515766
$$ packed form
9322H816954L647931m254135j0163542p567582Q34591O274585N337963K970984
9314E897749L136010K776746j524042o573787p378563m610907j789307J051430
9306i014671M594022M963377p79818o387107l030066O303713Q949851Q64151p093135
9297f29683n312671J196759K203257k067548l122866J731160N994653M039072
9289D032133k003507o337748o066358k472383J428617L469709L624038L049571
9281a275928K021911K21145j125706k21266J659305J084739j676531j906472J984747
9272G65944M456710M62362o239631p380008j143185N864903P160554K953229k042566
9263D858312m181282l347329j606823l61522J007593L072264L873855J200698
$$ plain form
9255 4515766 1675298 -1803491 -2251047 -1181612 -2500293 -5594988 -6084973 -3361677 -2059397
9246 -2059397 -4629994 -7416996 -6595146 -3724063 -2211533 -1880185 -862396 -73419 -1406075
9237 -1406075 -3146697 -1801655 1872055 3070125 97034 -2571757 -691559 3136573
9229 3136573 2915810 -1665647 -4073290 -504380 3407192 -128708 -9112353 -13156125
9221 -13156125 -7459751 986427 4073332 3154793 3575027 4035077 -530407 -8267633 -11649941
9212 -11649941 -9365153 -8402605 -12486565 -16202747 -13815565 -7283398 -1681034 1633165
9204 1633165 3274055 2598403 704997 1872419 7101282 10441699 7001341 922342
9196 922342 -261255 3835633 7521770 8251113 8293055 8371098 6239419 2077274 -323991
$$ packed form
9255D515766k840468l478789m47556J069435j318681l094695m89985K723296J302280
9246b059397k570597k787002Q21850K871083J512530L31348J017789P88977j332656
9237a406075j740622J345042L673710J198070k973091k668791J880198L828132
9229C136573k20763m581457k407643L568910L911572l535900q983645m043772
9221a3156125N696374Q446178L086905r18539M20234M60050m565484p737226l382308
9212a1649941K284788R62548m083960l716182K387182O532167N602364L314199
9204A633165J640890o75652j893406J167422N228863L340417l440358o078999
9196I22342j183597M096888L686137P29343M1942P8043k131679m162145k401265
$$ plain form
9187 -323991 867765 3095291 3858083 3835200 4139777 3774587 1711269 -819164 -1926547
9178 -1926547 -1555909 -1021412 -836224 -9558 2436768 5353909 5506562 1127782 -4752793
9169 -4752793 -6968124 -4810929 -2919412 -4139807 -5235650 -2718459 537159 -866727
9161 -866727 -6409064 -10028817 -8279426 -3622230 219084 1839672 837495 -2707329
9153 -2707329 -6327393 -6537429 -3668243 -2209153 -4718605 -8194245 -8353332 -5171707 -2115872
9144 -2115872 -1630727 -3445469 -6143637 -8354433 -8800670 -6763627 -2758865 1761470 5257095
9135 5257095 6594142 5522267 3271045 1995425 2553556 2873020 -236414 -6711503 -11585077
9126 -11585077 -9777745 -2795385 1974549 275673 -3453898 -2686788 1466392 2209893
$$ packed form
9187c23991J191756K227526P62792k2883L04577l65190k063318k530433j107383
9178a926547L70638N34497J85188Q26666K446326K917141J52653m378780n880575
9169d752793k215331K157195J891517j220395j095843K517191L255618j403886
9161h66727n542337l619753J749391M657196L841314J620588j002177l544824
9153b707329l620064k10036K869186J459090k509452l475640j59087L181625L055835
9144b115872M85145j814742k698168k210796m46237K037043M004762M520335L495625
9135E257095J337047j071875k251222j275620N58131L19464l109434o475089m873574
9126a1585077J807332O982360M769934j698876l729571P67110M153180P43501
$$ plain form
9118 2209893 -2154286 -5645848 -4194638 -1741939 -3410106 -7516570 -8914406 -6868317
9110 -6868317 -4816839 -4326674 -3694689 -1734560 234967 -264593 -4923999 -12315110 -16926391
9101 -16926391 -14217201 -7737961 -5899403 -9452366 -9223368 -909357 5776180 850041
9093 850041 -9626996 -11859406 -4951679 -853892 -4733376 -8385018 -5550489 -1621969
9085 -1621969 -2685175 -4918930 -2265188 2493126 2209530 -3388372 -7968868 -7719843 -4562058
9076 -4562058 -1630945 32011 839776 1480499 1970158 1114605 -1452066 -2966699 -593170
9067 -593170 3433694 4277587 2197807 2000328 4078549 3173981 -1578279 -3164633 2374399
9058 2374399 8810920 9341078 6769897 7055594 8375235 5093637 -1178760 -3346026 188126
$$ packed form
9118B209893m364179l491562J451210K452699j668167m106464j397836K046089
9110f868317K051478M90165O31985J960129J969527m99560m659406p391111m611281
9101a6926391K709190O479240J838558l552963K28998Q314011O685537m926139
9093H50041j0477037k232410O907727M097787l879484l651642K834529L928520
9085a621969j063206k233755K653742M758314k83596n597902m580496K49025L157785
9076d562058K931113J662956Q07765O40723M89659q55553k566671j514633K373529
9067e93170M026864Q43893k079780j97479K078221r04568m752260j586354N539032
9058B374399O436521N30158k571181K85697J319641l281598o272397k167266L534152
$$ plain form
9049 188126 4231429 5396104 4665803 2326406 -2155026 -5319819 -2119372 6062469 12136732
9040 12136732 12641534 10221038 6779792 1498168 -3383698 -2933123 1569235 1840663 -5041501
9031 -5041501 -10461461 -6055688 4020964 9226509 6938396 3518368 3464875 4837526
9023 4837526 5283654 6052668 8248746 9726659 8150407 4462738 1346559 -248894 -1753549
9014 -1753549 -4895483 -9292791 -11585445 -7846562 1591354 10562080 12621840 8048231
9006 8048231 3093904 2309803 4251970 5366199 5018891 4555213 3626189 699950 -3244760
8997 -3244760 -4584380 -1554258 3178097 5806861 5642730 4150868 1047689 -5294680
8989 -5294680 -12962542 -15636706 -9686366 -265775 3597398 -206826 -4968695 -4939042 -2660566
$$ packed form
9049A88126M043303J164675p30301k339397m481432l164793L200447Q181841O074263
9040A2136732N04802k420496l441246n281624m881866M50575M502358K71428o882164
9031e041501n419960M405773J0076652N205545k288113l420028n3493J372651
9023D837526M46128P69014K196078J477913j576252l687669l116179j595453j504655
9014a753549l141934m397308k292654L738883R437916Q970726K059760m573609
9006H048231m954327p84101J942167J114229l47308m63678r29024k926239l944710
8997c244760j339620L030122M732355K628764j64131j491862l103179o342369
8989e294680p667862k674164N950340R420591L863173l804224m761869K9653K278476
$$ plain form
8980 -2660566 -3744940 -8039141 -10547993 -9181894 -6506050 -4375107 -2162546 -973513
8972 -973513 -3965020 -10008712 -12096828 -6052995 2924021 6927164 5603892 4706330 6626565
8963 6626565 8289083 7661950 6337268 5201179 3233480 1709211 3858122 8358848
8955 8358848 8858500 3070419 -2795115 -2490604 2082284 5565858 7477464 10108409 11586861
8946 11586861 7833629 -18213 -6322475 -8427819 -8062509 -6112153 -2164679 868398
8938 868398 -1508521 -7449395 -8855102 -2212980 5941760 7958139 5096452 4325880 8076841
8929 8076841 11839541 10969356 6167271 1880040 1335996 3695804 5442609 4386566 1776868
8920 1776868 -182817 -1606658 -3834482 -6320988 -7371759 -7097732 -6549302 -4896603 -1252916
$$ packed form
8980b660566j084374m294201k508852J366099K675844K130943K212561J189033
8972i73513k991507o043692k088116O043833Q977016M003143j323272q97562J920235
8963F626565J662518o27133j324682j136089j967699j524269K148911M500726
8955H358848M99652n788081n865534L04511M572888L483574J911606K630945J478452
8946A1586861l753232p851842o304262k105344L65310J950356L947474L033077
8938H68398k376919n940874j405707O642122Q154740K016379k861687p70572L750961
8929H076841L762700q70185m802085m287231n44044K359808J746805j056043k609698
8920A776868j959685j423841k227824k486506j050771K74027N48430J652699L643687
$$ plain form
8911 -1252916 1685189 650817 -1986996 -752794 3796196 5009463 1011624 -1271691
8903 -1271691 3423664 10389007 12008233 8239345 4713642 4230253 5548243 7655486
8895 7655486 9994083 10661301 8946582 7475122 7880814 7337291 3785208 1121970 3693351
8886 3693351 8648748 9888366 7138575 4667655 3216558 432291 -2124741 -245228
8878 -245228 4862591 7402229 6412371 6850179 10180829 11605318 8768793 5723361 5231872
8869 5231872 4262739 817761 -1666721 -1243735 -2194044 -7364088 -11779358 -10394967 -7004444
8860 -7004444 -7866569 -10511242 -7503363 874413 6673837 6639450 5697962 6801894 5980178
8851 5980178 1021434 -2652825 -467395 2697361 -650864 -8562153 -11891530 -7524857
$$ packed form
8911a252916K938105j034372k637813J234202M548990J213267l997839k283315
8903a271691M695355O965343J619226l768888l525703m83389J317990K107243
8895G655486K338597O67218j714719j471460M05692n43523l552083k663238K571381
8886C693351M955397J239618k749791k470920j451097k784267k557032J879513
8878b45228N107819K539638r89858M37808L330650J424489k836525l045432m91489
8869E231872r69133l444978k484482M22986r50309n170044m415270J384391L390523
8860g004444q62125k644673L007879Q377776N799424l4387r41488J103932q21716
8851E980178m958744l674259K185430L164756l348225p911289l329377M366673
$$ plain form
8843 -7524857 -2078473 -1333398 -2655661 -1142483 1952596 1798305 -1981648 -4861294 -3822920
8834 -3822920 11291 4420900 7617105 7151630 1901718 -4294330 -5449801 -1090509
8826 -1090509 3059271 3235954 1667214 677086 -1398435 -4796975 -4662393 1545523 7610185
8817 7610185 6398200 874989 -197575 4532315 8066729 6396096 2538458 -915797
8809 -915797 -4799034 -7595909 -5407633 -377134 -456887 -6661708 -9161332 -2006575 6240720
8800 6240720 4540048 -4302054 -8558460 -4387217 2265302 7956078 15068296 22469480
8792 22469480 23107507 14293193 2806064 -4094264 -6832648 -9014468 -10185764 -7768686
8784 -7768686 -2546330 2335797 5702727 8212494 9742818 9887821 9412002 8666482 6307465
$$ packed form
8843g524857N446384P45075j322263J513178L095079j54291l779953k879646J038374
8834c822920L834211M409609L196205m65475n249912o196048j155471M359292
8826a090509M149780J76683j568740r90128k075521l398540J34582O207916O064662
8817G610185j211985n523211j072564M729890L534414j670633l857638l454255
8809i15797l883237k796875K188276N030499p9753o204821k499624P154757Q247295
8800F240720j700672q842102m256406M171243O652519N690776P112218P401184
8792B2469480O38027q814314j1487129o900328k738384k181820j171296K417078
8784g768686N222356M882127L366930K509767J530324J45003m75819p45520k359017
$$ plain form
8775 6307465 2029397 -1381000 -1533051 -261363 -904725 -3123899 -3718515 -1720255 719153
8766 719153 2139180 3087813 3530379 2265006 -440726 -2692845 -4323808 -7297360 -11425932
8757 -11425932 -12893710 -9342839 -3808810 -811367 -654443 -801012 -1105149 -3530248 -7187701
8748 -7187701 -7998888 -4275362 738072 3149362 2433540 121960 -2401514 -3373807 -1361842
8739 -1361842 1275303 -881369 -8837835 -15530073 -13939227 -6612683 -2074592 -3108823
8731 -3108823 -4456411 -2309188 160289 -943038 -3682897 -3819480 -1524822 -538611 -2452655
8722 -2452655 -5372819 -7335387 -8104801 -7928565 -6799885 -5039726 -3373068 -2645832 -3790419
8713 -3790419 -6739458 -9021109 -7813503 -4470167 -4013565 -8022144 -11225265 -8560613
$$ packed form
8775F307465m278068l410397j52051J271688o43362k219174n94616J998260K439408
8766G19153J420027R48633M42566j265373k705732k252119j630963k973552m128572
8757a1425932j467778L550871N534029K997443J56924j46569l04137k425099l657453
8748g187701q11187L723526N013434K411290p15822k311580k523474r72293K011965
8739a361842K637145k156672p956466o692238J590846P326544M538091j034231
8731c108823j347588K147223K469477j103327k739859j36583K294658R86211j914044
8722b452655k920164j962568p69414J76236J128680J760159J666658P27236j144587
8713c790419k949039k281651J207606L343336M56602m008579l203121K664652
$$ plain form
8705 -8560613 -2733608 -43799 -749902 293312 3708387 3312339 -3811561 -11199155 -11705901
8696 -11705901 -7929836 -7894699 -12670623 -15101291 -10943381 -4659873 -1831192 -1561793 -570580
8687 -570580 -244864 -3638630 -7892717 -6564698 349306 5131713 2813876 -2807249 -6223272
8678 -6223272 -7485052 -8334267 -6722162 -1464676 1858450 -2515109 -10215928 -11343009
8670 -11343009 -4978939 -626593 -3984654 -9836743 -11920703 -11384127 -10612364 -6542447
8662 -6542447 2669658 10075915 7453193 -2522284 -9243799 -7802041 -2899832 -203595
8654 -203595 -506830 -2589780 -5785190 -8580011 -9261577 -8750567 -9116447 -9566307 -8012805
8645 -8012805 -5948917 -6840747 -9880479 -10538358 -7563523 -4135622 -1597876 2128175 6583317
$$ packed form
8705h560613N827005K689809p06103J043214L415075l96048p123900p387594n06746
8696a1705901L776065L5137m775924k430668M157910O283508K828681K69399R91213
8687e70580L25716l393766m254087J328019O914004M782407k317837n621125l416023
8678f223272j261780q49215J612105N257486L323126m373559p700819j127081
8670a1343009O364070M352346l358061n852089k083960N36576P71763M069917
8662f542447R212105P406257k622722r975477o721515J441758M902209K696237
8654b03595l03235k082950l195410k794821o81566N11010l65880m49860J553502
8645h012805K063888q91830l039732o57879K974835L427901K537746L726051M455142
$$ plain form
8636 6583317 7219891 2364890 -3340747 -5320447 -4498217 -3705070 -3107417 -2330508 -2998916
8627 -2998916 -5623117 -7420799 -6586670 -5405372 -5820163 -5466487 -2053205 1549011 1179389
8618 1179389 -1998158 -3332360 -1472242 1081470 2951116 4920002 6485241 5654896
8610 5654896 2695506 762122 1883372 4500177 5642544 4143179 1478671 287851
8602 287851 1806550 4410136 5508951 4630907 2772471 -633440 -6497993 -11846048 -11924972
8593 -11924972 -8063123 -7626161 -12987505 -16582978 -11906044 -3726540 -604221 -1960552
8585 -1960552 -963693 2823189 3171213 -1228742 -4266343 -2744008 -909061 -2312723 -4350749
8576 -4350749 -3824807 -1782569 -2605 1675571 1987251 -1845363 -7902319 -9298258 -3789443
$$ packed form
8636F583317O36574m855001n705637j979700Q22230P93147N97653P76909o68408
8627b998916k624201j797682Q34129J181298m14791L53676L413282L602216l69622
8618A179389l177547j334202J860118K553712J869646J968886J565239q30345
8610E654896k959390j933384J121250K616805J142367j499365k664508j190820
8602B87851J518699K603586J098815q78044j858436l405911n864553n348055p8924
8593a1924972L861849M36962n361344l595473M676934Q179504L122319j356331
8585a960552R96859L786882L48024m399955l037601J522335J834947j403662k038026
8576d350749N25942K042238J779964J678176L11680l832614o056956j395939N508815
$$ plain form
8567 -3789443 1976983 1812073 -1878023 -3671416 -3280442 -2803312 -1017605 3201491 5947323
8558 5947323 3680431 377667 2108681 6768381 6680612 207281 -6693193 -10119467 -11822902
8549 -11822902 -12382959 -8563567 -336967 5823261 4683934 -1010370 -5024215 -5255887
8541 -5255887 -3518594 -925077 2515452 5392509 5524325 2789707 -554016 -1963306
8533 -1963306 -351234 2821780 3644556 -789466 -7956084 -11484193 -8710680 -3888643
8525 -3888643 -1703991 -709869 3078753 8308578 9090450 3683706 -2250366 -2695322 1820994
8516 1820994 6469258 8487231 8492742 7296342 4879395 2250199 1270290 2035521 2797908
8507 2797908 3100375 4330918 5924821 4096249 -2748639 -9445930 -8819168 -499085 8508694
$$ packed form
8567c789443N766426j64910l690096j793393L90974M77130J785707M219096K745832
8558E947323k266892l302764J731014M659700q7769o473331o900474l426274j703435
8549a1822902n60057L819392Q226600O160228j139327n694304m013845k31672
8541e255887J737293K593517L440529K877057J31816k734618l343723j409290
8533a963306J612072L173014Q22776m434022p166618l528109K773513M822037
8525c888643K184652R94122L788622N229825P81872n406744n934072m44956M516316
8516A820994M648264K017973N511j196400k416947k629196r79909P65231P62387
8507B797908L02467J230543J593903j828572o844888o697291O26762Q320083R007779
$$ plain form
8498 8508694 12061145 10153146 5748010 748891 -3079025 -3276051 -37985 2261632
8490 2261632 172452 -4056006 -5693357 -3737165 -959380 503777 424418 -1033908 -2678863
8481 -2678863 -1689927 2486478 5052399 1244655 -5950020 -8518207 -3988726 1897624
8473 1897624 3967558 3597206 3725476 3089245 -688854 -5744562 -7870675 -5945349 -2280837
8464 -2280837 862022 2316116 1213735 -1759984 -3328861 -780221 4213489 7318624
8456 7318624 6929048 5804558 7155172 10508056 11883550 7814587 -455056 -7080845
8448 -7080845 -7441672 -3810527 -2784256 -6421498 -9048594 -4844284 4162365 10530327
8440 10530327 9933111 4286244 -2103341 -6111904 -6221428 -2865682 1010573 1976015 -572252
$$ packed form
8498H508694L552451j907999m405136m999119l827916j97026L238066K299617
8490B261632k089180m228458j637351J956192K777785J463157p9359j458326j644955
8481b678863R88936M176405K565921l807744p194675k568187M529481N886350
8473A897624K069934l70352J28270o36231l778099n055708k126113J925326L664512
8464b280837L142859J454094j102381k973719j568877K548640M993710L105135
8456G318624l89576j124490J350614L352884J375494m068963q269643o625789
8448g080845l60827L631145J026271l637242k627096M204310R006649O367962
8440A0530327n97216n646867o389585m008563j09524L355746L876255R65442k548267
$$ plain form
8431 -572252 -4169615 -6146965 -5751649 -4206445 -3843836 -6157214 -9578205 -10778188 -9466102
8422 -9466102 -9319683 -11767637 -11983081 -5417325 3887739 7273168 3328029 -248887 2149928
8413 2149928 6796761 7364532 3908303 1070766 988494 2663447 6030587 11530421 16300053
8404 16300053 15554680 8727195 943493 -2797489 -2488482 -1114872 -106175 1401483
8396 1401483 3943655 6202969 6237524 3557036 -187014 -2528901 -2220221 242201 3896915
8387 3896915 7997884 10940583 10202325 5248391 -414294 -2496270 -1106451 -181161 -1432099
8378 -1432099 -1849439 1259503 5454247 6005716 1909311 -3680455 -7805686 -9405565 -7494661
8369 -7494661 -1598921 5328982 8108555 5239191 873276 -910503 -1013939 -2114190
$$ packed form
8431e72252l597363j977350L95316J545204L62609k313378l420991j199983J312086
8422i466102J46419k447954k15444O565756R305064L385429l945139l576916K398815
8413B149928M646833N67771l456229k837537q2272J674953L367140N499834M769632
8404A6300053p45373o827485p783702l740982L09007J373610J008697J507658
8396A401483K542172K259314L4555k680488l744050k341887L08680K462422L654714
8387C896915M100969K942699p38258m953934n662685k081976J389819R25290j250938
8378a432099m17340L108942M194744N51469m096405n589766m125231j599879J910904
8369g494661N895740O927903K779573k869364m365915j783779j03436j100251
$$ plain form
8361 -2114190 -3416811 -2420780 -294397 -1015511 -5053820 -7856484 -5807136 -692617 3212816
8352 3212816 4057905 2761145 516591 -1960756 -3828053 -4584176 -4663116 -4395354 -3011166
8343 -3011166 139309 3839137 5738982 4914320 2819162 1357469 620015 -574210 -1813166
8334 -1813166 -312843 5114697 10075969 7932530 -1653788 -10700992 -11910420 -6949116
8326 -6949116 -2518509 -895412 872128 3992987 5869233 5133333 3598684 2415347
8318 2415347 972767 291804 2351153 4941253 2826683 -4067401 -9384850 -9700004 -8979883
8309 -8979883 -10340658 -10086554 -5193839 -532902 -1714667 -5517583 -5060494 -886564 1204267
8300 1204267 692480 1905926 4312899 2439851 -3845461 -7551673 -5193618 -1804108
$$ packed form
8361b114190j302621R96031K126383p21114m038309k802664K049348N114519L905433
8352C212816Q45089j296760k244554k477347j867297p56123p8940K67762J384188
8343c011166L150475L699828J899845q24662k095158j461693p37454j194225j238956
8334a813166J500323N427540M961272k143439r586318r047204j209428M961304
8326f949116M430607J623097J767540L120859J876246p35900j534649j183337
8318B415347j442580o80963K059349K590100k114570o894084n317449l15154P20121
8309h979883j360775K54104M892715M660937j181765l802916M57089M173930K090831
8300A204267n11787J213446K406973j873048o285312l706212K358055L389510
$$ plain form
8292 -1804108 -2600121 -6157152 -8934004 -10652874 -11669029 -10227777 -6240557 -3526741
8284 -3526741 -4501772 -6108496 -4364041 197598 4478679 6909052 6813164 3240644 -2320853
8275 -2320853 -5265159 -3340555 -132536 3804 -2304082 -3896013 -4313253 -4942545 -5512184
8266 -5512184 -5254776 -5350127 -6429321 -5840949 -1609193 2652624 1395824 -5028831 -10266472
8257 -10266472 -9437333 -3487532 3194895 6218164 3246889 -3556073 -7707881 -4821800
8249 -4821800 1555817 4318378 2351892 999160 2975931 4465124 2075512 -1591338
8241 -1591338 -2677236 -2207579 -3254467 -4870770 -3698087 -301591 833882 -2311419
8233 -2311419 -6915952 -9881269 -10921784 -9905642 -5240524 2211496 6860050 4257635
$$ packed form
8292a804108p96013l557031k776852j718870j016155J441252L987220K713816
8284c526741r75031j606724J744455M561639M281081K430373r5888l572520n561497
8275b320853k944306J924604L208019J36340k307886j591931m17240o29292n69639
8266e512184K57408r5351j079194N88372M231756M261817j256800o424655n237641
8257a0266472Q29139N949801O682427L023269k971275o802962m151808K886081
8249d821800O377617K762561j966486j352732J976771J489193k389612l666850
8241a591338j085898M69657j046888j616303J172683L396496J135473l145301
8233b311419m604533k965317j040515J016142M665118P452020M648554k602415
$$ plain form
8225 4257635 -2307847 -5466381 -3381107 -863652 -481769 1647567 8350951 14883386
8217 14883386 14848001 9221875 3954093 959053 -2198526 -5000265 -3799001 297147
8209 297147 775886 -4339604 -8468737 -6230533 -1275272 578406 659766 3450269 7278593
8200 7278593 6638850 1940442 -718820 546095 898287 -2488840 -5653047 -4422457 -528803
8191 -528803 2063232 2744404 2729050 1432561 -1625687 -3624470 -1280433 4012141 7234075
8182 7234075 5691833 1388940 -2323217 -4162394 -4866191 -5573073 -6619195 -6915354 -4726259
8173 -4726259 -30934 4570849 6623029 6681862 6735978 6703333 5086189 2791781 2988725
8164 2988725 6135302 8258050 6313723 2815712 2257803 4622198 5880592 4242753
$$ packed form
8225D257635o565482l158534K085274K517455L81883K129336O703384O532435
8217A4883386l5385n626126n267782k995040l157579k801739J201264M096148
8209B97147M78739n115490m129133K238204M955261J853678Q1360K790503L828324
8200G278593o39743m698408k659262J264915L52192l387127l164207J230590L893654
8191e28803K592035O81172j5354j296489l058248j998783K344037N292574L221934
8182G234075j542242m302893l712157j839177p03797p06882j046122k96159K189095
8173d726259M695325M601783K052180N8833N4116l2645j617144k294408J96944
8164B988725L146577K122748j944327l498011n57909K364395J258394j637839
$$ plain form
8156 4242753 2196275 1851871 1633901 -952900 -5690193 -10251323 -12606952 -11848663 -8707056
8147 -8707056 -6228029 -7497310 -11398863 -13186547 -10688449 -6975138 -5110423 -3924830
8139 -3924830 -1851195 -1129661 -3988949 -7722697 -8312836 -6370008 -4495894 -1591506 3987037
8130 3987037 8039179 5007577 -2080277 -4408189 -510480 1855297 -1498068 -5371295
8122 -5371295 -5250811 -4417272 -6132241 -6683830 -2453295 2753919 4226150 4463131 7615910
8113 7615910 10873162 9203657 4690942 3057953 3840211 2031335 -2621320 -5728358
8105 -5728358 -6000113 -5379709 -3060430 2776047 8438489 8183209 3774214 2435788 5354126
8096 5354126 6681866 4346390 2692956 2939144 641101 -4276177 -4462630 2969551 9780680
$$ packed form
8156D242753k046478l44404k17970k586801m737293m561130k355629P58289L141607
8147h707056K479027j269281l901553j787684K498098L713311J864715J185593
8139c924830K073635P21534k859288l733748n90139J942828J874114K904388N578543
8130C987037M052142l031602p087854k327912L897709K365777l353365l873227
8122e371295J20484Q33539j714969n51589M230535N207214J472231K36981L152779
8113G615910L257252j669505m512715j632989P82258j808876m652655l107038
8105e728358k71755O20404K319279N836477N662442k55280m408995j338426K918338
8096E354126J327740k335476j653434K46188k298043m917278j86453P432181O811129
$$ plain form
8087 9780680 7864578 442553 -4242366 -4593268 -4371172 -4522059 -3329569 -1582462 -1271687
8078 -1271687 -1402592 -367736 8786 -2133987 -4005695 -2349440 200996 -1054225 -4546703
8069 -4546703 -4319501 485657 4245883 3359273 604969 -160326 951890 1759226 1485729
8060 1485729 744623 342849 959451 2312900 2732219 1233668 -881243 -2444947 -4622012
8051 -4622012 -7741513 -8148323 -2801730 4209117 5180627 -887713 -6635641 -6169663 -1753883
8042 -1753883 1216437 1518870 1586621 3042387 5748478 8965548 10809105 8460332 1468787
8033 1468787 -6388457 -10506156 -9768358 -6398656 -3152240 -1930188 -3339643 -5932109
8025 -5932109 -7197567 -6522939 -5632253 -5224667 -3525103 344235 4098117 5482369 5306437
$$ packed form
8087I780680j916102p422025m684919l50902K22096j50887J192490J747107L10775
8078a271687j30905J034856L76522k142773j871708J656255K550436j255221l492478
8069d546703K27202M805158L760226q86610k754304p65295J112216Q07336k73497
8060A485729p41106m01774O16602J353449M19319j498551k114911j563704k177065
8051d622012l119501m06810N346593P010847R71510o068340n747928M65978M415780
8042a753883K970320L02433O7751J455766K706091L217070J843557k348773o991545
8033A468787p857244m117699P37798L369702L246416J222052j409455k592466
8025e932109j265458O74628Q90686M07586J699564L869338L753882J384252j75932
$$ plain form
8016 5306437 4861089 2985860 -880674 -3157723 -328783 4510830 4708354 132279 -1180486
8007 -1180486 6142323 16559017 19924782 13736926 5257822 2135254 4279314 5790016
7999 5790016 2719893 -2743829 -5444133 -3328140 643211 2531933 1727172 -17232
7991 -17232 -2175944 -5296194 -7891830 -7094072 -3166315 74009 829195 1766835 4482424
7982 4482424 5200662 157726 -7145922 -9103235 -3704236 3576723 7646484 8918812
7974 8918812 9657525 9761290 8429431 6530785 4687883 1630780 -2960378 -6231570 -5602162
7965 -5602162 -2767428 -1368574 -1843559 -1668496 -265399 -405167 -3753852 -7368185 -6648823
7956 -6648823 -1290592 3465127 2589156 -2349864 -4501763 -316687 5249088 4548875 -3039131
$$ packed form
8016E306437m45348j875229l866534k277049K828940M839613J97524m576075j312765
8007a180486P322809J0416694L365765o187856q479104l122568K144060J510702
7999E790016l070123n463722k700304K115993L971351J888722q04761j744404
7991a7232k158712l120250k595636P97758L927757L240324P55186R37640K715589
7982D482424P18238n042936p303648j957313N398999P280959M069761J272328
7974H918812P38713J03765j331859j898646j842902l057103m591158l271192O29408
7965e602162K834734J398854m74985J75063J403097j39768l348685l614333P19362
7956f648823N358231M755719q75971m939020k151899M185076N565775p00213p588006
$$ plain form
7947 -3039131 -10616195 -12650058 -10346175 -7296268 -4103516 22313 3584627 4264011
7939 4264011 2506558 819107 506454 1272651 2938510 5439299 7851110 8930058 7982863
7930 7982863 4845136 748998 -806011 2615165 7441508 6855862 353979 -4485356
7922 -4485356 -2980654 -581074 -3942023 -9829360 -10153036 -4664607 -394452 -67378 322283
7913 322283 2384153 2422039 -584363 -2003919 352697 1967254 -828705 -4901324 -6006530
$$ packed form
7947c039131p577064k033863K303883L049907L192752M125829L562314O79384
7939D264011j757453j687451l12653P66197J665859K500789K411811J078948r47195
7930G982863l137727m096138j555009L421176M826343n85646o501883m839335
7922d485356J504702K399580l360949n887337l23676N488429M270155L27074L89661
7913C22283K061870L7886l006402j419556K356616J614557k795959m072619j105206
$$ [...]
##END NTUPLES=NMR SPECTRUM
##END=
