##TITLE=31Pdec_SR71_27
 CDCl3, 24 sc
 27.09.2021
##JCAMPDX= 6.0         $$ Bruker NMR JCAMP-DX V2.0
##DATA TYPE= NMR SPECTRUM
##DATA CLASS= NTUPLES
##ORIGIN= UXNMR, Bruker Analytische Messtechnik GmbH
##OWNER= root
$$ XWIN-NMR		Version 3.5
$$ Mon Sep 27 13:01:29 2021 Russian Standard Time (UT+4h)  she@DPX200
##.OBSERVE FREQUENCY= 81.013821
##.OBSERVE NUCLEUS= ^31P
##.ACQUISITION MODE= SIMULTANEOUS
##.ACQUISITION SCHEME= undefined
##.AVERAGES= 124
##.DIGITISER RES= 16
##SPECTROMETER/DATA SYSTEM= spect
##.PULSE SEQUENCE= zgpg30
##.SOLVENT NAME= CDCl3
##.SHIFT REFERENCE= (INTERNAL, CDCl3, 0, 248.564)
##AUDIT TRAIL= $$ (NUMBER, WHEN, WHO, WHERE, WHAT)
$$ ##TITLE= Audit trail, XWIN-NMR		Version 3.5
$$ ##JCAMPDX= 5.01
$$ ##ORIGIN= Bruker BioSpin GmbH
$$ ##OWNER= she
$$ F:/spectra/data/she/nmr/P31/1/pdata/1/auditp.txt
$$ ##AUDIT TRAIL=  $$ (NUMBER, WHEN, WHO, WHERE, WHAT)
(   1,<2021-09-27 12:59:02.67 +0400>,<she>,<DPX200>,
      <continue with go, POWCHK disabled, PULCHK disabled
       configuration hash MD5:
       00 E9 B6 7A A2 85 ED C7 34 08 36 98 17 FE 4E 26
       data hash MD5: 32K
       49 6E 34 F1 97 7C 18 ED E0 EC 56 95 7C EA 77 8E>)
(   2,<2021-09-27 13:00:44.07 +0400>,<she>,<DPX200>,
      <Start of raw data processing
       efp BC_mod = 2 LB = 1 FT_mod = 6 PKNL = 1 PHC0 = -8502.718 PHC1 = 183.2688 SI = 64K 
       data hash MD5: 64K
       98 1F 69 93 5A 3A B7 D0 F9 E1 05 23 78 75 32 B3>)
(   3,<2021-09-27 13:00:59.06 +0400>,<she>,<DPX200>,
      <pk PHC0 = 15.54554 PHC1 = 0 
       data hash MD5: 64K
       32 7E 37 8F 8B 1A 03 21 03 07 84 A2 A0 F3 A2 C5>)
(   4,<2021-09-27 13:01:06.06 +0400>,<she>,<DPX200>,
      <abs ABSG = 5 
       data hash MD5: 64K
       38 5D 88 67 1A 01 F2 80 A8 84 35 F6 02 AF BB 1B>)
$$ ##END=
$$ 
$$ hash MD5
$$ 45 23 24 BD 87 C1 A1 C1 04 27 77 12 A9 BD A1 41
##$RELAX= 
##$RELAX= 
##$RELAX= 
##$RELAX= 
##$RELAX= 
##$RELAX= 
##$RELAX= 
##$RELAX= 
$$ Bruker specific parameters
$$ --------------------------
##$DU= <F:/spectra>
##$EXPNO= 1
##$NAME= <P31>
##$PROCNO= 1
##$TYPE= <nmr>
##$USER= <she>
##$AMP= (0..31)
100 100 100 100 100 100 100 100 100 100 100 100 100 100 100 100 100 100 
100 100 100 100 100 100 100 100 100 100 100 100 100 100 
##$AQSEQ= 0
##$AQ_mod= 1
##$AUNM= <au_zg>
##$AUTOPOS= <>
##$BF1= 81.014009
##$BF2= 200.13
##$BF3= 200.13
##$BF4= 200.13
##$BF5= 200.13
##$BF6= 200.13
##$BF7= 200.13
##$BF8= 200.13
##$BYTORDA= 1
##$CFDGTYP= 0
##$CFRGTYP= 5
##$CHEMSTR= <none>
##$CNST= (0..31)
1 1 145 1 1 1 1 1 1 1 1 1 1 1 1 1 1 1 1 1 1 1 1 1 1 1 1 1 1 1 1 1 
##$CPDPRG= <waltz16>
##$CPDPRG1= <>
##$CPDPRG2= <waltz16>
##$CPDPRG3= <>
##$CPDPRG4= <mlev>
##$CPDPRG5= <mlev>
##$CPDPRG6= <mlev>
##$CPDPRG7= <mlev>
##$CPDPRG8= <mlev>
##$CPDPRGB= <>
##$CPDPRGT= <>
##$D= (0..31)
0 1 0 0 0 0 0 0 0 0 0 0.03 2e-05 3e-06 0 0 0 0 0 0 0 0 0 0 0 0 0 0 0 0 
0 0 
##$DATE= 1632732974
##$DBL= (0..7)
120 120 120 11 120 120 24 19 
##$DBP= (0..7)
150 150 150 150 150 150 150 150 
##$DBP07= 0
##$DBPNAM0= <>
##$DBPNAM1= <>
##$DBPNAM2= <>
$$ [...]
##$SUBNAM3= <"">
##$SUBNAM4= <"">
##$SUBNAM5= <"">
##$SUBNAM6= <"">
##$SUBNAM7= <"">
##$SUBNAM8= <"">
##$SUBNAM9= <"">
##$SW= 501.771253377433
##$SWIBOX= (0..15)
0 1 3 0 0 0 0 0 0 0 0 0 0 0 0 0 
##$SW_h= 40650.406504065
##$TD= 32768
##$TD0= 1
##$TE= 0
##$TE2= 300
##$TE3= 300
##$TEG= 300
##$TL= (0..7)
0 120 53 12 22 120 120 120 
##$TP= (0..7)
150 150 150 150 150 150 150 150 
##$TP07= 0
##$TPNAME0= <>
##$TPNAME1= <>
##$TPNAME2= <>
##$TPNAME3= <>
##$TPNAME4= <>
##$TPNAME5= <>
##$TPNAME6= <>
##$TPNAME7= <>
##$TPOAL= (0..7)
0.5 0.5 0.5 0.5 0.5 0.5 0.5 0.5 
##$TPOFFS= (0..7)
0 0 0 0 0 0 0 0 
##$TUNHIN= 0
##$TUNHOUT= 0
##$TUNXOUT= 0
##$USERA1= <user>
##$USERA2= <user>
##$USERA3= <user>
##$USERA4= <user>
##$USERA5= <user>
##$V9= 5
##$VALIST= <valist>
##$VCLIST= <CCCCCCCCCCCCCCC>
##$VD= 0
##$VDLIST= <DDDDDDDDDDDDDDD>
##$VPLIST= <PPPPPPPPPPPPPPP>
##$VTLIST= <TTTTTTTTTTTTTTT>
##$WBST= 1024
##$WBSW= 4
##$XGAIN= (0..3)
0 0 0 0 
##$XL= 0
##$YL= 0
##$YMAX_a= 2262
##$YMIN_a= -8806
##$ZGOPTNS= <>
##$ZL1= 120
##$ZL2= 120
##$ZL3= 120
##$ZL4= 120
##$ABSF1= 248.5645
##$ABSF2= -253.2056
##$ABSG= 5
##$ABSL= 3
##$ALPHA= 0
##$AQORDER= 0
##$ASSFAC= 0
##$ASSFACI= 0
##$ASSFACX= 0
##$ASSWID= 0
##$AUNMP= <proc_1d>
##$AZFE= 0.1
##$AZFW= 0.5
##$BCFW= 0
##$BC_mod= 2
##$BYTORDP= 0
##$COROFFS= 0
##$CY= -3
##$DATMOD= 1
##$DC= 0
##$DFILT= <>
##$DTYPP= 0
##$F1P= 0
##$F2P= 0
##$FCOR= 1
##$FTSIZE= 65536
##$FT_mod= 6
##$GAMMA= 0
##$GB= 0
##$INTBC= 1
##$INTSCL= 5.30512e-09
##$ISEN= 30
##$LB= 1
##$LEV0= 0
##$LPBIN= 0
##$MAXI= 10000
##$MC2= 0
##$MEAN= 0
##$ME_mod= 0
##$MI= 50
##$NCOEF= 0
##$NC_proc= -8
##$NLEV= 6
##$NOISF1= 182.463
##$NOISF2= 159.3651
##$NSP= 0
##$NTH_PI= 0
##$NZP= 0
##$OFFSET= 248.5645
##$PC= 4
##$PHC0= -8487.172
##$PHC1= 183.2688
##$PH_mod= 1
##$PKNL= yes
##$PPARMOD= 0
##$PSCAL= 0
##$PSIGN= 0
##$REVERSE= no
##$SF= 81.014009
##$SI= 65536
##$SIGF1= 159.3651
##$SIGF2= -187.1042
##$SINO= 113.3802
##$SIOLD= 16384
##$SREGLST= <1H.CDCl3>
##$SSB= 0
##$STSI= 65536
##$STSR= 0
##$SW_p= 40650.406504065
##$SYMM= 0
##$S_DEV= 0
##$TDeff= 32768
##$TDoff= 0
##$TI= <>
##$TILT= no
##$TM1= 0
##$TM2= 0
##$TOPLEV= 0
##$USERP1= <user>
##$USERP2= <user>
##$USERP3= <user>
##$USERP4= <user>
##$USERP5= <user>
##$WDW= 1
##$XDIM= 65536
##$YMAX_p= 444101282
##$YMIN_p= -187272094
$$ End of Bruker specific parameters
$$ ---------------------------------
##NTUPLES= NMR SPECTRUM
##VAR_NAME=  FREQUENCY,     SPECTRUM/REAL,   SPECTRUM/IMAG
##SYMBOL=    X,             R,               I
##VAR_TYPE=  INDEPENDENT,   DEPENDENT,       DEPENDENT
##VAR_FORM=  AFFN,          ASDF,            ASDF
##VAR_DIM=   65536,         65536,           65536
##UNITS=     HZ,            ARBITRARY UNITS, ARBITRARY UNITS
##FACTOR=    0.620285442955139, 1,           1
##FIRST=     20137.2065510759, 0,            0
##LAST=      -20513.1999529892, 0,           0
##MIN=       -20513.1999529892, -187272094,  0
##MAX=       20137.2065510759, 444101282,    0
$$ Real data points
##PAGE= N=1
##DATA TABLE= (X++(R..R)), XYDATA
$$ [...]
12921G05035R267472J530563k931599j878854p82039l720997p972273p379386
12913a3162078J56208Q635974R214395J118884n813072l185044M560655O329581
12905G855503k67460o673179o207818j914942L97475P26438K470293N306346N239046
12896F931702R29057l631899l875528k49905K887239L433528L592269M436974
12888A4453437K320826m943913j1346355q964007r825N392243M106439L364337
12880D373182O405746N369457m491754j2865385p379019O981614J3128478M665139
12872A6187458p270386j0305607m434610K754138O243089N291513J042127l208954
12864F298768l030118J996488O182303L890495l145514p320278m494341J49317
$$ plain form
12921 705035 9972507 11503070 8571471 6692617 5910578 2189581 -5782692 -13162078
12913 -13162078 -13005870 -4369896 4844499 5963383 150311 -3034733 1525922 7855503
12905 7855503 7588043 914864 -5292954 -7207896 -6810421 -6083983 -3613690 1692656 6931702
12896 6931702 7860759 4228860 353332 103427 2990666 6424194 10016463 14453437
12888 14453437 16774263 11830350 483995 -8480012 -8489837 -3097594 1008845 4373182
12880 4373182 10778928 16148385 11656631 -1208754 -8587773 -1606159 11522319 16187458
12872 16187458 8917072 -1388535 -5823145 -3069007 3174082 8465595 9507722 6298768
12864 6298768 3268650 5265138 11447441 15337936 12192422 4872144 377803 527120
12856E27120j726209r369376j1215888L47751J5881510J8291063M997278q319297
12848I413952q646255r00509L024520J349608N9530M26657p42451k313974m53274
12839A217804K904098K469534p67972j265765N99817q20082n075194m583723K809648
12830b511835Q920308O520501j243062o399242n587550p08556M823744P208961
12822A1023269L886130k896327p357011o887004m114915j459387J600936M282480
12814a921829K933571l196018q911417r125383m704275L69843M287869P078006
12806a3189633Q154500P264017N571996L480925k62578n321850q255467o292861
12798h850951m22589O316304J0567720Q309327j930520j3395906j4707217l508904
$$ plain form
12856 527120 -1199089 -10568465 -21784353 -21436602 -5555092 12735971 17733249 9413952
12848 9413952 767697 -132812 2891708 4241316 4300846 4727503 3985052 1671078 1217804
12839 1217804 4121902 6591436 5823464 4557699 5157516 4337434 -737760 -5321483 -2511835
12830 -2511835 6408473 12928974 11685912 5286670 -300880 -1009436 3814308 11023269
12822 11023269 14909399 12013072 4656061 -2230943 -6345858 -7805245 -6204309 -1921829
12814 -1921829 1011742 -2184276 -11095693 -20221076 -24925351 -24555508 -20267639 -13189633
12806 -13189633 -5035133 2228884 7800880 11281805 11019227 5697377 -2558090 -8850951
12798 -8850951 -9273540 -2957236 7610484 15919811 13989291 593385 -14113832 -17622736
12790a7622736Q654253J0380993M341890M91182L21573k294077o875973m984972
12782g587867M472339R722991K410692q786527r463826N08203P819975M919841
12774D015821j135684j007448L507187L384635m232787j1931232j1095107j841159
12766b0335774P462880R611250N663969J510453p44160l724660p008881n010170
12758a2575093L192455Q170023K032411q158294q636452J386547R400796Q879552
12750C691945O024903M481319k073420j4255655j7644339k234919J8080960K0636351
12742A6707145L981320j1543277j1168553k65251Q069822P415109j066986j0899092
12734A230237j2163371j551882Q898517M594838r428686j2858704L32891J1928225
$$ plain form
12790 -17622736 -8968483 1412510 5754400 6245582 6567155 4273078 -2602895 -7587867
12782 -7587867 -3115528 6607463 9018155 231628 -9232198 -8723995 -904020 4015821
12774 4015821 2880137 1872689 5379876 8764511 4531724 -7399508 -18494615 -20335774
12766 -20335774 -12872894 -3261644 2402325 3912778 3168618 -556042 -7564923 -12575093
12758 -12575093 -9382638 -1212615 819796 -7338498 -15974950 -14588403 -5187607 3691945
12750 3691945 9716848 14198167 12124747 -2130908 -19775247 -22010166 -3929206 16707145
12742 16707145 20688465 9145188 -2023365 -2288616 5781206 13196315 12129329 1230237
12734 1230237 -10933134 -12485016 -3586499 1008339 -8420347 -21279051 -20946160 -9017935
12726i017935O365686o737734q624752R68332O785154K826984r40350L513485
12718d861130J0258601R346409Q90577o138168n774740j091605J469116L90851
12710D489911j037815j699432m150663p387253m855744M599417J0134671K511372
12702B604464j0098003j1416097j26864Q977487O955397N99451j704132p28340
12694d936637Q93798M137441O886333L632266l346128m690630l66032j357856
12686H52555r307636j0563111P36484J0404286P034781O84763L446961O835906
12678A0124989k051776j4158949j0666001N793588J4540960Q161570m45594j310694
12670I988093J732299M027725O059764M960980l356158j2056191r548583O74944
$$ plain form
12726 -9017935 -2652249 -9389983 -18014735 -17046403 -10261249 -7434265 -8374615 -4861130
12718 -4861130 5397471 14743880 15634457 9496289 3721549 2629944 4099060 4489911
12710 4489911 3452096 1752664 -2397999 -9785252 -14640996 -10041579 93092 2604464
12702 2604464 -7493539 -18909636 -19036500 -10059013 -3103616 -2504165 -4208297 -4936637
12694 -4936637 -4042839 94602 6980935 10613201 7267073 2576443 2210411 852555
12686 852555 -8455081 -19018192 -18281708 -7877422 -842641 -157878 3289083 10124989
12678 10124989 8073213 -6085736 -16751737 -10958149 3582811 11744381 11298787 9988093
12670 9988093 11720392 15748117 21807881 26768861 23412703 11356512 1807929 2482873
12662B482873L055725n012395q982433k176511L448166p84965m843031K251327
12654a0561244J2930093J2545613J388308p154277n382882J729675N535964K587725
12646A3618975l761796o553189j916568N986625R549631O406192p76216r892573
12638A2661081j7299972j4546892R49356J4860417J0596534n368029r839317L222568
12630d764254J4225045R255576m60559j350927J4983o367951j1594556l376789
12622d419432P805032K030802j5993368k0396943k407648J7048278J8580220Q842188
12614A1089129M075793M688629R0034j0008580j3881433n846899N214062Q100046
12606C520781L165108n93822P39389J073475m894704j0726790n151516J0124154
$$ plain form
12662 2482873 5538598 526203 -8456230 -10632741 -7184575 -7969540 -12812571 -10561244
12654 -10561244 2368849 14914462 16302770 9148493 3765611 5495286 11031250 13618975
12646 13618975 9857179 3303990 1387422 7374047 16923678 23329870 22553654 12661081
12638 12661081 -4638891 -19185783 -18236427 -3376010 7220524 1852495 -7986822 -4764254
12630 -4764254 9460791 18716367 18255808 16904881 16919864 10551913 -1042643 -4419432
12622 -4419432 3385600 5416402 -10576966 -30973909 -33381557 -16333279 2246941 11089129
12614 11089129 15164922 19853551 19943585 9935005 -3946428 -9793327 -4579265 3520781
12606 3520781 6685889 6092067 6831456 7904931 3010227 -7716563 -12868079 -2743925
12598b743925J8215907P952178r862613j5563695n940529L891425K953591k762146
12590c859807l248904K16398K57875l003916k974365J498736M234758K102531
12582d776694l87558Q84715L433297L535892K449003K471662J183478m160962
12574D632833r378577p938086j884672j39892m699837o759146j54707Q876806
12566a7445278J1016414O869312L706748L571467K340012j667241n443531o714701
12558c766798n405441p05195P084212J2467215R167135p91039q180758p737158
12550B132173l314878j174726k888649n918809p020873m006629K386867P684750
12542a2120774P631675L118323j094559j606419J742798O768697Q908749L803900
$$ plain form
12598 -2743925 15471982 23424160 13561547 -2002148 -7942677 -4051252 -1097661 -3859807
12590 -3859807 -7108711 -6892313 -6634438 -9638354 -12612719 -11113983 -6879225 -4776694
12582 -4776694 -5164252 -4279537 -846240 2689652 5138655 7610317 8793795 4632833
12574 4632833 -4745744 -12683830 -14568502 -14708394 -19408231 -26167377 -26322084 -17445278
12566 -17445278 -6428864 440448 4147196 7718663 10058675 8391434 2947903 -3766798
12558 -3766798 -9172239 -9877434 -2793222 9673993 18841128 18050089 9869331 2132173
12550 2132173 -1182705 -2357431 -5246080 -11164889 -18185762 -22192391 -19805524 -12120774
12542 -12120774 -4489099 -1370776 -2465335 -4071754 -2328956 4439741 13348490 17152390
12534A7152390o034591j0900239n198960M650519Q903363O657480L206028M59046
12526A8895036k093241j879810J966993K854064l896375j0211766n592047N349112
12518E391966Q802524K604212l099050m336527o645348r754356n876192L779017
12510i133754P194683R93123l720970m19827L156725Q53551j307623J860266N028967
12501D505141L709288K033911J748170k485423r125864o747186N701658J2081941
12493A1421636L747216n859334m504845j286468o801007j0763423o28400J2132601
12485b542024Q616050n450710r504046k221579K89313m565091l744149L988270
12477a5133966N356494q02916j98709R183203J1276448Q23044o415550j764336
$$ plain form
12534 17152390 11117799 217560 -4981400 -330881 8572482 15229962 18435990 18895036
12526 18895036 16801795 14921985 16888978 19743042 15846667 5634901 42854 5391966
12518 5391966 14194490 16798702 13699652 9363125 2717777 -7036579 -12912771 -9133754
12510 -9133754 -1939071 -945948 -4666918 -5086745 -1930020 -1076469 -2384092 -523826 4505141
12501 4505141 8214429 10248340 11996510 9511087 385223 -6361963 -660305 11421636
12493 11421636 15168852 9309518 4804673 3518205 -3282802 -14046225 -14674625 -2542024
12485 -2542024 6074026 623316 -8880730 -11102309 -10812996 -15378087 -19122236 -15133966
12477 -15133966 -9777472 -10580388 -10779097 -1595894 9680554 10503598 4088048 2323712
12469B323712J855558m170960o819060L632060J2038392K305775j3305328j1706834
12461a3846685N043915J4566389Q741652P42621m75819r84904m881296n734095
12453C171778o43483K905449R41096P2071L132410R52138j0992849j8945520q232734
12444b7639644J2190410J8651277N305904q026088m886861N337935L976861q127261
12436c217467j2730679j733057J1891570J3321593M328961l434947m995875m075766
12428f45667l602965k255930Q84432L915138M391159J403105l408135n708030
12420e026893k505035K429032J985602l497227n257853M91533N488984J818264
12412d073593n285738n111665K938423J0078351J0987524P386217J491230n326701
$$ plain form
12469 2323712 4179270 8310 -6810750 -3178690 8859702 11165477 -2139851 -13846685
12461 -13846685 -8802770 5763619 14505271 15247892 14772073 13787169 8905873 3171778
12453 3171778 2528295 5433744 6374840 6446911 9579321 10531459 -461390 -19406910 -27639644
12444 -27639644 -15449234 3202043 8507947 481859 -4405002 932933 4909794 -3217467
12436 -3217467 -15948146 -17681203 -5789633 7531960 11860921 8425974 3430099 -645667
12428 -645667 -4248632 -6504562 -5620130 -1704992 2686167 4089272 681137 -5026893
12420 -5026893 -7531928 -5102896 -3117294 -6614521 -11872374 -11380841 -5891857 -4073593
12412 -4073593 -9359331 -14470996 -11532573 -1454222 9533302 16919519 18410749 13084048
12404A3084048q903488n668781Q34385L779220K449926J525497K899849M809535
12396A4810191O703925Q000697M918712l708942j0608578q592178j765750R15642
12388A0673719l41508P81040L227588Q29544m064992l145064K030645J227043
12380A1218015o138855q674581k214797L225676P08504l213046j827509O86657
12372f229936p13047j963062J649635O139656N791118J953182j477668m150141
12364I99737n848556m560647j717876j051219j82600N756241J0727137L054997
12356G177214j2197107j4290097J781501J4034812N998734q147163p579186K898378
12348a0322914N362740Q4304N49737O020046L923546m511276n225220K564700
$$ plain form
12404 13084048 4180560 -1488221 -653836 3125384 5575310 7100807 10000656 14810191
12396 14810191 21514116 29514813 34433525 30724583 20116005 11523827 9758077 10673719
12388 10673719 10332211 11113251 14340839 15170383 11105391 7960327 9990972 11218015
12380 11218015 5079160 -3595421 -5810218 -2584542 -1876038 -5089084 -6916593 -6229936
12372 -6229936 -6942983 -8906045 -7256410 -1116754 4674364 6627546 5149878 999737
12364 999737 -4848819 -9409466 -11127342 -12178561 -12361161 -6604920 4122217 7177214
12356 7177214 -5019893 -19309990 -17528489 -3493677 2505057 -5642106 -13221292 -10322914
12348 -10322914 -4960174 -4875870 -4326133 1693913 5617459 1106183 -4119037 -1554337
12340a554337M045153m959606j0448693l837914N427750P154498M437952L806030
12332D070833M732576M898457M471936J359549o317471j1269164m241210Q181405
12324E886911R070663k509317q842388k697490J033509p276949j3297063k955312
12316b1587436J1859910J1493659J12585k539509O067517Q779399k119488j3278008
12308a211371j1544799j471023M353463J862211l217626l865455K222323J0554621
12300b317656J2615082N060498m522027o189809m62591L707541K402162P22355
12292A1015555L075314O454864N177775k307146j2168446j7472150j2982124j534013
12284b0740371O811073O565428M055596O654826R663001L910098o582826p526035
$$ plain form
12340 -1554337 2490816 -2468790 -12917483 -16755397 -11327647 -4173149 264803 4070833
12332 4070833 8803409 13701866 18173802 19533351 13215880 1946716 -2294494 5886911
12324 5886911 14957574 12448257 3605869 908379 1941888 -5335061 -18632124 -21587436
12316 -21587436 -9727526 1766133 1878718 -660791 5406726 14186125 12066637 -1211371
12308 -1211371 -12756170 -14227193 -9873730 -8011519 -11229145 -15094600 -12872277 -2317656
12300 -2317656 10297426 15357924 10835897 4646088 4183497 7891038 10293200 11015555
12292 11015555 14090869 20545733 25723508 23416362 11247916 -6224234 -19206358 -20740371
12284 -20740371 -13929298 -7363870 -3308274 3346552 13009553 16919651 10336825 2810790
12276B810790L693283J1837827M993931q629660j2926052n370381K704223K966672
12268B080633j802503n406879o237245n636998l315329J974697Q543524J1688210
12260A888110Q946676L864713J640250J561258j499306o952581o669078K126336
12252D906378R201596M908775m122458m206305L609566M750825n260619j3081569
12244G06189q412569Q68839K693224j359718k589109n15557L34183K374319J0114751
12235D214552J6688276R657097q493733j8696482r517607O400213P894154p562203
12227E84267k0539653j3799657O423712J7934997R734649m974864o985633L486016
12219h136166R182952J942878o539674m490534K129579J391806m778481n505090
$$ plain form
12276 2810790 6504073 18341900 23335831 14706171 1780119 -3590262 -886039 2080633
12268 2080633 278130 -5128749 -11365994 -17002992 -20318321 -18343624 -9800100 1888110
12260 1888110 10834786 14699499 16339749 17901007 16401701 9449120 2780042 4906378
12252 4906378 14107974 19016749 14894291 10687986 14297552 19048377 13787758 706189
12244 706189 -7706380 -6837541 -4144317 -5504035 -8093144 -8608701 -8274518 -5900199 4214552
12235 4214552 20902828 30559925 22066192 3369710 -6147897 252316 8146470 584267
12227 584267 -19955386 -33755043 -27331331 -9396334 338315 -4636549 -11622182 -8136166
12219 -8136166 1046786 2989664 -3550010 -8040544 -5910965 -4519159 -9297640 -14802730
12211a4802730L53775M424279M599602O212937Q285724L720009m766942m344982
12203C681672O749112J2383693K110931j1087700r400575K730834N847373m334074
12195H681266j0997421l010068P566407L658598j0859920j5845162l014038J2617938
12187a1202400J3156382P40735p886554m939371P80176J48041l229622j793577
12179a4226190K670087L510117J865976M298373R503259Q257049j693151j0259004
12171C926516q591090o64752L693127J890009p74580k17930J761312J043784l440728
12162a374332p814161o664246J73885N585149L349183l000853m440192J150250
12154a3035317O807525O926261L468494N78106o49476j77676K207383M111020
$$ plain form
12211 -14802730 -14448955 -10024676 -5425074 787863 9073587 12793596 8026654 3681672
12203 3681672 10430784 22814477 24925408 13837708 4437133 7167967 13015340 8681266
12195 8681266 -2316155 -5326223 2240184 5898782 -4961138 -20806300 -23820338 -11202400
12187 -11202400 1953982 2694717 -5191837 -10131208 -9351032 -9202991 -12432613 -14226190
12179 -14226190 -11556103 -8045986 -6180010 -1881637 7621622 15878671 14185520 3926516
12171 3926516 -4664574 -5329326 -1636199 253810 -520770 -738700 1022612 2066396 -1374332
12162 -1374332 -9188493 -15852739 -15678854 -10093705 -6744522 -9745375 -14185567 -13035317
12154 -13035317 -6227792 698469 4166963 4745069 4095593 3917917 6125300 10236320
12146A0236320J993354l129390o946068q949758j1157318j0192016p31054J1887226
12138a6988704J4545125N671233j092673J421683K600698n716333j1801375k149896
12130a3510242J3404694J3501857k594685j3634232p274335M960878P431116N32021
12122B817072n302879m961270r02247K996992M069516J659444j478262k047184
12114c148818r41061o32170P22679N662772R356870M456098n655228q771952j469704
12105d20514N471029L516789j653069j174813K367557k6816q984683j5254048
12097a6158568j1356157O00707J1462793J2316911J868702j0702272j3423838
12090b5391722m539816N764201Q446824N110449J718065m27507k189149j221036
$$ plain form
12146 10236320 12229674 9100284 2154216 -6795542 -17952860 -28144876 -28875930 -16988704
12138 -16988704 -2443579 3227654 2134981 3556664 6157362 441029 -11360346 -13510242
12130 -13510242 -105548 13396309 10801624 -2832608 -10106943 -5146065 2285051 2817072
12122 2817072 -2485807 -7447077 -8349324 -5352332 -1282816 376628 -1101634 -3148818
12114 -3148818 -4089879 -4722049 -3999370 1663402 11020272 15476370 9821142 1049190 -420514
12105 -420514 5050515 8567304 6914235 5739422 8106979 8080163 -904520 -16158568
12097 -16158568 -27514725 -26914018 -15451225 -3134314 -1265612 -11967884 -25391722
12090 -25391722 -29931538 -24167337 -15720513 -10610064 -8891999 -9319506 -11508655 -12729691
12082a2729691L674038P107970L808762k187300l082325Q4542m78054n018004
12074h820062m321772M881464J2220245P918081k388936n876354j452689R286
12066B169263n964207j0046181m522004L672771M007406l69578J738167R558529
12058B44166R961668p36234q694619l460152N445676M125797l228902k257375
12050A400025O856776R418461K18689r060186r534258o625777n635346n65244
12042a3526860J2172678K0587318J1469392q354500j8680397j1727366L08578
12035g751157L558153j726785n865700k625712N878166J2707572J2281030N550772
12027B2006339o88421j710651l17747j263514l298541k299326O7817j700609o679153
$$ plain form
12082 -12729691 -9055653 -1947683 1861079 -326221 -3408546 -3324004 -3802058 -8820062
12074 -8820062 -13141834 -8260370 3959875 11877956 9489020 3612666 2159977 2169263
12066 2169263 -3794944 -13841125 -18363129 -14690358 -10682952 -11052530 -9314363 244166
12058 244166 10205834 9469600 774981 -2685171 2760505 6886302 3657400 1400025
12050 1400025 8256801 17675262 17893951 8833765 -700493 -7326270 -12961616 -13526860
12042 -13526860 -1354182 19233136 30702528 22348028 3667631 -8059735 -7751157
12035 -7751157 -4193004 -5919789 -11785489 -14411201 -8533035 4174537 16455567 22006339
12027 22006339 21317918 19607267 19289520 18026006 14727465 12428139 12495956 10795347 4116194
12018D116194p332984j492377L341814J538125k057055j087533Q31797l600189
12010e742208j0737701q417062N270594J5692097J0396621l013099o897548K019843
12002a428463R289546M804901l166544k409902L817721K598646p553507j3670211
11994g717813p461396L305623P001895L309006p3827J94355J382040J844434K601860
11985D386177L086726J578541l92376N46751L653059M441276J479618j962505
11977A6817267l846401n802783p827487n919835J220964P473209O546734J355909
11969A0017577L3890L418935L452114m069670j1754512j0416811k009290L608226
11961g719541K365636o88157j209525r27386j349527K29773M169303M607574j627846
$$ plain form
12018 4116194 -3216790 -4709167 -1367353 170772 -1886283 -2973816 -2142019 -5742208
12010 -5742208 -16479909 -24896971 -19626377 -3934280 6462341 3449242 -3448306 -1428463
12002 -1428463 7861083 12665984 9499440 7089538 10907259 13505905 5952398 -7717813
11994 -7717813 -15179209 -11873586 -4871691 -1562685 -1636512 -1442157 -60117 1784317 4386177
11985 4386177 7472903 9051444 8659068 9205819 12858878 17300154 18779772 16817267
11977 16817267 12970866 7168083 -659404 -6579239 -5358275 2114934 8661668 10017577
11969 10017577 10051467 13470402 16922516 12852846 1098334 -9318477 -11327767 -7719541
11961 -7719541 -5353905 -6042062 -7251587 -8178973 -9528500 -9298727 -5129424 -521850 -2149696
11952b149696p459779m681316K769287L661461l385291p182405m98041R302580
11944i623200J0984348M619907k13579J789461N839762M643304k631886j0139830
11936E268287j1866206p125272k81443L969952M325899K251956l38373j571983
11928e367183R0954L617304N061378K376365q64940p9232L152156K895907k243530
11919H639179o592631m955602R57830N292173M650832N99874k565225j799508
11911D226922J554751K769029o98274n668136p238775m794456j484218N44984
11903a0788173J287678R06880j08644l45924L02838L44464J002724O017722J3117775
11894A1737340J2337266K00351j0880247p890664L036657N104769l722400q862073
$$ plain form
11952 -2149696 -9609475 -14290791 -11521504 -7860043 -11245334 -18427739 -18925780 -9623200
11944 -9623200 1361148 5981055 5767476 7556937 13396699 18040003 15408117 5268287
11936 5268287 -6597919 -13723191 -14004634 -10034682 -5708783 -3456827 -3795200 -5367183
11928 -5367183 -5276229 -1658925 3402453 5778818 4913878 4834646 7986802 10882709 8639179
11919 8639179 2046548 -2909054 -1951224 3340949 7991781 8591655 6026430 4226922
11911 4226922 5781673 8550702 7852428 2184292 -5054483 -9848939 -11333157 -10788173
11903 -10788173 -9500495 -8593615 -8702259 -9048183 -8745345 -8400881 -7398157 -1380435 11737340
11894 11737340 24074606 24274957 13394710 5504046 8540703 13645472 9923072 1060999
11886A060999l210033K869798K17834n211002m813894j460807j810762l990163
11878a6348030k543825J357572L338747L718318M488483L828893N38210j266683
11870b888315J632885N467810N199195J377712l159499p331201q576661l441297
11862a1719371M034110L933252l742845n879190L138463R705311J621433j0735600
11854i644437r279047L801391J0340371M268428k417386j429235Q37383k410284
11846e932816o770807n038308K016902Q117014Q714556L363749m057259o967091
11838f554060k817945K744154L381290J012307J202148L305072K949389R76494
11830F198849J246421K382234O43811j727692m03198J522090k063149q589319
$$ plain form
11886 1060999 -2149034 720764 938598 -4272404 -9086298 -10547105 -12357867 -16348030
11878 -16348030 -18891855 -17534283 -14195536 -10477218 -5988735 -2159842 -1621632 -2888315
11870 -2888315 -1255430 4212380 9411575 10789287 7629788 298587 -8278074 -11719371
11862 -11719371 -7685261 -3752009 -7494854 -13374044 -10235581 -530270 1091163 -9644437
11854 -9644437 -18923484 -15122093 -4781722 -513294 -2930680 -4359915 -3522532 -5932816
11846 -5932816 -12703623 -17741931 -15725029 -7608015 1106541 4470290 413031 -6554060
11838 -6554060 -9372005 -6627851 -3246561 -2234254 -1032106 2272966 5222355 6198849
11830 6198849 7445270 9827504 10471315 8743623 8340425 9862515 7799366 -789953
11822g89953r783770m581171R38245M378954P464506Q194241L790950q83576M52350
11813I180776L547791N01039m603299j692836O034417N558568l782966r157186
11805E586304o260461m009951m714409N23777J1100434J1822974k275822j4293902
11797b521056r931257K277751P098924M427358K199791M71100l719625n945943
11789e642957j731279M060028N456543M114514J554933n665165j4133470j1105094
11781b3091947M682767J4708826P262677k998570P09732Q709402K275698j2696044
11773d37459j4754521k186308O782360N670580N739844J0194924P908864k890125
11765A6028159q079053j785509L552585o70808o006352m992089m440624r535445
$$ plain form
11822 -789953 -10573723 -15154894 -14216649 -9837695 -2373189 5821052 9612002 8728426 9180776
11813 9180776 12728567 13229606 8626307 6933471 12967888 18526456 14743490 5586304
11805 5586304 -674157 -4684108 -9398517 -8874740 2225694 14048668 11772846 -2521056
11797 -2521056 -12452313 -10174562 -3075638 1351720 3551511 4022611 302986 -5642957
11789 -5642957 -7374236 -3314208 2142335 6256849 7811782 2146617 -11986853 -23091947
11781 -23091947 -18409180 -3700354 3562323 563753 1273485 9982887 12258585 -437459
11773 -437459 -15191980 -17378288 -10595928 -4925348 814496 11009420 18918284 16028159
11765 16028159 7949106 6163597 9716182 9045374 3039022 -1953067 -6393691 -15929136
11757a5929136j0752632o010J2846772J3555806M332355j684625K38497M381208
11749F982235O364690O123862K875983l467047q382645p608289l552236j251847
11741a915294j113614n64961P68748J948283K792647J729310l043506p269837
11733f668224l148746P463993J1545527L457069m707526j264806N746983J272167
11725A3696437j0972661j2438247J316402J2754336Q067845l898080o976380q43526
11717G06126K466661j160014l464777J251208P160206O009396j435776p358404
11709D174626o813685j768153K978931M248140J335931m115555q100780o681688
11701a4742233l39919N497108O164334L076965J294226K342719K248627k311588
$$ plain form
11757 -15929136 -26681768 -26687778 -13841006 -285200 4047155 2362530 2601027 6982235
11749 6982235 13346925 19470787 22346770 18879723 10497078 2888789 -663447 -1915294
11741 -1915294 -3028908 -3593869 -2825121 -876838 1915809 3645119 601613 -6668224
11733 -6668224 -9816970 -2352977 9192550 12649619 7942093 6677287 12424270 13696437
11725 13696437 2723776 -9714471 -8398069 4356267 12424112 8526032 1549652 706126
11717 706126 3172787 2012773 -1452004 -200796 6959410 12968806 11533030 4174626
11709 4174626 -2639059 -4407212 -1428281 2819859 4155790 40235 -8060545 -14742233
11701 -14742233 -15082152 -9585044 -3420710 -343745 950481 3293200 5541827 3230239
11693C230239q229687q884995k515970M856543O356854K569253K95495L248151
11685I25883P381281O947824J892651l472427o091277n062218m28173M253427
11677F346971K230018o699614j0955645j554940J1447065J0077482m591181j2483845
11669f183689m541684N016515L826768J37321L759827O011754l267360j3305643
11661h546191q709611K841581L140977m329396j012147J2357693J6219331O767742
11653A8729979J064994M152907R84990j1202110j3167791Q10577P651939o071482
11645B954003j8213402o734076J3156562J4721234K277312k105609J388734l652513
11637C792245j4189368j1731748K371443P665243J22973l193522L029862M182047
$$ plain form
11693 3230239 -4999448 -13884443 -16400413 -11543870 -5187016 -2617763 -2322268 925883
11685 925883 8307164 15254988 17147639 13675212 7583935 2521717 2093544 6346971
11677 6346971 8576989 1877375 -9078270 -10633210 813855 10891337 6300156 -6183689
11669 -6183689 -10725373 -5708858 -1882090 -1744769 2015058 8026812 4759452 -8546191
11661 -8546191 -17255802 -14414221 -11273244 -15602640 -16614787 -4257094 11962237 18729979
11653 18729979 19794973 23947880 24932870 13730760 562969 1373546 9025485 2954003
11645 2954003 -15259399 -21993475 -8836913 5884321 8161633 6056024 7444758 3792245
11637 3792245 -10397123 -22128871 -19757428 -12092185 -11969212 -15162734 -12132872 -7950825
11629g950825m627999q698835j452473L674447j122380m135309K809248R114700
11621a2389426N608219L76060J801431L985497J611986J499531O351543N027516
11613A3872357o571288j2845725l171660P938898M029796n848167m145786M392074
11605b349501K847741o691273p100127L682790J0241142N661466j362789m963176
11597c3727p906680q781476k347029O230085N600536j879196k344857N740817
11589e721527Q476485M73875o722503n202938j597001j032268K009141Q690373
11581f26363Q891378o58629p206430k257454L870824M56587m924117j191182N210840
11572A565454J724120o923137n644987N562807J1425721N180306m065803q387556
$$ plain form
11629 -7950825 -12578824 -21277659 -22730132 -19055685 -20178065 -24313374 -21504126 -12389426
11621 -12389426 -6781207 -6405147 -4603716 -618219 993767 2493298 8844841 13872357
11613 13872357 7301069 -5544656 -8716316 -777418 3252378 -2595789 -6741575 -2349501
11605 -2349501 498240 -6193033 -13293160 -9610370 630772 6292238 4929449 -33727
11597 -33727 -7940407 -16721883 -19068912 -12838827 -7238291 -9117487 -11462344 -5721527
11589 -5721527 2754958 3228833 -3493670 -8696608 -10293609 -11325877 -9316736 -626363
11581 -626363 8265015 7606386 399956 -1857498 2013326 2469913 -2454204 -3645386 1565454
11572 1565454 3289574 -3633563 -9278550 -3715743 7709978 12890284 8824481 436925
11564D36925j0086252j0979380o621947L502742J0832285Q774534J359359l795709
11556f577443m741967l572679j530759L14879K77513q74400j54686K350839L116451
11547a1392252J704056J953007M360119L771991j385064m003034J520087R001362
11539E530272Q073897o39509o347326l854663Q9592j076925l241662M24203O356032
11530E313911M500752n504564j1304328m473564P013378R115275L7532q931415
11522d233023q680871j079956O885879J0500220Q016141Q55447n092458m435000
11514B736379L1858R84138j503321o06753L022827j79204j0272840j1553424L936447
11505a3403893J8575774J1465637r072356j5223753J62324J4247082Q970287m930642
$$ plain form
11564 436925 -9649327 -20628707 -27250654 -23747912 -12915627 -4141093 -2781734 -6577443
11556 -6577443 -11319410 -14892089 -16422848 -16107969 -15830456 -16704856 -16859542 -14508703 -11392252
11547 -11392252 -9688196 -7735189 -3375070 396921 -988143 -4991177 -3471090 5530272
11539 5530272 13604169 12964660 6617334 2762671 2852263 1775338 -1466324 -1042121 5313911
11530 5313911 9814663 4310099 -6994229 -11467793 -4454415 4660860 4698392 -4233023
11522 -4233023 -12913894 -13993850 -7107971 3392249 11408390 12263837 7171379 2736379
11514 2736379 2768237 3752375 2249054 1642301 4665128 4485924 -5786916 -17340340 -13403893
11505 -13403893 5171881 16637518 7565162 -7658591 -7496267 6750815 15721102 10790460
11497A0790460q396933j970381P68752l380801n694070j984021K819863M645241
11489b401890M461783L321456J000063j446565l386210o122597q001401l599061
11481a6174422N881748Q928413k5926q306345k039987J0808215J1062661j373700
11473H760657p427629k26772M521557l588409j1679467n986816M903525N720807
11465e002547K87943K402790R655410P483311l953137q107314P90072Q199745
11457A1756273L090767n161403l170812N808668Q965877L246261l834412p678871
11449A3022348r998666j0616034n744208M068276J1206279R314037Q54926o253332
11441E853626p752498o136562m777501k353595L409471Q382363N278344m002324
$$ plain form
11497 10790460 2393527 423146 1191898 -2188903 -7882973 -9866994 -7047131 -2401890
11489 -2401890 2059893 5381349 6381412 4934847 1548637 -4573960 -12575361 -16174422
11481 -16174422 -10292674 -1364261 -1390187 -9696532 -11736519 -928304 10134357 8760657
11473 8760657 1333028 1106256 5627813 2039404 -9640063 -15626879 -10723354 -5002547
11465 -5002547 -4714604 -2311814 7343596 14826907 10873770 2766456 3556528 11756273
11457 11756273 14847040 9685637 6514825 12323493 21289370 24535631 20701219 13022348
11449 13022348 3023682 -7592352 -13336560 -9268284 1937995 11252032 12106958 5853626
11441 5853626 -1898872 -8035434 -12812935 -15166530 -11757059 -3374696 1903648 -2098676
11433b098676p391967M72369Q515067N366245k401433j295758N535172L089011
11425I790030q676873j2714100l243618M226656j19843l547339N082046J2519628
11417C316587K232993j5049790j5133036K395582J4309874R191709k1973j256509
11409a4563L99437j637230j984823M239895R373137M825813m748305q898548o022439
11400d467626j982635L18032K107838L325853K556848J92589k296288l963344
11392d208733l415664K53264M515491N714799M669850M792744N027681J389408
11384A8738840m714447p550986o451628n395618l431523L665635J1280327Q328235
11376A4468835m663791j2803834p897445J79255M02013l312892k278876J598104
$$ plain form
11433 -2098676 -9490643 -9018274 -503207 4863038 2461605 1165847 6701019 9790030
11425 9790030 1113157 -11600943 -14844561 -10617905 -10737748 -14285087 -9203041 3316587
11417 3316587 5549580 -9500210 -24633246 -22237664 -7927790 1263919 1241946 -14563
11409 -14563 384874 -1252356 -3237179 1002716 10375853 15201666 10453361 1554813 -4467626
11400 -4467626 -6450261 -6132229 -4024391 -698538 1858310 2050899 -245389 -4208733
11392 -4208733 -7624397 -7371133 -2855642 2859157 7529007 12321751 17349432 18738840
11384 18738840 14024393 6473407 21779 -5373839 -8805362 -5139727 6140600 14468835
11376 14468835 9805044 -2998790 -10896235 -10716980 -10314967 -13627859 -15906735 -14308631
11368a4308631J669199o71725l6622K571395L097246K293700K025217L60258k179716
11359e179679J71965O908663P012747l785527j2347045p002966L692558N517264
11351e012020J213780J417285K925104l381674j0598259n307083N355471J864354
11343a1523042j2843204j4073123M186517J6976456P246167q209859p445665L460443
11335b2225310N452009j744745m306775M17558M396741P366703J4531219K0190029
11327B4077429J3385665j380798p631278k286802n6806q752799j6692130j1892866
11319a1230385j46793N648917M178976L212145M927534M364094k04050m293656
11311F456782m314460j274284K484452N028400L672373k494483q467682p114142
$$ plain form
11368 -14308631 -12639432 -13311157 -13347779 -10776384 -7679138 -5385438 -3360221 -2999963 -5179679
11359 -5179679 -5007714 1900949 8913696 5128169 -7218876 -14221842 -10529284 -5012020
11351 -5012020 -3798240 -2380955 544149 -2837525 -13435784 -18742867 -13387396 -11523042
11343 -11523042 -24366246 -38439369 -34252852 -17276396 -10030229 -18240088 -25685753 -22225310
11335 -22225310 -16773301 -18518046 -22824821 -22407263 -18010522 -10643819 3887400 24077429
11327 24077429 37463094 36082296 28451018 26164216 26107410 17354611 662481 -11230385
11319 -11230385 -11377178 -5728261 -1549285 1662860 6590394 10954488 10750438 6456782
11311 6456782 2142322 868038 3352490 8380890 12053263 9558780 1091098 -6023044
11303f023044J306441Q257429P685768K669850j714278o241738j2303914j4016186
11295b0379672n076370Q222901J1735129L127301l950968j41161N912410K662474
11287B112044m858357l343850O248742R191969q5563r427110p200162K292320
11279e069967P757378O383859L074811O98238r70174n14856L189381N986648K224460
11270B2759778o316078j0897803o852263O0328J247002l107502m224580K799343
11262d531775J0842190R171132j990862j1204232j0410698l164350L605656Q155059
11254D72120R890737N416787l725537p163565K40174P040104M19543j2545762
11246D4601j4006179k858076M298498L28592l122793J626196M987186j011199
$$ plain form
11303 -6023044 -4716603 3540826 11226594 13896444 12182166 5940428 -6363486 -20379672
11295 -20379672 -25456042 -17233141 -5498012 -2370711 -6321679 -6462840 -550430 2112044
11287 2112044 -2746313 -6090163 158579 9350548 9264985 -162125 -7362287 -5069967
11279 -5069967 2687411 9071270 12146081 12844319 11874145 11359289 14548670 20535318 22759778
11270 22759778 16443700 5545897 -1306366 -1246038 964 -3106538 -7331118 -4531775
11262 -4531775 6310415 15481547 13490685 2286453 -8124245 -11288595 -7682939 472120
11254 472120 10362857 15779644 12054107 4890542 5130716 12170820 12590363 44601
11246 44601 -13961578 -16819654 -12521156 -12192564 -15315357 -13689161 -8701975 -9713174
11238i713174p283629l969394J866445j37318l814369K395665J2640032J1052617
11230C036875j667534q127149j479131M836321n81255r782642q528968L376116
11222a8917367J3331883J1970850J572328q129442q551185L16544Q713846O586229
11214F893686m423200j2359682r207776R56759R050573J0657675O767221O80916
11206I016172k769725j26243N128885M814253k492219p638375l516737L851950
11198F267961L844974l222542p699783n618393k399688j421694O14635M016677
11190e617853K568577m238944n645859M195046J3179269P344028o153576q265600
11182b634912K189114O667472k581125r887098k671494P757020N783314l226724
$$ plain form
11238 -9713174 -16996803 -20966197 -19099752 -19237070 -23051439 -20655774 -8015742 3036875
11230 3036875 1369341 -6757808 -8236939 -3400618 -3981873 -13764515 -22293483 -18917367
11222 -18917367 -5585484 6385366 7957694 -171748 -8722933 -8406389 307457 6893686
11214 6893686 2470486 -9889196 -19096972 -18140213 -9089640 1568035 8335256 9016172
11206 9016172 6246447 6120204 11249089 16063342 13571123 5932748 2416011 6267961
11198 6267961 10112935 6890393 -809390 -6427783 -8827471 -10249165 -9634530 -5617853
11190 -5617853 -3049276 -7288220 -12934079 -8739033 4440236 11784264 5630688 -2634912
11182 -2634912 -445798 6221674 3640549 -6246549 -8918043 -1161023 4622291 1395567
11174A395567m502829Q08274J264317k286699n98998L013727k132076j0674033
11166a3712750o817862O004866O422143q890409j6328674k656254J3395564J1753859
11158a0829517J210692J74790N833995M463473j693432j177631L032123j78209
11150H36284o982893m714177L526389L308568m277780l517243P360453J1608985
11142G148586K291313o502129l987439J447882J62397k593324N3334K340839j951096
11133a589637n297244J396364J1336487J0902475N78151o554243m346767L67132
11125F792718O14273j963671k490959L12296M380417O650973M439343j831246
11117A6904144p083050n950041Q99758O759172N344265l283613j2282537j3605204
$$ plain form
11174 1395567 -3107262 -2298988 -1034671 -3321370 -3920368 -906641 -3038717 -13712750
11166 -13712750 -20530612 -14525746 -8103603 -16994012 -33322686 -35978940 -22583376 -10829517
11158 -10829517 -9618825 -9444035 -3610040 853433 -839999 -2017630 1014493 836284
11150 836284 -6146609 -10860786 -7334397 -4025829 -8303609 -11820852 -4460399 7148586
11142 7148586 9439899 2937770 -1049669 398213 560610 -2032714 -1979380 361459 -1589637
11133 -1589637 -6886881 -5490517 5845970 16748445 17326596 10772353 6425586 6792718
11125 6792718 7406991 5443320 2952361 3264657 7645074 14296047 18735390 16904144
11117 16904144 9821094 3871053 4770811 11529983 16874248 13590635 1308098 -12297106
11109a2297106o079048K409948L769719l2351k20489N502477R504271O147971
11101H705392L66778k79119L196787L974789K03055l389766l747970l565438n755790
11092b91282p808914m669432L549535R412701N923055m023512r435488m425653
11084a1768990M005539N464497L11606k030407K293008O200059K708049n091707
11076B091654q712201m931466J577028M191543J130156k509327j04108P202685
11068f4036R622636J734583p586553o404920K076807M036063k656258m886987
11060d128665K984790Q151523N11657q856738m725104O582778O289405o425280
11052C84366j2095125p46483J3282124J2841249O06744q850261r471357n853593
$$ plain form
11109 -12297106 -18376154 -15966206 -12196487 -12228838 -12449327 -6946850 2557421 8705392
11101 8705392 9072170 8793051 11989838 15964627 16167682 12777916 9029946 5464508 -291282
11092 -291282 -8100196 -12769628 -9220093 192608 6115663 2092151 -7343337 -11768990
11084 -11768990 -7763451 -2298954 -1987348 -4017755 -1724747 4475312 7183361 2091654
11076 2091654 -6620547 -11552013 -9974985 -5783442 -4653286 -7162613 -7266721 -64036
11068 -64036 9558600 11293183 3706630 -2698290 -621483 3414580 758322 -4128665
11060 -4128665 -1143875 7007648 7519305 -1337433 -6062537 520241 6809646 384366
11052 384366 -11710759 -12457242 824882 13666131 14272875 5422614 -4048743 -9902336
11044i902336j860333K088317L861199J604705n37698K717592P876315O073808
11036A1921569l039920r276371o058800J166124M262210L033516J612436N45607
11028D166371j221223j431049J452047L232146K93702k726742N2310M349068J586455
11019I753085n695652o414609N80374L976787p31854l600929J276598L723159
11011B866959m848358j3711090p843008P269010J2630949L912079m112850j271201
11003e107510N626918P186133M261851J083679k837720p267581o797835R80779
10995b871286R120713R318023K003231n711527q169858m583682J275628L029474
10987C410716j777941o445917k780150N785235P535212O08026l003998L526931
$$ plain form
11044 -9902336 -11762669 -9674352 -5813153 -4208448 -4746146 -2028554 5847761 11921569
11036 11921569 8881649 -394722 -6453522 -5287398 -1025188 2008328 3620764 4166371
11028 4166371 2945148 1514099 2966146 6198292 6491994 3765252 3817562 8166630 9753085
11019 9753085 4057433 -2357176 -1776802 2199985 1468131 -2132798 -856200 2866959
11011 2866959 -1981399 -15692489 -23535497 -16266487 -3635538 276541 -3836309 -5107510
11003 -5107510 519408 7705541 11967392 13051071 10213351 2945770 -3852065 -2871286
10995 -2871286 6249427 15567450 17570681 11859154 3689296 -894386 381242 3410716
10987 3410716 1632775 -4813142 -7593292 -1808057 5727155 6335181 3331183 6858114
10979F858114R790383L964179p687581q930881K382109J0132519J453539j5910152
10971B052229k2523013j0442408P333021J2498466L854682k229863M294125J1733024
10963F570263M081925j3092814j8787856o751432O904434R079248O032894P405876
10955A442538R517856N414948j095745l656875n216157r347636r502435m69473
10947a2912979Q282832N717417j850986j219551M700397K795563n290487m752519
10939d530313N364484P680774n378248j7468423j1902958M780311J3581455P382428
10931d90490n315517j3504204j1925409k180785P207962P105212k80800k103867
10923b1487898O662997J3225891M194679j3246946j8677010n320617J1039382
$$ plain form
10979 6858114 16648497 20612676 12925095 3994214 6376323 16508842 17962381 2052229
10971 2052229 -20470784 -30913192 -23580171 -11081705 -7227023 -9456886 -5162761 6570263
10963 6570263 10652188 -2440626 -21228482 -27979914 -21075480 -11996232 -5963338 1442538
10955 1442538 10960394 16375342 15279597 11622722 6406565 -2941071 -12443506 -12912979
10947 -12912979 -4630147 1087270 -763716 -1983267 2717130 5512693 222206 -4530313
10939 -4530313 834171 8514945 3136697 -14331726 -26234684 -21454373 -7872918 -490490
10931 -490490 -5806007 -19310211 -31235620 -33416405 -26208443 -19103231 -19384031 -21487898
10923 -21487898 -14824901 -1599010 2595669 -10651277 -29328287 -34648904 -23609522
10916b3609522J2472797L22809q992327n607956L088140M714550p34618k429393
10908b0775520L525159P267887R35988p390275n106929N233639R850740M753502
10900a705809o49561j134163k400482o759034o435563J895324Q514349N607563
10892c067376R4987J353098N447722L187746l455009n407244j873581O70100J472256
10883a577301N341507J1146321J2011597O897737J764112j096971n166123j0361893
10875A8958986j1197208o384174j878885j614182k410787j065224j48082l037626
10867h777182p476053p479454p6885J0617712J5395549Q574702l518605p567736
10859c07952m11876N662906J095235n922169l326555L671751P94378j0149333
$$ plain form
10916 -23609522 -11136725 -10813916 -19806243 -25414199 -22326059 -17611509 -18346127 -20775520
10908 -20775520 -17250361 -9982474 -9046486 -16436761 -21543690 -16310051 -6459311 -1705809
10900 -1705809 -2355370 -3489533 -5890015 -12649049 -19084612 -17189288 -8674939 -3067376
10892 -3067376 -2972389 -1619291 3828431 7016177 3561168 -1846076 -3719657 -3049557 -1577301
10883 -1577301 3764206 14910527 26922124 33819861 35583973 34487002 29320879 18958986
10875 18958986 7761778 1377604 -501281 -2115463 -4526250 -5591474 -5739556 -8777182
10867 -8777182 -16253235 -23732689 -23809574 -13191862 2203687 10778389 7259784 -307952
10859 -307952 -719828 4943078 6038313 116144 -3210411 461340 1255718 -8893615
10851h893615j2355437p07853J0564328J0684615N698814L008911p50125p478683
10843b29045q600060K62108Q339742N753463l95090J211965O707676M166948o746496
10834A0471211j5225606j4448437n786996O163454J3378536P445813o727546j0243309
10826a4972880M032671J6384617P445786j0708409j2082851K938026J0187969
10819C224929J193625p150683m358290p38130l046762j222559R374141J5137535
10811A2413806P465418j012845J324406M767611k645463j1995262r011369M33800
10803A740102J382371l635310j006050P656401Q101116l68422l100861M389232
10795A5158579Q969635K123653p282850q386593k911195J567299J937587j723216
$$ plain form
10851 -8893615 -21249052 -21956905 -11392577 -707962 4990852 7999763 7249638 -229045
10843 -229045 -8829105 -8566997 -227255 5526208 5131118 6343083 13050759 17217707 10471211
10834 10471211 -4754395 -19202832 -24989828 -18826374 -5447838 1997975 -4729571 -14972880
10826 -14972880 -10940209 5444408 12890194 2181785 -9901066 -6963040 3224929
10819 3224929 4418554 -2732129 -7090419 -7828549 -10875311 -12097870 -2723729 12413806
10811 12413806 19879224 18866379 20190785 24958396 22312933 10317671 1306302 1740102
10803 1740102 3122473 -512837 -1518887 6137514 14238630 13870208 10769347 15158579
10795 15158579 24128214 26251867 18969017 10582424 7671229 9238528 11176115 9452899
10787I452899p894370j0295326k663794R718310J3470858N715537j596766n05973
10779A5401375J502237l953246j0939091q653402J253302P234757L664173m462557
10771A047548r589443p399769J969501J1790916J1707297R9395j0437487q096540
10763h908582J763851N289823J555434J821608P777217O857682m997365j1936681
10755g77013j789868J1446399O160656j2680314j8559493k927964J1547563N204034
10747b376000r825587r701424N319402J3754305N602843o486247q726257k571992
10739a5010957M048426Q479239J0418050P256028j107714r068047j1339144p394254
10731a3718373J276072J1511796J5616186P536804n732828q816956J937919J2341702
$$ plain form
10787 9452899 1558529 -8736797 -11400591 -1682281 11788577 17504114 15907348 15401375
10779 15401375 16903612 12950366 2011275 -6642127 -5388825 1845932 5510105 1047548
10771 1047548 -8541895 -15941664 -13972163 -2181247 9526050 9625445 -812042 -8908582
10763 -8908582 -7144731 -1854908 -299474 1522134 9299351 16157033 11159668 -777013
10755 -777013 -2566881 8879518 15040174 2359860 -16199633 -19127597 -7580034 -2376000
10747 -2376000 -12201587 -21903011 -16583609 -2829304 2773539 -3712708 -12438965 -15010957
10739 -15010957 -10962531 -2483292 7934758 15190786 14083072 5015025 -6324119 -13718373
10731 -13718373 -12442301 -930505 14685681 22222485 16489657 7672701 9610620 21952322
10723B1952322R185927l621935j3055750j2735918n230700L287110N292193k946056
10715B127193j3242674j1450306L102809J4217201J0960781J575738k637461m119906
10707E33375q050588p340258N121182J8188828J4632944k741117j4233730j0759003
10699d648367k318490R66909R69638K084932K783993J218242j07628P69586K214619
10690C933434K662642J846230j496586p391740j1192463q341450j168311M417408
10682a6730836O427099N782631K030266l739954o486398m364548k742937m311385
10674b4136062k672337N562337J0883196M499445o082457q243969l863133l166399
10666b7219379n443640k331048M357630N483331K397552M295615R308185O372788
$$ plain form
10723 21952322 31138249 27516314 14460564 1724646 -3506054 -218944 5073249 2127193
10715 2127193 -11115481 -22565787 -19462978 -5245777 5715004 7290742 4653281 533375
10707 533375 -7517213 -14857471 -9736289 8452539 23085483 20344366 6110636 -4648367
10699 -4648367 -6966857 -5999948 -5030310 -2945378 -161385 1056857 949229 1718815 3933434
10690 3933434 6596076 8442306 6945720 -446020 -11638483 -19979933 -21148244 -16730836
10682 -16730836 -10303737 -4521106 -2490840 -6230794 -12717192 -17081740 -19824677 -24136062
10674 -24136062 -26808399 -21246062 -10362866 -5863421 -11945878 -20189847 -24052980 -27219379
10666 -27219379 -32663019 -34994067 -30636437 -25153106 -22755554 -18459939 -9151754 -2778966
10658b778966l657859o879196J124136Q398133O172144R0603k514876k741398
10650b787279k759229n85536L171970L577593m58043n051842q752080j1637374
10642b5281820q963958K548560J4229695J4503403O579292L125723N439611L534652
10634A5715158m326086q782457o168414k316550L82567M276741N904089K68547
10626D953595o182420l729261K500589R16358m521384j843345M507056J686960
10618a711852l768508M593704J8444333J2925638q828808j5747965Q8784J0091006
10610A6086332j514827j3017807o892708Q03540n110221r509034J601003J1313949
10602f239773L025364o279508L897831J8233834J0985551q577025j2202916k25414
$$ plain form
10658 -2778966 -6436825 -13316021 -12191885 -3793752 2378392 2468995 -45881 -2787279
10650 -2787279 -5546508 -6132044 -2960074 617519 159476 -4892366 -13644446 -25281820
10642 -25281820 -34245778 -31697218 -17467523 -2964120 3615172 6740895 12180506 15715158
10634 15715158 11389072 2606615 -3561799 -5878349 -5495782 -1219041 4685048 4953595
10626 4953595 -1228825 -4958086 -2457497 -1541139 -6062523 -7905868 -3398812 -1711852
10618 -1711852 -5480360 -886656 17557677 30483315 21654507 5906542 5995326 16086332
10610 16086332 14571505 1553698 -5339010 -4535470 -9645691 -19154725 -17553722 -6239773
10602 -6239773 -3214409 -9493917 -5596086 12637748 23623299 15046274 2843358 2617944
10594B617944K802692q349330j4440316o912252J827901L376123L574439O454154
10586i048645P837503N730464K189359k847748p784929o214978J104503J804854
10578g229617q022809j2915773j986979J1339920J0575242J420531k851491m545092
10570a4216068r190295p488019O408256J5373229M697215q820137k364868J2850257
10562b750430R548256r090053j5860534n527851J131136l189961l424192N433854
10554b3729775R081124K296623j601041L752604P227351J824994m166454l619225
10546h933799m25528J139729J639151j72045n109594o438830R00184Q311486N659123
10537c430123j116622o55711L561196J429247l884096l295255l60534k995252
$$ plain form
10594 2617944 5420636 -2928694 -17369010 -24281262 -22453361 -19077238 -15502799 -9048645
10586 -9048645 -1211142 4519322 6708681 3860933 -3923996 -10138974 -9034471 -7229617
10578 -7229617 -15252426 -28168199 -30155178 -18815258 -8240016 -6819485 -9670976 -14216068
10570 -14216068 -23406363 -30894382 -24486126 -9112897 -4415682 -13235819 -15600687 -2750430
10562 -2750430 6797826 -2292227 -18152761 -23680612 -22549476 -25739437 -29163629 -23729775
10554 -23729775 -14648651 -12352028 -13953069 -10200465 -2973114 -1148120 -5314574 -8933799
10546 -8933799 -9359327 -8219598 -6580447 -6752492 -11862086 -18300916 -17400732 -9089246 -3430123
10537 -3430123 -4546745 -5202456 -1641260 -212013 -4096109 -7391364 -7751898 -10747150
10529a0747150n794450l46145O557566M485453j901915m390910p301886j2696796
10521c2136233p725316J0865941K0459888O716599q592955k966088Q427283L020518
10513a930363p062949j795795M897925o233933j6183796j368388J5657009K880963
10505a1139327j9714631j3964458P031766P010581k847141P535370J6210198j1709932
10497b1587574m1767440k0578834J7741171M281954l0083280m891123M1055283
10490e5829843l312582r1952501l6177168J80719952L02550856J48102568j07740302
10483C36360980j76871718n4493840L1990870j1795532n9806906k3661877K0636561
10476F2358538K970702k4123062o402055J4187502m196423k0719679K382722K3931503
$$ plain form
10529 -10747150 -16541600 -16887745 -10330179 -5844726 -7746641 -12137551 -19439437 -32136233
10521 -32136233 -39861549 -28995608 -8535720 -1819121 -10412076 -13378164 -4950881 -1930363
10513 -1930363 -8993312 -10789107 -5891182 -12125115 -28308911 -29677299 -14020290 -11139327
10505 -11139327 -30853958 -44818416 -37786650 -30776069 -33623210 -26087840 -9877642 -21587574
10497 -21587574 -63355014 -83933848 -66192677 -61910723 -91994003 -96885126 -55829843
10490 -55829843 -59142425 -151094926 -187272094 -6552142 295998714 444101282 336360980
10483 336360980 159489262 104995422 136986292 125190760 65383854 41721977 62358538
10476 62358538 65329240 41206178 34804123 48991625 44795202 24075523 26458245 50389748
10468E0389748L186839k3376020j1695148J1272358L776395j4694886p622547
10461A1236739Q553556J221177j3698532m246301J4894644R708276j0900372j3784515
10453B984672j10394M194974k030852j018286M093975k068512j1274815m062607
10445i291845J2229921J3906355P14108p685397o678341o964921p630285O05973
10437a0794432J0966574Q192357l369334n696620J974448L319941n463151j0047683
10429a0917900l229375M806441M587273m47246k977883j122629K915895N075696
10421a309728J377844n863325p794475j015998O476103P503144N701327O360345
10413A1435237O534238K451921k161318l310728l523595m348729k095818K112061
$$ plain form
10468 50389748 53576587 30200567 18505419 29777777 33554172 18859286 11236739
10461 11236739 19790295 21011472 7312940 3066639 17961283 27669559 16769187 2984672
10453 2984672 2874278 7069252 5038400 4020114 8114089 6045577 -5229238 -9291845
10445 -9291845 2938076 16844431 17558539 9873142 3194801 -3770120 -11400405 -10794432
10437 -10794432 172142 8364499 4995165 -701455 1272993 4592934 -870217 -10917900
10429 -10917900 -14147275 -9340834 -4753561 -5200807 -8178690 -9301319 -6385424 -1309728
10421 -1309728 68116 -5795209 -13589684 -14605682 -8129579 -626435 5074892 11435237
10413 11435237 17969475 20421396 18260078 14949350 11425755 7077026 4981208 7093269
10405G093269j07260q832520j0780768M27206J1772644R818108J21735m337940
10397E174474k831238k199721k586817q06447M56913j469329k128981J194710
10389e196436K538701j258729k764738K104235M241343k567180p914964j265630
10381a2083398Q982717Q544165j20041m346723k341406j265920j122271K611953
10373a140924N435656k50729q912549p643285L270132J0060698N482753l443921
10365B857831p669172n391310M74144M952264K477366o316698j2030180q087793
10357b8733548k15459L461367M964111Q995545J0364046K246038q174077p062548
10349a4154525N147970J3798682J0392255Q04037o656536r928221r409073n632620
$$ plain form
10405 7093269 6986009 -1846511 -12627279 -12200073 -427429 9390679 9512414 5174474
10397 5174474 2343236 143515 -2443302 -3249749 -2792836 -4262165 -6391146 -5196436
10389 -5196436 -2657735 -3916464 -6681202 -4576967 -335624 -2902804 -10817768 -12083398
10381 -12083398 -3100681 5443484 5323443 976720 -1364686 -2630606 -3752877 -1140924
10373 -1140924 4294732 4044003 -4868546 -12511831 -9241699 818999 6301752 2857831
10365 2857831 -4811341 -10202651 -9728507 -4776243 -2298877 -8615575 -20645755 -28733548
10357 -28733548 -28949007 -25487640 -20523529 -11527984 -1163938 1082100 -7091977 -14154525
10349 -14154525 -9006555 4792127 15184382 15988419 9331883 -596338 -10005411 -15638031
10341a5638031j557854P91835M725872J1900232J4317798M012966j1590394j6078643
10333i116219n747758O278942Q333518K118508m619809o988586k779186O893452
10325e627138J4383988J1433634M60719p522000p160662k960960Q34367M769032
10317H610980P256383L813525l387916n199541O89669M928329Q92256n295981
10309A2307704o121651n223513q931333j2131635m964215R041396J4546501O036682
10301D559936l759699k640256L619120J902400o489669p322461L925454J3758374
10293G553199R974024j221745n948344k861018j599121n256690o707041k104353
10285h171089L312620M881570M120646K186311k606450p432999n007397M153536
$$ plain form
10341 -15638031 -17195885 -16404050 -11678178 222054 14539852 18552818 6962424 -9116219
10333 -9116219 -14863977 -8585035 -251517 1866991 -2752818 -9741404 -12520590 -5627138
10325 -5627138 8756850 20190484 20651203 13129203 5968541 3007581 3841948 8610980
10317 8610980 15867363 19680888 16292972 11093431 11783100 16711429 17603685 12307704
10309 12307704 6186053 962540 -7968793 -20100428 -25064643 -16023247 -1476746 4559936
10301 4559936 800237 -1840019 1779101 3681501 -2808168 -10130629 -6205175 7553199
10293 7553199 17527223 16305478 10357134 7496116 5896995 640305 -6066736 -8171089
10285 -8171089 -4858469 23101 4143747 6330058 3723608 -3709391 -8716788 -4563252
10277d563252Q765062K130817p764796r965792m597768J591553O021108Q824541
10269D41473P746789K967968O92340L594400M522692j150485m803242J880530
10261A5892465R891837M734093r105906j2963096k764253N217462J121468l834941
10253H189129J974980J0600921P873972l970792j1128812r153395n037960j982946
10245b634903L565458R711602P813825k743119r945523n465700L337584M862240
10237H501464n67197m256455l281815j637233o91426J630655L654338J698304
10229E050635j363512P57975N613757L935887m374633q200709l294860K75811
10221a599649m345441q580810l736047L300669K698803j41050N156152J3147633
$$ plain form
10277 -4563252 4201810 6332627 -1432169 -11397961 -15995729 -14404176 -8383068 441473
10269 441473 8188262 11156230 11848570 15442970 19965662 18815177 14011935 15892465
10261 15892465 25784302 30518395 21412489 8449393 5685140 10902602 12024070 8189129
10253 8189129 10164109 20765030 28639002 24668210 13539398 4386003 -651957 -2634903
10245 -2634903 930555 10642157 18455982 15712863 5767340 301640 3639224 8501464
10237 8501464 7934267 3677812 395997 -1241236 -1932662 -302007 3352331 5050635
10229 5050635 3687123 4445098 10058855 13994742 9620109 1419400 -1875460 -1599649
10221 -1599649 -5945090 -14525900 -18261947 -14961278 -12262475 -12403525 -7247373 5900260
10213E900260J0097724j810803o714912q51589K766823k127008n317467K54215
10205B197243N860711K783213l034666k307951K342338K934942q727j18981L590091
10196A4238213O474247N703444J963842l025494o523788n840574k282885k58893
10188A0448112j050096k012078j973385j516834J107247O561141Q339541J91999
10180B0095647j1002117j1534166p43863P864398O801085K443569M48823j993459
10172A2379917n368697m202676P21371J382351j259188L275553J3095266J0649812
10164C0673709q642623k3725558j7618764k162588K996329k41735J202262O083133
10156a1435835M803859M32805K534425P452764M788083k580568m165399j809122
$$ plain form
10213 5900260 15997984 14187181 7472269 6620680 9387503 7260495 1943028 2197243
10205 2197243 8057954 10841167 7806501 5498550 7840888 10775830 10767103 10648122 14238213
10196 14238213 20712460 26415904 28379746 25354252 18830464 12989890 10707005 10448112
10188 10448112 9398016 7385938 5412553 3895719 5002966 11564107 19903648 20095647
10180 20095647 9093530 -2440636 -3184499 4679899 11480984 13924553 14373376 12379917
10172 12379917 7011220 2808544 3529915 4912266 3653078 6928631 20023897 30673709
10164 30673709 22031086 -1694472 -19313236 -21475824 -18479495 -18721230 -17518968 -11435835
10156 -11435835 -6631976 -6199171 -3664746 3788018 8576101 5995533 1830134 21012
10148B1012m603969r053129m362042O247418R581838M952488K566802K314238
10140G664656m127011j1525057n308744J0644702J4852707K202687o912169j54344
10132G337427P409470N47155j0608635r545750j132145l36991m771206o1962J2747008
10123A584371J6187750L809802q923556o899366M129102P499244j415889j1280710
10115D690748j1407336m133388J465533K440636L089967N299591M632576j816272
10107D262055r013409r579719k869329M865852P019842J383644p946825j1647285
10099b3525174l583544R224254J1935031J276636q334479m156649P698552J2724009
10091C258636P750672M5768o188341j0374303q300546K262061J2215947J0800942
$$ plain form
10148 21012 -4582957 -13636086 -17998128 -11750710 -2168872 2783616 5350418 7664656
10140 7664656 3537645 -7987412 -13296156 -2651454 12201253 14403940 7491771 7337427
10132 7337427 14746897 15294052 4685417 -4860333 -5992478 -6329469 -11100675 -11162637 1584371
10123 1584371 17772121 21581923 12658367 5759001 9888103 17387347 15971458 4690748
10115 4690748 -6716588 -10849976 -9384443 -6943807 -3853840 1445751 6078327 4262055
10107 4262055 -4751354 -14331073 -17200402 -12334550 -5314708 -3931064 -11877889 -23525174
10099 -23525174 -27108718 -17884464 -5949433 -4672797 -13007276 -17163925 -9465373 3258636
10091 3258636 11009308 11055076 4866735 -5507568 -13808114 -11546053 669894 11470836
10083A1470836K231721o09571L030933J902622o853349j2903710j0372605n533187
10075a7636310l063056J440039R637791J3595423P782113j731577o306094m764989
10067a046660K84338P399110J2704308J0032922N5016q277794r715561q185453
10059C250226o771207k181763N468805P871850J389303m349866K5829Q788122
10051A3491299R709630J992819m598442m840420k192367K58674L227630N360948
10043B2409771K508862m893467r860428p012211J103759P620191Q232544L277940
10035B3386961l918240q837807q183973k984137J475683Q04669l437397n482975
10027g177216k427972K409531M295479K948096J173443j84271j933880k547560
$$ plain form
10083 11470836 13702557 13092986 16123919 18026541 11173192 -1730518 -12103123 -17636310
10075 -17636310 -20699366 -19259327 -9621536 3973887 11756000 10024423 3718329 -1046660
10067 -1046660 -762322 6636788 19341096 29374018 29429034 21151240 11435679 3250226
10059 3250226 -3520981 -5702744 -233939 7637911 9027214 4677348 4703177 13491299
10051 13491299 23200929 25193748 20595306 15754886 13562519 13821193 17048823 22409771
10043 22409771 24918633 20025166 10164738 3152527 4256286 11876477 20109021 23386961
10035 23386961 19468721 10630914 2446941 -537196 938487 1743156 -1694241 -7177216
10027 -7177216 -9605188 -7195657 -2900178 47918 1221361 1037090 -896790 -3444350
10019c444350K37292L816452K531113l593326p612131n216175J6528L220565M234232
10010e809800M162639K000054j799740l943879l655381l711577l828710j77857
10002a6764251O039260Q182881N406957M306782N745546K194657o400197q151612
9994E60023J135348Q546166N038269N37822M353160O355128m169068j5198768
9986G158080r584123N088708Q337897L83784j634102M294404L758844n019636
9978A2783856p919084k292494j449318p961469p963686K036181P329108J587614
9970c849292k447552K272345M880704n52324k739344M196331P840533Q79820l907528
9961F573693K637798P922299N97775p701421l458250L304077k972824j4025562
$$ plain form
10019 -3444350 -3207058 609394 3140507 -452819 -8064950 -13281125 -13264597 -10044032 -5809800
10010 -5809800 -1647161 352893 -1446847 -5390726 -9046107 -12757684 -16586394 -16764251
10002 -16764251 -10724991 -2542110 2864847 7171629 12917175 15111832 8711635 560023
9994 560023 1695371 10241537 15279806 15817628 20170788 26525916 22356848 7158080
9986 7158080 -2426043 2662665 11000562 11384346 9750244 14044648 17803492 12783856
9978 12783856 4864772 2572278 1122960 -6838509 -14802195 -12766014 -5436906 -3849292
9970 -3849292 -6296844 -4024499 856205 303881 -2435463 1760868 9601401 10481221 6573693
9961 6573693 9211491 17133790 17731565 10030144 6571894 9875971 6903147 -7122415
9953g122415j0301727O640660J7206027J3248075L898868l428147q669201r257011
9945B215129k555467M286106K741341k195651r55714J652557n512367j6346208
9937a6670274j2574015O397434J8594295J0085127o103322r741332O56612J0678043
9929A322568J0099852J511026o252381o707979j82922O448059O083784q06951
9921A1515056o444745m490485L183195Q758693O386739k085117r240238j0427771
9913b844673p927975m722922J209640J0150478J3341951L536461r905183j0438363
9905g600586J218174P820591K828904j302519K435885K977591o311363j1933360
9897i866683k619691R149779O390375m908521p307619m53649K447414r35009j610162
$$ plain form
9953 -7122415 -17424142 -10783482 6422545 19670620 23569488 20141341 11472140 2215129
9945 2215129 -340338 3945768 6687109 4491458 3535744 5188301 -324066 -16670274
9937 -16670274 -29244289 -22846855 -4252560 5832567 -270755 -10012087 -9355475 1322568
9929 1322568 11422420 12933446 6681065 -26914 -209836 6238223 12322007 11515056
9921 11515056 5070311 579826 3763021 12521714 18908453 16823336 7583098 -2844673
9913 -2844673 -10772648 -15495570 -14285930 -4135452 9206499 12742960 2837777 -7600586
9905 -7600586 -6382412 1438179 4267083 2964564 5400449 8378040 2066677 -9866683
9897 -9866683 -12486374 -3336595 3053780 -1854741 -9162360 -9616009 -7168595 -8103604 -9713766
9888i713766J694646K169009R6655J154842L367007J860760J077959N397169N221147
9879A2325428p537067j8245995q593645R133237O141411j5537053k2042258J31298
9871d4224644K3079026K1321744P105668L176986N610436k013431j5313276j6149606
9863a7407097l244461P495152Q213025M990787J876331k940450o313988j889818
9855i220519O542021P409750j109019p832026n122058J785620M853740L428780
9847G36289P41085k033378l879852k124855K735341M566213j099688r448070j0781405
9838b0588320k473610P311663R477292M638443N13149L99048j4728l149884l726339
9829g613286K405247R089641P297589j368330p230777p099621o848381r202977
$$ plain form
9888 -9713766 -8019120 -5850111 -5753456 -4598614 -1231607 629153 1707112 7104281 12325428
9879 12325428 4788361 -13457634 -22051279 -12918042 -6776631 -22313684 -44355942 -44224644
9871 -44224644 -21145618 176126 7281794 10458780 16069216 14055785 -1257491 -17407097
9863 -17407097 -20651558 -13156406 -4943381 47406 1923737 -1016713 -7330701 -9220519
9855 -9220519 -2678498 4731252 3622233 -4209793 -9331851 -7546231 -2692491 736289
9847 736289 1477374 -556004 -4435856 -6560711 -3825370 740843 -358845 -9806915 -20588320
9838 -20588320 -23061930 -15750267 -6272975 -1634532 -1121383 -722335 -737063 -3886947 -7613286
9829 -7613286 -5208039 3881602 11179191 9810861 2580084 -4519537 -11367918 -20570895
9821b0570895q958766k988206M057891P741088R170092Q356508J335960r979346
9813a1835674j3772172k996685J2002015J5231496N679074l496903m268929j803318
9805e261096k437617l668720o64514M349061N488471K330454m04979q02862j662922
9796b734724m166729n151506k985678j267662k521370k276404M372545J2828028
9788c903500J3509748N979983j26269K10021J294785j139153k188968J145193
9780A4781840J468513o370593j2906760p051653M955799Q024884J558159j456564
9772C003625K852477M441825q72850l911221Q7374J959539m496422r745885l709947
9763a0391485O749029P814831q29853p478678o014323j049279K325875M031662
$$ plain form
9821 -20570895 -29529661 -32517867 -28459976 -20718888 -11548796 -3192288 -1856328 -11835674
9813 -11835674 -25607846 -28604531 -16602516 -1371020 4308054 811151 -3457778 -5261096
9805 -5261096 -7698713 -11367433 -12031947 -7682886 -2194415 136039 -268940 -1071802 -2734724
9796 -2734724 -6901453 -12052959 -15038637 -16306299 -18827669 -21104073 -16731528 -3903500
9788 -3903500 9606248 15586231 15459962 15669983 16964768 15825615 13636647 14781840
9780 14781840 16250353 9879760 -3027000 -10078653 -5122854 2902030 4460189 3003625
9772 3003625 5856102 10297927 9425077 5513856 5601230 7560769 3064347 -6681538 -10391485
9763 -10391485 -3642456 4172375 3342522 -4136156 -10150479 -11199758 -8873883 -4842221
9755d842221M330170J647595l333926o348466m003704K386165P659858P293197
9747D788668K321813j319775j129539k644048r760304j4403424o543828P431902
9739b1258535J0756520K192571r88175Q177565J3050150Q64152j3814134j0956865
9731a1976751K916931O266486k369418m746333M395939R399508J666368o599539
9723a046809m316417J441781N68568k936409m90127N690910P924567N402002J594200
9714A3832266l330663q946589j0445664o082395j908188j797189n94087N017139
9706a4255370P932486K818212k236351J398406O517496J464510q368065p785293
9698a2513969K475871O209976r50445m098275N036078J2661618M409369j1497149
$$ plain form
9755 -4842221 -512051 1135544 -2198382 -8546848 -12550552 -10164387 -2504529 4788668
9747 4788668 7110481 5790706 4661167 2017119 -7743185 -22146609 -28690437 -21258535
9739 -21258535 -10502015 -8309444 -9297619 -1120054 11930096 12794248 -1019886 -11976751
9731 -11976751 -9059820 -2793334 -5162752 -9909085 -5513146 3886362 5552730 -1046809
9723 -1046809 -5363226 -3921445 -3352877 -6289286 -6779413 -1088503 6836064 12238066 13832266
9714 13832266 10501603 1555014 -8890650 -14973045 -16881233 -18678422 -19272509 -14255370
9706 -14255370 -6322884 -3504672 -5741023 -4342617 2174879 3639389 -4728676 -12513969
9698 -12513969 -10038098 -3828122 -4778567 -8876842 -3840764 8820854 13230223 1733074
9690A733074j6193621o604277L704975N251586J451573j621744k987302k953196
9682a8218932M2521O014701J1618882J3484033J0639905L797214m928263j1975152
9674A0474909j4491692j2317890p044317j010959K266902L48866l965824m720449
9666c0460454o65903L481487M858827N297472M620694n26593p451851o679659
9658b7525980L288713J0393280O730438J654638N709225J1410071N572140o673926
9650A0558599q892901q24182J366542o945219j1059679k428208O919842M503309
9642f801897l732189n636823j466576J252668J642100K915572L503053J100259
9634g223833o72088J244993K441383o58459k194116L705893J0679420Q062521
$$ plain form
9690 1733074 -14460547 -21064824 -17359849 -12108263 -10656690 -12278434 -15265736 -18218932
9682 -18218932 -18176411 -12161710 -542828 12941205 23581110 27378324 22450061 10474909
9674 10474909 -4016783 -16334673 -23378990 -24389949 -22123047 -21774181 -25740005 -30460454
9666 -30460454 -31126357 -27644870 -22786043 -17488571 -12867877 -13394470 -20846321 -27525980
9658 -27525980 -24237267 -13843987 -7113549 -5458911 250314 11660385 17232525 10558599
9650 10558599 1665698 841516 2208058 -4737161 -15796840 -18225048 -11305206 -6801897
9642 -6801897 -10534086 -16170909 -17637485 -16384817 -14742717 -11827145 -8324092 -7223833
9634 -7223833 -7895921 -6650928 -4209545 -4868004 -7062120 -3356227 7323193 15385714
9626A5385714k557946r076079n537537J799301M630419J714231k409712k924162
9618A024229R68064M726647L268251j672190l074062J096319M877982L550411
9610A4765651p60744m868398q211547q502709k912117L601184K002004n164055
9602a0050731m772409M939940Q778101l28032p207827J113626J2269620P616883
9594A2359171p695908j3840124o976384l056J788621M691446Q756474O504952
9586E585192k79340j092822M513640N780939Q0086l122953o0285J559493k015321
9577A0948629m212838j214699J874774J489400P2008k141260p374372j0939362
9569a1497720m988796O836059J2336289R569466P774523Q281443J825533j1469284
$$ plain form
9626 15385714 12827768 3751689 -1785848 13453 4643872 6358103 3948391 1024229
9618 1024229 1992293 6718940 9987191 8315001 5240939 6337258 11215240 14765651
9610 14765651 14004907 9136509 924962 -7577747 -10489864 -6888680 -4886676 -10050731
9602 -10050731 -14823140 -9883200 -1105099 -1433131 -8640958 -7527332 4742288 12359171
9594 12359171 4663263 -9176861 -16153245 -16156301 -14367680 -9676234 -919760 5585192
9586 5585192 5305852 4213030 8726670 14507609 14587695 11464742 11404457 12963950 10948629
9577 10948629 6735791 5521092 7395866 8885266 8957274 6816014 -558358 -11497720
9569 -11497720 -16486516 -9650457 2685832 12255298 20029821 28311264 30136797 18667513
9561A8667513j7430747r660104M04966K497870R36641J455425N40586l078581
9553e666431j761463N844229P632969k275012j0459771m036579Q438060J0263314
9545G979316J316893m993706k706438K178114L714937J563037k078129l322619
9537C651405R42832O046172K826303o526853p110491N830489J5282099O231061
9529B7173017j0235595j2698519j336892M199095m123063j1915772n488441Q550077
9521e876093J3453110M125586p787722q448066K025168R645020L917143q090088
9513B964058j1197532l411429K638562K54007k260979K251218P603921O233223
9505E075049K011998J536153K229674q71246m763379m599009k617636k082517
$$ plain form
9561 18667513 1236766 -8423338 -8018372 -5520502 -4583861 -3128436 -2587850 -5666431
9553 -5666431 -7427894 -1583665 6049304 3774292 -6685479 -10722058 -2283998 7979316
9545 7979316 9296209 4302503 1596065 3774179 7489116 9052153 6974024 3651405
9537 3651405 4594237 10640409 13466712 6939859 -170632 5659857 20941956 27173017
9529 27173017 16937422 4238903 2902011 7101106 2978043 -8937729 -14426170 -5876093
9521 -5876093 7577017 11702603 3914881 -4533185 -2508017 7137003 11054146 2964058
9513 2964058 -8233474 -11644903 -9006341 -8752334 -11013313 -8762095 -1158174 5075049
9505 5075049 7087047 8623200 10852874 9981628 5218249 619240 -1998396 -4080913
9497d080913j54298M595538O089778R93031l946589l635173l491995o959131n914876
9488a6504628M465060J3068137R183995M66947r45000M43555o009964j4749039
9480a0580937j2031627M8359P321101O839578P095927Q575167L932837m151319
9472G049086m648903K408330N913343K809057K14417m91809m013234o831518j492819
9463I15950N560855Q05820j1253041j1570259K199712J0492697L274611n564922
9455e138577l391734K661545K856212J478178M221609N375569K2218m985556l644513
9446e45049j428868k961443k173283M844923J0040309O868225J186733r02094
9438A4929453k861839n957394k777574O415218P085760o152402j5735756p150562
$$ plain form
9497 -4080913 -4235211 360327 6450105 7443136 3496547 -138626 -3630621 -10589752 -16504628
9488 -16504628 -12039568 1028569 10212564 10679511 9734511 10178066 4168102 -10580937
9480 -10580937 -22612564 -22564205 -15243104 -8403526 -1307599 7267568 11200405 7049086
9472 7049086 2400183 4808513 10721856 13530913 13745330 13253521 9240287 2408769 915950
9463 915950 6476805 7282625 -3970416 -15540675 -13340963 -2848266 426345 -5138577
9455 -5138577 -8530311 -5868766 -3012554 -1534376 2687233 8062802 8085020 3099464 -545049
9446 -545049 -1973917 -4935360 -7108643 -2263720 7776589 14644814 15831547 14929453
9438 14929453 12067614 6110220 3332646 9747864 16833624 10681222 -5054534 -12205096
9430a2205096O780312O840871j450734r7612R121779R557294R8867m559738j135896
9421A2950047p57094m998790k967371N129342M934933n931535j0779699j254269
9413c674436Q342370M791054m074074n718029l261990m988936o888446j871580
9405a7344067L756446M1429p420994n254255M846188Q354435J935605j977233
9397a3062446L006608P327211L594486J5278N624689J3098153Q997597n055624
9389B3545952j4307490j1511931l725724J399066M424308O569368M259707l004191
9381G649065p785440m777479O45793J199603p23090J395722N904894O135939K615512
9372A2260519J189174O98590n055166j2557557r722996L991156J2518474O385092
$$ plain form
9430 -12205096 -5424784 1416087 -34647 -132259 8989520 18546814 18645681 14085943 12950047
9421 12950047 12192953 7194163 4226792 9356134 14291067 8359532 -2420167 -3674436
9413 -3674436 4667934 9458988 5384914 -333115 -3595105 -8584041 -15472487 -17344067
9405 -17344067 -13587621 -13546192 -20967186 -26221441 -21375253 -13020818 -11085213 -13062446
9397 -13062446 -10055838 -2728627 865859 881137 6505826 19603979 28601576 23545952
9389 23545952 9238462 -2273469 -5999193 -4600127 -175819 6393549 10653256 7649065
9381 7649065 -136375 -4913854 -4268061 -3068458 -3791548 -2395826 3509068 9645007 12260519
9372 12260519 13449693 14148283 9093117 -3464440 -13187436 -9196280 3322194 9707286
9364I707286j707528L308977J3564644R177889j0004877k1597125j1931364N608509
9356c873589J0792028L187085j935360K635974Q282940N371170m058103j1053929
9348I348216j0847207n537487L94665L484390K470838k90361P0697M868161P971898
9339A1933810K621657p788758j1561886l787601O262564P687535K678031J185801
9331I231153M383437L585868m104692r803681o693039p13190n33797l858647k587867
9322a1094455K663279L308365k678479o579357j889348N994159P610307K230143
9314d35386k361685p51567M121641N835331J970343m371847q573994q371704m294527
9305a7233395J864967P650126R673197N339984l291230q817375m916198N788648
$$ plain form
9364 9707286 7999758 11308735 24873379 34051268 24046391 2449266 -9482098 -3873589
9356 -3873589 6918439 10105524 8170164 10806138 19089078 24460248 20402145 9348216
9348 9348216 -1498991 -7036478 -6641813 -3157423 -686585 -976946 -906249 3961912 11933810
9339 11933810 14555467 6766709 -4795177 -8582778 -2320214 5367321 8045352 9231153
9331 9231153 13614590 17200458 13095766 3292085 -3400954 -4114144 -4647941 -8506588 -11094455
9322 -11094455 -8431176 -5122811 -7801290 -14380647 -16269995 -10275836 -2665529 -435386
9314 -435386 -2797071 -3548638 573003 6408334 8378677 4006830 -4567164 -12938868 -17233395
9305 -17233395 -15368428 -7718302 1954895 7294879 4003649 -4813726 -9729924 -3941276
9297c941276J3028845R977489R53619m570534l722936j763568k650552l951285
9289C359802k962328j834605k339891r34050M742884R043356O134613J044690
9281A6254471K507250O758552J580978j2084716j7327269o060813P545510Q309385
9273G483348J843497J489385M169896k715273j5813248j7063987j491589J3579355
9265h518616J2233328m42834q750366o183356J524352N916146L231040k888810
9257c879116m130855K193514O935648J018318q783884p719105L740295Q988325
9249a636860O37633q287215n387932K593612K248937o173362j1875695r437322
9241c7318204j702054P290195J3477737J2202564M341612j885900j709767l95275
$$ plain form
9297 -3941276 9087569 19065058 20018677 15448143 11725207 9961639 7311087 3359802
9289 3359802 397474 -1437131 -3777022 -4711072 31812 9075168 15209781 16254471
9281 16254471 18761721 25520273 27101251 15016535 -2310734 -8371547 -826037 7483348
9273 7483348 9326845 10816230 14986126 12270853 -3542395 -20606382 -22097971 -8518616
9265 -8518616 3714712 3271878 -5478488 -11661844 -10137492 -4221346 -990306 -3879116
9257 -3879116 -8009971 -5816457 1119191 2137509 -6646375 -14365480 -10625185 -1636860
9249 -1636860 -999227 -9286442 -14674374 -12080762 -9831825 -16005187 -27880882 -37318204
9241 -37318204 -39020258 -31730063 -18252326 -6049762 -1708150 -3594050 -5303817 -5699092
9233e699092k737743l625605K512917R891258R041557J436388l301114j523042
9225E995524J684479J419566k350235o625625o899998p25535O395860M995185
9217C889221m316141r384641m582318L95532k168625l982953M106516J4092972
9209a950437J2973089M115924l1162M36489l467883r236324n522017O163499J0990703
9200A4471881L274145p060536j1868068j2774871j0273964j219947R749674J1905889
9192c795797N251951R90988K266069M16774n814460n097820N607925J2160449
9184A1986079M834630o151739p371290j351026J955772J170448p0275k240892
9176B761707m939911k659347M535145O539781l66453m108080M161675J3191953
$$ plain form
9233 -5699092 -8436835 -12062440 -9549523 341735 9383292 10819680 7518566 5995524
9225 5995524 7680003 9099569 6749334 123709 -6776289 -7501824 -1105964 3889221
9217 3889221 -426920 -9811561 -14393879 -13998347 -16166972 -20149925 -16043409 -1950437
9209 -1950437 11022652 15138576 15107414 15543903 12076020 2839696 -2682321 3481178 14471881
9200 14471881 17746026 10685490 -1182578 -13957449 -24231413 -25451360 -15701686 -3795797
9192 -3795797 1456154 2447142 4713211 5129985 -684475 -5782295 -174370 11986079
9184 11986079 16820709 10668970 3297680 1946654 3902426 5072874 5002599 2761707
9176 2761707 -2178204 -4837551 -302406 6237375 5870922 1762842 5924517 19116470
9168A9116470Q423048m401491r083146m740745l672675q097649p621491Q53755
9160i223924P640529O498324K135064q27646l740611o171134l855545K382298
9152e162645N703782M140173L177695M964586M230842j716097p327474p010154
9144A000708k271791K417337M995785M820215J937019r99455j185498m13067j987066
9135H314187m009307k631744l80080k417782n720940k716431M205467M232914
9127a123716l535207o669626N26072O824740K260444n385751l401106N714789
9119d789361R517140M938530l87146k481684m200379n451949k172721M011623
9111a015947N461329J36331m946885m213711N3314L917071O672252O746344Q49354
$$ plain form
9168 19116470 27539518 23138027 14054881 9314136 5641461 -2456188 -10077679 -9223924
9160 -9223924 -1583395 4914929 7049993 6222347 2481736 -3689398 -7544943 -5162645
9152 -5162645 541137 4681310 7859005 12823591 17054433 15338336 8010862 1000708
9144 1000708 -1271083 1146254 6142039 10962254 12899273 11899818 10714320 10301253 8314187
9135 8314187 4304880 1673136 1293056 -1124726 -6845666 -9562097 -5356630 -1123716
9127 -1123716 -4658923 -11328549 -10802477 -3977737 -1717293 -7103044 -10504150 -4789361
9119 -4789361 4727779 9666309 9279163 6797479 2597100 -2854849 -5027570 -1015947
9111 -1015947 4445382 4581713 -365172 -4578883 -4525569 -608498 6063754 12810098 13659452
9102A3659452q152713j0073850q94997Q359576M629315q491970j4270607m996960
9094b0232754Q107673J0193339J028965p333098o698790l8219N778529P904817
9086a289538O745462K578084l375399p206107n613041l99305L263268L210730
9078b085846K455889M111193O213995L936618l045002p843055l758757N969882
9070E954917R974905K870743o570294o835308m6013J856620l373040m383509L999213
9061C448234R682422J831514j0034616r795514n47097R36601p094618q135510
9053a9708584M028672J3528181P906375k413694l022302J343090j142746o407933
9045e888941l030317M377454J957138o746585l708255J2330879J9983380P571027
$$ plain form
9102 13659452 5506739 -4567111 -5462108 2897468 7526783 -965187 -15235794 -20232754
9094 -20232754 -12125081 -1931742 -902777 -8235875 -14934665 -14972884 -9194355 -1289538
9086 -1289538 5455924 8034008 4658609 -2547498 -8160539 -8559844 -5296576 -2085846
9078 -2085846 370043 4481236 10695231 14631849 11586847 3743792 -14965 5954917
9070 5954917 15929822 18800565 12230271 5394963 5348950 7205570 3832530 -550979 3448234
9061 3448234 13130656 14962170 4927554 -4867960 -5415057 -4478456 -11573074 -19708584
9053 -19708584 -15679912 -2151731 5754644 3340950 318648 1661738 518992 -5888941
9045 -5888941 -8919258 -4541804 -2584666 -9331251 -13039506 -708627 19274753 26845780
9037B6845780q764607j0194928j186392L415226K779206M794046O862324O85298
9029B5235953r215611r984004j781974K152759k609603n918394k013202J575641
9021b558435o9941O11397Q304574J2392206K611312j1816153j3314837j594896
9013e434773O812690L819932n89710K360188N704936O09100o025808j359950J0795582
9004A6692187J2350894k328289j5892047j1462819M062618J1266429N805946N55461
8996B1050380K211082J786478p081156j4808534j0656836n01572K299362k743454
8988h444250m789146R6816N025768N325783L387916N48263m047728n981546M90231
8979h387893R440987P712128m437537j1379830n777456J238877J091591K118350
$$ plain form
9037 26845780 18081173 7886245 6699853 10115079 12894285 17688331 24550655 25235953
9029 25235953 16020342 6036338 4254364 6407123 3797520 -2120874 -4134076 -2558435
9021 -2558435 -2628376 -2016979 6287595 18679801 21291113 9474960 -3839877 -5434773
9013 -5434773 1377917 5197849 4608139 6968327 12673263 13282363 7256555 5896605 16692187
9004 16692187 29043081 26714792 10822745 -640074 3422544 14688973 20494919 21050380
8996 21050380 23261462 25047940 17966784 3158250 -7498586 -8000158 -5700796 -8444250
8988 -8444250 -13233396 -13136580 -8110812 -2785029 602887 1151150 -2896578 -8878124 -8387893
8979 -8387893 1053094 8765222 4327685 -7052145 -12829601 -11590724 -10499133 -8380783
8971h380783J0811930J5101343L835738j0205249p969896M244095M428615q493991
8963C371802j3053927j178861R451349N383731l248690l721580r29582l194718
8955g120476m624987K882368J2570514J2906453N117373k657178r074489j4179615
8947d180037j0733485L467765J3844812P116600o186130o100779N582713R428722
8939A2240181P13823n296372j941803j413457r528281j2437891o02702J2440813
8931e825689J0670964O91504j043928M156247J577435r829978j4237588m302125
8923a8143158O853833N269555m301575p285509m20426O007961M735362O47882
8915f636075P73362K867515Q37543k746486M42421Q794871R446664j996071j1507022
$$ plain form
8971 -8380783 2431147 17532490 21368228 11162979 3193083 7437178 11865793 3371802
8963 3371802 -9682125 -10860986 -1409637 3974094 725404 -2996176 -3925758 -7120476
8955 -7120476 -11745463 -8863095 3707419 16613872 21731245 19074067 9999578 -4180037
8947 -4180037 -14913522 -11445757 2399055 9515655 3329525 -2771254 2811459 12240181
8939 12240181 12954004 7657632 5715829 4302372 -5225909 -17663800 -18266502 -5825689
8931 -5825689 4845275 5536779 4492851 8649098 10226533 396555 -13841033 -18143158
8923 -18143158 -11289325 -6019770 -10321345 -17606854 -18027280 -12019319 -7283957 -6636075
8915 -6636075 -5862713 -2995198 -2157655 -4904141 -4461720 4333151 13779815 11783744 276722
8906B76722o414987M351734L980900n061341n585479N088216J0766565L982527
8898A1384857k612594L2016J898101n859765j2626676o066664N636075O915870
8890a298780j90206k484931Q74370L25830l921768k946472K364008K626812j277884
8881e929021N14968O501264M251363n991595q151466K910752J0579607K370912
8873G056784j0202538j0451797j447716K792017J073860L600686J1599302J3959507
8865A7980105M761704p429659j1015885n262037O82750k64721m937215m890520
8857a0375478P94115K674132m282962r132577P70260J7175694J8283681O41273
8849A6548138j3593671q621951K680127J049086r134287r686563R14585O837561
$$ plain form
8906 276722 -6138265 -1786531 2194369 -2866972 -8452451 -3364235 7402330 11384857
8898 11384857 8772263 8804279 10702380 4842615 -7784061 -13850725 -8214650 -1298780
8890 -1298780 -1488986 -3973917 -3099547 -2773717 -6695485 -9641957 -7277949 -4651137 -5929021
8881 -5929021 -5414053 1087211 5338574 -653021 -8804487 -5893735 4685872 7056784
8873 7056784 -3145754 -13597551 -15045267 -12253250 -11179390 -7578704 4020598 17980105
8865 17980105 22741809 15312150 4296265 -965772 -283022 -547743 -5484958 -10375478
8857 -10375478 -9581363 -6907231 -11190193 -20322770 -19552510 -2376816 15906865 16548138
8849 16548138 2954467 -5667484 -2987357 -1938271 -11072558 -20759121 -19844536 -13006975
8841a3006975J620200l214792J585171R451257R805358K636024m068997m521227
8833B86019Q15605O551154O483264M53524m109391k122514J181428r68599m647770
8824C922720j698255N047440N386928n56750j878484M320546P511433J398400
8816B3453978n940725n996551k378295j683339k187951n82950o81414n137436
8808a134683o613581R18472Q546846L793895q126694r503630L238437J3060139
8800D179201O903258o236002r643819j410879P148944Q909321N877424K13301
8792A5940749q202687j4918300j2153029l70692R526240R959235N588015L491186
8784H860717K024638k686317n741481k49996Q137828O466963n215059j1987019
$$ plain form
8841 -13006975 -11386775 -14601567 -13016396 -3565139 6240219 8876243 4807246 286019
8833 286019 1101624 7652778 14136042 14589566 10480175 8357661 9539089 8570490 3922720
8824 3922720 2224465 7271905 12658833 12102083 10223599 14544145 22055578 23453978
8816 23453978 17513253 11516702 9138407 7455068 5267117 4684167 4002753 -1134683
8808 -1134683 -7748264 -6829792 1717054 5510949 -2615745 -12119375 -8880938 4179201
8800 4179201 11082459 4846457 -4797362 -6208241 940703 9850024 15727448 15940749
8792 15940749 7738062 -7180238 -19333267 -19703959 -10177719 -218484 5369531 8860717
8784 8860717 10885355 8199038 2457557 2207561 10345389 16812352 11597293 -389726
8776c89726o337505P26289j658123o435364j164487J0326638J3047628L593475
8768A1708825o224780p777775m692473k191621L64835K737768O40431n269321
8760a0704111o407803J307494R473862Q477800P45530m283247l436268o44293
8752e471036J606296L610354L402737j561764q042740r569322n900570l087447
8744b5013492k963547j66574P134938J1309600O615989M58115L629136J1970926
8736A2975091R663153o820313j9908148j3770006L173811R900880J462718p544301
8728a0867115o717677k195065j771488j641761L861222R834052Q310403J396347
8720B08918k828202k629555j776810n18462L452356P900579Q399881N539673K439316
$$ plain form
8776 -389726 -6727231 -6000942 -7659065 -14094429 -15258916 -4932278 8115350 11708825
8768 11708825 5484045 -2293730 -6986203 -9177824 -8812989 -6075221 -5434790 -10704111
8760 -10704111 -17111914 -15804420 -6330558 2147242 2892772 -1390475 -4826743 -5471036
8752 -5471036 -3864740 -254386 3148351 1586587 -6456153 -16025475 -21926045 -25013492
8744 -25013492 -27977039 -28143613 -21008675 -9699075 -3083086 -2624971 1004165 12975091
8736 12975091 22638244 15817931 -4090217 -17860223 -14686412 -4785532 -3322814 -10867115
8728 -10867115 -17584792 -19779857 -21551345 -23193106 -19331884 -9497832 -1187429 208918
8720 208918 -2619284 -5248839 -7025649 -7544111 -4091755 3808824 12208705 17748378 20187694
8711B0187694j752526q092959j1382040o697769O04879J310894l454302m720384
8703a3996513p38984J516276l52294o53703L098644N678719L550382K03177l61839
8694b056135J547521M080659M935581N74110q172566j1976437l884894Q197440
8686f754721J1082331N868961M518007Q481101O740022l748105j2445352j3494955
8678B47289j2827323j2164791l688583J1548208J7482834O524729o168008m766216
8670c811861M233529N240063j546708m094756M35268L789175J465959k905309
8662B805360n262064m232363k4515L509117J217607m108198l182071M334331P157500
8653B214704J193150k915801N51881J268220o573520r532527K627168J5377364
$$ plain form
8711 20187694 18435168 10342209 -1039831 -7737600 -7132721 -5821827 -9276129 -13996513
8703 -13996513 -14735497 -13219221 -13571515 -14225218 -11126574 -5447855 -1897473 -1694296 -2056135
8694 -2056135 -508614 3572045 8507626 9081736 909170 -11067267 -14952161 -6754721
8686 -6754721 4327610 10196571 14714578 23195679 29935701 26187596 13742244 247289
8678 247289 -12580034 -24744825 -28433408 -16885200 597634 7122363 954355 -3811861
8670 -3811861 421668 5661731 4115023 20267 455535 4244710 5710669 2805360
8662 2805360 -2456704 -6689067 -6713582 -3204465 -1986858 -6095056 -9277127 -4942796 2214704
8653 2214704 3407854 492053 1043934 2312154 -4261366 -13793893 -11166725 4210639
8645D210639J0610726l722493p787339k730912m122560j0403141n706383Q591812
8637a1059651J3113867L368363k717017M228289J0261873K924864r492321j3514427
8629b886160q952556k506034L259308O476623L801013j696217j738474L451026
8621g91471M540168m99733k842548Q00935K888924N74777J203330O594570P238474
8612A9707426p78866p780047o992190m663888n788687m402247K628774O333982
8604a735743P31664n643076m220710n44623k774690o991485n406157K63042M196195
8595b2125583O372227P746131M987578j111495k210243L809964O818117J194510
8587E481206l915544j205066J775739j708224l509817K949300O653775k487637
$$ plain form
8645 4210639 14821365 11098872 3311533 580621 -3541939 -13945080 -19651463 -11059651
8637 -11059651 2054216 5422579 2705562 6933851 17195724 20120588 10628267 -2886160
8629 -2886160 -11838716 -14344750 -11085442 -4608819 -807806 -2504023 -4242497 -791471
8621 -791471 3748697 3248964 406416 1207351 4096275 4671052 5874382 12468952 19707426
8612 19707426 18928560 11148513 4156323 -507565 -6296252 -10698499 -8069725 -1735743
8604 -1735743 -1004079 -6647155 -10867865 -11412488 -14187178 -21178663 -26584820 -26321778 -22125583
8595 -22125583 -15753356 -8007225 -3019647 -4131142 -6341385 -2531421 4286696 5481206
8587 5481206 1565662 360596 2136335 428111 -3081706 -132406 6521369 4033732
8579D033732j2098525n398783R394213J0845095j244862p203699l47195N366072
8571C346048J417590l627355k414307L69307L58417L58092N80186k847338o359812
8562h819172j486300P849994P209020m511270j0405620j794542P935889N587303
8554A565302j545243n30151M977454K642595o876944j1523501o898037j89255
8546a8377780L321318N894759Q988789R110725M455279j184189l902386m451259
8538C855256n032928m719158j127385M735788Q405271P500026M899240L914647
8530B2430757K352294l608057j0155134q057747L079903J1032803P339037m84996
8522B3928860j720443J13961n135445j4264748j3424906l65440J0771919R879728
$$ plain form
8579 4033732 -8064793 -13463576 -4069363 6775732 5530870 -1672829 -2020024 3346048
8571 3346048 4763638 1136283 -1278024 -908717 -550300 -192208 387978 -2459360 -8819172
8562 -8819172 -10305472 -2455478 4753542 242272 -10163348 -11957890 -4022001 1565302
8554 1565302 20059 -510092 4467362 7109957 233013 -11290488 -18188525 -18377780
8546 -18377780 -15056462 -9161703 -172914 8937811 13393090 12208901 8306515 3855256
8538 3855256 -1177672 -5896830 -7024215 -2288427 6116844 13616870 18516110 22430757
8530 22430757 24783051 21174994 11019860 2962113 6042016 17074819 24413856 23928860
8522 23928860 22208417 22322378 17186933 2922185 -10502721 -10868161 -96242 9783486
8514I783486L180909M19245J180297J99653k797378m969315n306717l067164K222403
8505H45419O025174J846906p655543j1334575n336863J105103O03925j683429
8497a5583883R83359N098355M770778K930363M770513O922125L653663j600178
8489A1945095j611044J988912K215716l81661L64755L289377P45978o930010r194807
8480B432311j049736Q134208O869172l344833j0612308p299554K238066P707815
8472E075141M024753m206663q862707p470846l914552j020813K369703N663179
8464h342805M383251k006201o006634j726765O190026R759520Q980819Q180788
8456A9411999N744062k233771j0689806r708309j78311N986572L409299k3616
$$ plain form
8514 9783486 12964395 13383640 14563937 14763590 11966212 6996897 1690180 -1376984 845419
8505 845419 6870593 8717499 1061956 -10272619 -15609482 -14504379 -13900454 -15583883
8497 -15583883 -14600524 -9502169 -4731391 -1801028 2969485 9891610 13545273 11945095
8489 11945095 10334051 12322963 14538679 14157018 14521773 17811150 18557128 11627118 2432311
8480 2432311 1382575 9516783 16385955 13041122 2428814 -4870740 -2632674 5075141
8472 5075141 9099894 4893231 -3969476 -11440322 -15354874 -16375687 -14005984 -8342805
8464 -8342805 -3959554 -5965755 -11972389 -13699154 -7509128 2250392 11231211 19411999
8456 19411999 25156061 22922290 12232484 2524175 2345864 8332436 11741735 11718119
8448A1718119K100004M204573l46319o988265p351741k552505o1458j533393k512410
8439c323395j481259o70056N26364M511796Q381175O174728j063191n472884m131667
8430C451611k428081l061385o57495P206070J1893372N121422p123865j1806576
8422B595073o765130j204920J44884J806993N201504L715780m603373r951423
8414i060612m304134N934580R577391O323582L162119R83200l651102p273076
8406A691948l096586N260398O704297J92502l653093o92979Q12548k948195l128061
8397A142779M702574Q767816j225389j4819394j3848390J330127J3200504J1616566
8389A0867193L144597l178574o160598o938434m563479k60147K413218L722138
$$ plain form
8448 11718119 13818123 18022696 17676377 10688112 3336371 783866 722408 -810985 -3323395
8439 -3323395 -4804654 -5474710 -4948346 -436550 7944625 14119353 13056162 7583278 3451611
8430 3451611 1023530 -2037855 -2695350 4510720 16404092 21525514 14401649 2595073
8422 2595073 -4170057 -5374977 -5230093 -3423100 1778404 5494184 890811 -9060612
8414 -9060612 -13364746 -7430166 2147225 8470807 11632926 12616126 8965024 1691948
8406 1691948 -1404638 3855760 10560057 10752559 7099466 6406487 7219035 4270840 1142779
8397 1142779 5845353 14613169 13387780 -1431614 -15280004 -13949877 -749373 10867193
8389 10867193 14011790 10833216 4672618 -2265816 -6829295 -7089442 -4676224 -954086
8381i54086O494088Q169035L009710o633032j0812364n987691P37154L870115
8373b107071O049214Q687864O769356j012886o547332m209794j97915j854559
8365E576877n322111l286595J454418J132243k490753l37224Q553275J4295863
8357A9575993R687868j633420j1151845j2680790m237957R322728J5691483N991892
8349C0565952j2284852k1705566j6139276o525379k622743M4092Q040319J4855701
8341e771752R642874l961515j0673721m916276K487298J875849j809701L61031
8333a2765913N858254N751998O71754J61610O047072P968838R7230p616780l475202
8324B698861P365890R419958o77021j0031949q770779k054884J168442J048158
$$ plain form
8381 -954086 5540002 13709037 16718747 10085715 -726649 -6714340 -5977186 -2107071
8373 -2107071 3942143 12630007 19399363 18386477 11839145 7629351 7431436 5576877
8365 5576877 254766 -3031829 -1577411 -445168 -2935921 -3273145 5280130 19575993
8357 19575993 29263861 27630441 16478596 3797806 -440151 8882577 24574060 30565952
8349 30565952 18281100 -3424466 -19563742 -26089121 -28711864 -28667772 -20627453 -5771752
8341 -5771752 3871122 -90393 -10764114 -15680390 -13193092 -11317243 -13126944 -12765913
8333 -12765913 -6907659 -1155661 -483907 -322297 5724775 13693613 13790843 6174063 2698861
8324 2698861 10064751 19484709 18807688 8775739 4960 -2049924 -881482 166676
8316A66676J849904K675271J300447M08804J296506k029331j1943613j6524837
8308b2800173l790317J6256345J9975862K376420j4793731j3086700p20499L927849
8300a2654944l72554r63665N697294R921421N935251n35252l446186l950209l470751
8291c839595Q96820Q550503J0485481j40169j5961532k1234962r995075O592970
8283b4645559J2933118N990225l441250n193007r39321J235116n64662o94177
8275a5319517L713405P898622O951740K263014k464405n956435o543609j112844
8267a0570029P671154R733389Q89764q096471n471895L425583M209671l483744
8259a692578n864695J322353N265645j911092q812781k972205Q578269J0364391
$$ plain form
8316 166676 2016580 4691851 5992298 6401102 7697608 5668277 -6275336 -22800173
8308 -22800173 -26590490 -10334145 9641717 12018137 -2775594 -15862294 -16582793 -12654944
8300 -12654944 -13027498 -13991163 -8293869 1627552 7562803 7027551 3581365 -368844 -3839595
8291 -3839595 -2942775 5607728 16093209 15953040 -8492 -21243454 -31238529 -24645559
8283 -24645559 -11712441 -5722216 -9163466 -14356473 -15295794 -14060678 -14625340 -15319517
8275 -15319517 -11606112 -3707490 3244250 5507264 3042859 -2913576 -9457185 -10570029
8267 -10570029 -2898875 6834514 7724278 -372193 -5844088 -2418505 1791166 -1692578
8259 -1692578 -7557273 -6234920 -969275 -2880367 -11693148 -14665353 -6087084 4277307
8251D277307K015840l947838l303718l637942p393051o666027J565486Q192805
8243h897138O291521K153852M058274Q328543O180741j026526l962562n55689
8235A2571016J312697k702796o413786l229492L750749P007748N262237K940367
8227B0498740J586170j855568q169615j2635868j0635848l420211L452540N499699
8219e679961K293674k741901m671369j468414L076178L377705l32560j900485
8211h047133J783410N963992N234441J490281M3574R12727k81488m350310p305199
8202d555705o629474l577021L17497L778509L729347r25966m045572J281031J0309977
8193c17377J0084422j631326j0791851o365713M179943P317839L258821J847455
$$ plain form
8251 4277307 6293147 2345309 -958409 -4596351 -11989402 -18655429 -17089943 -8897138
8243 -8897138 -2605617 -451765 3606509 11935052 18115793 17089267 13126705 12571016
8235 12571016 13883713 11180917 4767131 1537639 5288388 12296136 17558373 20498740
8227 20498740 22084910 20229342 12059727 -576141 -11211989 -14632200 -11179660 -5679961
8219 -5679961 -3386287 -6128188 -10799557 -12267971 -9191793 -5814088 -6146648 -8047133
8211 -8047133 -6263723 -299731 4934710 6424991 6468565 7381292 7099804 2749494 -4555705
8202 -4555705 -11185179 -14762200 -14444703 -10666194 -6936847 -7862813 -11908385 -10627354 -317377
8193 -317377 9767045 8135719 -2656132 -9021845 -4841902 2475937 5734758 7582213
8185G582213M247046K418013m727509q471404n361875k360077l025921r49056
8177a0648570O470821R360735N38147r830080p420201M078785Q146321Q75715
8169A571673l652287L844219J3397516J1156425j132441j1018975j2594612r219817
8161g648299l809606L262718Q383461O499824p09937n991661o317881m722713
8153a1054094k641963J559858N961294N859902K686689K660011M332274j189720
8145H174251j3062820j6621799n053137P249844N469362k363696P71100J1753863
8137c683032J2109773r57552r660496m199323M157082M845516L543816O073862
8129A2229646M763807n238520j1267010j909676J0960740Q114517o462466j1248876
$$ plain form
8185 7582213 11829259 14247272 9519763 1048359 -4313516 -6673593 -9699514 -10648570
8177 -10648570 -4177749 5182986 5721133 -4108947 -11529148 -7450363 695958 1571673
8169 1571673 -2080614 1763605 15161121 26317546 25185105 14166130 1571518 -7648299
8161 -7648299 -11457905 -8195187 188274 6688098 5978161 -13500 -6331381 -11054094
8153 -11054094 -13696057 -12136199 -6174905 -315003 2371686 5031697 9363971 8174251
8145 8174251 -4888569 -21510368 -26563505 -19313661 -13844299 -16207995 -15436895 -3683032
8137 -3683032 8426741 7469189 -2191307 -6390630 -2233548 2611968 6155784 12229646
8129 12229646 16993453 11754933 487923 -1421753 9538987 17653504 11191038 -57838
8121e7838l87655R278827N906215j877016l015539r50055l280111p133862n637499
8112g154533n92023J556190Q41773J682388L473505J779353l093465n988892m557949
8103a2053653j241872J794017M610462O617426O349894M531256L699992M231283
8095A8538805L675003N67133l524085o110466n854250k592991K140988M331357
8087A1171494K94110q057232j3174344r692723j070300M259250K745095j293013
8079a4817663k495572m33802K624956N729080P825070O050914J45986m369649
8071B59320l208640r24389l930839p759818j814269J1844395J6640490M360542
8063A5466792j1166653j2707330k954260K815900P44224K65988M573772N096992
$$ plain form
8121 -57838 -445493 8833334 14739549 12862533 9846994 8896939 5616828 -1517034 -7154533
8112 -7154533 -7746556 -6190366 -5348593 -3666205 -192700 1586653 -1506812 -7495704 -12053653
8103 -12053653 -13295525 -11501508 -6891046 -273620 6076274 10607530 14307522 18538805
8095 18538805 22213808 22780941 19256856 13146390 7292140 4699149 6840137 11171494
8087 11171494 11465604 3408372 -9765972 -19458695 -20528995 -16269745 -13524650 -14817663
8079 -14817663 -17313235 -17747037 -15122081 -9393001 -1567931 4482983 4628969 259320
8071 259320 -2949320 -3873709 -7804548 -15564366 -17378635 -5534240 11106250 15466792
8063 15466792 4300139 -8407191 -11361451 -8545551 -7801327 -7535339 -2961567 2135425
8055B135425j981527p685474m585992J729129K537578j236610l483350l173718
8047a5744539k473044j63368N006817Q423747N062607j754907m534287k588590
8039h765564j331404j902011K35605N821922R115631P141086M328786M077849
8031A8721900K346182m569852j1113306r059943m69867M345004J815082m34527
8023A580673L235600P061081L513934l895739n682340r30720K239854P7361j995813
$$ plain form
8055 2135425 153898 -7531576 -12117568 -10388439 -7850861 -9087471 -12570821 -15744539
8047 -15744539 -18217583 -18380951 -13374134 -4950387 112220 -1642687 -6176974 -8765564
8039 -8765564 -10096968 -11998979 -11763374 -5941452 3174179 10315265 14644051 18721900
8031 18721900 21068082 16498230 5384924 -3675019 -4144886 200118 2015200 1580673
8023 1580673 4816273 11877354 15391288 11495549 5813209 4882489 7122343 7199704 5203891
$$ [...]
##END NTUPLES=NMR SPECTRUM
##END=
