##TITLE=31Pdec_SR70_vak
 d2O, 24 sc
 29.09.2021
##JCAMPDX= 6.0         $$ Bruker NMR JCAMP-DX V2.0
##DATA TYPE= NMR SPECTRUM
##DATA CLASS= NTUPLES
##ORIGIN= UXNMR, Bruker Analytische Messtechnik GmbH
##OWNER= root
$$ XWIN-NMR		Version 3.5
$$ Wed Sep 29 12:45:55 2021 Russian Standard Time (UT+4h)  she@DPX200
##.OBSERVE FREQUENCY= 81.013821
##.OBSERVE NUCLEUS= ^31P
##.ACQUISITION MODE= SIMULTANEOUS
##.ACQUISITION SCHEME= undefined
##.AVERAGES= 24
##.DIGITISER RES= 16
##SPECTROMETER/DATA SYSTEM= spect
##.PULSE SEQUENCE= zgpg30
##.SOLVENT NAME= D2O
##.SHIFT REFERENCE= (INTERNAL, D2O, 0, 248.564)
##AUDIT TRAIL= $$ (NUMBER, WHEN, WHO, WHERE, WHAT)
$$ ##TITLE= Audit trail, XWIN-NMR		Version 3.5
$$ ##JCAMPDX= 5.01
$$ ##ORIGIN= Bruker BioSpin GmbH
$$ ##OWNER= she
$$ F:/spectra/data/she/nmr/P31/1/pdata/1/auditp.txt
$$ ##AUDIT TRAIL=  $$ (NUMBER, WHEN, WHO, WHERE, WHAT)
(   1,<2021-09-29 12:44:13.39 +0400>,<she>,<DPX200>,
      <created by zg, POWCHK disabled, PULCHK disabled
       configuration hash MD5:
       00 E9 B6 7A A2 85 ED C7 34 08 36 98 17 FE 4E 26
       data hash MD5: 32K
       AB B8 F3 3B 3C E9 DD FD 40 43 60 CE 7F 9B 29 EC>)
(   2,<2021-09-29 12:44:20.95 +0400>,<she>,<DPX200>,
      <Start of raw data processing
       efp BC_mod = 2 LB = 1 FT_mod = 6 PKNL = 1 PHC0 = -9022.819 PHC1 = 631.0691 SI = 64K 
       data hash MD5: 64K
       C5 14 55 01 BF CA 2B B5 D7 75 6C 4D 6D EE 51 18>)
(   3,<2021-09-29 12:44:53.95 +0400>,<she>,<DPX200>,
      <pk PHC0 = -196.7946 PHC1 = 410.4 
       data hash MD5: 64K
       73 D3 B7 C0 11 77 95 2A 89 BC 0B DD 5C 0A F5 7F>)
(   4,<2021-09-29 12:45:18.62 +0400>,<she>,<DPX200>,
      <pk PHC0 = 450.8675 PHC1 = -1115.2 
       data hash MD5: 64K
       11 95 FC F0 80 54 04 4C D6 E2 8B 23 D5 B1 5A 2D>)
$$ ##END=
$$ 
$$ hash MD5
$$ DB 16 5A B2 B5 32 39 EA 47 0F A6 34 E9 55 CC 6D
##$RELAX= 
##$RELAX= 
##$RELAX= 
##$RELAX= 
##$RELAX= 
##$RELAX= 
##$RELAX= 
##$RELAX= 
$$ Bruker specific parameters
$$ --------------------------
##$DU= <F:/spectra>
##$EXPNO= 1
##$NAME= <P31>
##$PROCNO= 1
##$TYPE= <nmr>
##$USER= <she>
##$AMP= (0..31)
100 100 100 100 100 100 100 100 100 100 100 100 100 100 100 100 100 100 
100 100 100 100 100 100 100 100 100 100 100 100 100 100 
##$AQSEQ= 0
##$AQ_mod= 1
##$AUNM= <au_zg>
##$AUTOPOS= <>
##$BF1= 81.014009
##$BF2= 200.13
##$BF3= 200.13
##$BF4= 200.13
##$BF5= 200.13
##$BF6= 200.13
##$BF7= 200.13
##$BF8= 200.13
##$BYTORDA= 1
##$CFDGTYP= 0
##$CFRGTYP= 5
##$CHEMSTR= <none>
##$CNST= (0..31)
1 1 145 1 1 1 1 1 1 1 1 1 1 1 1 1 1 1 1 1 1 1 1 1 1 1 1 1 1 1 1 1 
##$CPDPRG= <waltz16>
##$CPDPRG1= <>
##$CPDPRG2= <waltz16>
##$CPDPRG3= <>
##$CPDPRG4= <mlev>
##$CPDPRG5= <mlev>
##$CPDPRG6= <mlev>
##$CPDPRG7= <mlev>
##$CPDPRG8= <mlev>
##$CPDPRGB= <>
##$CPDPRGT= <>
##$D= (0..31)
0 1 0 0 0 0 0 0 0 0 0 0.03 2e-05 3e-06 0 0 0 0 0 0 0 0 0 0 0 0 0 0 0 0 
0 0 
##$DATE= 1632905052
##$DBL= (0..7)
120 120 120 11 120 120 24 19 
##$DBP= (0..7)
150 150 150 150 150 150 150 150 
##$DBP07= 0
##$DBPNAM0= <>
##$DBPNAM1= <>
$$ [...]
##$SUBNAM2= <"">
##$SUBNAM3= <"">
##$SUBNAM4= <"">
##$SUBNAM5= <"">
##$SUBNAM6= <"">
##$SUBNAM7= <"">
##$SUBNAM8= <"">
##$SUBNAM9= <"">
##$SW= 501.771253377433
##$SWIBOX= (0..15)
0 1 3 0 0 0 0 0 0 0 0 0 0 0 0 0 
##$SW_h= 40650.406504065
##$TD= 32768
##$TD0= 1
##$TE= 0
##$TE2= 300
##$TE3= 300
##$TEG= 300
##$TL= (0..7)
0 120 53 12 22 120 120 120 
##$TP= (0..7)
150 150 150 150 150 150 150 150 
##$TP07= 0
##$TPNAME0= <>
##$TPNAME1= <>
##$TPNAME2= <>
##$TPNAME3= <>
##$TPNAME4= <>
##$TPNAME5= <>
##$TPNAME6= <>
##$TPNAME7= <>
##$TPOAL= (0..7)
0.5 0.5 0.5 0.5 0.5 0.5 0.5 0.5 
##$TPOFFS= (0..7)
0 0 0 0 0 0 0 0 
##$TUNHIN= 0
##$TUNHOUT= 0
##$TUNXOUT= 0
##$USERA1= <user>
##$USERA2= <user>
##$USERA3= <user>
##$USERA4= <user>
##$USERA5= <user>
##$V9= 5
##$VALIST= <valist>
##$VCLIST= <CCCCCCCCCCCCCCC>
##$VD= 0
##$VDLIST= <DDDDDDDDDDDDDDD>
##$VPLIST= <PPPPPPPPPPPPPPP>
##$VTLIST= <TTTTTTTTTTTTTTT>
##$WBST= 1024
##$WBSW= 4
##$XGAIN= (0..3)
0 0 0 0 
##$XL= 0
##$YL= 0
##$YMAX_a= 2901
##$YMIN_a= -2751
##$ZGOPTNS= <>
##$ZL1= 120
##$ZL2= 120
##$ZL3= 120
##$ZL4= 120
##$ABSF1= 0
##$ABSF2= 0
##$ABSG= 0
##$ABSL= 0
##$ALPHA= 0
##$AQORDER= 0
##$ASSFAC= 0
##$ASSFACI= 0
##$ASSFACX= 0
##$ASSWID= 0
##$AUNMP= <proc_1d>
##$AZFE= 0.1
##$AZFW= 0.5
##$BCFW= 0
##$BC_mod= 2
##$BYTORDP= 0
##$COROFFS= 0
##$CY= -3
##$DATMOD= 1
##$DC= 0
##$DFILT= <>
##$DTYPP= 0
##$F1P= 0
##$F2P= 0
##$FCOR= 1
##$FTSIZE= 65536
##$FT_mod= 6
##$GAMMA= 0
##$GB= 0
##$INTBC= 1
##$INTSCL= 5.30512e-09
##$ISEN= 30
##$LB= 1
##$LEV0= 0
##$LPBIN= 0
##$MAXI= 10000
##$MC2= 0
##$MEAN= 0
##$ME_mod= 0
##$MI= 50
##$NCOEF= 0
##$NC_proc= -7
##$NLEV= 6
##$NOISF1= 182.463
##$NOISF2= 159.3651
##$NSP= 0
##$NTH_PI= 0
##$NZP= 0
##$OFFSET= 248.5645
##$PC= 4
##$PHC0= -8768.747
##$PHC1= -73.73096
##$PH_mod= 1
##$PKNL= yes
##$PPARMOD= 0
##$PSCAL= 0
##$PSIGN= 0
##$REVERSE= no
##$SF= 81.014009
##$SI= 65536
##$SIGF1= 159.3651
##$SIGF2= -187.1042
##$SINO= 113.3802
##$SIOLD= 16384
##$SREGLST= <1H.CDCl3>
##$SSB= 0
##$STSI= 65536
##$STSR= 0
##$SW_p= 40650.406504065
##$SYMM= 0
##$S_DEV= 0
##$TDeff= 32768
##$TDoff= 0
##$TI= <>
##$TILT= no
##$TM1= 0
##$TM2= 0
##$TOPLEV= 0
##$USERP1= <user>
##$USERP2= <user>
##$USERP3= <user>
##$USERP4= <user>
##$USERP5= <user>
##$WDW= 1
##$XDIM= 65536
##$YMAX_p= 236239261
##$YMIN_p= -294790921
$$ End of Bruker specific parameters
$$ ---------------------------------
##NTUPLES= NMR SPECTRUM
##VAR_NAME=  FREQUENCY,     SPECTRUM/REAL,   SPECTRUM/IMAG
##SYMBOL=    X,             R,               I
##VAR_TYPE=  INDEPENDENT,   DEPENDENT,       DEPENDENT
##VAR_FORM=  AFFN,          ASDF,            ASDF
##VAR_DIM=   65536,         65536,           65536
##UNITS=     HZ,            ARBITRARY UNITS, ARBITRARY UNITS
##FACTOR=    0.620285442955139, 1,           1
##FIRST=     20137.2065510759, 0,            0
##LAST=      -20513.1999529892, 0,           0
##MIN=       -20513.1999529892, -294790921,  0
##MAX=       20137.2065510759, 236239261,    0
$$ Real data points
##PAGE= N=1
##DATA TABLE= (X++(R..R)), XYDATA
$$ [...]
$$ plain form
41700 1206067 476832 -515208 -1297084 -1708649 -1377979 -790106 -1248179 -2678676 -3151990
41691 -3151990 -1868948 -840288 -1808759 -3107347 -1952204 1160100 3009694 2286743
41683 2286743 1002558 917919 1087032 101390 -1186656 -920892 755740 1668353 518209
41674 518209 -1370053 -1689777 -57253 1391406 593050 -1737874 -2956721 -2064043 -1037896
41665 -1037896 -1838857 -3576675 -4224689 -3962775 -4563844 -5973642 -6039848 -3876566 -1110031
41656 -1110031 871247 2581824 4268340 4325588 1708986 -1584748 -2449426 -385819 2203018
41647 2203018 2889385 1260725 -1268418 -2640371 -1790501 65267 591560 -592555 -1360108
41638 -1360108 -468288 420111 -185240 -464971 2017650 5702455 6412607 3219436 -166907
$$ packed form
41700A206067p29235r92040p81876m11565L30670N87873m58073j430497m73314
41691c151990J283042J028660r68471j298588J155143L112304J849594p22951
41683B286743j284185q4639J69113r85642j288046K65764J676632R12613j150144
41674E18209j888262l19724J632524J448659p98356k330924j218847Q92678J026147
41665a037896q00961j737818o48014K61914o01069j409798o6206K163282K766535
41656a110031J981278J710577J686516N7248k616602l293734q64678K063607K588837
41647B203018O86367j628660k529143j371953Q49870J855768N26293j184115p67553
41638a360108Q91820Q88399o05351k79731K482621L684805P10152l193171l386343
$$ plain form
41629 -166907 -438060 1576414 3146123 3203472 2335186 1148803 195812 180197 889711
41620 889711 993746 15742 -624301 296805 1768439 1935958 644585 -778199 -1555717
41611 -1555717 -1809742 -1385394 52585 1779784 2336608 1487355 776375 1547288 3100376
41602 3100376 3469480 1725399 -1080245 -3267992 -4281629 -4646894 -4491612 -3101381 -456576
41593 -456576 1704794 1600213 -138797 -1131425 -496219 51066 -1054738 -2809853 -3146106
41584 -3146106 -1896269 -807604 -951432 -1512272 -1350881 -705873 -752720 -1966834 -3538574
41575 -3538574 -4417471 -4495000 -4341110 -3920927 -2405621 211063 2089932 1320027 -1526746
41566 -1526746 -3893206 -4358525 -3924783 -3863004 -3758881 -2594291 -657789 732773 815409
$$ packed form
41629a66907k71153K014474J569709N7349q68286j186383r52991j5615P09514
41620H89711J04035r78004o40043R21106J471634J67519j291373j422784p77518
41611a555717k54025M24348J437979J727199N56824q49253p10980P70913J553088
41602C100376L69104j744081k805644k187747j013637l65265J55282J390231K644805
41593d56576K161370j04581j739010r92628O35206N47285j105804j755115l36253
41584c146106J249837J088665j43828n60840J61391O45008m6847j214114j571740
41575c538574q78897p7529J53890M20183J515306K616684J878869p69905k846773
41566a526746k366460m65319M33742O1779J04123J164590J936502J390562Q2636
$$ plain form
41557 815409 -74407 -959102 -734276 831278 2052352 634706 -2903494 -4568470 -1464242
41548 -1464242 3922787 6188385 3425237 -1032899 -3386476 -3530892 -3546788 -4123635 -4257148
41539 -4257148 -3445841 -2394546 -1780791 -1658295 -2046570 -2963529 -3747012 -3429547 -2164200
41530 -2164200 -1302819 -1459936 -1463155 -266677 879940 -163736 -2970375 -4457959 -3063191
41521 -3063191 -1233367 -2182465 -5403413 -7448280 -6580302 -4447812 -3125694 -2677134 -2257946
41512 -2257946 -1760002 -1350818 -738623 126811 623673 454542 168026 219839 482483 885826
41502 885826 1314959 895394 -871605 -2269643 -1074724 1511377 1605584 -1600674 -4110726
41493 -4110726 -3043820 -902044 -1070296 -2259684 -1357031 719654 770084 -587849 277392
$$ packed form
41557H15409q89816q84695K24826J565554J221074j417646l538200j664976L104228
41548a464242N387029K265598k763148m458136k353577j44416j5896n76847j33513
41539d257148Q11307J051295O13755J22496l88275r16959p83483L17465J265347
41530b164200Q61381j57117l219J196478J146617j043676k806639j487584J394768
41521c063191J829824r49098l220948k044867Q67978K132490J322118M48560M19188
41512b257946M97944M09184O12195Q65434M96862j69131k86516N1813K62644M03343
41502H85826M29133m19565j766999j398038J194919K586101R4207l206258k510052
41493d110726J066906K141776j68252j189388R02653K076685N0430j357933Q65241
$$ plain form
41484 277392 3432527 4652331 1982800 -1433308 -2323360 -1194789 53891 801224 527405
41475 527405 -1544318 -4036019 -4017121 -1665189 -834695 -3116914 -5106512 -4041436 -2294500
41466 -2294500 -2942487 -4446325 -3893956 -2594297 -3599213 -5648323 -4789411 -1177217 798713
41457 798713 -755544 -2984874 -3390160 -2945932 -2967867 -2681564 -1535281 -747268 -836764
41448 -836764 -405403 915248 1020528 -1109149 -2845035 -1432893 1669658 2658614 631094
41439 631094 -1489663 -971862 1752998 4202348 4528614 2929492 1217000 977841 1781420
41430 1781420 1727259 144030 -1245113 -652832 1278050 2470740 2135553 1174090 394858
41421 394858 -240914 -787916 -1097751 -1480885 -2345789 -2995228 -2045605 449885 2451693
$$ packed form
41484B77392L155135J219804k669531l416108q90052J128571J248680P47333k73819
41475E27405k071723k491701J8898K351932Q30494k282219j989598J065076J746936
41466b294500o47987j503838N52369J299659j004916k049110Q58912L612194J975930
41457G98713j554257k229330m05286M44228k1935K86303J146283P88013q9496
41448h36764M31361J320651J05280k129677j735886J412142L102551R88956k027520
41439F31094k120757N17801K724860K449350L26266j599122j712492k39159Q03579
41430A781420n4161j583229j389143N92281J930882J192690l35187r61463p79232
41421C94858o35772n47002l09835l83134q64904o49439R49623K495490K001808
$$ plain form
41412 2451693 2406083 1414679 1635572 2828764 2162399 -1776105 -6109040 -6561547 -2945854
41403 -2945854 268727 -379692 -2972152 -3163718 -124737 2933045 3668509 3203228 3244798
41394 3244798 3344128 2547036 1638692 1658845 1627213 28524 -2274654 -2868752 -1159032
41385 -1159032 1141153 2664784 3446249 3373990 1891303 -292729 -1350101 -952972 -724541
41376 -724541 -1198744 -622430 1670127 2911179 369170 -4260459 -6657822 -5370842 -2823143
41367 -2823143 -1155651 7 1172977 1390523 167000 -1152626 -1655167 -2543284 -4685932
41358 -4685932 -6170126 -4698871 -1408609 325338 -400868 -1060703 195376 1818346
41350 1818346 1308318 -1289934 -3641810 -3906110 -2195691 80150 1436493 1289419 351092
$$ packed form
41412B451693m5610r91404K20893J193192o66365l938504m332935m52507L615693
41403b945854L214581o48419k592460j91566L038981L057782P35464m65281M1570
41394C244798R9330p97092r08344K0153l1632j598689k303178n94098J709720
41385a159032K300185J523631P81465p2259j482687k184032j057372L97129K28431
41376g24541m74203N76314K292557J241052k542009m629629k397363J286980K547699
41367b823143J667492J155658J172970K17546j223523j319626n02541q88117k142648
41358d685932j484194J471255L290262J733947p26206o59835J256079J622970
41350A818346n10028k598252k351876k64300J710419K275841J356343j47074r38327
$$ plain form
41341 351092 -194106 -62155 122806 126448 352894 648371 264987 -415574 305775 2787353
41331 2787353 4645086 3660742 1076716 93808 1674180 3808796 4660273 4292915 3157631
41322 3157631 1140492 -1077306 -1712440 -234135 1430487 1396306 326793 19594 570504
41313 570504 673124 36553 -386743 -340540 -595230 -1235007 -1332009 -673686 -183727 -113207
41303 -113207 478732 1593532 1419625 -942019 -3307432 -2894538 -137983 1991384 2025883
41294 2025883 1253785 1017866 1006025 717391 520455 327348 -899598 -3082726 -4149499
41285 -4149499 -2744219 -401586 713218 972034 2113078 3869997 4313511 3330315 3142618
41276 3142618 4742583 6009557 4568852 1026641 -1930485 -2721978 -1979258 -1033948 -470105
$$ packed form
41341C51092n45198J31951J84961L642K26446K95477l83384o80561P21349K481578
41331B787353J857733r84344k584026r82908J580372K134616Q51477l67358j135284
41322C157631k017139k217798o35134J478305J664622l4181j069513l07199N50910
41313E70504J02620o36571m23296M6203k54690o39777r7002O58323M89959P0520
41303a13207N91939J114800j73907k361644k365413M12894K756555K129367L4499
41294B025883p72098k35919j1841k88634j96936j93107j226946k183128j066773
41285d149499J405280K342633J114804K58816J141044J756919M43514r83196j87697
41276C142618J599965J266974j440705l542211k957126p91493P42720R45310N63843
$$ plain form
41267 -470105 -257687 -591584 -1976398 -4232344 -5825419 -5150751 -2639829 -364993 944752
41258 944752 2808583 5786117 7421074 5629688 2405066 1071612 1082236 -664801 -3882336
41249 -3882336 -4724142 -2121672 246620 -147200 -1220434 -1056967 -1795096 -5219932 -8123855
41240 -8123855 -6500605 -1904334 913873 991795 1153186 2127876 1552146 -1174212 -3470066
41231 -3470066 -3691594 -2953831 -2127113 -545737 1330044 1318631 -1031778 -3157783 -2976470
41222 -2976470 -1298069 277319 1395396 1788701 631425 -1517630 -2351389 -876734
41214 -876734 1046867 1457771 640440 -435563 -1877938 -3580953 -4134565 -2748545 -801454
41205 -801454 -61194 -715388 -2162710 -3991341 -5076301 -3776016 -528776 1693375 1156230
$$ packed form
41267d70105K12418l33897j384814k255946j593075O74668K510922K274836J309745
41258I44752J863831K977534J634957j791386l224622j333454J0624j747037l217535
41249c882336q41806K602470K368292l93820j073234J63467p38129l424836k903923
41240h123855J623250M596271K818207P7922J61391R74690n75730k726358k295854
41231c470066k21528P37763Q26718J581376J875781j1413k350409k126005J81313
41222b976470J678401J575388J118077L93305j157276k149055q33759J474655
41214h76734J923601M10904q17331j076003j442375j703015n53612J386020J947091
41205h01454P40260o54194j447322j828631j084960J300285L247240K222151n37145
$$ plain form
41196 1156230 -294694 -342644 398722 174370 -630018 -467880 541347 1179756 1306962
41187 1306962 1187337 -31104 -2644948 -4435770 -3207638 -390820 782261 -16427
41179 -16427 -438609 53952 -576136 -2924091 -4795322 -4903573 -4862420 -5929877 -6361618
41170 -6361618 -4081548 -209576 2193611 1852990 -28645 -1995166 -3481354 -4084948
41162 -4084948 -3354473 -1608109 16149 698389 653265 565631 685489 657209 73198 -952067
41152 -952067 -1796811 -1934209 -1470749 -1000840 -901505 -780828 259566 2509847 4747101
41143 4747101 5072505 3168498 1073314 822732 1968781 2717271 2825073 3354886 3859777
41134 3859777 2505949 -414242 -1903495 -585174 1010128 465695 -637945 485433
$$ packed form
41196A156230j450924m7950P41366k24352q04388J62138J009227O38409J27206
41187A306962j19625j218441k613844j790822J228132K816818J173081p98688
41179a6427m22182M92561o30088k347955j871231j08251M1153j067457m31741
41170f361618K280070L871972K403187l40621j881635j966521j486188o03594
41162d084948P30475J746364J624258O82240m5124q7634J19858k8280n84011j025265
41152i52067q44744j37398M63460M69909R9335J20677J040394K250281K237254
41143D747101L25404j904007k095184k50582J146049P48490J07802N29813N04891
41134C859777j353828k920191j489253J318321J595302n44433j103640J123378
$$ plain form
41126 485433 3081687 4023181 2485090 307380 -1448730 -3023968 -3546590 -1635536 1376163
41117 1376163 2162416 5950 -2358554 -3234794 -4063423 -5746252 -6127800 -3392639 471362
41108 471362 2185880 1557486 913055 1294352 1609585 1030575 87155 -608167 -1106072
41099 -1106072 -1429423 -1293537 -725151 -258166 -424044 -1351842 -2643561 -3525715 -3691348
41090 -3691348 -4039667 -5596260 -7489139 -7351055 -4404791 -819962 954351 940158 557305
41081 557305 123480 -895525 -2060344 -2323443 -1864688 -1797636 -2193958 -2116868 -1609583 -1793769
41071 -1793769 -2641596 -2547326 -943548 407805 21020 -906379 -431102 881283 847295
41062 847295 -609923 -1113527 342802 1637957 874258 -577334 -380571 913011 857584
$$ packed form
41126D85433K596254R41494j538091k177710j756110j575238n22622J911054L011699
41117A376163P86253k156466k364504q76240q28629j682829l81548K735161L864001
41108D71362J714518o28394o44431L81297L15233n79010r43420o95322m97905
41099a106072l23351J35886N68386M66985j65878r27798j291719q82154j65633
41090c691348l48319j556593j892879J38084K946264L584829J774313j4193l82853
41081E57305m33825j019005j164819k63099M58755O7052l96322P7090N07285j84186
41071a793769q47827R4270J603778J351353l86785r27399M75277J312385l3988
41062H47295j457218n03604J456329J295155p63699j451592J96763J293582n5427
$$ plain form
41053 857584 -772836 -1655766 -760755 254031 226920 452583 2037610 3499507 2908398
41044 2908398 853429 -664922 -1114148 -1315586 -1428553 -957418 -105703 550762 1080634
41035 1080634 1387458 351880 -2391821 -4725654 -4216361 -1470264 670710 781451 -219466
41026 -219466 -1144751 -1429538 -576644 1050070 1538197 -53611 -1287481 652689 4238426
41017 4238426 5310953 3237163 1511597 1959683 2511420 1737217 1308086 2076980 1762756
41008 1762756 -818225 -2734625 -1330731 1220618 1205836 -982985 -2028447 -938157
41000 -938157 381260 823682 1065773 1265902 634366 -720748 -1683997 -1772160 -1297219
40991 -1297219 -478169 120152 -698870 -2866444 -4077567 -2743473 -669985 -482268 -1598005
$$ packed form
41053H57584j630420q82930Q95011J014786k7111K25663J585027J461897n91109
41044B908398k054969j518351m49226k01438j12967M71135Q51715O56465N29872
41035A080634L06824j035578k743701k333833N09293K746097K140974J10741j000917
41026b19466r25285k84787Q52894J626714M88127j591808j233870J940170L585737
41017D238426J072527k073790j725566M48086N51737p74203m29131P68894l14224
41008A762756k580981j916400J403894K551349j4782k188821j045462J090290
41000i38157J319417M42422K42091K00129o31536j355114r63249q8163M74941
40991a297219Q19050N98321q19022k167574j211123J334094K073488J87717j115737
$$ plain form
40982 -1598005 -1458233 199536 1300293 1129979 992251 1253261 743347 -550666 -981208
40973 -981208 -75639 578924 54813 -522463 -180945 244699 -353761 -1733419 -3046409
40964 -3046409 -3888669 -3973863 -3009419 -1431568 -158538 706502 1833300 3208108 3904481
40955 3904481 3366467 1789970 -546620 -2986980 -3954300 -2480186 -57667 920439 401572
40946 401572 289741 997485 894721 -515976 -1512282 -1042229 -308475 -477816 -1039811
40937 -1039811 -1479098 -2278489 -3003197 -1784236 1545412 3937777 2826798 -377454 -2563986
40928 -2563986 -3058818 -3144751 -2897049 -1395131 535591 676981 -1304438 -3274294 -3759953
40919 -3759953 -3636433 -4024128 -4315360 -3393013 -1586341 -189341 353458 705999 1253994
$$ packed form
40982a598005J39772J657769J100757j70314j37728K61010n09914j294013m30542
40973i81208R05569O54563n24111n77276L41518M25644n98460j379658j312990
40964c046409q42260q5194R64444J577851J273030Q65040J126798J374808O96373
40955C904481n38014j576497k336590k440360r67320J474114K422519R78106n18867
40946D01572j11831P07744j02764j410697r96306M70053P33754j69341n61995
40937a039811m39287p99391p24708J218961L329648K392365j110979l204252k186532
40928b563986m94832q5933K47702J501918J930722J41390j981419j969856m85659
40919c759953J23520l87695k91232R22347J806672J397000N42799L52541N47995
$$ plain form
40910 1253994 1339428 196871 -1758528 -3116021 -3052514 -2260353 -1855607 -1805744 -1297994
40901 -1297994 -423081 -236794 -951587 -1479533 -1432060 -2132562 -4431006 -6718958 -6806530
40892 -6806530 -5047781 -3689404 -3375313 -2412565 69753 2276569 2258046 792885 160466
40883 160466 854949 1275049 515829 -241222 359487 1824289 2558435 1849480 227439
40874 227439 -1603430 -3217196 -4111210 -3905840 -3031551 -2516274 -2904830 -3824601 -4578581
40865 -4578581 -4678693 -3953530 -2757587 -1929097 -1904071 -2141833 -2113464 -2239019 -2721949 -2293096
40855 -2293096 -32217 2138111 1463659 -1019174 -1040570 2675795 6058841 5631787 3669093
40846 3669093 4248456 6620123 6628489 3551802 1181854 1940329 3719773 3556774 1470501
$$ packed form
40910A253994Q5434j142557j955399j357493O3507P92161M04746M9863N07750
40901a297994Q74913J86287p14793n27946M7473p00502k298444k287952q7572
40892f806530J758749J358377L14091R62748K482318K206816j8523j465161o32419
40883A60466O94483M20100p59220p57051O00709J464802P34146p08955j622041
40874B27439j830869j613766q94014K05370Q74289N15277l88556r19771p53980
40865d578581j00112P25163J195943Q28490K5026k37762K8369j25555m82930M28853
40855b293096K260879K170328o74452k482833k1396L716365L383046m27054j962694
40846C669093N79363K371667Q366l076687k369948P58475J779444j62999k086273
$$ plain form
40837 1470501 -594380 -1394504 -812941 610528 1717889 1684201 1273805 1710392 2430089
40828 2430089 1918295 672293 893339 2904444 4352838 3643047 1875848 643368 86720
40819 86720 -144306 -170168 -744088 -2576584 -4312954 -3774964 -1740944 -1419187 -3289258
40810 -3289258 -3951090 -1604018 960363 1013601 -16109 65528 99399 -1549848 -2797585
40801 -2797585 -751315 3027868 4440820 2918419 1533728 1775648 2224568 2210785 2880231
40792 2880231 4245559 4631218 3666312 2786054 2196890 401747 -2413352 -3512045 -1517316
40783 -1517316 1208349 1657710 -85891 -1602940 -1344944 80424 998989 324666 -1334725
40774 -1334725 -2158052 -1290818 24694 445741 531520 1068325 714166 -2011594 -5195682
$$ packed form
40837A470501k064881q00124N81563J423469J107361l3688m10396M36587P19697
40828B430089n11794j246002K21046K011105J448394p09791j767199j232480n56648
40819H6720k31026k5862n73920j832496j736370N37990K034020L21757j870071
40810c289258o61832K347072K564381N3238j029710Q1637L3871j649247j247737
40801b797585K046270L779183J412952j522401j384691K41920M48920j3783O69446
40792B880231J365328L85659r64906q80258n89164j795143k815099j098693J994729
40783a517316K725665M49361j743601j517049K57996J425368R18565o74323j659391
40774a334725q23327Q67234J315512M21047Q5779N36805l54159k725760l184088
$$ plain form
40765 -5195682 -5225839 -1960877 1042926 1798844 1975903 2912207 3131389 1493510 -388943
40756 -388943 -1074728 -1896241 -4106699 -5684898 -3870895 548765 4145994 5080135 4165869
40747 4165869 2671716 1380296 1229858 2652055 4384195 4551485 2714304 -266620
40739 -266620 -3528875 -5997056 -6107283 -3809918 -1973637 -3407976 -6855475 -8311546
40731 -8311546 -6278002 -3317292 -2079401 -2213460 -2139590 -1755115 -1862303 -2270699 -2091338
40722 -2091338 -1336606 -957981 -1418991 -2033162 -1813449 -707428 67029 -820244 -2962106
40713 -2962106 -4021828 -2317933 723515 2038949 891682 -243020 638371 2145939
40705 2145939 1608267 -1061413 -3424202 -3986931 -3695320 -3685601 -3319708 -1517985 1083213
$$ packed form
40765e195682l0157L264962L003803P55918J77059R36304K19182j637879j882453
40756c88943o85785q21513k210458j578199J814003M419660L597229R34141r14266
40747D165869j494153j291420j50438J422197J732140J67290j837181k980924
40739b66620l262255k468181j10227K297365J836281j434339l447499j456071
40731h311546K033544K960710J237891j34059P3870L84475j07188m08396J79361
40722b091338P54732L78625m61010o14171K19713J106021P74457q87273k141862
40713b962106j059722J703895L041448J315434j147267j134702Q81391J507568
40705B145939n37672k669680k362789n62729K91611R719L65893J801723K601198
$$ plain form
40696 1083213 2699038 2690314 1975055 1208023 -38679 -1766822 -2563192 -1374201 464801
40687 464801 578257 -1089097 -1851782 165864 3394923 4813465 3634720 1662010 491931
40678 491931 -80457 -804720 -1564522 -1816668 -1518895 -1034600 -743718 -1100317 -2290072
40669 -2290072 -3398257 -2880505 -659439 1094344 374089 -2044535 -3620848 -3291694 -2257361
40660 -2257361 -1618397 -906022 494153 1924231 2430511 2109395 1458436 283464 -1540219
40651 -1540219 -2873655 -2266847 77359 2400400 3331552 2818644 1445309 -23675 -612256
40642 -612256 74811 1006100 833781 -175699 -548105 170785 1090196 1839098 2905283
40633 2905283 3848744 3292174 1406411 217562 357669 -155356 -2300766 -3682807 -2208303
$$ packed form
40696A083213J615825q724p15259p67032j246702j728143p96370J188991J839002
40687D64801J13456j667354p62685K017646L229059J418542j178745j972710j170079
40678D91931n72388p24263p59802k52146K97773M84295K90882l56599j189755
40669b290072j108185N17752K221066J753783p20255k418624j576313L29154J034333
40660b257361O38964P12375J400175J430078N06280l21116o50959j174972j823683
40651a540219j333436O06808K344206K323041R31152n12908j373335j468984n88581
40642f12256O87067R31289j72319j009480l72406P18890R19411P48902J066185
40633B905283R43461n56570j885763j188849J40107n13025k145410j382041J474504
$$ plain form
40624 -2208303 24142 -265865 -2157483 -1954652 657828 1990669 235769 -2051054
40616 -2051054 -2589669 -2727244 -4065422 -5009438 -3527718 -934098 203041 205874 1132679
40607 1132679 2719694 2965953 2275924 3412531 6835204 9275262 8109995 4611574
40599 4611574 1534625 -245646 -1107797 -818948 523193 1098697 -717911 -3714675 -5191509
40590 -5191509 -4519469 -3338775 -2530305 -1349802 129481 133103 -2142385 -4856427 -5944977
40581 -5944977 -5744225 -5632834 -5354561 -3705036 -1142031 478245 664381 779425 1509728
40572 1509728 1707919 364678 -1865109 -3843261 -5211674 -5676920 -4522962 -1981551
40564 -1981551 161435 633755 338739 640559 1021604 117915 -1604483 -2086075 -452552
$$ packed form
40624b208303K232445k90007j891618K02831K612480J332841j754900k286823
40616b051054n38615j37575j338178r44016J481720K593620J137139K833R26805
40607A132679J587015K46259o90029J136607L422673K440058j165267l498421
40599D611574l076949j780271q62151K88849J342141N75504j816608k996764j476834
40590e191509O72040J180694Q08470J180503J479283L622k275488k714042j088550
40581e944977K00752J11391K78273J649525K563005J620276J86136J15044P30303
40572A509728J98191j343241k229787j978152j368413m65246J153958K541411
40564a981551K142986M72320k95016L01820L81045r03689j722398m81592J633523
$$ plain form
40555 -452552 2068682 4096632 5520661 6704341 7435365 7021111 4730525 333059 -4861512
40546 -4861512 -7979935 -7186442 -4275632 -2961768 -4266045 -5369055 -3759999 -756704
40538 -756704 456845 -941677 -2767963 -2821901 -1023157 1305932 2973230 3411079 2555879
40529 2555879 899265 -547288 -823561 153531 1342661 1460933 304176 -1133498 -2077993
40520 -2077993 -2884540 -3924971 -4347500 -3230187 -1607056 -1695033 -3798178 -5471921 -4487171
40511 -4487171 -1489463 1084320 1811059 1209563 660841 1189459 2674613 3646642 2613831
40502 2613831 185524 -1125248 -108996 1193848 123713 -2778641 -4315271 -2848128
40494 -2848128 -267823 698866 -214812 -1060778 -397654 1188975 2064352 1359111 -304236
$$ packed form
40555d52552K521234K027950J424029J183680P31024m14254k290586m397466n194571
40546d861512l118423P93493K910810J313864j304277j103010J609056L003295
40538g56704J213549j398522j826286n3938J798744K329089J667298M37849q55200
40529B555879j656614j446553k76273R77092J189130J18272j156757j437674r44495
40520b077993q06547j040431m22529J117313J623131q7977k103145j673743R84750
40511d487171K997708K573783P26739o01496n48722N28618J485154R72029j032811
40502B613831k428307j310772J016252J302844j070135k902354j536630J467143
40494b848128K580305R66689r13678q45966O63124J586629Q75377p05241j663347
$$ plain form
40485 -304236 -1618259 -1968225 -1929326 -2350855 -3191048 -3639948 -3316675 -2789158 -2668124 -2676159
40475 -2676159 -2138554 -1128082 -405035 -180806 237876 1157900 1669698 953915 -219146
40466 -219146 -508511 -127088 -368327 -1053931 -445533 1662809 2849593 1424147 -932826
40457 -932826 -1679538 -964880 -490993 -281562 642121 1363611 90162 -2270437 -2915033
40448 -2915033 -1677645 -1269589 -2419706 -2585297 -849871 -175079 -2430093 -4753584 -4008790
40439 -4008790 -1849672 -1659766 -2931497 -2925059 -2048506 -2768505 -4131347 -2586600 1505439
40430 1505439 3326034 863762 -2002232 -1825489 -664762 -1790759 -3999952 -4089342 -2333025
40421 -2333025 -1187405 -275483 2648679 6316181 6346176 1897885 -2249692 -2063620 684092
$$ packed form
40485c04236j314023l49966L8899m21529q40193m48900L23273N27517J21034q035
40475b676159N37605J010472P23047K24229M18682R20024N11798p15783j173061
40466b19146k89365L81423k41239o85604O08398K108342J186784j425446k356973
40457i32826p46712P14658M73887K09431R23683P21490j273449k360599o44596
40448b915033J237388M08056j150117j65591J735426O74792k255014k323491P44794
40439d008790K159118J89906j271731O438Q76553p19999j362842J544747M092039
40430A505439J820595k462272k865994J76743J160727j125997k209193q9390J756317
40421b333025J145620R11922K924162L667502K9995m448291m147577J86072K747712
$$ plain form
40412 684092 2027610 1589294 1660366 2469869 2083548 475928 118682 1796116 2754392
40403 2754392 582049 -3031138 -4263611 -1826452 1983274 4264191 4003354 1872629
40395 1872629 -872633 -2862253 -3051320 -1528926 291780 762692 -481556 -2075699
40387 -2075699 -2268450 -982287 -93968 -982592 -2351044 -1883962 150403 999254 -379432
40378 -379432 -1613519 -858844 -108954 -2084081 -5531838 -6766679 -5001373 -2811409 -1610741
40369 -1610741 -294996 1180779 719380 -1877096 -3180950 -824528 2704430 3624838
40361 3624838 2161075 1327478 1912515 1979680 813598 152787 1091174 2320954 2341675
40352 2341675 1564770 1227007 1478356 1491818 731779 -554007 -1667015 -1963203 -1414852
$$ packed form
40412F84092J343518m38316P1072Q09503l86321j607620l57246J677434R58276
40403B754392k172343l613187j232473K437159L809726K280917k60837k130725
40395A872629k745262j989620j89067J522394J820706M70912j244248j594143
40387b075699j92751J286163Q88319q88624j368452M67082K034365Q48851j378686
40378c79432j234087P54675P49890j975127l447757j234841J765306K189964J200668
40369a610741J315745J475775m61399k596476j303854K356422L528958R20408
40361C624838j463763q33597N85037O7165j166082o60811R38387J229780K0721
40352B341675p76905l37763K51349J3462p60039j285786j113008k96188N48351
$$ plain form
40343 -1414852 -757240 -638918 -653721 224875 2176296 4027362 4444732 3347618 1888378
40334 1888378 1061644 571386 -547380 -2183391 -2821398 -1560065 347578 1057962 559830
40325 559830 92045 -213163 -1088639 -1833126 -742906 1852286 3592728 3864104 4780381
40316 4780381 7097340 8063175 5516850 1644429 -73340 225193 -159479 -1934135 -3401923
40307 -3401923 -3771785 -3891737 -4002735 -3379903 -2068599 -742421 825420 2929553 4102811
40298 4102811 2643513 -359846 -2146803 -2232004 -2495265 -3418815 -3372853 -2161471 -2059941
40289 -2059941 -3999830 -5467715 -4031564 -919950 847058 454855 -476972 -778879 -1014991
40280 -1014991 -1965405 -3083440 -2995424 -1330722 401426 436215 -778105 -1083118 -172117
$$ packed form
40343a414852O57612J18322j4803Q78596J951421J851066M17370j097114j459240
40334A888378q26734m90258j118766j636011o38007J261333J907643P10384m98132
40325E59830m67785l05208q75476p44487J090220K595192J740442K71376R16277
40316D780381K316959R65835k546325l872421j717769K98533l84672j774656j467788
40307c401923l69862j19952j10998O22832J311304J326178J567841K104133J173258
40298D102811j459298l003359j786957q5201k63261r23550M5962J211382J01530
40289b059941j939889j467885J436151L111614J767008l92203r31827l01907k36112
40280a014991r50414j118035Q8016J664702J732148L4789j214320l05013R11001
$$ plain form
40271 -172117 -713673 -4227458 -7762833 -7532472 -4620035 -3531394 -5363871 -6232954 -3289244
40262 -3289244 1194673 3390490 2861960 2011206 2457837 3735787 4383834 3173116 324961
40253 324961 -1959844 -1612195 413320 1232368 183799 -589168 -147478 -259948 -1665541
40244 -1665541 -2028486 225393 2746326 2588279 577324 -476951 -236736 -424663 -1085966
40235 -1085966 -518842 1307534 2178529 911662 -1016062 -1773853 -1455278 -1321394 -1913658
40226 -1913658 -2683492 -2980329 -2882371 -3004531 -3475244 -3422153 -2139371 -578120 -555400 -2325570
40216 -2325570 -4152319 -4606554 -4013750 -3244651 -2502461 -1888040 -1756050 -1816437 -1148383
40207 -1148383 367772 1940215 3395515 5070380 5998632 4544276 1427415 -482535
$$ packed form
40271a72117n41556l513785l535375K30361K912437J088641j832477q69083K943710
40262c289244M483917K195817n28530q50754M46631J277950O48047j210718k848155
40253C24961k284805L47649K025515Q19048j048569p72967M41690j12470j405593
40244a665541l62945K253879K520933j58047k010955j054275K40215j87927o61303
40235a085966N67124J826376Q70995j266867j927724p57791L18575J33884n92264
40226a913658p69834k96837R7958j22160m70713N3091J282782J561251K2720j770170
40216b325570j826749m54235N92804P69099P42190O14421J31990o0387O68054
40207a148383J516155J572443J455300J674865R28252j454356l116861j909950
$$ plain form
40199 -482535 -331211 -413375 -1872229 -2485743 -812073 665137 -557066 -2704445 -2733297
40190 -2733297 -1318056 -1025513 -1378823 -57699 2070570 1694296 -1254949 -2948422 -1375011
40181 -1375011 1046219 1664734 1082169 912817 820216 -297907 -1971714 -2715792 -1911064
40172 -1911064 -119599 1614525 2221297 1241628 -657038 -2469099 -3898909 -4769382 -4218576
40163 -4218576 -2052299 -129444 -338945 -1647430 -1381761 825348 2761095 3177506 2956626
40154 2956626 2523522 998847 -1197914 -1645553 672663 3370352 3684566 1911718 351501
40145 351501 175967 806172 1367624 1396007 741676 -209254 -675417 -405185 76187 332552
40135 332552 309895 -230000 -1337984 -1839360 -230318 2869228 4618758 3092360 -579939
$$ packed form
40199d82535J51324q2164j458854o13514J673670J477210j222203k147379k8852
40190b733297J415241K92543l53310J321124K128269l76274k949245j693473J573411
40181a375011K421230O18515n82565j69352r2601j118123j673807p44078Q04728
40172a911064J791465J734124O06772r79669j898666j812061j429810q70473N50806
40163d218576K166277J922855k09501j308485K65669K207109J935747M16411k20880
40154B956626m33104j524675k196761m47639K318216K697689L14214j772848j560217
40145C51501j75534O30205N61452K8383o54331r50930m66163K70232M81372K56365
40135C32552k2657n39895j107984n01376J609042L099546J749530j526398l672299
$$ plain form
40126 -579939 -3760086 -4876322 -4011669 -2239149 -1058500 -1370546 -2335335 -2189714 -621992
40117 -621992 758266 702477 -172297 -683101 -672238 -682989 -1083978 -1994026 -3082944 -3217235
40107 -3217235 -1553727 776121 1523104 214718 -1321737 -1683502 -1393595 -1142390 -479726
40098 -479726 784080 1677421 1721020 1844530 2468429 2348245 735558 -922695 -1106098
40089 -1106098 -599237 -841748 -1093677 497055 3513642 5112196 3439772 -246275 -3138146
40080 -3138146 -3607757 -2283589 -1120380 -1498063 -2981201 -4125011 -4311204 -3899197 -2718025
40071 -2718025 -83766 3142725 4374777 2476061 -302111 -1057829 192996 1205173
40063 1205173 786513 -292655 -1041476 -1263679 -1071768 -596688 39771 1158409 3140914
$$ packed form
40126e79939l180147j116236Q64653J772520J180649l12046r64789J45621J567722
40117f21992J380258n5789q74774n10804J0863j0751m00989r10048j088918j34291
40107c217235J663508K329848P46983j308386j536455l61765K89907K51205O62664
40098d79726J263806Q93341M3599J23510O23899j20184j612687j658253j83403
40089a106098N06861k42511k51929J590732L016587J598554j672424l686047k891871
40080c138146m69611J324168J163209l77683j483138j143810j86193M12007J181172
40071b718025K634259L226491J232052j898716k778172p55718J250825J012177
40063A205173m18660j079168p48821k22203J91911M75080O36459J118638J982505
$$ plain form
40054 3140914 4883794 4051766 321198 -3002927 -2663489 196869 1648121 336521
40046 336521 -1330990 -1304495 -454102 -211732 -15374 1337277 3225504 3760832 2255876
40037 2255876 -88502 -1819736 -2707943 -3446465 -4345693 -4749465 -3959490 -2471979 -1567254
40028 -1567254 -1518527 -1144453 302869 1783819 1933151 1027970 327997 140925 -119602
40019 -119602 -478287 -494606 -525032 -1351927 -2585988 -2874525 -1802535 -297051 892388
40010 892388 1751481 2018308 1266965 331124 972747 3284993 4742083 2922595 -1587056
40001 -1587056 -5840409 -7497938 -6562706 -4776588 -3866407 -3965908 -3534921 -1413395 1094376
39992 1094376 1330221 -1211781 -3827249 -3839019 -1716663 80693 305305 -439596 -1480090
$$ packed form
40054C140914J742880q32028l730568l324125L39438K860358J451252j311600
40046C36521j667511K6495Q50393K42370J96358J352651J888227N35328j504956
40037B255876k344378j731234q88207p38522q99228m03772P89975J487511R04725
40028a567254M8727L74074J447322J480950J49332r05181o99973j87072k60527
40019a19602l58685j6319l0426q26895j234061k88537J071990J505484J189439
40010H92388Q59093K66827p51343r35841O41623K312246J457090j819488m509651
40001a587056m253353j657529R35232J786118R10181r9501M30987K121526K507771
39992A094376K35845k542002k615468j1770K122356J797356K24612p44901j040494
$$ plain form
39983 -1480090 -2703442 -3500276 -2796814 -732934 873410 506179 -1351817 -3179322 -4370740
39974 -4370740 -5271230 -5645973 -4393406 -1221835 2260744 3974108 3563924 2360218 1266297
39965 1266297 -230719 -2487773 -4182035 -3574352 -1029980 976741 719727 -844056
39957 -844056 -1536840 -585562 995244 2078493 2414418 2088180 1153067 182497 223211
39948 223211 1467450 2624579 2479271 1595626 1415780 1974051 1904359 860648 345567
39939 345567 1364787 2711189 2878384 2498790 3109624 4245099 3913100 1877818 252951
39930 252951 299428 694864 3358 -991533 -930045 -392813 -889102 -2206358 -2762980 -2270570
39920 -2270570 -2072952 -2629341 -2491686 -626029 1546357 1622438 -809882 -3705574 -4956343
$$ packed form
39983a480090j223352p96834P03462K063880J606344l67231j857996j827505j191418
39974d370740r00490l74743J252567L171571L482579J713364m10184j203706j093921
39965A266297j497016k257054j694262O07683K544372K006721k57014j563783
39957h44056o92784R51278J580806J083249L35925l26238r35113r70570M0714
39948B23211J244239J157129j45308q83645j79846N58271o9692j043711n15081
39939C45567J019220J346402J67195l79594O10834J135475l31999k035282j624867
39930B52951M6477L95436o91506r94891O1488N37232m96289j317256n56622M92410
39920b270570J97618n56389J37655J865657K172386P6081k432320k895692j250769
$$ plain form
39911 -4956343 -4375556 -3058311 -1569725 313102 2190904 2583334 714158 -1958235
39903 -1958235 -3237152 -3001490 -3120248 -4331243 -4768972 -2593581 1035156 3055689 2249311
39894 2249311 602705 647560 2249975 2731791 184114 -3910204 -6114333 -5064713 -2834839
39885 -2834839 -1636306 -812397 1075884 2654320 1317913 -2034185 -3482037 -1927174
39877 -1927174 -693372 -1820531 -2734092 -1255385 -80583 -2187368 -4780517 -3001391
39869 -3001391 1974046 4175250 1837157 -543022 -29033 519544 -1647118 -4048127
39861 -4048127 -3355663 -1095355 -738253 -1719577 -909283 1391740 1579490 -1238189 -3546591
39852 -3546591 -2696728 -459105 303033 -138882 359986 2004516 2916231 2263261 1439572
$$ packed form
39911d956343N80787J317245J488586J882827J877802L92430j869176k672393
39903a958235j278917K35662j18758j210995m37729K175391L628737K020533q06378
39894B249311j646606M4855J602415M81816k547677m094318k204129J049620K229874
39885b834839J198533Q23909J888281J578436j336407l352098j447852J554863
39877a927174J233802j127159r13561J478707J174802k106785k593149J779126
39869c001391M975437K201204k338093k380179N13989N48577k166662k401009
39861d048127O92464K260308L57102r81324Q10294K301023J87750k817679k308402
39852c546591Q49863K237623P62138m41915M98868J644530R11715o52970q23689
$$ plain form
39843 1439572 1823801 2882520 3257351 2752864 2186317 1682294 344062 -2090985 -4232819
39834 -4232819 -4415833 -2664071 -643747 99831 -598892 -1656302 -1624023 85945 2217973
39825 2217973 2423182 -193329 -3727570 -5559228 -5270914 -4422360 -3956126 -3301532 -1930824
39816 -1930824 -339389 738174 971903 230449 -1211494 -2351440 -2466624 -2224243 -2574088
39807 -2574088 -3005048 -2501187 -1688979 -1891863 -2356327 -1031845 1732987 3164543 2413800
39798 2413800 1908101 3108248 3994314 2756642 1135301 1374491 2130510 626222 -2553869
39789 -2553869 -4063103 -2483086 479286 3071629 5017158 6048997 5552541 4047209
39781 4047209 2907173 2210764 708567 -1702152 -3210280 -2341046 374342 3398379
$$ packed form
39843A439572L84229J058719L74831n04487n66547n04023j338232k435047k141834
39834d232819j83014J751762K020324P43578o98723j057410L2279J709968K132028
39825B217973K05209k616511l534241j831658K88314Q48554M66234O54594J370708
39816a930824J591435J077563K33729p41454j441943j139946j15184K42381l49845
39807b574088m30960N03861Q12208k02884m64464J324482K764832J431556p50743
39798B413800n05699J200147Q86066j237672j621341K39190P56019j504288l180091
39789b553869j509234J580017K962372K592343J945529J031839m96456j505332
39781D047209j140036o96409j502197k410719j508128Q69234K715388L024037
$$ plain form
39773 3398379 5731424 7198328 8243067 9741249 12355482 16064735 20645819 25889824
39765 25889824 30734134 33338327 33073098 31180032 28288350 23110117 15573490 9278507
39757 9278507 7753082 9449211 9771724 7290394 4396890 2411866 303048 -1509255
39749 -1509255 -670825 2457147 3959869 2254624 904741 2873205 5506641 4675768
39741 4675768 1158158 -955756 -407543 514642 374536 65212 193086 132568 -148495
39732 -148495 178357 1016975 1259261 508180 -763130 -2424551 -4311702 -5118150 -3614810
39723 -3614810 -691368 1582378 2514472 2724832 2342423 1418401 1348375 3263842 5438863
39714 5438863 5096354 2638007 1098419 1265206 617211 -2160786 -4913826 -5635772 -5319253
$$ packed form
39773C398379K333045J466904J044739J498182K614233L709253M581084N244005
39765B5889824M844310K604193k65229j893066k891682n178233p536627o294983
39757I278507j525425J696129L22513k481330k893504j985024k108818j812303
39749a509255Q38430L127972J502722j705245j349883J968464K633436q30873
39741D675768l517610k113914N48213R22185j40106l09324J27874o0518k81063
39732a48495L26852Q38618K42286p51081j271310j661421j887151q06448J503340
39723c614810K923442K273746R32094K10360l82409r24022p0026J915467K175021
39714E438863l42509k458347j539588J66787o47995k777997k753040p21946L16519
$$ plain form
39705 -5319253 -5347766 -4790989 -2685876 -802360 -1322098 -3111105 -3036291 -352210 2561593
39696 2561593 3549220 2787171 1642710 1115132 1527017 2478586 2949992 2298279 1092337
39687 1092337 353185 345444 738003 1381379 2180504 2749640 2879580 2777193 2371047 1267353
39677 1267353 -121691 -625403 -125155 181062 121987 1181850 3418686 4040341 1372801
39668 1372801 -1751807 -1620033 831377 1664997 202132 -456179 874704 1599619 237221
39659 237221 -939522 -155993 554579 -1017477 -3236702 -3377340 -2161640 -2087420 -2793330
39650 -2793330 -1875516 346844 773578 -1326502 -2558142 -170857 3980486 6042407
39642 6042407 5050888 3353913 3053786 3772898 3880717 2769041 1514767 1574852 2961645
$$ packed form
39705e319253k8513N56777K105113J883516n19738j789007P4814K684081K913803
39696B561593R87627p62049j144461n27578M11885R51569M71406o51713j205942
39687A092337p39152p741L92559O43376P99125N69136J29940j02387m06146j103694
39677A267353j389044n03712N00248L06217n9075J059863K236836O21655k667540
39668A372801l124608J31774K451410Q33620j462865o58311J330883P24915j362398
39659B37221j176743P83529P10572j572056k219225j40638J215700P4220p05910
39650b793330R17814K222360M26734k100080j231640K387285M151343K061921
39642F042407r91519j696975l00127P19112J07819j111676j254274O0085J386793
$$ plain form
39633 2961645 3910343 2767817 107426 -1709472 -1210794 620240 1701888 1095774 -507616
39624 -507616 -1906145 -2378956 -1993902 -1618235 -2414114 -4610916 -6764852 -6935082 -4890010
39615 -4890010 -2615743 -2166550 -3372162 -4292191 -3756118 -2631560 -2384609 -3188101 -4003570
39606 -4003570 -3956762 -2968033 -1475233 -282160 -286061 -1449613 -2301828 -1475737 341502
39597 341502 1021644 -403674 -2723342 -4115248 -3675200 -1490296 1366324 2758295 1108746
39588 1108746 -2253011 -3923324 -2425354 128214 1249533 1137790 1092893 676348 -1297530
39579 -1297530 -3982514 -5084930 -3866950 -1606157 572950 2310608 2747986 1003734
39571 1003734 -1724505 -2636518 -722791 1834301 2358505 532610 -1926933 -3134459
$$ packed form
39633B961645R48698j142526k660391j816898M98678J831034J081648o06114j603390
39624e07616j398529m72811L85054L75667p95879k196802k153936j70230K045072
39615d890010K274267M49193j205612r20029N36073J124558K46951q03492q15469
39606d003570M6808R88729J492800J193073l901j163552q52215Q26091J817239
39597C41502O80142j425318k319668j391906M40048K184904K856620J391971j649549
39588A108746l361757j670313J497970K553568J121319j11743m4897m16545j973878
39579a297530k684984j102416J217980K260793K179107J737658M37378j744252
39571A003734k728239r12013J913727K557092N24204j825895k459543j207526
$$ plain form
39563 -3134459 -2087937 729240 3072299 2516716 -810305 -4032301 -4775781 -3686616
39555 -3686616 -2998978 -3579503 -4364976 -4119418 -2816536 -1468321 -1076141 -1632362 -2131812
39546 -2131812 -1909704 -1649330 -2263789 -3150320 -2865863 -1464409 -592448 -956706 -1338723
39537 -1338723 -808309 -337809 -1112625 -2445146 -2641584 -1237985 656370 1771790 1740113
39528 1740113 1191163 1133447 1654944 1313051 -1019414 -3778569 -4010978 -1495987 516842
39519 516842 -306910 -2364915 -3000680 -2416418 -2583510 -3720889 -4253047 -3470772 -2122636
39510 -2122636 -955846 -481305 -1389827 -3281569 -3910355 -1954002 294988 -369978 -3254067
39501 -3254067 -4646514 -3417515 -2384035 -3337843 -3999792 -1711071 2329805 4748477
$$ packed form
39563c134459J046522K817177K343059n55583l327021l221996p43480J089165
39555c686616O87638n80525p85473K45558J302882J348215L92180n56221m99450
39546b131812K22108K60374o14459q86531K84457J401454Q71961l64258l82017
39537a338723N30414M70500p74816j332521j96438J403599J894355J115420l1677
39528A740113n48950n7716N21497l41893k332465k759155k32409K514991K012829
39519E16842q23752k058005o35765N84262j67092j137379n32158P82275J348136
39510b122636J166790M74541r08522j891742o28786J956353K248990o64966k884089
39501c254067j392447J228999J033480r53808o61949K288721M040876K418672
$$ plain form
39493 4748477 4388127 2968405 2284959 2553890 3081006 3122177 2172042 326595 -1605844
39484 -1605844 -2673282 -2319611 -637662 1152353 943434 -2002543 -5134315 -4910339 -1434388
39475 -1434388 1301098 617759 -1657800 -2566018 -2251803 -2597983 -3414010 -2832594 -677966
39466 -677966 1314235 2408869 3447084 4355285 3592685 918700 -1318841 -948102 1216263
39457 1216263 2512186 1655981 -139470 -932612 -239370 627105 324616 -565601 -100353
39448 -100353 2080705 3565443 2330536 126310 425304 3170815 4322187 1608958
39440 1608958 -1817454 -1537933 2040328 4370182 2889114 -241634 -1866051 -1828240 -1832350
39431 -1832350 -1997173 -766271 1994361 3862189 2782875 -34928 -1552712 -865308
$$ packed form
39493D748477l60350j419722o83446K68931N27116M1171r50135j845447j932439
39484a605844j067438L53671J681949J790015k08919k945977l131772K23976L475951
39475a434388K735486o83339k275559r08218L14215l46180q16027N81416K154628
39466f77966J992201J094634J038215R08201p62600k673985k237541L70739K164365
39457A216263J295923q56205j795451p93142O93242Q66475l02489q90217M65248
39448a00353K181058J484738j234907k204226K98994K745511J151372k713229
39440A608958l426412K79521L578261K329854j481068l130748j624417L7811m110
39431a832350j64823J230902K760632J867828j079314k817803j517784O87404
$$ plain form
39423 -865308 -218682 -1728821 -4502374 -6034474 -5450675 -3955308 -2634798 -1455131 -374016
39414 -374016 203148 468403 1278559 2596646 3157137 2369142 1293457 909727 714315
39405 714315 115731 -74977 970888 2239469 2099051 700233 -584219 -1568080 -3134911
39396 -3134911 -4938392 -5346495 -3969065 -2319027 -1495641 -1106389 -1098170 -2498932 -5066460
39387 -5066460 -6170090 -3957556 -349792 1200339 161346 -931675 -325415 1191138
39379 1191138 2459994 3612794 4687774 4426773 1931902 -1432748 -3194587 -2480915
39371 -2480915 -609033 684536 657348 -506334 -2019716 -2627242 -1493418 567623 1622795
39362 1622795 1042675 586895 2031972 4307302 4537680 1988191 -743740 -1256148 -487113
$$ packed form
39423h65308O46626j510139k773553j532100N83799J495367J320510J179667J081115
39414c74016N77164K65255Q10156J318087N60491p87995j075685l83730j95412
39405G14315n98584j90708J045865J268581j40418j398818j284452r83861j566831
39396c134911j803481m08103J377430J650038Q23386L89252Q219j400762k567528
39387e066460j103630K212534L607764J550131j038993j093021O06260J516553
39379A191138J268856J152800J074980k61001k494871l364650j761839P13672
39371b480915J871882J293569k7188j163682j513382o07526J133824K061041J055172
39362A622795n80120m55780J445077K275330K30378k549489k731931n12408P69035
$$ plain form
39353 -487113 -840035 -2299221 -2518504 -510620 1905043 2807364 2483892 2161978 1976349
39344 1976349 1424653 753105 564609 689966 559343 186919 -161884 -720995 -1654618
39335 -1654618 -2278082 -1921455 -1150833 -1034459 -1513096 -1622906 -1130193 -754629 -729038 -289764
39325 -289764 973937 2026120 1287556 -1390514 -3930812 -3724167 -643525 2157123 1727762
39316 1727762 -627248 -777988 2311470 4616549 2579008 -1754708 -3665017 -2103143
39308 -2103143 -12543 661399 850187 1398559 1507911 714594 -240208 -1088213 -2209724
39299 -2209724 -2850573 -1796412 -136424 -355762 -2092377 -2152784 179987 1491748 -322016
39290 -322016 -2591518 -2410651 -1253373 -1738580 -2694286 -1474090 899881 1282356 -174537
$$ packed form
39353d87113l52922j459186k19283K007884K415663R02321l23472l21914j85629
39344A976349n51696o71548j88496J25357j30623l72424l48803n59111r33623
39335a654618o23464L56627P70622J16374m78637j09810M92713L75564K5591M39274
39325b89764J263701J052183p38564k678070k540298K06645L080642K800648m29361
39316A727762k355010j50740L089458K305079k037541m333716j910309J561874
39308b103143K090600O73942J88788N48372J09352p93317r54802q48005j121511
39299b209724o40849J054161J659988k19338j736615o0407K332771J311761j813764
39290c22016k269502J80867J157278m85207r55706J220196K373971L82475j456893
$$ plain form
39281 -174537 -592443 227903 -454276 -2891777 -3650142 -1154490 1455044 1058569 -932125
39272 -932125 -1222805 476992 1850564 1870247 1706340 2158103 2284820 996228 -1112397
39263 -1112397 -2077794 -603978 2267612 3821448 2500315 -227494 -1581379 -643229
39255 -643229 1286397 3076117 4793884 6197070 6039297 3809452 974195 -455969
39247 -455969 60789 1479970 2305890 1569848 -374945 -1723360 -896824 1330987 2498597
39238 2498597 1597337 254987 206025 960119 987794 127413 -432470 8189 881873 1153492
39228 1153492 281912 -1317574 -2457420 -2320519 -1553106 -1423931 -1810655 -1255689 583007
39219 583007 2014299 1721924 699694 525088 883715 405546 -837865 -1435640 -903580
$$ packed form
39281a74537m17906Q20346o82179k437501p58365K495652K609534l96475j990694
39272i32125k90680J699797J373572J9683j63907M51763J26717j288592k108625
39263a112397r65397J473816K871590J553836j321133k727809j353885R38150
39255f43229J929626J789720J717767J403186j57773k229845k835257j430164
39247d55969N16758J419181Q25920p36042j944793j348415Q26536K227811J167610
39238B498597r01260j342350m8962P54094K7675q60381n59883M40659Q73684K71619
39228A153492q71580j599486j139846J36901P67413J29175l86724N54966J838696
39219E83007J431292k92375j022230j74606L58627m78169j243411n97775N32060
$$ plain form
39210 -903580 -187857 87543 377808 997298 1446757 1328620 822734 -147920 -2122044
39201 -2122044 -4847243 -6770651 -6643538 -5040503 -3443828 -2269383 -786604 1147436
39193 1147436 2377667 1911573 388691 -557802 -142225 902294 1393113 976365 294402
39184 294402 179177 727588 1092233 439958 -732803 -862573 517060 1609054 516619
39175 516619 -1959923 -3343072 -3084823 -2963480 -3452816 -2339739 1436041 4887747 4482441
39166 4482441 1106550 -1229166 -800642 576679 1264646 1617445 1760768 632408 -1660315
39157 -1660315 -3044745 -2422424 -1365213 -1512654 -2161839 -1966734 -1336495 -1394785 -1872308
39148 -1872308 -1798901 -1300420 -1063606 -845941 -104972 595065 410190 -28233 763273 2900924
$$ packed form
39210i03580P15723K75400K90265O19490M49459j18137n05886r70654j974124
39201b122044k725199j923408J27113J603035J596675J174445J482779J934040
39193A147436J230231m66094j522882r46493M15577J044519M90819m16748o81963
39184B94402j15225N48411L64645o52275j172761j29770J379633J091994j092435
39175E16619k476542j383149K58249J21343m89336J113077L775780L451706m05306
39166D482441l375891k335716M28524J377321O87967L52799J43323j128360k292723
39157a660315j384430O22321J057211j47441o49185J95105O30239n8290m77523
39148a872308P3407M98481K36814K17665P40969P00037j84875m38423P91506K137651
$$ plain form
39138 2900924 4791441 4989677 3542277 1652179 669213 1086669 2023092 2211287 1817971
39129 1817971 2279398 3842399 4730950 3814442 2602086 2979993 4229290 4287670 3059860
39120 3059860 2197774 2062444 1381350 92335 145117 2610375 5786981 7276585 6715950
39111 6715950 5469039 4581489 4076925 3718666 3552832 3804138 4642831 5933896 7135064
39102 7135064 7742157 7838795 7854480 7899787 7814895 7687036 7658728 7333459 6168873 4567753
39092 4567753 3837075 4749602 6600511 7915536 7795780 6520015 5160869 4657587 5051984
39083 5051984 5732085 6543943 8191493 11080406 14236531 16119380 16317680 15765351 15444211
39074 15444211 15613744 16271414 17536970 19267938 20863013 21962570 23223034 25910718
$$ packed form
39138B900924J890517J98236j447400j890098r82966M17456R36423J88195l93316
39129A817971M61427J563001Q88551r16508j212356L77907J249297N8380j227810
39120C059860q62086j35330o81094j289015N2782K465258L176606J489604n60635
39111F715950j246911q87550n04564l58259j65834K51306Q38693J291065J201168
39102G135064O07093R6638J5685M5307q4892j27859k8308l25269j164586j601120
39092D567753p30678R12527J850909J315025j19756j275765j359146n03282L94397
39083E051984O80101Q11858J647550K888913L156125J882849J98300n52329l21140
39074A5444211J69533O57670J265556J730968J595075J099557J260464K687684
$$ plain form
39066 25910718 30322824 34762321 36953274 37051286 38351725 43726709 51973051 59488971
39058 59488971 65234250 71553845 79776762 88128224 95637468 105167903 119714070 137717315
39050 137717315 155329804 171927807 189649371 208028242 223066992 232144699 236239261
39043 236239261 236200845 230307407 217580438 200907618 184411562 169312015 154488347
39036 154488347 139787246 126517321 115302628 105345032 95687008 86061563 76844565
39029 76844565 69042949 63737365 60670045 58052899 54584602 50847597 47881847 45431685
39021 45431685 42770465 40268805 38660071 37410095 35334717 32449969 29807520 27796184
39013 27796184 26018894 24690494 24683402 25987276 27312354 27543248 26750462 25642086 24839315
$$ packed form
39066B5910718M412106M439497K190953R8012J300439N374984Q246342P515920
39058E9488971N745279O319595Q222917Q351462P509244R530435J4546167J8003245
39050A37717315J7612489J6598003J7721564J8378871J5038750R077707M094562
39043B36239261l8416n893438j2726969j6672820j6496056j5099547j4823668
39036A54488347j4701101j3269925j1214693r957596r658024r625445r216998
39029G6844565p801616n305584l067320k617146l468297l737005k965750k450162
39021D5431685k661220k501660j608734j249976k075378k884748k642449k011336
39013B7796184j777290j328400p092J303874J325078K30894p92786j108376q02771
$$ plain form
39004 24839315 24786357 25567074 26640011 27334525 27570127 27548091 27090045 26154315 25683524
38995 25683524 26785325 29106079 31105237 31951865 32061327 31854251 31428541 31602120 33507284
38986 33507284 36383851 37426798 35150663 31726447 30465351 31765014 33129924 32747523
38978 32747523 31350670 30473548 30357399 30113160 29055232 27411114 26154971 26129673 26842185
38969 26842185 26518701 24218609 21402019 20075095 19741921 18034835 14490186 11556774
38961 11556774 11026771 11510289 10866402 9369381 8580162 8457418 7838396 6949718 7078368
38952 7078368 8081650 8498109 8121100 8258602 9173402 9397112 8122725 6315523 4828295
38943 4828295 3393289 2259598 2692845 4569012 5410721 3520846 603326 -492776
$$ packed form
39004B4839315n2958P80717J072937O94514K35602k2036m58046r35730m70791
38995B5683524J101801K320754J999158Q46628J09462k07076m25710J73579J905164
38986C3507284K876567J042947k276135l424216j261096J299663J364910l82401
38978C2747523j396853q77122j16149k44239j057928j644118j256143k5298P12512
38969B6842185l23484k300092k816590j326924l33174j707086l544649k933412
38961A1556774n30003M83518o43887j497021p89219j22744o19022q88678J28650
38952G078368J003282M16459l77009J37502R14800K23710j274387j807202j487228
38943D828295j435006j133691M33247J876167Q41709j889875k917520j096102
$$ plain form
38935 -492776 583578 2148585 3556368 5624147 8320752 10046232 9585459 7580889
38927 7580889 5759210 5295522 5789767 5425828 2746702 -1184825 -3346491 -2324891 -226491
38918 -226491 168060 -979809 -1437054 -464119 561624 776008 1026429 2131917 3487066
38909 3487066 3881386 2776423 662709 -1082936 -1007468 764198 2105941 1263060 -839445
38900 -839445 -1970329 -1708835 -1519618 -2051863 -2278657 -1476455 -328130 374412 761009
38891 761009 1242059 1939481 2889254 3762532 3555788 1853618 169849 465822 2397249
38882 2397249 3652209 3033183 1539251 385119 -199084 -38221 1138038 2515897 2768537
38873 2768537 2264871 2770681 4423882 5118248 3711194 1724882 753467 232550 -795393
$$ packed form
38935d92776J076354J565007J407783K067779K696605J725480m60773k004570
38927G580889j821679m63688M94245l63939k679126l931527k161666J021600K098400
38918b26491L94551j147869m57245R72935J025743K14384K50421J105488J355149
38909C487066L94320j104963k113714j745645P5468J771666J341743q42881k102505
38900h39445j130884K61494J89217n32245k26794Q02202J148325P02542L86597
38891G61009M81050O97422R49773Q73278k06744j702170j683769K95973J931427
38882B397249J254960o19026j493932j154132n84203J60863J176259J377859K52640
38873B768537n03666N05810J653201O94366j407054j986312r71415n20917j027943
$$ plain form
38864 -795393 -1579675 -1082853 -59044 99308 -431902 -487079 125688 721905 1114232 1537354
38854 1537354 1764744 1486187 1080890 1048438 1211544 1300267 1655288 2539294 3427142 3684326
38844 3684326 3219691 1993276 9051 -1615514 -1091472 1461898 3352053 2612093 600084
38835 600084 -323059 -359804 -1346295 -3140868 -3502162 -1595420 616555 1041361 -196730
38826 -196730 -1715356 -2637024 -2469414 -559098 2819722 5341133 4264733 -229473 -4402110
38817 -4402110 -4741423 -1965341 58136 -642778 -1949402 -1319353 296372 218175 -1562316
38808 -1562316 -2473895 -1564691 -819774 -1751274 -3119244 -3071323 -1648104 -132564 545040
38799 545040 707 -1437508 -2218548 -1013508 872729 696092 -1547275 -2740249 -1430753
$$ packed form
38864g95393p84282M96822J023809J58352n31210n5177O12767N96217L92327M23122
38854A537354K27390k78557m05297l2452J63106Q8723L55021Q84006Q87848K57184
38844C684326m64635j226415j984225j624565N24042K553370J890155p39960k012009
38835F00084r23143l6745r86491j794573l61294J906742K211975M24806j238091
38826a96730j518626r21668J67610J910316L378820K521411j076400m494206m172637
38817d402110l39313K776082K023477p00914j306624O30049J615725p8197j780491
38808a562316r11579R09204P44917r31500j367970M7921J423219J515540O77604
38799E45040n44333j438215p81040J205040J886237j76637k243367j192974J309496
$$ plain form
38790 -1430753 -70005 -804080 -1979696 -1301619 53174 -503161 -2582525 -3574795 -2636443
38781 -2636443 -1174693 -318213 -430498 -2087509 -4871190 -6122017 -3731178 421180
38773 421180 2538063 1913715 1133077 1689286 2403221 2295504 2088249 2187198 1656153 140504
38763 140504 -1111771 -1065203 -278804 245116 450711 926245 1994151 3283339 3720052
38754 3720052 2417253 237652 -455235 1347668 3734024 4380818 3390190 2160071 943945
38745 943945 -466125 -1074571 -146314 837522 297593 -445315 809541 3018697 3088905
38736 3088905 831793 -647679 292868 1827213 1962714 1069523 373348 245621 651987
38727 651987 1395040 1626057 857542 235344 892484 1700237 1006340 -265354 -135013
$$ packed form
38790a430753J360748p34075j175616O78077J354793n56335k079364r92270R38352
38781b636443J461750Q56480j12285j657011k783681j250827K390839M152358
38773D21180K116883o24348p80638N56209P13935j07717k07255R8949n31045j515649
38763A40504j252275M6568P86399N23920K05595M75534J067906J289188M36713
38754C720052j302799k179601o92887J802903K386356O46794r90628j230119j216126
38745I43945j410070o08446R28257R83836n39929p42908J254856K209156P0208
38736C088905k257112j479472R40547J534345J35501q93191o96175j27727M06366
38727F51987P43053K31017p68515o22198O57140Q07753o93897j271694J30341
$$ plain form
38718 -135013 709013 157606 -1063267 -414381 1468984 1295464 -1052289 -1927417 -161047
38709 -161047 864995 -910385 -2849877 -2417354 -1142545 -1016587 -708753 1442335 3798063
38700 3798063 4026632 2829894 2133913 1840074 1070225 410805 340331 -354260 -2125790
38691 -2125790 -2967784 -1633283 -65710 -39303 -87118 1278965 2130619 497461 -1373274
38682 -1373274 -294138 2234672 2103791 -842997 -2703316 -1591428 170923 151585 -1221578
38673 -1221578 -2259486 -2064927 -704531 806160 932541 -449907 -1519962 -1432579 -1965386
38664 -1965386 -4069132 -5044780 -2390559 1465100 2152273 -280798 -2133705 -2246407 -2958222
38655 -2958222 -5093417 -6440275 -5765754 -4397484 -3084801 -991313 1321552 1552852
$$ packed form
38718a35013Q44026n51407j220873O48886J883365j73520k347753q75128J766370
38709a61047J026042j775380j939492M32523J274809J25958L07834K151088K355728
38700C798063K28569j196738o95981k93839p69849o59420p0474o94591j771530
38691b125790q41994J334501J567573K6407m7815J366083Q51654j633158j870735
38682a373274J079136K528810j30881k946788j860319J111888J762351j9338j373163
38673a221578j037908J94559J360396J510691J26381j382448j070055Q7383n32807
38664a965386k103746r75648K654221L855659O87173k433071j852907j12702p11815
38655b958222k135195j346858O74521J368270J312683K093488K312865K31300
$$ plain form
38647 1552852 -434636 -1627151 -234827 1734947 1680179 -268652 -2358927 -3399033
38639 -3399033 -2790619 -599929 1417052 976272 -1659722 -3724977 -3603531 -2286037 -842848
38630 -842848 944888 2786338 3382176 2614937 1798541 1102540 -530214 -2235914 -1269765
38621 -1269765 2495708 5297485 4493888 2001272 838041 1039800 1213979 1516571 2448726
38612 2448726 2783303 1362476 -616630 -1471050 -1715515 -2671338 -3831052 -3816702 -2711004
38603 -2711004 -1426071 -52816 1252753 1238221 -485773 -1923066 -1382266 -306414 -1021962
38594 -1021962 -2924935 -3474388 -1988486 95622 1874938 3307639 3638295 2197841
38586 2197841 341635 25670 782610 604209 -543064 -816967 -11750 -101513 -1849469
$$ packed form
38647A552852j987488j192515J392324J969774n4768j948831k090275j040106
38639c399033O08414K190690K016981m40780k635994k065255J21446J317494J443189
38630h42848J787736J841450N95838p67239q16396o96001j632754j705700R66149
38621a269765L765473K801777q03597k492616j163231K01759J74179L02592R32155
38612B448726L34577j420827j979106q54420k44465r55823j159714J4350J105698
38603b711004J284933J373255J305569j4532j723994j437293N40800J075852p15548
38594a021962j902973n49453J485902K084108J779316J432701L30656j440454
38586B197841j856206l15965P56940j78401j147273k73903Q05217q9763j747956
$$ plain form
38577 -1849469 -3475808 -3432843 -2295808 -1166799 -221000 425557 288432 -287677 -196454
38568 -196454 567185 830554 509904 976482 2477779 3314877 2612432 1804226 1997464
38559 1997464 1899211 202294 -1683594 -1501500 437562 2011675 2664239 3557612 4627693
38550 4627693 4086783 1443484 -1166862 -1791086 -1192090 -1252281 -2072496 -2309466 -1744044
38541 -1744044 -1632529 -2341972 -2347265 -503247 1848301 2393683 959215 -375541 -350394
38532 -350394 -179972 -1333231 -2878451 -2545697 -78565 2033281 1606929 -556893 -1832263
38523 -1832263 -939853 967232 2123178 2028671 1243737 165846 -1192674 -2519014 -3163749
38514 -3163749 -2936847 -2274133 -1382590 50575 1858111 2922252 2570178 1835070 2190578
$$ packed form
38577a849469j626339M2965J137035J129009R45799O46557j37125n76109R1223
38568a96454P63639K63369l20650M66578J501297Q37098p02445q08206J93238
38559A997464r8253j696917j885888J82094J939062J574113O52564Q93373J070081
38550D627693n40910k643299k610346o24224N98996o0191q20215k36970N65422
38541a744044J11515p09443n293J844018K351548N45382j434468j334756K5147
38532c50394J70422j153259j545220L32754K467132K111846m26352k163822j275370
38523a832263Q92410J907085J155946r4507p84934j077891j358520j326340o44735
38514c163749K26902O62714Q91543J433165J807536J064141l52074p35108L55508
$$ plain form
38505 2190578 3352472 3614481 2309517 585416 -443919 -913928 -1174132 -1011777 -642827
38496 -642827 -1068230 -2397581 -3058609 -1947801 -330889 -184016 -1489270 -2682871 -3038302
38487 -3038302 -2895070 -2108857 -299716 1495705 1545998 191466 -88146 1779191 3545177
38478 3545177 2573314 -450620 -2215335 -804124 2103371 3104423 637094 -3340550
38470 -3340550 -5177605 -3315782 -63832 1104698 -208878 -1089003 455779 2648988
38462 2648988 2458659 -257271 -2733838 -2925464 -1547207 -444165 -308897 -519291 -331739
38453 -331739 371213 1064905 953256 -257243 -1704697 -1928677 -445973 1499782 2111372
38444 2111372 854220 -1105130 -2169625 -1842064 -1016663 -824462 -1230227 -980432 816249
$$ packed form
38505B190578J161894K62009j304964j724101j029335m70009k60204J62355L68950
38496f42827m25403j329351o61028J110808J616912J46873j305254j193601l55431
38487c038302J43232P86213J809141J795421N0293j354532k79612J867337J765986
38478C545177r71863l023934j764715J411211K907495J001052k467329l977644
38470c340550j837055J861823L251950J168530j313576q80125J544782K193209
38462B648988j90329k715930k476567j91626J378257J103042J35268k10394J87552
38453c31739P02952O93692j11649j210499j447454k23980J482704J945755O11590
38444B111372j257152j959350j064495L27561Q25401J92201m05765K49795J796681
$$ plain form
38435 816249 3271478 4448061 3606767 2081215 1477227 1588748 968465 -654874 -1691938
38426 -1691938 -882720 773001 1238199 139978 -885946 -568199 422777 742668 251049
38417 251049 -232078 -420243 -762633 -1380272 -1790631 -1687815 -1133797 -51633 1377629
38408 1377629 1808469 -190093 -3489606 -4534653 -1615205 2297745 3048162 800242
38400 800242 -544178 695311 1664322 -340500 -3756445 -5385509 -4856029 -3803297 -2397484
38391 -2397484 -37996 1515483 -384097 -4530466 -6415134 -4498230 -2302833 -2635625
38383 -2635625 -3384702 -1748242 610365 397289 -1560821 -1713225 190892 930163 -442106
38374 -442106 -1063034 602699 2039955 856418 -1514363 -2395074 -1602238 -413856 982549
$$ packed form
38435H16249K455229J176583q41294j525552o03988J11521o20283j623339j037064
38426a691938Q09218J655721M65198j098221j025924L17747R90976L19891m91619
38417B51049m83127j88165l42390o17639m10359J02816N54018J082164J429262
38408A377629M30840j998562l299513j045047K919448L912950P50417k247920
38400H00242j344420J239489R69011k004822l415945j629064N29480J052732J405813
38391b397484K359488J553479j899580m146369j884668J916904K195397l32792
38383b635625p49077J636460K358607k13076j958110j52404J904117P39271j372269
38374d42106o20928J665733J437256j183537k370781q80711P92836J188382J396405
$$ plain form
38365 982549 2553787 2704186 244007 -2942652 -3792411 -2138988 -598058 -625533 -951761
38356 -951761 -198081 961787 1092625 150568 -640007 -521483 -55472 -195456 -857047
38347 -857047 -926653 9973 671639 -111039 -1175013 -442275 1543990 1905933 -124336
38338 -124336 -1765751 -1163313 -495107 -2111118 -4044383 -2915891 251526 1274066 -567902
38329 -567902 -1435322 792102 3145836 2319096 -455299 -1859255 -1576887 -1982302 -3819333
38320 -3819333 -4989612 -3709927 -909717 1035158 840743 -845493 -2463140 -2968220
38312 -2968220 -2442088 -1554359 -729727 -113114 -42414 -877762 -2318298 -3411064 -3312961
38303 -3312961 -1804428 581439 2500594 2523880 756310 -889845 -1051037 -833877 -2088293
$$ packed form
38365I82549J571238J50399k460179l186659q49759J653423J540930k7475l26228
38356i51761P53680J159868J30838r42057p90575J18524M66011j39984o61591
38347h57047o9606R36626O61666p82678j063974P32738J986265L61943k030269
38338a24336j641415O02438O68206j616011j933265J128492L167417J022540j841968
38329e67902q67420K227424K353734q26740k774395j403956K82368m05415j837031
38320c819333j170279J279685K800210J944875j94415j686236j617647n05080
38312b968220N26132Q87729Q24632O16613P0700q35348j440536j092766R8103
38303c312961J508533K385867J919155K3286j767570j646155j61192K17160j254416
$$ plain form
38294 -2088293 -4496719 -6032536 -5698186 -3930827 -976431 2686160 4753693 3048018
38286 3048018 -641166 -1947099 -93543 729238 -2187858 -5694318 -5557463 -2721013
38278 -2721013 -1233856 -1868884 -1820529 -16035 1211951 212878 -1385119 -1280539 414231
38269 414231 1782807 1505093 -29546 -1174640 -494371 1486128 2487171 1400014 35573
38260 35573 407017 1407322 535856 -1822735 -2747445 -1360180 -51481 -529329 -1489599
38251 -1489599 -1296268 -358017 574505 2010329 3792815 3770288 672932 -3303851 -5174501
38242 -5174501 -5201434 -5771845 -7100678 -6834497 -3911195 -300294 1694571 1900357 1277200
38233 1277200 159825 -1356534 -2413815 -2098111 -787796 115343 -249834 -1418799 -2343715
$$ packed form
38294b088293k408426j535817L34350J767359K954396L662591K067533j705675
38286C048018l689184j305933J853556Q22781k917096l506460J36855K836450
38278b721013J487157o35028M8355J804494J227986r99073j597997J04580J694770
38269D14231J368576k77714j534639j145094O80269J980499J001043j087157j364441
38260C5573L71444J000305q71466k358591r24710J387265J308699m77848r60270
38251a489599J93331R38251R32522J435824J782486k2527l097356l976783j870650
38242e174501k6933n70411j328833K66181K923302L610901J994865K05786o23157
38233A277200j117375j516359j057281L15704J310315R03139l65177j168965r24916
$$ plain form
38224 -2343715 -2542644 -2365866 -2227747 -1869448 -796945 577207 988619 34694 -848606
38215 -848606 -95438 1648578 2124429 532548 -1252368 -1195766 210770 906548 310312
38206 310312 -67878 817453 1879466 1709067 951467 1320458 2648164 2818979 1090447
38197 1090447 -427902 72792 1054286 -144765 -2928223 -3938005 -1995854 181950
38189 181950 167625 -819014 -501867 630237 651163 25224 1058666 3713206 4887016
38180 4887016 2695611 -785906 -2342175 -1584712 -660621 -1040101 -2120679 -2673351 -2427170
38171 -2427170 -2026236 -2024312 -2186062 -1782553 -648117 343175 349971 -189391 -239025 78198
38161 78198 -405624 -1859186 -2809168 -2099186 -381808 1025756 1761556 2137321 2201475
$$ packed form
38224b343715j98929J76778J38119L58299J072503J374152M11412r53925q83300
38215h48606P53168J744016M75851j591881j784916N6602J406536O95778n96236
38206C10312l78190Q85331J062013j70399p57600L68991J327706J70815j728532
38197A090447j518349N00694R81494j199051k783458j009782J942151K177804
38189A81950j4325r86639L17147J132104K0926o25939J033442K654540J173810
38180D887016k191405l481517j556269P57463R24091l79480j080578n52672K46181
38171b427170M00934J924j61750M03509J134436R91292O796n39362m9634L17223
38161G8198m83822j453562r49982P09982J717378J407564P35800L75765O4154
$$ plain form
38152 2201475 1942436 1602921 1049048 -214409 -1663471 -1702779 -136220 735598 -816263
38143 -816263 -3023571 -2967680 -1040682 -483750 -2575003 -4765864 -4056234 -181523 4925114
38134 4925114 8757970 8957724 4873782 -620367 -3118950 -1685220 224969 -53676
38126 -53676 -919561 -73895 1199266 383775 -1602068 -1787055 -248380 19431 -1679838
38117 -1679838 -2436087 -574170 1531561 1177952 -722638 -1458834 -392108 1137431 2474821
38108 2474821 3984241 5275168 5072217 2983733 165584 -1921173 -2650574 -2227841 -1284196
38099 -1284196 -490489 -94897 141811 355023 201746 -658962 -1947547 -2799279 -2314552
38090 -2314552 -352897 1807339 2145839 161978 -2026097 -2150832 -963724 -1180970 -3403876
$$ packed form
38152B201475k59039l39515n53873j263457j449062l9308J566559Q71818j551861
38143h16263k207308N5891J926998N56932k091253k190861P09630L874711N106637
38134D925114L832856J99754m083942n494149k498583J433730J910189k78645
38126e3676q65885Q45666J273161q15491j985843j84987J538675K67811j699269
38117a679838p56249J861917K105731l53609j900590p36196J066726J529539J337390
38108B474821J509420J290927k02951k088484k818149k086757p29401M22733R43645
38099a284196P93707L95592K36708K13212j53277q60708j288585q51732M84727
38090b314552J961655K160236L38500j983861k188075j24735J187108k17246k222906
$$ plain form
38081 -3403876 -5278162 -5070620 -3675811 -2228129 -341688 1740907 1864826 -770948
38073 -770948 -3110335 -1845880 1859342 4107679 3612285 2278637 1304339 140292 -830678
38064 -830678 -81344 2029406 3104889 2401680 1816307 2286159 2163094 509084 -839110
38055 -839110 -304061 821315 799351 224271 156609 -406890 -2546972 -4553032 -3954642
38046 -3954642 -1411120 224415 87499 -141982 510778 1181974 1266001 1155362 733390
38037 733390 -454247 -1256404 259646 3324825 4408540 1974001 -997554 -1079302 861536
38028 861536 1355270 -387117 -1645648 -637046 799508 133525 -1952483 -2450739 -327620
38019 -327620 1919174 1582528 -744838 -2275227 -1933725 -1421951 -2237770 -3418303 -3241431
$$ packed form
38081c403876j874286K07542J394809J447682J886441K082595J23919k635774
38073g70948k339387J264455L705222K248337m95394j333648r74298j164047r70970
38064h30678P49334K110750J075483p03209n85373M69852j23065j654010j348194
38055h39110N35049J125376k1964n75080o7662n63499k140082k006060N98390
38046c954642K543522J635535j36916k29481O52760O71196Q4027j10639m21972
38037G33390j187637q02157J516050L065179J083715k434539k971555q1748J940838
38028H61536M93734j742387j258531J008602J436554o65983k086008m98256K123119
38019c27620K246794l36646k327366j530389L41502N11774q15819j180533J76872
$$ plain form
38010 -3241431 -1820427 -561289 106409 808412 1403612 774502 -1329392 -3509461 -4208254
38001 -4208254 -3216520 -1546184 -486699 -748541 -1817327 -2271501 -1426849 -313787 -174960
37992 -174960 -559706 -168746 889996 1315218 916381 923684 1761698 2188434 1174737 -721141
37982 -721141 -2314683 -2942545 -2448302 -1335055 -981924 -2153049 -3320389 -2401961 -196361
37973 -196361 357495 -1257358 -2147836 -562495 1543492 2050745 1771509 1844886 1024783
37964 1024783 -1496877 -3194689 -1731284 697626 547678 -1128600 -429241 2587788
37956 2587788 3794102 1849544 222678 1207971 2588067 2283689 2125716 4132324 6376105
37947 6376105 5827213 2901689 61295 -2096084 -4138950 -4840885 -2452318 1755974
$$ packed form
38010c241431J421004J259138O67698P02003N95200o29110k103894k180069o98793
38001d208254R91734J670336J059485k61842j068786m54174Q44652J113062J38827
37992a74960l84746L90960J058742M25222l98837P303Q38014M26736j013697j895878
37982g21141j593542o27862M94243J113247L53131j171125j167340R18428K205600
37973a96361N53856j614853q90478J585341K105987N07253k79236P3377q20103
37964A024783k521660j697812J463405K428910j49948j676278O99359L017029
37956B587788J206314j944558j626866R85293J380096l04378j57973K006608K243781
37947F376105n48892k925524k840394k157379k042866p01935K388567M208292
$$ plain form
37939 1755974 4325656 3776733 1456297 -1285327 -4006436 -5458564 -4022947 -613298
37931 -613298 1332576 -54529 -2704012 -3382163 -1500875 799556 1284456 -566664 -3562277
37922 -3562277 -5740429 -5729803 -3756603 -1235951 511904 792576 -616074 -3034334 -4514951
37913 -4514951 -3263537 258991 3632211 5099743 4988184 4432077 3866062 3189523 2404891
37904 2404891 1552191 733318 467664 1153142 1945120 1284933 -932670 -2760052 -2493427
37895 -2493427 -752614 472180 166966 -1037422 -1942517 -1761214 -423691 1411367 2824008
37886 2824008 3433958 3474098 3080334 2207114 1304262 1048494 1088846 225006 -1627326 -2935445
37876 -2935445 -2822480 -2451041 -2930415 -3244979 -2047768 -431211 -644383 -2509647 -3474542
$$ packed form
37939A755974K569682n48923k320436k741624k721109j452128J435617L409649
37931f13298J945874j387105k649483o78151J881288K300431M84900j851120k995613
37922c562277k178152J0626J973200K520652J747855K80672j408650k418260j480617
37913d514951J251414L522528L373220J467532j11559n56107n66015o76539p84632
37904B404891q52700q18873k65654O85478P91978o60187k217603j827382K66625
37895b493427J740813J224794l05214j204388r05095J81303J337523J835058J412641
37886B824008O09950M0140l93764q73220r02852k55768M0352q63840j852332j308119
37876b935445J12965L71439m79374l14564J197211J616557k13172j865264r64895
$$ plain form
37867 -3474542 -2276537 -231710 1500787 3408340 5289730 4878098 898598 -3997635
37859 -3997635 -5706668 -3517127 -541399 359875 -822345 -2665614 -4277026 -5120947
37851 -5120947 -4477775 -2323731 -118341 238668 -1808007 -4937733 -6965924 -6511913 -4258323
37842 -4258323 -2466060 -2533485 -3268333 -2629605 -909249 -467920 -2003706 -3105614 -1668285
37833 -1668285 991533 2081785 1050152 -551502 -1830404 -2959988 -3545332 -3044549
37825 -3044549 -2534504 -3505268 -4909884 -4244849 -1989467 -1757039 -4712065 -7013056 -5123626
37816 -5123626 -1042841 753328 -310341 -996986 359418 2120473 2755504 2599261 1798632
37807 1798632 -365879 -3156627 -4114399 -2461252 -558346 -576375 -1636343 -1697345 -531900
$$ packed form
37867c474542J198005K044827J732497J907553J881390m11632l979500m896233
37859c997635j709033K189541K975728R01274j182220j843269j611412q43921
37851e120947O43172K154044K205390L57009k046675l129726k028191M54011K253590
37842d258323J792263o7425p34848O38728J720356M41329j535786j101908J437329
37833a668285K659818J090252j031633j601654j278902j129584n85344N00783
37825c044549N10045r70764j404616O65035K255382K32428k955026k300991J889430
37816e123626M080785J796169j063669o86645J356404J761055O35031j56243q00629
37807A798632k164511k790748r57772J653147J902906j8029j059968o1002J165445
$$ plain form
37798 -531900 722786 1425314 1270195 -268714 -2666619 -3909829 -3148788 -2432987 -3671798
37789 -3671798 -5131574 -3687308 83086 2090254 261888 -2894057 -4079590 -3114272
37781 -3114272 -1755900 -682965 519814 1633838 1903689 1320579 485801 -328481 -902740
37772 -902740 -533179 901497 1886693 884464 -1191622 -1843794 -544658 427987 -471865
37763 -471865 -1495443 -242122 2368470 3096704 1141659 -527842 588792 2978608
37755 2978608 3325585 860831 -2335816 -4447699 -5187798 -4373931 -1742138 1299019 1994420
37746 1994420 -421714 -3309648 -3865954 -2465553 -1377037 -1399967 -1546067 -1192317 -599069
37737 -599069 289484 1651787 2536856 1695645 -170670 -785803 660758 2487740 3087472
$$ packed form
37798e31900J254686P02528j55119j538909k397905j243210P61041P15801j238811
37789c671798j459776J444266L770394K007168j828366l155945j185533R65318
37781c114272J358372J072935J202779J114024K69851n83110q34778q14282n74259
37772i02740L69561J434676R85196j002229k076086o52172J299136R72645q99852
37763d71865j023578J253321K610592P28234j955045j669501J116634K389816
37755B978608L46977k464754l196647k111883p40099Q13867K631793L041157O95401
37746A994420k416134k887934n56306J400401J088516k2930j46100L53750N93248
37737e99069Q88553J362303Q85069q41211j866315o15133J446561J826982N99732
$$ plain form
37728 3087472 2909947 3066693 3390892 2960945 1535590 -416744 -2164335 -2543984 -724057
37719 -724057 1872789 2005478 -1334491 -4599303 -3667769 520546 2860271 701328 -2961131
37710 -2961131 -3814697 -1564075 665093 800734 -244794 -605098 242093 1310164 1219314
37701 1219314 -570641 -2936392 -3727542 -2069121 235271 655195 -867889 -1998066
37693 -1998066 -1446664 -756606 -1759096 -3545020 -3456186 -562563 3228133 5393399 4994153
37684 4994153 2810238 583748 229075 2379238 5142524 5475404 2587892 -921349
37676 -921349 -2112386 -984470 259467 367720 88481 454297 1422081 2316833 2586183
37667 2586183 1963908 682655 -451379 -900720 -1091976 -1416258 -1020203 965500 3227112
$$ packed form
37728C087472j77525J56746L24199m29947j425355j952334j747591l79649J819927
37719g24057K596846J32689l339969l264812R31534M188315K339725k158943l662459
37710b961131q53566K250622K229168J35641j045528l60304Q47191J068071r0850
37701A219314j789955k365751p91150J658421K304392M19924j523084j130177
37693a998066N51402O90058j002490j785924Q8834K893623L790696K165266l99246
37684D994153k183915k226490l54673K150163K763286L32880k887512l509241
37676i21349j191037J127916J243937J08253k79239L65816R67784Q94752K69350
37667B586183o22275j281253j134034m49341j91256l24282L96055J985703K261612
$$ plain form
37658 3227112 3245619 912284 -845842 -142775 1024454 -228575 -3221452 -4546329 -2789947
37649 -2789947 -67909 1303964 1462053 1505586 1212630 -270843 -2465487 -3844015 -3842784
37640 -3842784 -3402703 -3439359 -3709918 -3496621 -2704280 -1751238 -779743 312178 1049734
37631 1049734 397131 -1782196 -3766264 -3567710 -1631220 -779299 -2723628 -5608144 -6290209
37622 -6290209 -4499358 -3090673 -4096569 -6209517 -6914829 -5736600 -4143760 -3067904
37614 -3067904 -1914179 120264 2775635 4853581 5063570 3004387 -59061 -1779528
37606 -1779528 -984009 833056 1134250 -723377 -3083754 -4236591 -3822656 -2146930 248583
37597 248583 1946507 1345989 -1031799 -2411476 -1171007 963772 1611048 1232502 1829275
$$ packed form
37658C227112J8507k333335j758126P03067J167229j253029k992877j324877J756382
37649b789947K722038J371873J58089M3533k92956j483473k194644j378528J231
37640c842784M40081l6656k70559K13297P92341R53042R71495J091921P37556
37631A049734o52603k179327j984068J98554J936490Q51921j944329k884516o82065
37622f290209J790851J408685j005896k112948p05312J178229J592840J075856
37614c067904J153725K034443K655371K077946K09989k059183l063448j720467
37606a779528P95519J817065L01194j857627k360377j152837M13935J675726K395513
37597B48583J697924o00518k377788j379677J240469K134779O47276l78546N96773
$$ plain form
37588 1829275 3180548 3155610 1589345 891196 2104979 3134855 2273119 1021731 1396640
37579 1396640 2428731 1878434 97621 -616263 113240 368768 -517348 -772535 698847
37570 698847 2255219 1772805 -606728 -3086413 -4319175 -3921225 -2056435 378504 1972442
37561 1972442 2131172 1572352 992228 236725 -599697 -530208 805346 2012607 1542196
37552 1542196 -321282 -2103873 -2986647 -2975631 -2135286 -895248 -325637 -805401 -1164150
37543 -1164150 -440510 444547 351164 220502 1566858 3382978 3148458 872766 -505428
37534 -505428 706970 2783923 3455208 2774551 1971788 1382790 898677 880547 1243190
37525 1243190 999775 -16387 -380757 694014 1896283 2065177 2231181 3460882 4248531
$$ packed form
37588A829275J351273k4938j566265o98149J213783J029876q61736j251388L74909
37579A396640J032091n50297j780813p13884P29503K55528q86116k55187J471382
37570F98847J556372m82414k379533k479685j232762L97950J864790K434939J593938
37561A972442J58730n58820n80124p55503q36422O9489J335554J207261m70411
37552A542196j863478j782591q82774J1016Q40345J240038N69611m79764l58749
37543a164150P23640Q85057r3383j30662J346356J816120k34520k275692j378194
37534e05428J212398K076953O71285o80657q02763n88998m84113j8130L62643
37525A243190k43415j016162l64370J074771J202269J68894J66004J229701P87649
$$ plain form
37516 4248531 2638459 -75250 -676090 1243002 2693005 1678290 -446150 -1654325
37508 -1654325 -1875829 -1901734 -1742337 -1405034 -1667877 -2692830 -3181105 -2243342 -974225
37499 -974225 -863022 -1713128 -2534109 -3471666 -5169430 -6916332 -7240087 -6046023 -4467208
37490 -4467208 -2748309 -138171 2877044 4189878 2865243 839436 564727 1948693
37482 1948693 2998670 2845854 2546057 2959927 3361629 2664613 954472 -856288 -2105401
37473 -2105401 -2442405 -1576483 120731 1309796 1064975 275494 540158 1812478 2445031
37464 2445031 1684653 677034 512833 740711 674208 770256 1457341 1810745 999853 133984
37454 133984 793095 2272286 2333674 564692 -1105864 -1493440 -1660148 -2615864 -3454082
$$ packed form
37516D248531j610072k713709o00840J919092J450003j014715k124440j208175
37508a654325k21504k5905J59397L37303k62843j024953m88275R37763J269117
37499i74225J11203q50106q20981r37557j697764j746902l23755J194064J578815
37490d467208J718899K610138L015215J312834j324635k025807k74709J383966
37482A948693J049977j52816k99797M13870M01702o97016j710141j810760j249113
37473b105401l37004Q65922J697214J189065k44821p89481K64664J272320O32553
37464B445031p60378j007619j64201K27878o6503R6048O87085L53404q10892q65869
37454A33984O59111J479191O1388j768982j670556l87576j66708r55716q38218
$$ plain form
37445 -3454082 -2999007 -1876453 -1572417 -2346618 -3257826 -3559971 -3078126 -1847702 -309253
37436 -309253 693598 898953 1036339 1586978 1881270 1225457 173927 -252424 2957
37427 2957 288629 348893 264151 -156148 -983425 -1649734 -1719907 -1752908 -2549673 -3961128
37417 -3961128 -5194968 -5797081 -5606361 -4415191 -2566988 -1242262 -1192878 -1775720 -2086323
37408 -2086323 -2232218 -2474373 -2129991 -803790 96117 -1163678 -4001027 -5970874 -5684891
37399 -5684891 -3854925 -1673400 307676 1728091 2288653 2212272 1821397 858442 -771272
37390 -771272 -2108029 -2252978 -1802015 -1791956 -1947899 -1609640 -1547159 -2779076 -4283467
37381 -4283467 -4270956 -3242215 -3150612 -3837712 -3268566 -1365992 -390403 -929169 -761506
$$ packed form
37445c454082M55075J122554L04036p74201r11208l02145M81845J230424J538449
37436c09253J002851K05355J37386N50639K94292o55813j051530m26351K55381
37427B957K85672O0264q4742m20299q27277o66309p0173l3001p96765j411455
37417c961128j233840o02113J90720J191170J848203J324726M9384n82842l10603
37408b086323j45895k42155L44382J326201Q99907j259795k837349j969847K85983
37399e684891J829966K181525J981076J420415N60562p6381l90875r62955j629714
37390g71272j336757j44949M50963J0059j55943L38259O2481j231917j504391
37381d283467J2511J028741R1603o87100N69146J902574R75589n38766J67663
$$ plain form
37372 -761506 1199999 2943682 2805552 2015997 2068700 2184774 1362507 595920 955771
37363 955771 1490325 1044180 305530 232221 409769 702229 2238517 4781447 5658361
37354 5658361 3739902 1888294 2548097 3549264 1930870 -475992 164552 2890127
37346 2890127 3021080 -298298 -2660490 -1286603 1114666 1025343 -931695 -1799987 -499492
37337 -499492 1744380 3491649 4091028 3695532 3081479 2585173 1349099 -1030512 -2763816
37328 -2763816 -1931193 253626 930104 52554 248071 2114811 3148120 2112032 990609
37319 990609 1279636 1688743 1288438 1731259 4022007 5854647 4873298 2429664 1360430
37310 1360430 1755283 1680642 779144 397497 926979 1443805 1496122 1236358 314237 -1476098
$$ packed form
37372g61506J961505J743683j38130p89555N2703J16074q22267p66587L59851
37363I55771N34554m46145p38650p3309J77548K92460J536288K542930Q76914
37354E658361j918459j851608O59803J001167j618394k406862O40544K725575
37346B890127J30953l319378k362192J373887K401269q9323j957038q68292J300495
37337d99492K243872J747269N99379l95496o14053m96306j236074k379611j733304
37328b763816Q32623K184819O76478q77550J95517J866740J033309j036088j121423
37319I90609K89027M09107m00305M42821K290748J832640r81349k443634j069234
37310A360430L94853p4641r01498l81647N29482N16826N2317k59764r22121j790335
$$ plain form
37300 -1476098 -2924252 -2567045 -816101 577242 850437 728830 1004200 1777866 2723058
37291 2723058 3252980 3074909 3170338 5016110 8074318 9750502 9089683 8617949 10697457
37282 10697457 13919651 15551028 16017209 18007549 22052073 26124995 29366953 33144326
37274 33144326 38062127 42526884 44832598 44503428 41249061 34996392 27629715 22355084
37266 22355084 20204195 18965745 16530340 13487718 11357550 10099866 8858775 7714059
37258 7714059 7095472 6565199 5742696 5472281 6358899 6887931 5020096 1493108 -526860
37249 -526860 422742 2178093 2241276 1401310 2162152 4334999 4672552 1467065 -2634893
37240 -2634893 -3948087 -2430380 -1025977 -1136586 -1148353 478901 2977604 4840605 5694211
$$ packed form
37300a476098j448154L57207J750944J393343K73195j21607K75370P73666R45192
37291B723058N29922j78071R5429J845772L058208J676184o60819m71734K079508
37282A0697457L222194J631377M66181J990340M044524M072922L241958L777373
37274C3144326M917801M464757K305714l29170l254367o252669p366677n274631
37266B2355084k150889j238450k435405l042622k130168j257684j241091j144716
37258G714059o18587n30273q22503k70415Q86618N29032j867835l526988k019968
37249e26860R49602J755351O3183q39966P60842K172847L37553l205487m101958
37240b634893j313194J517707J404403j10609j1767J627254K498703J863001Q53606
$$ plain form
37231 5694211 5679555 4710593 3454865 3423073 4781512 5561196 4439647 2818477 2505680
37222 2505680 2813222 2010028 472733 17903 779842 1139382 505962 -63306 -32173
37213 -32173 -105279 -573783 -823449 -820400 -1333867 -2193528 -1927591 111614 2415697 2876195
37203 2876195 1087358 -1255248 -1955110 -499739 1090188 361025 -2169022 -3101986 -730093
37194 -730093 2231579 2426839 714607 401550 1724071 1658168 -790121 -2727890 -1872403
37185 -1872403 72699 169847 -1723345 -3275342 -2636671 61657 3028201 3994159 2309596
37176 2309596 151151 160066 1848062 2349081 851496 -302548 380442 1212943 418328
37167 418328 -850567 -461263 1494746 3276855 3977347 3896109 3524798 3353512 3637904
$$ packed form
37231E694211j4656r68962j255728l1792J358439P79684j121549j621170l12797
37222B505680L07542q03194j537295m54830P61939L59540o33420n69268L1133
37213c2173p3106m68504k49666L049n13467q59661K65937K039205K304083M60498
37203B876195j788837k342606o99862J455371J589927p29163k530047r32964K371893
37194g30093K961672J95260j712232l13057J322521o5903k448289j937769Q55487
37185a872403J945102R7148j893192j551997O38671K698328K966544R65958j684563
37176B309596k158445Q915J687996N01019j497585j154044O82990Q32501p94615
37167D18328j268895L89304J956009J782109P00492q1238l71311j71286K84392
$$ plain form
37158 3637904 3570125 2041811 -142308 -610033 1212876 3077771 3209788 2443345 1926412
37149 1926412 1128119 -310763 -1153529 -823932 -724937 -1327409 -490663 2852096 5818465
37140 5818465 5359631 2779345 1284471 1008394 46385 -1262130 -1129810 -289337 -973882
37131 -973882 -2454455 -1769811 1068451 2616082 1222316 -943241 -1712871 -1301951 -210945
37122 -210945 1729281 3343631 2714620 957374 1762623 5569362 7802547 5156984 405583
37113 405583 -1733878 -746747 669363 1426028 2418694 3444161 3111707 1451035 40649
37104 40649 -296086 -13326 495204 974312 596648 -1034440 -2648454 -2738023 -1662603
37095 -1662603 -659921 494739 2776716 5344268 6036533 4573816 3116966 3095891 3293454
$$ packed form
37158C637904o7779j528314k184119m67725J822909J864895J32017p66443n16933
37149A926412p98293j438882q42766L29597R8995o02472Q36746L342759K966369
37140E818465m58834k580286j494874k76077r62009j308515J32320Q40473o84545
37131i73882j480573O84644K838262J547631j393766k165557p69630M10920J091006
37122b10945J940226J614350o29011j757246Q05249L806739K233185k645563m751401
37113D05583k139461R87131J416110P56665R92666J025467l32454j660672j410386
37104D0649l36735K82760N08530M79108l77664j631088j614014q9569J075420
37095a662603J002682J154660K281977K567552O92265j462717j456850k1075J97563
$$ plain form
37086 3293454 1892833 -941461 -3388566 -3967376 -2604998 -460913 899539 824492 292557
37077 292557 635518 1585985 1639052 458682 -399483 288145 1696142 2330946 2093781
37068 2093781 1789751 1320785 -114436 -2133118 -2995666 -1895273 -351854 -391358 -1888313
37059 -1888313 -2755939 -1691482 264739 1242872 816491 113711 138756 792279 1462638
37050 1462638 1838710 1924191 1748522 1370684 940458 572810 275986 37348 -117748 -84635
37040 -84635 330023 1048886 1244424 -96966 -2544442 -3845613 -2308519 702945 1988678
37031 1988678 461774 -1390903 -704074 2047397 3563530 1643860 -2310409 -4932115
37023 -4932115 -4562359 -2789821 -2144982 -2766968 -2425124 -72635 2111411 1549718 -942216
$$ packed form
37086C293454j400621k834294k447105n78810J362378K144085J360452p5047n31935
37077B92557L42961R50467N3067j180370q58165O87628J407997O34804k37165
37068B093781l04030m68966j435221k018682q62548J100393J543419l9504j496955
37059a888313q67626J064457J956221R78133m26381p02780K5045O53523O70359
37050A462638L76072Q5481j75669l77838m30226l67648k96824k38638j55096L3113
37040h4635M14658P18863J95538j341390k447476j301171J537094L011464J285733
37031A988678j526904j852677O86829K751471J516133j919670l954269k621706
37023d932115L69756J772538O44839o21986L41844K352489K184046n61693k491934
$$ plain form
37014 -942216 -2205790 -1198678 -113641 -714831 -1869774 -1813919 -941702 -770417 -1461560
37005 -1461560 -2035272 -2195169 -2368459 -2407497 -1593980 249823 2513797 4341676 4900154
36996 4900154 3862290 2237500 1723307 2466346 2662603 1335102 30385 303029 983036
36987 983036 -69890 -2629435 -4733405 -5734093 -6258803 -5827295 -3394583 -178668 991049
36978 991049 -380656 -1840965 -1907539 -1778605 -2184144 -1604256 547851 1707875 -293798
36969 -293798 -3428382 -4049400 -2021843 -396689 -634189 -1061090 -155567 1270034 1901296
36960 1901296 1922163 2154153 2520335 2336968 1359522 -121389 -1699857 -2991763 -3736229
36951 -3736229 -3847018 -3093400 -1186461 1158576 1946649 -39009 -3307569 -5268874 -5499074
$$ packed form
37014i42216j263574J007112J085037o01190j154943N5855Q72217J71285o91143
37005a461560n73712j59897j73290l9038Q13517J843803K263974J827879N58478
36996D900154j037864j624790n14193P43039J96257j327501j304717K72644O80007
36987I83036j052926k559545k103970j000688n24710M31508K432712L215915J169717
36978I91049j371705j460309o6574J28934m05539N79888K152107J160024k001673
36969b93798l134584o21018K027557J625154k37500m26901R05523J425601O31262
36960A901296K0867K31990L66182j83367r77446j480911j578468j291906p44466
36951c736229j10789P53618J906939K345037P88073j985658l268560j961305k30200
$$ plain form
36942 -5499074 -5585715 -5758288 -4114277 -195222 2936674 2158013 -1530740 -4346335 -4455071
36933 -4455071 -3287186 -2542767 -2175374 -1713901 -1583341 -2144504 -2769069 -2858274 -2776386 -2830509
36923 -2830509 -2227611 -191795 2441994 3907912 3547451 2181947 627725 -1058578
36915 -1058578 -2684965 -3310584 -2208765 -61911 1365011 838892 -1108428 -2613630
36907 -2613630 -2389083 -1264088 -1324240 -3221815 -5092209 -4906493 -3141692 -1815732 -1401157
36898 -1401157 -564316 961582 1458949 150584 -969389 45030 1899838 1815330 -396646
36889 -396646 -2284291 -2400302 -1644761 -926107 38961 945002 322793 -1968700 -3704390
36880 -3704390 -3426889 -2928697 -4519328 -7045868 -7134561 -3982738 -480156 704201 17530
$$ packed form
36942e499074q6641j72573J644011L919055L131896p78661l688753k815595j08736
36933d455071J167885P44419L67393M61473J30560n61163o24565q9205Q1888n4123
36923b830509O02898K035816K633789J465918l60461j365504j554222j686303
36915a058578j626387o25619J101819K146854J426922n26119j947320j505202
36907b613630K24547J124995o0152j897575j870394J85716J764801J325960M14575
36898a401157Q36841J525898M97367j308365j119973J014419J854808q4508k211976
36889c96646j887645j16011P55541P18654R65068R06041o22209k291493j735690
36880c704390K77501M98192j590631k526540q8693L151823L502582J184357o86671
$$ plain form
36871 17530 -697559 -952342 -1363793 -1840931 -1521480 -240148 978582 1023008 -156369
36862 -156369 -1562030 -2164519 -1891543 -1462825 -1146375 -245568 1563976 3044961 2812018
36853 2812018 1641190 1675505 3069556 3366830 1228628 -1096455 -890445 796125 556242
36844 556242 -2149344 -3963519 -2503203 222899 878250 -475663 -908426 912111 3058669
36835 3058669 3275334 1637882 -408951 -2145243 -3594078 -4456123 -4332233 -3565935 -2733666
36826 -2733666 -1585010 316647 1990321 1501916 -1431290 -4432337 -4953953 -3087838
36818 -3087838 -993015 -42380 380835 1379183 2920032 4059005 4095031 3049620 1347275
36809 1347275 -526015 -2008789 -2339893 -867441 2051764 4611051 4893819 3034358
$$ packed form
36871A7530p15089k54783m11451m77138L19451J281332J218730M4426j179377
36862a56369j405661o02489K72976M28718L16450R00807J809544J480985k32943
36853B812018j170828L4315J394051K97274k138202k325083K06010J686570k39883
36844E56242k705586j814175J460316K726102O55351j353913m32763J820537K146558
36835C058669K16665j637452k046833j736292j448835q62045J23890P66298Q32269
36826b733666J148656J901657J673674m88405k933206l001047n21616J866115
36818c087838K094823R50635M23215R98348J540849J138973L6026j045411j702345
36809A347275j873290j482774l31104J472452K919205K559287K82768j859461
$$ plain form
36801 3034358 1203553 847012 923706 -112337 -1674337 -2083327 -1490432 -1495613 -2008501
36792 -2008501 -1165288 937553 1242712 -1754002 -4814953 -3901735 142881 2793154 2059968
36783 2059968 401556 232434 654238 -42009 -1133980 -824957 594549 1095182 -164325
36774 -164325 -2072692 -3508303 -4381764 -4640914 -3879835 -2575532 -2321492 -3673249 -4687455
36765 -4687455 -3164911 -59893 1145015 -992805 -3603989 -3100156 251559 3224737
36757 3224737 4213287 4327344 4025154 1868348 -2039505 -4324016 -2579836 725016 1597072
36748 1597072 313490 330328 2128496 2308660 -543222 -3109097 -2343455 12243 482956
36739 482956 -982280 -1815300 -1185221 -544986 -657595 -861018 -963437 -1372194 -1443335 -100669
$$ packed form
36801C034358j830805l56541P6694j036043j562000m08990N92895n181n12888
36792b008501Q43213K102841L05159k996714l060951R13218M044616K650273p33186
36783B059968j658412j69122M21804o96247j091971L09023J419506N00633j259507
36774a64325j908367j435611q73461k59150P61079J304303K54040j351757j014206
36765d687455J522544L105018J204908k137820k611184N03833L351715K973178
36757C224737R88550J14057l02190k156806l907853k284511J744180L304852Q72056
36748A597072j283582J6838J798168J80164k851882k565875P65642K355698M70713
36739D82956j465236q33020O30079O40235j12609k03423j02419m08757p1141J342666
$$ plain form
36729 -100669 1756083 1804796 -261637 -2027221 -1792409 -637593 -62918 351019 1350625
36720 1350625 1804926 246896 -2289002 -3188675 -1841045 -325641 -264915 -834058 -695602
36711 -695602 -318634 -933837 -2094685 -2018136 -274845 1407643 1477410 431358 -395792
36702 -395792 -810007 -1365085 -1785988 -1327881 -477567 -683219 -2095533 -3033547 -2342225
36693 -2342225 -1030018 -664044 -1165428 -1322218 -801518 -454222 -917874 -1916456 -2826103
36684 -2826103 -3165932 -2644081 -1346663 237110 1788459 3398466 4837722 5264996 4412558
36675 4412558 3418726 3438939 3833240 2905868 368267 -2024546 -2508208 -1203856 278488
36666 278488 642464 97293 -119039 541850 912247 -460784 -2891282 -3885463 -2430810
$$ packed form
36729a00669J856752M8713k066433j765584K34812J154816N74675M13937R99606
36720A350625M54301j558030k535898q99673J347630J515404O0726n69143J38456
36711f95602L76968o15203j160848P6549J743291J682488O9767j046052q27150
36702c95792m14215n55078m20903M58107Q50314k05652j412314r38014O91322
36693b342225J312207L65974n01384j56790N20700L47296m63652r98582r09647
36684b826103l39829N21851J297418J583773J551349J610007J439256M27274q52438
36675D412558r93832K0213L94301r27372k537601k392813m83662J304352J482344
36666B78488L63976n45171k16332O60889L70397j373031k430498r94181J454653
$$ plain form
36657 -2430810 -451771 46432 -316325 -30986 461707 1596 -425895 993423 3217875
36648 3217875 3227432 869885 -419046 1255657 3461704 3407116 1910975 1164969 880337
36639 880337 -428931 -1835958 -892440 2322462 4908158 5050391 3792907 2548249 1273775
36630 1273775 88019 487205 3142686 5774644 5266469 1582857 -2125710 -3447559
36622 -3447559 -3166683 -3220535 -3722403 -3402950 -2106031 -980026 -302532 942885 2797868
36613 2797868 3562023 2472417 1451620 2431558 4238685 4316826 2750512 2164020 3838879
36604 3838879 6269052 7732590 8121831 7884376 7224123 6776553 7078558 7090840 5566400
36595 5566400 4220202 6584969 12628960 17589973 18115952 16884069 18619149 23676296
$$ packed form
36657b430810J979039M98203l62757K85339M92693m60111m27491J419318K224452
36648C217875R557k357547j288931J674703K206047n4588j496141p46006k84632
36639H80337j309268j407027R43518L214902K585696J42233j257484j244658j274474
36630A273775j185756L99186K655481K631958n08175l683612l708567j321849
36622c447559K80876n3852n01868L19453J296919J126005O77494J245417J854983
36613B797868P64155j089606j020797R79938J807127P8141j566314n86492J674859
36604C838879K430173J463538L89241k37455o60253m47570L02005J2282j524440
36595E566400j346198K364767O043991M961013N25979j231883J735080N057147
$$ plain form
36587 23676296 28348212 29864325 28147767 23865627 17925386 12482200 9641201 9057306
36579 9057306 8767797 8008826 7258324 6231450 4293216 2446871 2341463 3401352 3456293
36570 3456293 2296391 2012011 3357176 4254127 2808483 -137953 -2348535 -2572824 -1026782
36561 -1026782 1065385 2033260 1242740 119715 242965 721167 -504020 -2971790 -3911500
36552 -3911500 -2416506 -651266 -128544 411289 2049168 3179085 1873750 -1051713
36544 -1051713 -3167814 -3339916 -2167916 -847860 -714219 -2439226 -4635748 -4867555 -2996669
36535 -2996669 -1565623 -1811402 -1772100 40084 1795418 1581801 995712 2391577 4492900
36526 4492900 4325543 2269260 1397362 2328872 2499096 665383 -1402911 -2333943 -2984026
$$ packed form
36587B3676296M671916J516113j716558m282140n940241n443186k840999n83895
36579I057306k89509p58971p50502j026874j938234j846345j05408J059889N4941
36570C456293j159902k84380J345165Q96951j445644k946436k210582k24289J546042
36561a026782K092167R67875p90520j123025J23250M78202j225187k467770r39710
36552c911500J494994J765240N22722N39833J637879J129917j305335k925463
36544a051713k116101j72102J172000J320056J33641j725007k196522k31807J870886
36535b996669J431046k45779L9302J812184J755334k13617n86089J395865K101323
36526D492900j67357k056283q71898R31510J70224j833713k068294r31032o50083
$$ plain form
36517 -2984026 -3845554 -3569385 -1500832 685663 1341976 867016 114652 -1201833 -3041116
36508 -3041116 -3866844 -2786269 -1456465 -1997380 -3986757 -5262554 -4962877 -4045998 -3208446
36499 -3208446 -1971457 26136 2038678 2965597 2626991 2055038 2453016 3656602 3989130
36490 3989130 2431345 518144 597486 2280933 2668599 686846 -1100446 -396184 1321862
36481 1321862 1383684 248067 381277 1833347 2173641 769734 -69287 968757 1936739
36472 1936739 801767 -1297940 -1845498 -552258 703533 668279 -262379 -1315470 -2127089
36463 -2127089 -2417203 -2037817 -1317040 -630490 75130 697393 516850 -795754 -2292463
36454 -2292463 -2894507 -2887966 -3136462 -3363958 -2683411 -1534689 -1433800 -2644151 -3606824
$$ packed form
36517b984026q61528K76169K068553K186495O56313m74960p52364j316485j839283
36508c041116q25728J080575J329804n40915j989377j275797K99677R16879Q37552
36499c208446J236989J997593K012542R26919l38606n71953L97978J203586L32528
36490C989130j557785j913201P9342J683447L87666j981753j787292P04262J718046
36481A321862O1822j135617J33210J452070L40294j403907q39021J038044R67982
36472A936739j134972k099707n47558J293240J255791l5254r30658j053091q11619
36463b127089k90114L79386P20777O86550P05620O22263j80543j312604j496709
36454b292463o02044O541k48496k27496O80547J148722J00889j210351r62673
$$ plain form
36445 -3606824 -3072519 -1517054 -50481 857402 1182635 1145865 1636217 3488972 5788431
36436 5788431 6329379 4538965 2492544 2034562 2310224 1386277 -989958 -3631426 -5644091
36427 -5644091 -6370625 -4887622 -1491651 1334654 1555843 377752 230800 866592 228919
36418 228919 -1341661 -1160196 1206511 2832537 2078372 1117214 1960188 2859502 1290598
36409 1290598 -1666838 -2969233 -2276042 -1857707 -2447492 -2258334 -384933 1413463 1178947
36400 1178947 -782508 -2729466 -3491680 -2991223 -1785501 -667336 -41409 503657 1353647
36391 1353647 1824397 1053476 -232920 -344781 751415 1107278 -118902 -820999 1294335
$$ packed form
36445c606824N34305J555465J466573R07883L25233l6770M90352J852755K299459
36436E788431N40948j790414k046421m57982K75662r23947k376235k641468k012665
36427e644091p26534J483003L395971K826305K21189j178091j46952O35792o37673
36418B28919j570580J81465K366707J626026p54165r61158Q42974Q99314j568904
36409A290598k957436j302395O93191M18335n89785J89158J873401J798396k34516
36400A178947j961455j946958p62214N00457J205722J118165O25927N45066Q49990
36391A353647M70750p70921j286396j11861J096196L55863j226180p02097K115334
$$ [...]
##END NTUPLES=NMR SPECTRUM
##END=
