##TITLE=31Pdec_SR70_k
 d2o, 24 sc
 9.07.2021
##JCAMPDX= 6.0         $$ Bruker NMR JCAMP-DX V2.0
##DATA TYPE= NMR SPECTRUM
##DATA CLASS= NTUPLES
##ORIGIN= UXNMR, Bruker Analytische Messtechnik GmbH
##OWNER= root
$$ XWIN-NMR		Version 3.5
$$ Fri Jul  9 13:22:44 2021 Russian Standard Time (UT+4h)  she@DPX200
##.OBSERVE FREQUENCY= 81.013821
##.OBSERVE NUCLEUS= ^31P
##.ACQUISITION MODE= SIMULTANEOUS
##.ACQUISITION SCHEME= undefined
##.AVERAGES= 24
##.DIGITISER RES= 16
##SPECTROMETER/DATA SYSTEM= spect
##.PULSE SEQUENCE= zgpg30
##.SOLVENT NAME= D2O
##.SHIFT REFERENCE= (INTERNAL, D2O, 0, 248.564)
##AUDIT TRAIL= $$ (NUMBER, WHEN, WHO, WHERE, WHAT)
$$ ##TITLE= Audit trail, XWIN-NMR		Version 3.5
$$ ##JCAMPDX= 5.01
$$ ##ORIGIN= Bruker BioSpin GmbH
$$ ##OWNER= she
$$ F:/spectra/data/she/nmr/P31/1/pdata/1/auditp.txt
$$ ##AUDIT TRAIL=  $$ (NUMBER, WHEN, WHO, WHERE, WHAT)
(   1,<2021-07-09 13:20:36.75 +0400>,<she>,<DPX200>,
      <created by zg, POWCHK disabled, PULCHK disabled
       configuration hash MD5:
       00 E9 B6 7A A2 85 ED C7 34 08 36 98 17 FE 4E 26
       data hash MD5: 32K
       FA 8B 01 4D C4 57 21 4A C4 01 D5 77 6C 82 8E 46>)
(   2,<2021-07-09 13:20:41.42 +0400>,<she>,<DPX200>,
      <Start of raw data processing
       efp BC_mod = 2 LB = 1 FT_mod = 6 PKNL = 1 PHC0 = -7934.597 PHC1 = 1539.075 SI = 64K 
       data hash MD5: 64K
       64 06 42 83 8F 7D 7A AC 58 A7 B3 4F 69 F6 6A B9>)
(   3,<2021-07-09 13:21:25.06 +0400>,<she>,<DPX200>,
      <pk PHC0 = 590.5936 PHC1 = -1592.4 
       data hash MD5: 64K
       14 3E 4D 95 4D 78 AF F6 D5 A6 90 AA DC 0C 1F F9>)
(   4,<2021-07-09 13:21:52.96 +0400>,<she>,<DPX200>,
      <abs ABSG = 5 
       data hash MD5: 64K
       03 79 F0 01 B6 44 6C 36 D8 A5 D7 13 04 1C F0 C6>)
(   5,<2021-07-09 13:22:17.95 +0400>,<she>,<DPX200>,
      <pk PHC0 = -0.797736 PHC1 = 0 
       data hash MD5: 64K
       86 EE C6 F3 A4 CE 4E 77 8B FF A2 60 91 1D 43 44>)
$$ ##END=
$$ 
$$ hash MD5
$$ EB E0 A3 05 59 A8 B8 55 97 7A 00 57 12 3A 59 5E
##$RELAX= 
##$RELAX= 
##$RELAX= 
##$RELAX= 
##$RELAX= 
##$RELAX= 
##$RELAX= 
##$RELAX= 
$$ Bruker specific parameters
$$ --------------------------
##$DU= <F:/spectra>
##$EXPNO= 1
##$NAME= <P31>
##$PROCNO= 1
##$TYPE= <nmr>
##$USER= <she>
##$AMP= (0..31)
100 100 100 100 100 100 100 100 100 100 100 100 100 100 100 100 100 100 
100 100 100 100 100 100 100 100 100 100 100 100 100 100 
##$AQSEQ= 0
##$AQ_mod= 1
##$AUNM= <au_zg>
##$AUTOPOS= <>
##$BF1= 81.014009
##$BF2= 200.13
##$BF3= 200.13
##$BF4= 200.13
##$BF5= 200.13
##$BF6= 200.13
##$BF7= 200.13
##$BF8= 200.13
##$BYTORDA= 1
##$CFDGTYP= 0
##$CFRGTYP= 5
##$CHEMSTR= <none>
##$CNST= (0..31)
1 1 145 1 1 1 1 1 1 1 1 1 1 1 1 1 1 1 1 1 1 1 1 1 1 1 1 1 1 1 1 1 
##$CPDPRG= <waltz16>
##$CPDPRG1= <>
##$CPDPRG2= <waltz16>
##$CPDPRG3= <>
##$CPDPRG4= <mlev>
##$CPDPRG5= <mlev>
##$CPDPRG6= <mlev>
##$CPDPRG7= <mlev>
##$CPDPRG8= <mlev>
##$CPDPRGB= <>
##$CPDPRGT= <>
##$D= (0..31)
0 1 0 0 0 0 0 0 0 0 0 0.03 2e-05 3e-06 0 0 0 0 0 0 0 0 0 0 0 0 0 0 0 0 
0 0 
$$ [...]
##$SUBNAM3= <"">
##$SUBNAM4= <"">
##$SUBNAM5= <"">
##$SUBNAM6= <"">
##$SUBNAM7= <"">
##$SUBNAM8= <"">
##$SUBNAM9= <"">
##$SW= 501.771253377433
##$SWIBOX= (0..15)
0 1 3 0 0 0 0 0 0 0 0 0 0 0 0 0 
##$SW_h= 40650.406504065
##$TD= 32768
##$TD0= 1
##$TE= 0
##$TE2= 300
##$TE3= 300
##$TEG= 300
##$TL= (0..7)
0 120 53 12 22 120 120 120 
##$TP= (0..7)
150 150 150 150 150 150 150 150 
##$TP07= 0
##$TPNAME0= <>
##$TPNAME1= <>
##$TPNAME2= <>
##$TPNAME3= <>
##$TPNAME4= <>
##$TPNAME5= <>
##$TPNAME6= <>
##$TPNAME7= <>
##$TPOAL= (0..7)
0.5 0.5 0.5 0.5 0.5 0.5 0.5 0.5 
##$TPOFFS= (0..7)
0 0 0 0 0 0 0 0 
##$TUNHIN= 0
##$TUNHOUT= 0
##$TUNXOUT= 0
##$USERA1= <user>
##$USERA2= <user>
##$USERA3= <user>
##$USERA4= <user>
##$USERA5= <user>
##$V9= 5
##$VALIST= <valist>
##$VCLIST= <CCCCCCCCCCCCCCC>
##$VD= 0
##$VDLIST= <DDDDDDDDDDDDDDD>
##$VPLIST= <PPPPPPPPPPPPPPP>
##$VTLIST= <TTTTTTTTTTTTTTT>
##$WBST= 1024
##$WBSW= 4
##$XGAIN= (0..3)
0 0 0 0 
##$XL= 0
##$YL= 0
##$YMAX_a= 2642
##$YMIN_a= -2495
##$ZGOPTNS= <>
##$ZL1= 120
##$ZL2= 120
##$ZL3= 120
##$ZL4= 120
##$ABSF1= 248.5645
##$ABSF2= -253.2056
##$ABSG= 5
##$ABSL= 3
##$ALPHA= 0
##$AQORDER= 0
##$ASSFAC= 0
##$ASSFACI= 0
##$ASSFACX= 0
##$ASSWID= 0
##$AUNMP= <proc_1d>
##$AZFE= 0.1
##$AZFW= 0.5
##$BCFW= 0
##$BC_mod= 2
##$BYTORDP= 0
##$COROFFS= 0
##$CY= -3
##$DATMOD= 1
##$DC= 0
##$DFILT= <>
##$DTYPP= 0
##$F1P= 0
##$F2P= 0
##$FCOR= 1
##$FTSIZE= 65536
##$FT_mod= 6
##$GAMMA= 0
##$GB= 0
##$INTBC= 1
##$INTSCL= 5.30512e-09
##$ISEN= 30
##$LB= 1
##$LEV0= 0
##$LPBIN= 0
##$MAXI= 10000
##$MC2= 0
##$MEAN= 0
##$ME_mod= 0
##$MI= 50
##$NCOEF= 0
##$NC_proc= -6
##$NLEV= 6
##$NOISF1= 182.463
##$NOISF2= 159.3651
##$NSP= 0
##$NTH_PI= 0
##$NZP= 0
##$OFFSET= 248.5645
##$PC= 4
##$PHC0= -7344.801
##$PHC1= -53.32507
##$PH_mod= 1
##$PKNL= yes
##$PPARMOD= 0
##$PSCAL= 0
##$PSIGN= 0
##$REVERSE= no
##$SF= 81.014009
##$SI= 65536
##$SIGF1= 159.3651
##$SIGF2= -187.1042
##$SINO= 113.3802
##$SIOLD= 16384
##$SREGLST= <1H.CDCl3>
##$SSB= 0
##$STSI= 65536
##$STSR= 0
##$SW_p= 40650.406504065
##$SYMM= 0
##$S_DEV= 0
##$TDeff= 32768
##$TDoff= 0
##$TI= <>
##$TILT= no
##$TM1= 0
##$TM2= 0
##$TOPLEV= 0
##$USERP1= <user>
##$USERP2= <user>
##$USERP3= <user>
##$USERP4= <user>
##$USERP5= <user>
##$WDW= 1
##$XDIM= 65536
##$YMAX_p= 297343055
##$YMIN_p= -26094903
$$ End of Bruker specific parameters
$$ ---------------------------------
##NTUPLES= NMR SPECTRUM
##VAR_NAME=  FREQUENCY,     SPECTRUM/REAL,   SPECTRUM/IMAG
##SYMBOL=    X,             R,               I
##VAR_TYPE=  INDEPENDENT,   DEPENDENT,       DEPENDENT
##VAR_FORM=  AFFN,          ASDF,            ASDF
##VAR_DIM=   65536,         65536,           65536
##UNITS=     HZ,            ARBITRARY UNITS, ARBITRARY UNITS
##FACTOR=    0.620285442955139, 1,           1
##FIRST=     20137.2065510759, 0,            0
##LAST=      -20513.1999529892, 0,           0
##MIN=       -20513.1999529892, -26094903,   0
##MAX=       20137.2065510759, 297343055,    0
$$ Real data points
##PAGE= N=1
##DATA TABLE= (X++(R..R)), XYDATA
$$ [...]
40919a96523M42208J191612J15786j000505n55968M22693K82167n34617m40457
40910b73604O63075J339680P65633l89113j102701j048025n01641O6389K49934
40901b30373M2960p9599K15614N34202K56198m29142n90441J09804P05017J42261
40891F76501j086031j393192k99113P98766O37374q7558l416N83662K25725j017570
40881i64852j333398N3991J586691J650041O27859k70165p96292j109879p68286
40872a324290L10232R64822L64237m62334j68468P19262P73618K7447m03423l94949
40862D06154o22202p89295o5945R62755Q37419k92525p32153L3577O29372J61865
40852E29022n64668p23982o21098n39782l5270R05047J385610R49796J86193m26524
$$ plain form
40919 -196523 245685 1437297 1553083 552578 -3390 419303 701470 166853 -273604
40910 -273604 389471 1729151 2494784 2105671 1002970 -45055 -546696 -480307 -230373
40901 -230373 -187413 -267012 -51398 482804 739002 309860 -280581 -170777 534240 676501
40891 676501 -409530 -1802722 -2101835 -1303069 -665695 -753253 -756669 -173007 52718 -964852
40881 -964852 -2298250 -2244259 -657568 992473 1620332 1350167 553875 -556004 -1324290
40872 -1324290 -1014058 -49236 315001 -147333 -315801 403461 1177079 1204526 801103 406154
40862 406154 -216048 -1005343 -1071288 -108533 728886 436361 -295792 -262215 367157 529022
40852 529022 -35646 -759628 -1380726 -1920508 -1955778 -1050731 334879 1284675 1470868 1044344
40842A044344r56465j042670j10898J065134Q69055n14296r78944J40040P97112
40833C12412l51872j492158n55235J268745J329204m13130j621968j198747k43245
40824b965994L12886P52526J155441R44921K10767j43488Q4289J50970j24513
40815C77805m0723N00133N96741j24746q51538q99811n35500j12549M08534P19703
40805C8049K56495n13921l17013Q03221J127166q0918j170989o52759L99584K20936
40795A09851o71552n41732M10348M35677n37977o69613N26121J206869L17603
40786E85595o51118k75354M95712K63331l47577o6905N53185J97928o51567m68934
40776c65704N75445Q68626J22350l09522N9790J60616m52192p25408m6870O68614
$$ plain form
40842 1044344 87879 -954791 -1065689 -555 868500 354204 -624740 -484700 312412
40833 312412 -39460 -1531618 -2086853 -818108 511096 97966 -1524002 -2722749 -2965994
40824 -2965994 -2653108 -1900582 -745141 199780 410547 267059 351348 502318 377805
40815 377805 337082 837215 1433956 1309210 457672 -442139 -977639 -1090188 -681654 38049
40805 38049 294544 -219377 -536390 266831 1393997 1313079 142090 -510669 -111085 109851
40795 109851 -561701 -1103433 -693085 -257408 -795385 -1464998 -938877 267992 585595
40786 585595 -65523 -340877 154835 418166 70589 3684 556869 754797 103230 -365704
40776 -365704 209741 1078367 1200717 891195 950985 1111601 659409 -65999 -112869 555745
40766E55745N59073P060m01686p39103r81681p42717k38992j47332j86794N07443
40756a808984J325372O16011j226558j571889L91293J933462Q74825r75157p89937
40747a231562Q65350J366004L33700l57477p1628j7514o27742r00729m27881L6114
40737a033365J00991Q5743j0301k69334m1653R37210J337900J16531j261284q45073
40727h82635M08807J35600j180416q49131J185488J854646L3118j508688o08785
40718a411996J092575J302421N55361L78548L88089m04911j261609j024003l05113
40709f90638k51556m10952J47380P88685M30995l21322j81363N24476N13807j87633
40699C61879n01726k47484p1911N7351N73807R65391L93320o70646j018536o18190
$$ plain form
40766 555745 1114818 1121878 720192 -18911 -1000592 -1743309 -1982301 -2129633 -2316427 -1808984
40756 -1808984 -483612 132399 -1094159 -2666048 -2274755 -341293 533532 -441625 -1231562
40747 -1231562 -366212 999792 1333492 976015 904387 886873 259131 -641598 -1069479 -1033365
40737 -1033365 -932374 -846631 -856932 -1126266 -1167919 -230709 1107191 1223722 -37562 -882635
40727 -882635 -473828 -338228 -1518644 -2367775 -1182287 672359 705477 -803211 -1411996
40718 -1411996 -319421 983000 1538361 1916909 2304998 1900087 638478 -385525 -690638
40709 -690638 -942194 -1353146 -1205766 -417081 13914 -307408 -488771 35705 549512 361879
40699 361879 -139847 -387331 -459242 -401891 171916 1137307 1530627 859981 -158555 -776745
40689g76745m06268m86201j66007M01850L24176k53743j29852R10290J527590
40680I45090P97582m88151j057823p22036j40635J94806J83499j29180n07757
40671i24605n45435q8494M97623O75651L09344j70629k51637m5888k04977p89918
40661a538965p55398N52048J840497J282016n95683j276480L9127J163161M10072
40652A120395p53204l22759Q13446M89476r37097j185223Q0857Q24572J82466
40643C12929k91153L88421Q70795p7776j329786j161090J06204Q13593M43334
40634G5471j07664k38942k60388l96937k87987L08701R87804J117617M90655n03020
40624A185310j163449j010813k25985M89054O11564K76861j3727q806J24083J65906
$$ plain form
40689 -776745 -1183013 -1669214 -1835221 -1433371 -1109195 -1362938 -1492790 -582500 945090
40680 945090 1742672 1254521 196698 -525338 -665973 -471167 -287668 -416848 -924605
40671 -924605 -1470040 -1558534 -1060911 -385260 -75916 -246545 -498182 -544070 -749047 -1538965
40661 -1538965 -2294363 -1742315 98182 1380198 784515 -491965 -452838 710323 1120395
40652 1120395 367191 44432 857878 1347354 410257 -774966 -694109 130463 312929
40643 312929 21776 410197 1280992 1203216 -126570 -1287660 -1181456 -367863 75471
40634 75471 -32193 -271135 -531523 -928460 -1216447 -907746 80058 1197675 1688330 1185310
40624 1185310 21861 -988952 -1214937 -725883 -114319 162542 148815 140009 264092 429998
40614D29998J65386K48279K18086k78702j006363j036547L2544J135090R42073
40605H49844j67989n75396L1289J40790q98816j427582j27225J367376O53998
40596a53711j480207j833008M66323K519579J813036l55992j097222l2072P14650
40587E61376o6137j138162q85324M24464J088300J45214j434332j781090k63226
40578c348917J630251J917432N34361o02573j58305R08451Q93439k01482r41382
40569F31275p72330o01106r12025p98472L60003J460249J114794k20330q99994
40560f37936m55989J36102L97124Q91051J535291J110060o41564j901658j068388
40551f35907R01841J825591J134691l7877q70229j339214j234992m13248K73940
$$ plain form
40614 429998 595384 843663 1061749 783047 -223316 -1259863 -1227319 -92229 849844
40605 849844 681855 106459 137748 278538 -620278 -2047860 -2175085 -807709 -153711
40596 -153711 -1633918 -3466926 -3000603 -481024 1332012 976020 -121202 -153274 561376
40587 561376 495239 -642923 -1528247 -1103783 -15483 129731 -1304601 -3085691 -3348917
40578 -3348917 -1718666 198766 733127 130554 -27751 880700 1774139 1572657 631275
40569 631275 -141055 -742161 -1654186 -2452658 -2092655 -632406 482388 262058 -637936
40560 -637936 -1093925 -957823 -560699 330352 1865643 2975703 2334139 432481 -635907
40551 -635907 265934 2091525 3226216 3188339 2318110 978896 -256096 -669344 -395404
40542c95404r711m38303K74143J329287P54320j119198j666312n3707J318154
40533f731O15968o93134n91390K52567J60351m31985o798J083673J220538L79377
40523A982436Q510L91759L48736m93284j132735j028163p39319n47116m9439O02881
40513f55734N61687k45162p69869l78420L18483M98539J15268l68964n06407o5389
40503a495968O65285R57649O35355M78736Q77768R01333j19144j002999l98353
40494A499662P05251K62790j404136j894915n85668L49227m44282j251981r7727
40485b861779K046557K632976J009077j106944j973802j315682R1562J178361
40477b99674J156526J87130o74546o90922k38463J074N5635L01952O31257O38913
$$ plain form
40542 -395404 -405115 -843418 -569275 760012 1514332 395134 -1271178 -1324885 -6731
40533 -6731 609237 -83897 -675287 -422720 -262369 -694354 -701152 382521 1603059 1982436
40523 1982436 1990946 2382705 2731441 2238157 1105422 77259 -662060 -1209176 -1258615 -655734
40513 -655734 -94047 -339209 -1109078 -1487498 -1169015 -670476 -555208 -924172 -1430579 -1495968
40503 -1495968 -830683 126966 762321 1241057 2118825 3020158 2901014 1898015 1499662
40494 1499662 2204913 2467703 1063567 -831348 -1417016 -1067789 -1512071 -2764052 -2861779
40485 -2861779 -815222 1817754 2826831 1719887 -253915 -1569597 -1478035 -299674
40477 -299674 856852 1043982 369436 -321486 -559949 -558875 -503240 -201288 429969 1068882
40467A068882K86935j72297o04639q60736o08739J76654Q31874O27889l18891
40458D26932j098848r44914Q787Q28566O79986k22071p55416k65613N34859N55871
40448b51861j36898n39256k32567K11405L04520K12370J66389J44346K44837N87706
40438G10991P78444L04236m87972p01782k33912J48073J21981J30038K68446O1355
40428A099898l93459l10056L46015N75385K9132l47487n6138m5704r48476j593227
40418a644117o61619J075544J684358P30105l98441n90195j32732K66097M16097
40409G45097L58598K3149m59615o39142k58637L64732O22889J96989n88451r70852
40399f05243n42117J70763L34164J4545Q5645P58671J063327L07531p40275r05300
$$ plain form
40467 1068882 1355817 1183520 578881 -281855 -890594 -713940 117934 745823 426932
40458 426932 -671916 -1616830 -1608043 -779477 -99491 -321562 -1076978 -1342591 -807732 -251861
40448 -251861 -388759 -928015 -1160582 -949177 -644657 -432287 -265898 -121552 123285 710991
40438 710991 1489435 1793671 1305699 603917 370005 518078 640059 770097 1038543 1099898
40428 1099898 706439 396383 742398 1317783 1346915 999428 943290 897586 -50890 -1644117
40418 -1644117 -2305736 -1230192 454166 1184271 785830 195635 62903 329000 745097
40409 745097 1103695 1126844 667229 28087 -230550 134182 757071 954060 365609 -605243
40399 -605243 -1147360 -976597 -642433 -627888 -542243 216428 1279755 1587286 847011 -58289
40389e8289k52035K21153J46029P1237L08984M34278J05181l37032m05897j57349
40379G6260j9936j78442m03260m37189l45148l39181l18827Q1932P68850R08746
40369b06195k5043j148710r79389N22161J636638J074566l30721q56318k21560
40360e34571K83697j94062r31632p78392K32560R63493O41925k40398o20301j46122
40350a323803N58749Q12903N96257K09811k66609p30671o68331K98392J541386
40341A028084J753614L63747j685696k708843j761231M55409K036040J603253
40333A084377j31317j019236n1756J373119J353126q9572j374375j495542o90766
40324a041942M61931J345582J145213k03338j221219n54666Q10035P06254r24177
$$ plain form
40389 -58289 -310324 -89171 56858 128095 437079 871357 976538 639506 233609 76260
40379 76260 56324 -122118 -525378 -962567 -1307715 -1646896 -1965723 -1883791 -1114941 -206195
40369 -206195 -231238 -1379948 -2359337 -1837176 -200538 874028 543307 -313011 -534571
40360 -534571 -250874 -444936 -1376568 -2154960 -1922400 -958907 -316982 -557380 -1177681 -1323803
40350 -1323803 -765054 47849 644106 853917 587308 -143363 -811694 -513302 1028084
40341 1028084 2781698 3145445 1459749 -1249094 -3010325 -2554916 -518876 1084377
40333 1084377 953060 -66176 -117932 1255187 2608313 2518741 1144366 -351176 -1041942
40324 -1041942 -580011 765571 1910784 1707446 486227 -68439 741596 1447850 523673
40315E23673j831236p94488Q16207J383504J032929M81630k48296r22937o32240
40306a91254N37496R50059j26317j051545l42790Q03457M07503j051739j444415
40297a509545l45056N97731M25542n575J80886O71301R09952Q79770N25862m36867
40287A894001j655504k004376q87092Q54080J722568J010241o12490j711152j392021
40278b781745j99865N36477L70673J68066N94250J012367N49619m70570j024513
40269a245241p87821k13117L14403N95326L73180k04077l60358K40809P36563
40260e50333K92637m58900l10015N94288R18095J02719r02385r54771N020J033665
40250b29980J059357j15674j330634j129916K72060R77255L2269j062518n92242
$$ plain form
40315 523673 -1307563 -2102051 -1285844 97660 1130589 1612219 1363923 440986 -191254
40306 -191254 346242 1296301 1169984 118439 -224351 579106 986609 -65130 -1509545
40297 -1509545 -1854601 -1256870 -831328 -836903 -656017 15284 925236 1805006 2330868 1894001
40287 1894001 238497 -1765879 -2652971 -1798891 -76323 933918 321428 -1389724 -2781745
40278 -2781745 -2981610 -2445133 -2074460 -1906394 -1312144 -299777 249842 -220728 -1245241
40269 -1245241 -2033062 -2246179 -1931776 -1336450 -963270 -1167347 -1527705 -1286896 -550333
40260 -550333 -257696 -716596 -1026611 -432323 485772 588491 -313894 -1268665 -1263645 -229980
40250 -229980 829377 713703 -616931 -1746847 -1474787 -497532 -465263 -1527781 -2120023
40241b120023P56483J095690K72360k63504k204J86788k3893J0401L45400K70631
40231E28129j16233R4742P84953P09335l64846j137139q85500l98784k42444J16914
40221i10873P20702N28885n49548q91258K34718J080874J61555j044059l21762
40212i90766J547855J853358J73460j149751q27827k69068o78172r70183j5115
40203a326209J002581M41900q58536p42527P37945J278071n9735j396248j029596
40194a952354L6886j3020q15109o06520P39133J474808P21326l67318n38242J310
40184a319100N04413P99099Q13395K32461n99779n99119L93460J005867L39171
40175A569868o02847o37048l49280q17437j425892q19328N90061J064701K91958
$$ plain form
40241 -2120023 -1363540 -267850 4510 -258994 -261198 -74410 -98303 -87902 257498 528129
40231 528129 411896 506638 1291591 2000926 1636080 498941 -386559 -785343 -1027787 -910873
40221 -910873 -190171 338714 -210834 -1102092 -867374 213500 375055 -669004 -990766
40212 -990766 557089 2410447 2583907 1434156 606329 337261 -340911 -1311094 -1326209
40203 -1326209 -323628 118272 -740264 -1482791 -744846 533225 473490 -922758 -1952354
40194 -1952354 -1915468 -1928488 -2743597 -3350117 -2610984 -1136176 -414850 -782168 -1320410 -1319100
40184 -1319100 -814687 -15588 797807 1030268 430489 -168630 224830 1230697 1569868
40175 1569868 967021 329973 -19307 -836744 -2262636 -3081964 -2491903 -1427202 -1135244
40166a135244k34331L03216R95479J007336P47431O38075K21183o90734j215178
40157F37233p00676J05301J41106l93818m81587J02807N02110N9320p14035o88904
40147a431143M86058J766638J802945O28391l53166l14442o7842n22620j050392
40138I44427n82506L96864M81187m11635j030065q89105p08380o70744o287J251379
40128a224865J753376Q12897m72007q43786m53903q0646R2507J51887o5428m10850
40118g40818k79117L06798M30532k42946p54624l45243L65212N08695K98403L42913
40108a10195N29865M94408L91364L70753J10340l55265k88993M28760P00782o3900
40098B207919p46209k72431N00862J58156r07179j186439m90468P7949K03958
$$ plain form
40166 -1135244 -1369575 -1066359 -70880 936456 1683887 2321962 2543145 1852411 637233
40157 637233 -63443 41858 182964 -210854 -692441 -589634 -87524 -28204 -742239 -1431143
40147 -1431143 -945085 821553 2624498 3252889 2899723 2585281 2517439 1994819 944427
40138 944427 361921 758785 1239972 828337 -201728 -1090833 -1799213 -2469957 -2476244 -1224865
40128 -1224865 528511 1341408 869401 25615 -428288 -508934 -416427 -264540 -329968 -740818
40118 -740818 -1019935 -713137 -282605 -525551 -1280175 -1625418 -1260206 -751511 -453108 -110195
40108 -110195 419670 914078 1305442 1676195 1786535 1431270 1142277 1571037 2271819 2207919
40098 2207919 1461710 1189279 1690141 1848297 941118 -245321 -735789 -657840 -453882
40089d53882N85876J164608R31014k27349j060755p97910j43360N3053m3385J5540
40079B3450O7697j79723m95687m87415j08068M82687J033013J060923K95916o15575
40069A077218o54156J07399M56494j83376q20785l25900R46047J690481J320416
40060C613838L76541m21064q38317r44898q40839o54383n13164m58053m83078
40051a163417n53979n01220j10299N11911Q63439N65074j59958p00442o67126
40042a916017j62798M46336Q56478R40390O81141J28883m98281p74317m13190
40033g11375K55314M89346N1138m25966l58231j12482l56731p98920n03653M84187
40023a987373Q85403M1005r09586n49722P74100J500526J086525M71059L11225
$$ plain form
40089 -453882 131994 1296602 2227616 2000267 939512 141602 -1758 51295 7910 23450
40079 23450 91147 -88576 -584263 -1071678 -1179746 -697059 335954 1396877 1692793 1077218
40069 1077218 423062 530461 986955 803579 -17206 -343106 602941 2293422 3613838
40060 3613838 3990379 3569315 2730998 1786100 945261 290878 -222286 -680339 -1163417
40051 -1163417 -1717396 -2218616 -2328915 -1817004 -953565 -388491 -548449 -1248891 -1916017
40042 -1916017 -2078815 -1632479 -776001 164389 845530 974413 476132 -298185 -711375
40033 -711375 -456061 33285 84423 -341543 -699774 -812256 -1168987 -1967907 -2471560 -1987373
40023 -1987373 -1101970 -1060965 -1970551 -2520273 -1746173 -245647 840878 1311937 1623162
40014A623162P4676o40235j083572n55676K51523K41789l28975l34942K93490
40005d58760N10409K7261k09534K19781L92507k82713q54153l28267O42087P84236
39995D42854J43732k93787l14911m31729n41323r0254O15801P03559K71808K09951
39985G15701M82100J57903o62631o60830M40003J101544L23640p46644o97652
39976D53134m0553j20348q05940q12838J68059J084859J111982M91645j71312
39967A358688n56238n73728l57270k69224m28368m46433p4940K76880J99542j805
39957h72896J14896K98910R8895k11610k4800N42367P77298M15177j45655n51665
39947D40917p81184q11360n58229j16317L09402N81546N33482O0427m66409m17210
$$ plain form
40014 1623162 1697838 1057603 -25969 -581645 -330122 -88333 -417308 -752250 -458760
40005 -458760 51649 78910 -130624 89157 481664 198951 -655202 -983469 -341382 442854
39995 442854 586586 292799 -22112 -453841 -995164 -1085418 -469617 233942 505750 715701
39985 715701 1197801 1355704 693073 32243 472246 1573790 1897430 1150786 453134
39976 453134 412581 292233 -513707 -1326545 -1158486 -73627 1038355 1530000 1358688
39967 1358688 802450 228722 -128548 -397772 -826140 -1272573 -1347513 -1070633 -871091 -872896
39957 -872896 -758000 -459090 -360195 -571805 -596605 -54238 723060 1138237 992582 440917
39947 440917 -340267 -1151627 -1709856 -1826173 -1516771 -935225 -401743 -341316 -807725 -1224935
39937a224935J64379M97466K69027P7430K22026O9079o64475j069029m58572L77217
39927a740387M64651J99974L15566L07175n01131j201928n11838Q62779J103023
39918g02116J82477k40141K50096K69377o65872j115426j73546R70251R57743
39909b67157K04883j45299L5278J78223R0328j45113n14991p24124l32530L64727
39899a255775N56981K65591K94774O29401L45505n33046p58065o593M55719K2794
39889A7286k04824L77171N87673k72937p97430J59223J245602P76891l96578m47881
39879A044196K82341J89548n24106l72098L92173N5766j341463j773442n46296
39870b593381O18523M60009p5284J59827O67495N29033p352j90781P0186M74894
$$ plain form
39937 -1224935 -1060556 -563090 -294063 -216633 5393 74472 -590003 -1659032 -2117604 -1740387
39927 -1740387 -1275736 -1075762 -760196 -453021 -954152 -2156080 -2667918 -1805139 -702116
39918 -702116 -519639 -759780 -509684 -240307 -906179 -2021605 -2195151 -1224900 -267157
39909 -267157 -62274 -207573 -172295 5928 96256 -48857 -563848 -1287972 -1620502 -1255775
39899 -1255775 -698794 -433203 -138429 490972 836477 303431 -454634 -461227 -5508 17286
39889 17286 -187538 189633 777306 504369 -293061 -133838 1111764 1888655 1492077 1044196
39879 1044196 1326537 1516085 991979 619881 1012054 1067820 -273643 -2047085 -2593381
39870 -2593381 -1974858 -1514849 -1590133 -1430306 -762811 -233778 -241130 -431911 -361725 113169
39860A13169Q43166Q90038M01190j57265k15857k10958p78280j081130J28326
39851f7601J773703J238522j463021k915373j090043J516834J565310l06730r18209
39842f66608M81585J517614O19293r30860j272586l58658O21840R25554O67335
39833A604509K71889m827k53261o16174p49148j27971Q48698R71968J2027o75498
39823A282212k24053K26294o00759j772743j394152M39186J747225J468506M66275
39814A637991j93311l88036k93484n762O0998m02843q00637l76114M68855Q20455
39804E28112P96902R95613R28373j66299j375700j128233N0831J72716q30713
39795b8398j007889K5557L43570o44742q95129N18900J388636J25770j251642
$$ plain form
39860 113169 956335 1846373 2247563 2090298 1874441 1663483 885203 -195927 -67601
39851 -67601 1706102 2944624 1481603 -1433770 -2523813 -1006979 558331 251601 -666608
39842 -666608 -185023 1332591 1951884 1021024 -251562 -610220 11620 937174 1604509
39833 1604509 1876398 1871571 1618310 1002136 252988 125017 973715 1945683 1957710 1282212
39823 1282212 1058159 1284453 683694 -1089049 -2483201 -2044015 -296790 1171716 1637991
39814 1637991 1444680 1056644 763160 757398 818396 415553 -385084 -761198 -292343 528112
39804 528112 1325014 2320627 3249000 3082701 1707001 578768 629599 802315 -28398
39795 -28398 -1036287 -1010730 -667160 -1311902 -2207031 -1688131 -299495 -173725 -1425367
39786a425367m46702J190293J034101m07909o92961L07378O83470J50630J24717
39777E17650N86303J12109j059314j126826n1016K70624m89553m80459P80297
39768i40185J330424K65323o48199k17553J56432o05928j038224Q5600J181009
39759d31301N27855n78847j10131R93379M80627j066061j078337N58626J277156
39750E72966J58945p18911j4648P29174m509j095636q32725K73588O37554K49381
39740d4821K15313M96196R9039q13419q99853J19280Q22708K03992q60419r99776
39730a661760k56743K79363J53900p7763N5973L01004K18589j91989n68143n38651
39720b286220L7121Q40385J116140L79346q12278j263286n12551O30118J142637
$$ plain form
39786 -1425367 -1872069 -681776 352325 -55584 -748545 -441167 242303 392933 517650
39777 517650 1103953 1216062 156748 -970078 -1021094 -750470 -1240023 -1720482 -940185
39768 -940185 390239 655562 7363 -210190 -53758 -659686 -1697910 -1612310 -431301
39759 -431301 96554 -482293 -592424 400955 881582 -184479 -1262816 -704190 572966
39750 572966 731911 13000 -1648 727526 723017 -372619 -1205344 -931756 -294202 -44821
39740 -44821 170492 666688 765727 -47692 -947545 -828265 -5557 198435 -661984 -1661760
39730 -1661760 -1918503 -1639140 -1485240 -1563003 -1507030 -1206026 -987437 -1179426 -1747569 -2286220
39720 -2286220 -2249099 -1408714 -292574 86772 -725506 -1988792 -2501343 -1871225 -728588
39711g28588R18218N09893K30848J9392j28079j50228j84746l74853n44829m57243
39701h90215k21488q8520p3927j32181l52209n65580k47532N94316R77919K42221
39691g57196o89766m32162P63254J276803M74651m90207m85088J77793N65119
39682D03201L63888j87156p41011p90237j8316R14428Q49545j94327q24582k61836
39672d86403N57423N64584J53918K29376N87805M19102k07736n14021k82324M8686
39662A070410K51774L72405K33681k33459m49076J24280R52100R76303R0723p49771
39652B639370q68051n79180n11596p90462r87856n76844M58640J296051R93278
39643A073350j66123o97860J63661J264133J042170l60543j461335j437771p03056
$$ plain form
39711 -728588 189630 699523 930371 949763 821684 671456 486710 111857 -432972 -890215
39701 -890215 -1111703 -1200223 -1274150 -1406331 -1758540 -2324120 -2571652 -1977336 -999417 -757196
39691 -757196 -1446962 -1879124 -1115870 160933 635584 145377 -339711 -161918 403201
39682 403201 767089 579933 -161078 -951315 -969631 -55203 794342 600015 -224567 -486403
39672 -486403 71020 635604 789522 1018898 1606703 2025805 1818069 1304048 1021724 1070410
39662 1070410 1322184 1694589 1928270 1694811 1245735 1370015 2322115 3298418 3389141 2639370
39652 2639370 1771319 1192139 680543 -109919 -1097775 -1674619 -1215979 80072 1073350
39643 1073350 907227 209367 373028 1637161 2679331 2318788 857453 -580318 -1283374
39634a283374J84906J007444J358349Q06438j93118m95592K68994J107059Q89583
39625C650689k81637j226036r80664J90104J048619P44703j94666o67509n95266
39616A688337p84001j177632o67745Q13340J598406P67992k09669J53586Q09326
39607B991940N106j520725j654443m73759L9783m30684j82669J055165J322539
39598A152253p3359j091305l30416O69778J96083q02252o18292L32246O48247
39589H2983M29578M80586L62574n27335j100262j75220J039048O13578p00871
39580E04659n51547R26536J174934m19605j362970j97487J090949L81174j279512
39571B67131j655740p53812j01675N7016N80998J262631J055050J29812k59904
$$ plain form
39634 -1283374 -1098468 -91024 1267325 2073763 1880645 1385053 1654047 2761106 3650689
39625 3650689 3369052 2143016 1162352 1352456 2401075 3145778 2951112 2283603 1688337
39616 1688337 904336 -273296 -941041 -127701 1470705 2238697 2029028 2182614 2991940
39607 2991940 2997046 1476321 -178122 -651881 -612098 -1042782 -1225451 -170286 1152253
39598 1152253 1078894 -12411 -342827 326951 523034 -279218 -897510 -565264 82983
39589 82983 512561 993147 1355721 828386 -271876 -447096 591952 1205530 504659
39580 504659 -46888 879648 2054582 1634977 272007 74520 1165469 1546643 267131
39571 267131 -1388609 -2142421 -2244096 -2187080 -1606082 -343451 711599 841411 581507
39562E81507J24620L11385j060j05776N5674l00435r69935n79464J017537J901250
39552B035303P80159r54198j282411m50453j11986m53064j66037R88470J596016
39543A981799Q74492j62251m66499m52319q48681j217382p48994J86423M55406
39534c98006j70517p57715n73338R6817O00221P53701P59945O77675L51036j66972
39524A172847m19819p0926M33820K35381o32864r12199K29319J710947J740645
39515C487151K77091r34480q48495l08628l72940p82648q17739n35704k81865
39506a118257Q7705O11966P21967K05323j90076Q227J11196m03318p34580j44782
39496h44629N51059L33611j76206P5328M24915m14992j747416j665445k00152
$$ plain form
39562 581507 706127 1017512 1016452 910676 966350 665915 -304020 -883484 134053 2035303
39552 2035303 2815462 1861264 578853 128400 16414 -436650 -602687 385783 1981799
39543 1981799 2856291 2694040 2227541 1775222 926541 -290841 -1039835 -853412 -398006
39534 -398006 -568523 -1326238 -1899576 -1802759 -1202538 -448837 311108 988783 1339819 1172847
39524 1172847 753028 682102 1115922 1351303 718439 -193760 35559 1746506 3487151
39515 3487151 3764242 2829762 1981267 1672639 1299699 517051 -300688 -836392 -1118257
39506 -1118257 -1030552 -418586 303381 508704 318628 326855 438051 34733 -699847 -844629
39496 -844629 -293570 40041 -136165 -60837 364078 -50914 -1798330 -3463775 -3663927
39487c663927O67407K45785r970O72865J102505N32230Q5501N37808P18021l15190
39477E73035j245460m87442J111037J493956M32073n45265o50935m41193k50948
39468a1142J78705N23437j7950j169275j559847p10150J96545J23951l07602N2062
39458b701266J028329J410571P55414q7899k95510o3694L0222m1340k7276o8054
39448f0503l20974k78698N37584J368963R67642l05391o34380M48358J100098
39439B822699J00363j003389m54366N76025j03421j719587j520464N25025J327175
39430E50060l82072j887444p51758J460852J797091K48657q53706n15935J15837
39421b18418L6740m20915n40290j09947N47902P78001K31205l96508j66115L77543
$$ plain form
39487 -3663927 -2996520 -2750735 -2760705 -2087840 -985335 -453105 -367604 170204 888225 573035
39477 573035 -672425 -1159867 -48830 1445126 1877199 1331934 680999 239806 -11142
39468 -11142 167563 691000 673050 -496225 -2056072 -2766222 -2569677 -2445726 -2753328 -2701266
39458 -2701266 -1672937 -262366 493048 405149 109639 45945 76167 34827 7551 -60503
39448 -60503 -381477 -660175 -122591 1246372 2214014 1908623 1274243 1722601 2822699
39439 2822699 2923062 1919673 1465307 2041332 1937911 218324 -1302140 -777115 550060
39430 550060 167988 -1719456 -2471214 -1010362 786729 1035386 181680 -334255 -218418
39421 -218418 -181678 -602593 -1142883 -1252830 -704928 73073 304278 -92230 -258345 119198
39411A19198k23480j651191j725182Q8803J397127O28927l19461N99898J866709
39402G81348R41812j175010j404744L49473J212282J50200p60472k32442L66375
39393B28822r2482o27518l08509J66252K09108M52947J002692P20479n34712j041097
39383A75982M3549J055658M82875o10068n66999J11995Q09o04473m00753M59550
39373A48125O97252J52371j95515j02473j90469m08413n8409O50893O63012j27665
39363A228709n55487q363O53086M77674k65559p00891n30627p8829L24411N20927
39353A065051M08762L9569l02460l50768j61010q6407l90359q08317o61225K43456
39343a003708R73266M16876j034973j621909m68491J134144J417770L86907n45388
$$ plain form
39411 119198 -104282 -1755473 -3480655 -3391852 -1994725 -1365798 -1685259 -1085361 781348
39402 781348 1723160 548150 -856594 -507121 705161 855361 94889 -137553 228822
39393 228822 136340 -491178 -799687 -633435 -424327 28620 1031312 1751791 1217079 175982
39383 175982 219531 1275189 1758064 1147996 580997 692992 693801 89328 -311425 148125
39373 148125 845377 997748 802233 699760 509291 100878 42469 693362 1356374 1228709
39363 1228709 673222 664859 1317945 1795619 1530060 829169 298542 219713 544124 1065051
39353 1065051 1473813 1513382 1210922 860154 699144 612737 222378 -585939 -1247164 -1003708
39343 -1003708 -30442 386434 -648539 -2270448 -2738939 -1604795 -187025 199882 -345506
39334c45506o14125k82309m3664J87533M47037M90796L81746M69436O12789K50845
39324A554578n28992q48582l31543K60962J75486k78938m22507k86074k29337
39315i34947j6701P41184J480689J128328k05534r96632k67508J000946J129464
39306C059289r1442j316758j499327r43074m22187r2286K84169O10923N73717
39297A63024K49195N8516J50640K48380J61692J19231M15136Q79134R08520J37360
39287C490828r56332j351687o33381L38581L44167o38195j324628p29173O58191
39278h01629J575108J380173M06827n86483q98265k77306O68058Q46360m5699
39269B267144j037340j156316o67575m01510m01252j25145L92509N76759L21118
$$ plain form
39334 -345506 -959631 -1241940 -1285604 -1098071 -651034 -160238 221508 690944 1303733 1554578
39324 1554578 1025586 177004 -154539 106423 281909 2971 -419536 -705610 -934947
39315 -934947 -951648 -210464 1270225 2398553 2193019 1196387 928879 1929825 3059289
39306 3059289 2967847 1651089 151762 -791312 -1213499 -1305785 -1021616 -410693 163024
39297 163024 412219 470735 621375 869755 1031447 1150678 1565814 2444948 3353468 3490828
39287 3490828 2534496 1182809 549428 888009 1232176 593981 -730647 -1459820 -801629
39278 -801629 773479 2153652 2560479 1973996 1075731 798425 1466483 2312843 2267144
39269 2267144 1229804 73488 -594087 -995597 -1396849 -1521994 -1129485 -552726 -231608
39260b31608K6997k28054o24622q23298k81228O40196R16086L42110j84455l4950
39250d82826M28974O78725O37117L01188l04794o48470j89451M98474K91936n92662
39240F18211o92064K87877P53797k25436j227537o41679P71704J090257J04105
39231H39235p16270o11129k40268j91282k61644k50778k26432L2575P36703J238379
39221C49089O38983o75910j243134m71090O42111R88717O08986J87366J33551
39212A158669M44447P76012N34569l75825r77702l71457O41796M15686r50315
39203A295880j491162l84571O50101M0988j141127r81927K00184N69152j17167
39194a359649k82492O49676J307234P02100l02471o36523n91790p57990p15678
$$ plain form
39260 -231608 -204611 -432665 -1057287 -1880585 -2161813 -1521617 -605531 -263421 -447876 -482826
39250 -482826 -53852 624873 1261990 1563178 1258384 609914 420463 918937 1210873 618211
39240 618211 -73853 214024 967821 742385 -485152 -1126831 -355127 735130 839235
39231 839235 122965 -488164 -728432 -919714 -1181358 -1432136 -1658568 -1625993 -889290 349089
39221 349089 988072 312162 -930972 -1402062 -759951 228766 837752 1025118 1158669
39212 1158669 1603116 2379128 2913697 2537872 1560170 1188713 1830509 2246195 1295880
39203 1295880 -195282 -579853 70248 111236 -1029891 -2011818 -1811634 -1242482 -1359649
39194 -1359649 -1642141 -992465 314769 1016869 714398 77875 -513915 -1271905 -1987583
39185a987583O311P10512N79478J37929K87120N39057k00410j444920j467145
39176b839651O2803J404827J176817N9748n61309m39451j60470o539K0996j69461
39166a451690l65800m5349O03227N87257k26316m88505N38770J451569P37080
39157A340243o92406q57175J23056L89778m23367o90241K26310Q45742K00721
39148D62661n47275k88889J22868l76743r86874m56730O12072P39573L7352j63419
39138h45404L25485L94782l02938q38027o58954k81882j03650J52819N20981N25841
39128a110947J73141J02293M15939M31642l9352k66990R7100M04865K48373J67899
39118F23963M19304K41628o37467r39957K90558J666803J112691r01625j788691
$$ plain form
39185 -1987583 -1981272 -1270760 -691282 -553353 -266233 272824 72414 -1372506 -2839651
39176 -2839651 -2776848 -1372021 -195204 -135456 -696765 -1136216 -1296686 -1303225 -1282229 -1451690
39166 -1451690 -1817490 -1862839 -1259612 -672355 -898671 -1387176 -848406 603163 1340243
39157 1340243 647837 -209338 -86282 303496 -119871 -810112 -583802 261940 462661
39148 462661 -84614 -373503 -250635 -627378 -1614252 -2070982 -1458910 -719337 -681985 -845404
39138 -845404 -519919 -125137 -428075 -1266102 -1925056 -2206938 -2310588 -2157769 -1636788 -1110947
39128 -1110947 -937806 -835513 -419574 12068 -27284 -294274 -197174 207691 456064 623963
39118 623963 1043267 1284895 647428 -292529 -1971 1664832 2777523 1875898 87207
39109H7207o15657O13099J59653q98491o92721L86153N47532l56761p35531k578
39099a508095N98233K52421j41854L04538R56107Q34950J52946l51061o17781
39090D80404p97462n19069K71985O55771J26077k79787L63418J023992K92411
39081A617740r67473p23674Q16270J314784J4057j084762m74746O56843O36731
39072A805770j76394m98610k64036j86378k87105k07579j03732j11185J84304
39063A55055P63141P04780k71785r44295m06384M29579M09414j3550M4135J05943
39053I76033n58218j125713m43285P88613J000687K21336l70401o29176j080762
39044a220886j059600L83795K091188J855934j37557j401667q45599O9276J99883
$$ plain form
39109 87207 -528450 84649 244302 -654189 -1346910 -960757 -413225 -769986 -1505517 -1508095
39099 -1508095 -909862 -657441 -799295 -494757 461350 1296300 1449246 1098185 480404
39090 480404 -317058 -836127 -564142 91629 217706 -62081 301337 1325329 1617740
39081 1617740 650267 -73407 742863 2057647 2071704 986942 512196 1169039 1805770
39072 1805770 1629376 1130766 866730 680352 393247 185668 81936 -29249 155055
39063 155055 918196 1622976 1351191 406896 512 430091 839505 825955 870090 976033
39053 976033 417815 -707898 -1151183 -362570 638117 859453 489052 -140124 -1220886
39044 -1220886 -2280486 -1896691 194497 2050431 1912874 511207 -334392 -265116 -65233
39035f5233J96021M58544J28921q95080j209684k96571M31853J31009k6725P87803
39025c59142J331403N05308n95907o11429j89077m62096q02046j25338Q65803
39016d42521Q49716K06331Q4625J40211o03156j474860j092255n09N5284p81143
39006c058277o03201R49077J931782J143671k50413q63634q77774p74466r8939
38997b502174J264042K015871J078505o09435j240006n03329L28007L04682k54382
38988a18219o04593m80338j4764O35220J246219J345802M87119j044314k008275
38979e56143j305710N16121J552648Q35226l88215m66305K96456L54556m62966
38970C75668p02748K14257R12838K17135r51586r51120J43117P25200q289j027791
$$ plain form
39035 -65233 130788 589332 718253 -176827 -1386511 -1683082 -1251229 -1120220 -1146945 -359142
39025 -359142 972261 1477569 881662 270233 81156 -380940 -1182986 -1308324 -442521
39016 -442521 407195 613526 698151 838362 235206 -1239654 -2331909 -2332418 -2277134 -3058277
39006 -3058277 -3661478 -2712401 -780619 363052 112639 -750995 -1628769 -2403235 -2502174
38997 -2502174 -1238132 777739 1856244 1246809 6803 -496526 -168519 136163 -118219
38988 -118219 -722812 -1203150 -1217914 -582694 663525 2009327 2496446 1452132 -556143
38979 -556143 -1861853 -1345732 206916 1042142 653927 187622 484078 838634 375668
38970 375668 -327080 -112823 800015 1017150 65564 -885556 -742439 -17239 -25528 -1053319
38960a053319r41153K61317J337664J327996N08078k15015m58512n09548n01566
38951b44058j59090M21854N14593j34180o08561o4117Q56144Q78973N1559l53046
38941A160071J51695N69176N4563p76087p30888L84417J545370J549502J49790
38932D057609j545089j956805p86141M46087K70899p64065r80755r313R58664
38923c08909J149216R39487N63653k94540j248478j135278J56550J180324R54116
38914A956141J78558k54453n48792r30278p37145K63470R19683L35185o15159
38905E67210o85796j53948J2525j11794L9810J22592m29669j028312p68487j955
38895b437824M17274P49624J596443K205393J428847j01794p30863m07762n13478
$$ plain form
38960 -1053319 -1994472 -1733155 -395491 932505 1440583 1225568 767056 257508 -244058
38951 -244058 -403148 18706 533299 399119 -209442 -273559 582585 1461558 1513117 1160071
38941 1160071 1311766 1880942 1935505 1159418 428530 812947 2358317 3907819 4057609
38932 4057609 2512520 555715 -230426 215661 486560 -277505 -1258260 -1267573 -308909
38923 -308909 840307 1779794 2343447 2048907 800429 -334849 -178299 1002025 1956141
38914 1956141 2134699 1880246 1331454 401176 -335969 -72499 847184 1182369 567210
38905 567210 -118586 -272534 -260009 -371803 -331993 -209401 -639070 -1667382 -2435869 -2437824
38895 -2437824 -2020550 -1270926 325517 2530910 3959757 3857963 3127100 2719338 2205860
38886B205860j193364j064571J93009J109653Q18636K10675M4007k10615q14895
38877A298395q55894O0129P83586M31638j49111J04950P23732O74388M8271l92661
38867B727423m74761l70003L4548N27971K55684r28082j687146r36150M64243
38858c86273R43913M26025L2818J83060K81764m0654m99950p29848m79846L08447
38848C9456R50412L61302j180415j670485m0721J867258J632877l10262j511533
38839A37889j142081n56965m52524P1744J208679J535063L71319q37980o74569
38830c39425K28480N14964J71590j7816l1241k72298m51062j16959K46844q8739
38820a55662p20685o42913R0970M37561N9218k01662K38646P90680O76915J09106
$$ plain form
38886 2205860 1012496 -52075 140934 1250587 2069223 2279898 2323905 2113290 1298395
38877 1298395 442501 502630 1286216 1717854 1568743 1673693 2397425 3071813 3120084 2727423
38867 2727423 2252662 1882659 1917207 2445178 2700862 1772780 85634 -850516 -386273
38858 -386273 557640 983665 1016483 1199543 1481307 1440653 940703 210855 -268991 39456
38848 39456 989868 1351170 170755 -1499730 -1540451 326807 1959684 1649422 137889
38839 137889 -1004192 -1561157 -2013681 -1941937 -733258 801805 1173124 335144 -339425
38830 -339425 -110945 404019 575609 557793 526552 254254 -196808 -313767 -66923 -155662
38820 -155662 -876347 -1519260 -1428290 -990729 -931511 -1133173 -894527 -103847 573068 682174
38810F82174j28167R9968J04091n43716j194124p81939O96626J801292J187097
38801A923302o42979j758641j099003L17389Q64517L63593l6155L39349R00533
38792A171905Q63952L25998j04146k30964l30209n11271n22361k14965J67930
38783F15869L18867K57044K20008K96178L24689R8586l99571q46463o81146K85391
38773D89452J252357R89752n42101j720032j175608L04182Q63740K23948j81453
38764E04237L01247O18812P2391m25601j25104J26708m56930r47878l29447M83603
38754a77962J64506n32625k488J241782J279776R0643m42627J54837L06039n41282
38744A540599q95592j36345J63357q72898j604934o17720P89865P82301p5698
$$ plain form
38810 682174 554007 653975 758066 214350 -979774 -1761713 -1065087 736205 1923302
38801 1923302 1280323 -478318 -1577321 -1259932 -395415 -31822 -67977 271372 1171905
38792 1171905 2035857 2361855 2257709 2026745 1696536 1185265 662904 447939 615869
38783 615869 934736 1191780 1411788 1707966 2032655 2131241 1731670 885207 204061 489452
38773 489452 1741809 2731561 2189460 469428 -706180 -401998 461742 685690 504237
38764 504237 805484 1424296 1496687 1071086 945982 1072690 615760 -332118 -661565 -177962
38754 -177962 -13456 -546081 -548569 693213 1972989 2063632 1621005 1775842 2081881 1540599
38744 1540599 645007 508662 672019 -200879 -1805813 -2423533 -1633668 -851367 -927065
38735i27065j46014M05004K62191m72873n47032J64935N80037K93374p9550j71360
38725f38353j00508J97316O68731P06689J47752q8902M11631M20516q93574j969140
38715a137842j002564Q68310J031307n08074j223731j73225P86567L31890m21096
38706a448458k42969K77115K88379K40064O18213O97275j71167j236932j412345
38697b390825o78478L35172J158491J316579N37613l95768l18362M16754L14282
38688B95458n91385n03729R15797J457486q8399j606128r04107P28133P24439
38679D27565n79564q54500J56293N61459p0694j07101R17150J346307M19814l48221
38669A868508Q7269M79845l33453j209229o55620N03996M76144m86140n96574
$$ plain form
38735 -927065 -1073079 -668075 -405884 -878757 -1425789 -1260854 -680817 -387443 -466993 -638353
38725 -638353 -738861 -541545 127186 833875 981627 892725 1304356 1724872 831298 -1137842
38715 -1137842 -2140406 -1272096 -240789 -748863 -1972594 -2145819 -1359252 -1027362 -1448458
38706 -1448458 -1691427 -1414312 -1125933 -885869 -267656 429619 258452 -978480 -2390825
38697 -2390825 -3069303 -2734131 -1575640 -259061 278552 -117216 -435578 -18824 295458
38688 295458 -295927 -799656 116141 1573627 1485228 -120900 -1025007 -296874 427565
38679 427565 -151999 -1006499 -850206 -288747 -359441 -466542 450608 1796915 2216729 1868508
38669 1868508 1955777 2435622 2102169 892940 237320 741316 1217460 731320 134746
38660A34746L59697O55880m09532j220774m05869R15649Q11386n42342j213489
38651i14648m00156O47535P41552K99348J77439K51623J09158J26862O77298J056552
38641B772563N48853p4086L45118J262347J310756R88637K133270M344393M479892
38632A8111743R97166l341722m888861l598895k110229j660971j276971l62137
38624A869123K96237J76227j86630l08136k76211j02007K16162J17090p52770
38615A049085j453242q79066L03811N03552k17258l05512N21220P93998j6532
38606C00056m81739K65191R73175M21273n70658o49867n2975K20227K05030M67810
38596A097523P10587L32785k78566l38989r280J1395k87151m51351m48441l61963
$$ plain form
38660 134746 494443 1150323 740791 -479983 -885852 29797 841183 298841 -914648
38651 -914648 -1314804 -667269 74283 373631 551070 802693 911851 1038713 1716011 2772563
38641 2772563 3321416 3247330 3592448 4854795 6165551 7154188 9287458 13631851 18111743
38632 18111743 19108909 15767187 10878326 7279431 5169202 3508231 2231260 1869123
38624 1869123 2165360 2341587 2154957 1846821 1570610 1468603 1684765 1801855 1049085
38615 1049085 -404157 -1283223 -979412 -475860 -693118 -998630 -477410 316588 300056
38606 300056 -181683 83508 1056683 1477956 907298 257431 204456 424683 629713 1097523
38596 1097523 1808110 2140895 1862329 1523340 1514060 1525455 1238304 786953 338512 -23451
38586b3451R2199P62587O75764l72980q90858J30941J183308L94150j155468q24758
38576b8566J189969J765142l14949k294030j583302M73526R88860j11257n64362
38567d78969L57544J005239L19800n74157l56568N23778P99439K88164j34878
38558A749392O620K16933j06644p63699r50770k89585N57951N75816k85776r04518
38548a94280m01161O41696R11643Q1294q54509r31446k85037K72393K34038k47562
38538g72931o01409k77461O78322J384558R48839k76329q44748k5407J104476
38529A317910J029617j50653r27973n37430J14648Q922m31631j42418P67464J041154
38519B089610J10749j032035j184301m55159J47674J79607M3926K695k29141p00705
$$ plain form
38586 -23451 68748 831335 1507099 1134119 243261 374202 1557510 1951660 796192 -28566
38576 -28566 1161403 2926545 2611596 317566 -1265736 -792210 196650 85393 -478969
38567 -478969 -121425 883814 1203614 629457 272889 796667 1596106 1884270 1749392
38558 1749392 1756012 1972945 1866301 1102602 151832 -137753 420198 996014 710238 -194280
38548 -194280 -595441 46255 957898 1039192 184683 -746763 -1031800 -759407 -525369 -772931
38538 -772931 -1374340 -1651801 -973479 411079 1359918 1083589 238841 213434 1317910
38529 1317910 2347527 2196874 1268901 731471 846119 855041 423410 280992 1048456 2089610
38519 2089610 2200359 1168324 -15977 -471136 -323462 -143855 -99929 -97234 -326375 -1027080
38509a027080p94534r2568Q16338J019539N03563L6930m8081k02966o58662q33994
38499a281515k13906P20176J064615P06298L06196J94561P6m87654p63038l30355
38489h4546M50913P71753M35960J5453l0898Q7938j7235k66423k96515j13147
38479I53253j32207m99267p28594l03363N48698J046201Q10400K66683j0747K3093
38469A974150R0928R9347M6329k50509p72064q67628L6921J290768J449270J93987
38459C291499r95015p21873M34152Q03976o273p33644m27050L14045M72763P9086
38449B511666j52225n8983r4189m05453o19544n45563m54205n06966m15393P4959
38439f65896O97874R27302N44159j98524p80718p04882J13949J066269J266771
$$ plain form
38509 -1027080 -1821614 -1914182 -1097844 -78305 425258 462188 414107 211141 -447521 -1281515
38499 -1281515 -1495421 -775245 289370 995668 1301864 1496425 1496501 1008847 245809 -84546
38489 -84546 366367 1138120 1574080 1589533 1558635 1646573 1629338 1362915 1066400 953253
38479 953253 821046 321779 -406815 -710178 -161480 884721 1695121 1961804 1951057 1974150
38469 1974150 2065078 2164425 2210754 1960245 1188181 320553 357474 1648242 3097512 3291499
38459 3291499 2296484 1574611 2008763 2812739 2806466 2072822 1645772 1959817 2432580 2511666
38449 2511666 2359441 2300458 2206269 1800816 1181272 635709 181504 -325462 -740855 -665896
38439 -665896 31978 959280 1503439 1304915 524197 -180685 -66736 999533 2266304
38430B266304N35054k93916l45022K69587P66251P36810L44039k72117j016436
38421B990554j331057o08575O30228R25949j85586j285361r33991L03095P62432
38412A267688J02237m83516l02914k3963k52623n28398k95295J40808K84433K72228
38402A80685L74658L84963J43194O450J57135J01504m69453r80598q45128l53361
38392a299951N2477N81265J247119J135908j94811j377371r02176M24571N31704
38383A98735o70707j164971j15715Q80490N34633j82008R086N26764K20991n05178
38373b67880n18963M2627K38755J03875L33881O75145K71507o14322q19039j90924
38363g45338K20600J011o8350M21082P65842M64903M1429k4624o7960l07913k22997
$$ plain form
38430 2266304 2801358 2507442 2162420 2432007 3198258 3935068 4279107 4006990 2990554
38421 2990554 1659497 1050922 1681150 2607099 2421513 1136152 202161 505256 1267688
38412 1267688 1369925 886409 583495 559532 306909 -221489 -516784 -375976 -91543 180685
38402 180685 555343 940306 1083500 1089950 1247085 1348589 879136 -101462 -946590 -1299951
38392 -1299951 -1247474 -666209 580910 1716818 1522007 144636 -757540 -332969 198735
38383 198735 -471972 -1636943 -1752658 -872168 -337535 -519543 -510457 16307 237298 -267880
38373 -267880 -786843 -744216 -505461 -401586 -67705 607440 878947 264625 -554414 -745338
38363 -745338 -524738 -523727 -592077 -170995 594847 1059750 1101179 1076555 1008595 700682 477685
38352D77685L73571O26809n0541p95995n03155M21290O83384R3743k95200N9814
38342A091405M81701K83646l08442p50810q63115n83460J44659Q07951M76321
38333G79856q06717j514142m58691J358172J865139P18831l20556o1893M54665
38324B014664j68765j302570j225193J07076R22499L84444j87713L99971J141505
38315B085918M10392j225187j491379K92203J977692J363609q15843j733132J2007
38306H76280K674933L423315J531458j027140k033898j386289o02752n22271m87136
38297B446500J30250P08962L86064n06064r65915q15600o47081n72727j71864
38288g475L62360K17299o45186j166406o91922J41755N16012N37017O27687O38250
$$ plain form
38352 477685 851256 1478065 1427524 631529 128374 549664 1233048 1326791 1031591 1091405
38342 1091405 1573106 1856752 1548310 797500 -65615 -649075 -504416 303535 779856
38333 779856 -26861 -1541003 -1999694 -641522 1223617 1942448 1621892 1559999 2014664
38324 2014664 1845899 543329 -681864 -574788 347711 732155 544442 944413 2085918
38315 2085918 2496310 1271123 -220256 71947 2049639 3413248 2597405 864273 876280
38306 876280 3551213 6974528 8505986 7478846 5444948 4058659 3455907 2933636 2446500
38297 2446500 2576750 3285712 3671776 3165712 2199797 1384197 737116 164389 -7475
38288 -7475 354885 572184 -73002 -1239408 -1931330 -1789575 -1273563 -736546 -108859 529391
38278E29391L23301N3169K39167N27597L26587k43969n99774n12394r1297N62838
38268A114616J046501O15760o92188j513388q00637M91785O10228m70090j128216
38259g25629n61624L55952P75978Q48940O55244k00591j278180j190953K33369
38250a087494J183897M78976m79560O0056J267010J046128n17398j299158m76188
38241A76269N20837N83261L01309K42827q1987o82956m50759P91548J365525K64011
38231C029885j026992q67197o9556j73096n29475L65946J648163J161194o24750
38222B914122r84402M88944R96618p56196k232263j273662L28020N4836j004913
38213a468896k84536J524653J555242k20576q47716O62447J854790J094871q300
$$ plain form
38278 529391 852692 905861 1145028 1672625 1999212 1755243 1155469 643075 551778 1114616
38268 1114616 2161117 2776877 2084689 571301 -229336 262449 872677 402587 -725629
38259 -725629 -1287253 -931301 -155323 693617 1348861 1148270 -129910 -1320863 -1087494
38250 -1087494 96403 575379 95819 155875 1422885 2469013 1951615 652457 176269
38241 176269 697106 1280367 1581676 1824503 1742516 1059560 608801 1400349 2765874 3029885
38231 3029885 2002893 1135696 1066140 893044 363569 729515 2377678 3538872 2914122
38222 2914122 1929720 2418664 3415282 2659086 426823 -846839 -518819 -463983 -1468896
38213 -1468896 -1753432 -228779 1326463 1105887 258171 920618 2775408 3870279 3861979
38204C861979J67689N37618k96420j354593j172686m59251n26705o21059O37318
38195G73890K236811J905665k07966j562884r44001J82983L66529N1972N4460
38186B857459O314o06562j177046q48348J69374J014402J285052J066166M09147
38177D175958n55690j340862j459026r11505j11640M89268O71676N98492O14765
38168B171436O60752K27623o87644j119588l78592P22636Q72415J41930k60760
38159B350208R0276L92637P9557m52844o90467n24901Q5499R17427J061264m5547
38149C263109j268869r30376O71353J516053Q19311k0528J44842O25059M45883
38140E265837j29015m59975n22065l27045L21220R90587R58020O49237J022162
$$ plain form
38204 3861979 4029668 4567286 4270866 2916273 1743587 1284336 757631 136572 773890
38195 773890 3010701 4916366 4708400 3145516 2201515 2384498 2751027 2802999 2857459
38186 2857459 2863773 2257211 1080165 231817 401191 1415593 2700645 3766811 4175958
38177 4175958 3620268 2279406 820380 -91125 -202765 286503 958179 1556671 2171436
38168 2171436 2832188 3059811 2372167 1252579 873987 1596623 2469038 2610968 2350208
38159 2350208 2440484 2833121 2912678 2459834 1769367 1244466 1329965 2247392 3308656 3263109
38149 3263109 1994240 1063864 1735217 3251270 4070581 4050053 4194895 4819954 5265837
38140 5265837 5136822 4676847 4154782 3827737 4148957 5139544 6097564 6746801 7768963
38131G768963J438051M55998j056300n64045J739552K611941J060052J74335J780420
38122A5408967L347313K944093L025250N619503P997040P775175Q215205J2839319
38114F7171865J9029459K4050556L2750692M8516496N8798958M3740463L284566
38107B97343055l6247407n0035188m0507610k7610112k1978425j8889226j3557215
38100H8517872q985998p846617p155356m489399k390633l214745m919281n016990
38092D4498853m441312m719072m888652l819110k631704k526922k729717k458326
38084A6284038k443784k806907k031150J14838J179430l85994k539668k704462
38076D666341j413188o30208l72409M21428J162312N20536q08123q67230L64160
$$ plain form
38131 7768963 9207014 9663012 8606712 8042667 9782219 12394160 13454212 13628547 15408967
38122 15408967 18756280 21700373 24725623 30345126 38342166 46117341 54332546 67171865
38114 67171865 86201324 110251880 143002572 191519068 250318026 294058489 297343055
38107 297343055 261095648 211060460 170552850 142942738 120964313 102075087 88517872
38100 88517872 79531874 71685257 64529901 60040502 57649869 54435124 49515843 44498853
38092 44498853 40057541 35338469 30449817 26630707 23999003 21472081 18742364 16284038
38084 16284038 13840254 11033347 9002197 9117035 10296465 9910471 7370803 4666341
38076 4666341 3253153 2622945 2250536 2671964 3834276 4354812 3546689 2679459 3043619
38067C043619Q60224k79473j491679j072698N06899J295977K86803j357492j596333
38058A95847l1510J411706J021038j97097q0353J099627R42087r51929j902201
38049A507215l90694J251871M20949j624209j758895K60994J753107J144514m16315
38040B148537j300754j157979l60845O16840J116302Q24223L33272K34740J41870
38031B596206l60302o02697O97N45892n037q86537p51513n1021j25241n66845
38021b06398J16792J514487J562333n3347j244599p80974J42204L15931K45895
38012A612324M84224L32699n25944r16601r9580P11185K06738r17345j173808
38003b86108n31169p496J16980K65519L87797J41499j81177l2522M22386O16384
$$ plain form
38067 3043619 3903843 3624370 2132691 1059993 1566892 2862869 3149672 1792180 195847
38058 195847 164337 1576043 2597081 2399984 2319631 3419258 4361345 3409416 1507215
38049 1507215 1116521 2368392 2789341 1165132 -593763 -332769 1420338 2564852 2148537
38040 2148537 847783 -310196 -671041 -54201 1062101 1886324 2219596 2454336 2596206
38031 2596206 2235904 1633207 1633904 2179796 2174759 1288222 536709 485688 360447 -206398
38021 -206398 -89606 1424881 2987214 2933867 1689268 908294 1050498 1366429 1612324
38012 1612324 2096548 2429247 1903303 986702 887122 1598307 1805045 887700 -286108
38003 -286108 -817277 -824773 -707793 -442274 -54477 87022 -94155 -126677 295709 912093
37993I12093M73008K24929j55674n83762n00653K71353Q67236M62983m64311q49619
37983F57583n66030l16940l65312l13749L1952L84211M58606J67800m34886r17304
37973a214069n86726N63885J458674J139464k1405r16357j067424p59652k98007
37964a701617J45920L55858L91657O29347R26376M84277p08263j230914j88136
37955h95495J048084O00467r74584j327542K22496J731412J486278J35045p26358
37946A299803o89655l48409m1985K10610J85482k64175p74621q96382o14999j18663
37936b052994M58439P70900L77218m84744q71011l33603M57234P53790P35981
37927a88790R04568J109411Q94236L10147l20727r80083j555256j389978j91743
$$ plain form
37993 912093 1385101 1610030 1454356 870594 369941 641294 1508530 1971513 1507202 657583
37983 657583 91553 -225387 -590699 -904448 -872496 -488285 -29679 138121 -296765 -1214069
37973 -1214069 -1800795 -1236910 221764 1361228 1339823 423466 -643958 -1403610 -1701617
37964 -1701617 -1555697 -1199839 -808182 -178835 747541 1231818 523555 -707359 -895495
37955 -895495 152589 753056 -221528 -1549070 -1326574 404838 1891116 2026161 1299803
37946 1299803 610148 261739 219754 430364 615846 351671 -422950 -1319332 -1934331 -2052994
37936 -2052994 -1594555 -823655 -446437 -931181 -1802192 -2135795 -1678561 -924771 -188790
37927 -188790 715778 1825189 2719425 3029572 2708845 1728762 173506 -1216472 -1408215
37918a408215R93932Q57811k47892o73854R9810O90812l233j070218j025031r1784
37908a877862K88854j77017k59291O48720J412584Q79240l67272r79292q20148
37899a251484p34684p72008j17419J091593J387272J24486j178133p55351Q93064
37890a312664J673756P65429m72873n61180K86062Q66236O42168J2324n57325
37881A341933r36445j015800o11351J70129Q09463Q38631L23475k55192n37712
37872A27131n18207k54484L02583R33312R70794Q7431r14971r01411n6226K09713
37862a4335o30757j251784m14900J039616J338262L36980m61556k69361P4233
37853b53602j94522m93020p953Q58410J005102J45589q64399j048258k86855O21751
$$ plain form
37918 -1408215 -414283 443528 195636 -478218 -378408 312404 309171 -761047 -1786078 -1877862
37908 -1877862 -1589008 -1766025 -2025316 -1376596 35988 915228 547956 -431336 -1251484
37899 -1251484 -1986168 -2758176 -2875595 -1784002 -396730 -272244 -1450377 -2205728 -1312664
37890 -1312664 361092 1126521 653648 92468 378530 1244766 1886934 1899258 1341933
37881 1341933 405488 -610312 -1221663 -1051534 -242071 596560 920035 664843 127131
37872 127131 -391076 -645560 -342977 590335 1561129 1648560 733589 -167822 -224048 -14335
37862 -14335 -645092 -1896876 -2311776 -1272160 66102 403082 -58474 -327835 -253602
37853 -253602 -448124 -941144 -949097 -90687 914415 1060004 195605 -852653 -1139508 -517757
37843e17757P45995j2261q01641q62695l99650l1530J83332M77234N42619l9730
37833g16084p63738p05311j2452K84110j0844k2553N10718P20190K10456k12629
37823g18137n0907J0093m62911o70921m6763N31962J75398m55545l08305K79687
37813a716349L25892o8575j41113N4861J109o5497K86830M90239j35336q31498
37803a799437l98055O60562P63917j87579p33181l04968J38981J36133M55527
37794a268100J314227J647619Q89761o7178m45106o60742j049784r49603j2591
37785f01497Q41107Q08739M33609M57325N03471n2264q51959j228895j239822
37776i30186j073919l90078P21985J134506K65607o58093k88580P34588Q90923
$$ plain form
37843 -517757 228238 215977 -585664 -1448359 -1848009 -1879539 -1696207 -1218973 -676354 -716084
37833 -716084 -1479822 -2185133 -2197585 -1913475 -1924319 -1946872 -1436154 -715964 -505508 -718137
37823 -718137 -769044 -758951 -1221862 -1892783 -1939546 -1407584 -1232186 -1687731 -1996036 -1716349
37813 -1716349 -1390457 -1459032 -1600145 -1545284 -1544175 -1609672 -1322842 -832603 -967939 -1799437
37803 -1799437 -2197492 -1536930 -773013 -960592 -1693773 -1998741 -1859760 -1723627 -1268100
37794 -1268100 46127 1693746 2583507 2516329 2071223 1410481 360697 -588906 -601497
37785 -601497 239610 1048349 1481958 1939283 2442754 2390490 1538531 309636 -930186
37776 -930186 -2004105 -2394183 -1672198 -537692 -272085 -930178 -1218758 -484170 406753
37767D06753K76632K26330Q37943P79027l61759j288869j013484k17589J5187
37758c39829k79111l68041J2282N01081O29190J82960n14542o56367J14488R05143
37748A87254N56246n65075q19660L59717J475525R76953o07831j443992p77105
37739f57968L88755Q26608M27709j67708n99968r30109j016957m32503P22340
37730a439801J426839Q34959m26614q91947k37637L74867K43435J76544Q20075
37721H80720J205376L21660q69446p60594J85718R2678j154198j621203n50164
37712b269453L86451o7919p45015k49789O28375M65743j98254J61754J315130
37703e72977J572461M85955o44315r29350q23166p29021l19055L21777L44762
$$ plain form
37767 406753 683385 909715 1747658 2526685 2164926 876057 -137427 -355016 -339829
37758 -339829 -618940 -986981 -974699 -473618 155572 338532 -176010 -832377 -717889 187254
37748 187254 743500 178425 -641235 -281518 1194007 2170960 1563129 119137 -657968
37739 -657968 -269213 557395 985104 817396 217428 -712681 -1729638 -2162141 -1439801
37730 -1439801 -12962 821997 395383 -496564 -734201 -359334 -115899 60645 880720
37721 880720 2086096 2407756 1538310 777716 963434 1056112 -98086 -1719289 -2269453
37712 -2269453 -1883002 -1950921 -2695936 -2945725 -2317350 -1851607 -2049861 -1888107 -572977
37703 -572977 999484 1485439 841124 -88226 -911392 -1640413 -1959468 -1637691 -1292929
37694a292929m06808q12324j33191P32042N40839m72536j003345m76353M23388
37685b901217Q53811P38617N34255N26723N18813J25189o09013r88778l94775
37676a596375P65798J301868O22365n52183j130909q93555m15276j05266J41235
37667a862298M27762N09397J54108l89950n51220j00753N04726O61558M33385
37658b13285M23585P30904O38873j89370q37099l38908O54085O02322o00193j365115
37648d94201p58308K58659N61858M82807O78472O19137l51533j331571r41287
37639a275967L56291P68793q1622o72703p8960P31914O71599R2599k24770l46541
37629e9367n12395l15304M20359R13367O31729K91998N04294L89764r64755k442831
$$ plain form
37694 -1292929 -1699737 -2512061 -2645252 -1913210 -1372371 -1844907 -2848252 -3324605 -2901217
37685 -2901217 -2047406 -1308789 -774534 -247811 271002 396191 -212822 -1201600 -1596375
37676 -1596375 -830577 471291 1093656 541473 -589436 -1482991 -1898267 -2003533 -1862298
37667 -1862298 -1434536 -925139 -771031 -1160981 -1712201 -1812954 -1308228 -646670 -213285
37658 -213285 210300 941204 1580077 1390707 553608 214700 868785 1471107 870914 -494201
37648 -494201 -1252509 -993850 -431992 50815 729287 1348424 996891 -334680 -1275967
37639 -1275967 -919676 -150883 -232505 -905208 -984168 -252254 419345 511944 287174 -59367
37629 -59367 -571762 -887066 -466707 446660 1078389 1370387 1874681 2264445 1299690 -1143141
37619a143141k096995r6893J359014J133863L72513K92736N23822L87233K55195
37610I87347N46410O00343k04725j113048j036227k76625N0227j80927j85824
37601h13049J48724J38252k69499k84063K58399M68859n3412l92106J91159Q54276
37591B47540L36299r90877j412263j99597J349637J540936K74702j040990j163490
37582a058103j57188R17849J066651K05268p58424p69849K19200J112209R67412
37573A745025J63667k38650m9898l8271m60770n63857P332L69368j41255n76266
37563B16425K53011J580954J486042j77711j356945p65106L32268K24000p04586
37554A088352q61093K4903P61513O66474K46849k0459k81281m92351j90436M94515
$$ plain form
37619 -1143141 -3240136 -3337029 -1978015 -844152 -471639 -178903 344919 732152 987347
37610 987347 1533757 2134100 1929375 816327 -219900 -496525 -446298 -627225 -813049
37601 -813049 -664325 -526073 -795572 -1079635 -821236 -352377 -405789 -797895 -606736 247540
37591 247540 583839 -407038 -1819301 -2018898 -669261 871675 1146377 105387 -1058103
37582 -1058103 -1215291 -297442 769209 974477 216053 -553796 -334596 777613 1745025
37573 1745025 1908692 1670042 1620144 1581873 1121103 557246 564578 933946 792691 216425
37563 216425 469436 2050390 3536432 3358721 2001776 1236670 1568938 1792938 1088352
37554 1088352 227259 252162 1013675 1680149 1926998 1906539 1625258 1132907 942471 1436986
37544A436986N74325m00781j382375j049480L55551J209874N37339q04007j266872
37535g89440n17722L45691L77597q0990j63781K07581M34976L23179K11511J56970
37525E05572q7540k64351J59417P58816L70138r57153j514637l12891J279186
37516f3443J439022M09399k90825l13039m51776p26749l67659M17309N06176j18085
37506D40330j75979O51712R83071n976j110469r09713J54608O56300K58064k29113
37496G12835k54656N3134M88015Q74412Q20385J24882o99095q71334k16761P28118
37486A759935J234949P94885n33767j865380k065763j011199J35367K72167m27818
37477a706624r67410p11628K16344J218425J535679Q03605l22887o46298P7653
$$ plain form
37544 1436986 2011311 1610530 228155 -821325 -465774 744100 1281439 477432 -789440
37535 -789440 -1307162 -961471 -583874 -664864 -828645 -621064 -186088 137091 348602 505572
37525 505572 418032 153681 313098 1071914 1442052 484899 -1029738 -1342629 -63443
37516 -63443 1375579 1784978 1494153 1181114 729338 2589 -365070 52239 558415 440330
37506 440330 264351 916063 1899134 1893158 782689 -127024 27584 683884 941948 712835
37496 712835 458179 511313 999328 1873740 2694125 2819007 2119912 1248578 1031817 1759935
37486 1759935 2994884 3789769 3256002 1390622 -675141 -1686340 -1550973 -1278806 -1706624
37477 -1706624 -2674034 -3385662 -3169318 -1950893 -415214 388391 65504 -580794 -503141
37468e03141P37390M29837k65047k62419L65896N96065L2437n76817m29094L23813
37458D48920Q06921M04488n53888j098741p46404j22041l5988k38487O9186O61116
37448d04918M62830m93133p04466N12067J668628J115548n90432j535317r60766
37439i29959K45814J020821R47063O3944j035279j290369l97277M54862J24845
37430g95535o67262l23606J155315K078056J431223L5413q49727r24983n56622
37421E82272o8096K69108K32942n0509k56933l23518l00183M031N65675O90999
37411A345788q2781r33869p10493K18359L35312o96326j382845n37722J019438
37402a425139J576322O25275p75761j317184o79457K98329N23599j10891n78665
$$ plain form
37468 -503141 234249 664086 399039 136620 502516 1098581 1131018 554201 125107 448920
37458 448920 1255841 1660329 1106441 7700 -738704 -860745 -896733 -1135220 -1066034 -404918
37448 -404918 57912 -435221 -1139687 -627620 1041008 2156556 1566124 30807 -929959
37439 -929959 -684145 336676 1283739 1347683 312404 -977965 -1375242 -920380 -795535
37430 -795535 -1462797 -1786403 -631088 1446968 2878191 2913604 2063877 1138894 582272
37421 582272 514176 783284 1016226 965717 708784 385266 85083 89114 654789 1345788
37411 1345788 1263007 329138 -381355 -162996 172316 -524010 -1906855 -2444577 -1425139
37402 -1425139 151183 776458 697 -1316487 -1995944 -1697615 -1174016 -1284907 -1863572
37393a863572j23329O52660P52438L24027K52744N95483O20593K31304M7981N9855
37383A550184m48137j398731j675781p95762L33312P74709O30095L49805N6586
37374f23720l6959L53837P36832K06973q80195r55826L64212J358862O72262o31064
37364E65214p59389J80595P42558M93363J93441J09417k36906p56063o95531j0935
37354a74236L88335M3965m18403m08842k44351m15692o41109k58490P16538J421010
37344H725J069224j44150j157406j089432j40283O66750O16800j1580m01106j20952
37334g03410M66707O33546J71258j90911L23303J155206P88026r38897j975431
37325b70603p46253J249239J344414l62485j281676m76496J46277n32746q37988
$$ plain form
37393 -1863572 -1986901 -1334241 -581803 -257776 -5032 590451 1211044 1442348 1490329 1550184
37383 1550184 1102047 -296684 -1972465 -2768227 -2434915 -1660206 -1030111 -680306 -623720
37374 -623720 -660679 -306842 429990 636963 -243232 -1199058 -834846 524016 1196278 565214
37364 565214 -194175 -13580 728978 1222341 1415782 1525199 1288293 532230 -163301 -174236
37354 -174236 214099 258064 -160339 -569181 -813532 -1229224 -1870333 -2128823 -1412285 8725
37344 8725 1077949 933799 -223607 -1313039 -1453322 -786572 -169772 -181352 -582458 -703410
37334 -703410 -236703 396843 568101 377190 700493 1855699 2643725 1704828 -270603
37325 -270603 -1016856 232383 1576797 1214312 -67364 -543860 -397583 -930329 -1768317
37316a768317N15075J749893Q44512r14690r04197O18618J163830J41228o18412
37307H27540k88953o9564m42964k06024R24182J278377O6694r68341l18949P25002
37297A527000J88313j299956j475054N5777J380417J183886K22954l36528m81740
37288I65069o64122p16378k59908M42922P32408L69418k88935p02808n13193J90886
37278d44641P31997L50444p79140j377328m66296J186003J690248K91131j562744
37269c80326j843726l10292J300564J367483J22148q95712p23410Q8409L84098
37260h90764j15318n86477l62009R2326j6141l63762J22228J323118J615422K76390
37250A095013r83722l04265J326529J254658q46729k267318j104881J069582J547177
$$ plain form
37316 -1768317 -1253242 496651 1341163 426473 -477724 140894 1304724 1445952 827540
37307 827540 538587 469023 26059 -179965 744217 2022594 2089288 1120947 801998 1527000
37297 1527000 1715313 415357 -1059697 -1003920 376497 1560383 1783337 1446809 965069
37288 965069 300947 -415431 -675339 -232417 499991 869409 580474 -122334 -635527 -444641
37278 -444641 287356 637800 -141340 -1518668 -1984964 -798961 891287 1182418 -380326
37269 -380326 -2224052 -2534344 -1233780 133703 255851 -639861 -1363271 -1274862 -890764
37260 -890764 -1006082 -1592559 -1954568 -1862242 -1878383 -2242145 -2119917 -796799 818623 1095013
37250 1095013 111291 -192974 1133555 2388213 1541484 -725834 -1830715 -761133 786044
37241G86044P9764j302623j231082k94261K95093J31181l43407n02666j46779
37232b528736K92396L19163J47868L46420P10354M32470l98331o33198J11676
37223a199918O98035K66627m50799n74834n71395j034716j115489K33178K175969
37214a573342K787220J561214k07330j198370j043355j6361J019764Q70624n25497
37205A674567j451867n53230J040626J263642J33978n83404k73899j6595l52151
37196H81667n26710j77058L5823j88698l50278l42733n77480p69282j95779O97334
37186a513194O64464j71879l46891M41391P86006M6672n83024k28224L16787K90458
37176b97434K42166N83380N39533k85621q09784j71893P74537Q40322J80589m61072
$$ plain form
37241 786044 865808 -436815 -1667897 -1962158 -1667065 -1535884 -1879291 -2381957 -2528736
37232 -2528736 -2236340 -1917177 -1769309 -1422889 -712535 -280065 -678396 -1311594 -1199918
37223 -1199918 -501883 -235256 -686055 -1260889 -1832284 -2867000 -3982489 -3749311 -1573342
37214 -1573342 1213878 2775092 2567762 1369392 326037 309676 1329440 2200064 1674567
37205 1674567 222700 -330530 710096 1973738 2107716 1524312 1250413 1233818 881667
37196 881667 354957 177899 213722 25024 -325254 -667987 -1245467 -2014749 -2210528 -1513194
37186 -1513194 -848730 -1020609 -1367500 -926109 -140103 -93431 -676455 -904679 -587892 -297434
37176 -297434 -55268 528112 1067645 782024 -27760 -199653 574884 1415206 1595795 1134723
37166A134723r64588j244790p19042N07666J124107M12693n71185o75114k87250
37157a282780k16265k23957J35738M62821M66924O69578J029130M42500j049724
37148D33965j379239M45861K158923J404207n27777q08128L82814N12061q17165
37139A805522j341064j43366R23206M72172m26620m63606r0525j82534m42939
37130A10246k55424J70422L83935L83666J83024k84789n48272n6220N89098K29596
37120I05282q49712j086259j07154O61691L56812r3300J58224M72349J77972j18057
37110D77848J73067L78839j27179n60140j1812Q59144P95076j27130q20995q72206
37100A64512o74814l52580K53325P87473O50494j9825m53417k53412K88032O77169
$$ plain form
37166 1134723 170135 -1074655 -1793697 -1286031 -161924 250769 -320416 -995530 -1282780
37157 -1282780 -1499045 -1723002 -1587264 -1124443 -657519 12059 1041189 1483689 433965
37148 433965 -945274 -499413 1659510 3063717 2535940 1727812 2110626 2622687 1805522
37139 1805522 464458 321092 1244298 1716470 1289850 826244 735719 553185 110246
37130 110246 -145178 25244 409179 792845 975869 691080 142808 86588 675686 905282
37120 905282 55570 -1030689 -1137843 -476152 -119340 -212640 -54416 417933 595905 477848
37110 477848 650915 1029754 902575 342435 330623 1189767 1984843 1857713 1036718 164512
37100 164512 -510302 -862882 -609557 177916 828410 808585 355168 101756 389788 1066957
37090A066957N48917j57363r18532r62822k88672K23643J19644J322K92414L38277
37080B63785l60212r21471l12183Q44436J044203J19496o70621o05104k21505
37071h19176l7170J56967M61436M73945J51679J17685O21497R71819N15402m22364
37061B191720j034441r82211m71373J65529N91592N45144J25502k71588m64681
37052C95193n91358o29944l18937K77018O47176N14630J38897k42898o42816p46201
37042a199240L7519J376229J735450K75528j586506j745293k53047P82435K26057
37033c50868o42671l14247O84264Q40813M8370m80892k78692j16635l87629l98922
37023a397109K41430P26456L32594l02056j64819M83230N63121l1627l13646O8272
$$ plain form
37090 1066957 1615874 1458511 539979 -422843 -711515 -487872 -368228 -366906 -74492 263785
37080 263785 -96427 -1017898 -1330081 -485645 558558 678054 7433 -597671 -819176
37071 -819176 -856346 -699379 -237943 236002 387681 505366 1126863 2098682 2614084 2191720
37061 2191720 1157279 175068 -296305 -130776 460816 1005960 1131462 859874 395193
37052 395193 -196165 -826109 -1145046 -868028 -220852 293778 432675 189777 -453039 -1199240
37042 -1199240 -1161721 214508 1949958 2225486 638980 -1106313 -1359360 -576925 -350868
37033 -350868 -993539 -1307786 -623522 217291 265661 -215231 -493923 -610558 -998187 -1397109
37023 -1397109 -1155679 -429223 -96629 -398685 -563504 -80274 482847 451220 137574 205846
37013B05846J77162o40853j510562j188647J16058J042817R78106O73888Q30037
37004F83852R83070L75843o68585j055090m46977K67065K04060l96486o35828
36995f89076j69839M47405M93707j41546q60348r12639j59050P09574R60509P55793
36985D34490P79988R36566L11994j160188k033247j263395O5022K14200o03510
36976b318080o70007M35287J250855Q76256K42839K93104M70158r152o67361o57183
36966g53284j31896L21576P09179J067664P91439l51322j345902j235795n57430
36957a485771l22470l59242M7259O14587O00562K67379L29588M81666J3472o09020
36947d21990m40844Q1061k19978j025170q78445K40139P12791n4595o91946j28957
$$ plain form
37013 205846 383008 -257845 -1768407 -2957054 -2840996 -1798179 -820073 -146185 683852
37004 683852 1666922 2042765 1374180 319090 -127887 139178 343238 -53248 -689076
36995 -689076 -858915 -411510 82197 -59349 -919697 -1832336 -1991386 -1281812 -321303 434490
36985 434490 1214478 2151044 2463038 1302850 -730397 -1993792 -1928770 -1714570 -2318080
36976 -2318080 -2988087 -2552800 -1301945 -425689 -182850 110254 580412 571260 -96101 -753284
36966 -753284 -885180 -563604 145575 1213239 2004678 1653356 307454 -928341 -1485771
36957 -1485771 -1808241 -2167483 -2120224 -1505637 -905075 -637696 -308108 173558 187030 -421990
36947 -421990 -862834 -781773 -1001751 -2026921 -2905366 -2665227 -1952436 -2007031 -2698977 -2827934
36937b827934R12093J337785J108717O26449L8176l35383j46634R0712l77492
36928D26489r33935l09754R64417R60193l91219q84990K77055J014160l7728j079180
36918E508k99903Q94918L57878j020793r25941L51126N92239m25637p96996j5958
36908a283559L61717k03480k93624O93024J309217N61145m24112l45107L22065
36899F97286M31406j05314p15271j165095j248508m88912R35593J814749J321198
36890A477132J58819m14569j43214K59765K07651k30064n53981l06874L65005
36881H19670O79101L09313K52503J567721L326197L209794N74489k384095l247962
36872E106731k064925n90525J23739K62210Q5431m56024j098239j249841p04443
$$ plain form
36937 -2827934 -1915841 -578056 530661 1157110 1195286 859903 713269 803981 426489
36928 426489 -507446 -817200 147217 1107410 716191 -168799 108256 1122416 1084688 5508
36918 5508 -294395 600523 958401 -62392 -988333 -637207 -44968 -470605 -1267601 -1283559
36908 -1283559 -921842 -1125322 -1418946 -725922 583295 1144440 720328 375221 697286
36899 697286 1128692 1023378 308107 -856988 -2105496 -2594408 -1658815 155934 1477132
36890 1477132 1635951 1221382 1078168 1337933 1545584 1315520 761539 454665 819670
36881 819670 1498771 1808084 2060587 3628308 6954505 10164299 10738788 8354693 5106731
36872 5106731 3041806 2451281 2575020 2837230 2922661 2466637 1368398 118557 -585886
36863e85886J94442J039486J528026J299449J98569j236737j993112j495857j91151
36854a242771Q43666Q68886J21825n21894n53019k94491k13530j46813L16908
36845h21233R55002J072410M98624j83465m45678l40733k10885l22874p11791
36836e10623r65369m45975P10832J275456M67749o31979m01578Q89591J403414
36827A791518M47744p10153r76126p30733m95786L9339Q53877J015403K76869
36818A511952j78304K93484N22177m37014j416263r78120Q7935J07523n84944
36809a071574l51543O96940P93163l52260r05944Q8408J208813J023920J33082
36800A263005k65192l16913p19990j134172p70662J41879P20672P92094Q12620
$$ plain form
36863 -585886 -391444 648042 2176068 3475517 3674086 2437349 444237 -1051620 -1242771
36854 -1242771 -399105 469781 591606 69712 -483307 -777798 -991328 -1138141 -821233
36845 -821233 133769 1206179 1704803 1521338 1075660 734927 524042 201168 -510623
36836 -510623 -1475992 -1921967 -1211135 64321 532070 -99909 -501487 388104 1791518
36827 1791518 2239262 1529109 552983 -177750 -673536 -634197 219680 1235083 1511952
36818 1511952 1333648 1627132 2149309 1712295 296032 -682088 -594153 -486630 -1071574
36809 -1071574 -1423117 -726177 66986 -285274 -1191218 -1102810 106003 1129923 1263005
36800 1263005 997813 680900 -39090 -1173262 -1943924 -1802045 -1081373 -289279 523341
36791E23341P72135K08505p97980j489559j325529m68911N50260J214474J210258
36782C96994O72948J25921j13777k34913m13548m53335l20455m75298j058314
36773a873777j273023m35985P16855Q14878j32279o16962J98679J234462J045724
36764c21428j29747p48715o3995J004090J173129L50325m44355m22915Q4100J87111
36754F67600l04838n64344P7616R66639P88862n61510j570245j041291K23437
36745a318074N29778l10398q00147l2998J024498J078742L64113K2671K59866
36736H18051K69954k16069n11622k86105j85251o20206q68733j94895P89745Q88096
36726a17035J32394k29049L89999J056564P29919k81444r04741p94923m82729
$$ plain form
36791 523341 1295476 1503981 706001 -783558 -2109087 -2577998 -2027738 -813264 396994
36782 396994 1069942 1195863 1082086 847173 433625 -19710 -340165 -815463 -1873777
36773 -1873777 -3146800 -3582785 -2865930 -2051052 -2183331 -2800293 -2601614 -1367152 -321428
36764 -321428 -451175 -1199890 -1263885 -259795 913334 1263659 819304 396389 480489 667600
36754 667600 362762 -201582 -123966 842673 1631535 1070025 -500220 -1541511 -1318074
36745 -1318074 -788296 -1098694 -1898841 -1931839 -907341 171401 535514 558185 818051
36736 818051 1088005 871936 360314 74209 -111042 -731248 -1599981 -1794876 -1005131 -117035
36726 -117035 15359 -213690 176309 1232873 1962792 1681348 776607 -18316 -501045
36717e01045l19010j09045J76716J34871k92862m16491K60376J094499R97371
36708A025380m3286q54591o33451N2816K06439j97769l73346k0478K61702o0014
36698f36598o67160q45667l50734M63231J089347J165323N95348k54255o54079
36689i5244k32645M48555M72293k33344p41062l80961L24235M31704n5189k62408
36679c24066J82754O14450M12691p4348k04571o6696j01982j08196M33887J165019
36669A928942J037213p7163r56211o90517Q8540K99246k9517j50114Q649j46005
36659A313063p03533j051473q27709k92800K60755P69165J041576Q09575K11124
36650A529743l11957n83142o61115m32097J21967M77988J83608l08376l19839
$$ plain form
36717 -501045 -820055 -929100 -752384 -617513 -910375 -1326866 -1066490 28009 1025380
36708 1025380 982094 127503 -505948 -453132 -246693 -444462 -817808 -838286 -576584 -636598
36698 -636598 -1303758 -2149425 -2500159 -2036928 -947581 217742 813090 558835 -95244
36689 -95244 -327889 120666 592959 359615 -381447 -762408 -438173 -6469 -61658 -324066
36679 -324066 -141312 473138 885829 811481 606910 540214 438232 330036 763923 1928942
36669 1928942 2966155 2888992 1932781 1242264 1330804 1630050 1600533 1450419 1459068 1313063
36659 1313063 609530 -441943 -1269652 -1562452 -1301697 -532532 509044 1318619 1529743
36650 1529743 1217786 634644 -26471 -458568 -336601 141387 324995 16619 -303220
36641c03220j77027n88287j030284l19586J112488J339002q5778j114882k33466
36632a401040J223664J264799K59237j17945J82839p8942q03820o17945N01975
36623D12822R41557J59700m18912N2577L59994n67505j603068j086225N43447
36614a205613J365379O66441m20298p46147l86728J66J06343M7282P9547L67186
36604a26442P04322N99318j6408m37855l6316P76209R98767L25419n61297r01160
36594A324557n59619J18612O59546O54581M0383p50823j187383j120227o68659
36585a489032O5864P75857Q23735N866q12088o24799K59275N99507R6745j70328
36575d69398M61488J075458N73738n47518q33814R2454J111855J152864L33414
$$ plain form
36641 -303220 -480247 -1068534 -2098818 -2418404 -1305916 33086 -52692 -1167574 -1401040
36632 -1401040 -177376 1087423 1346660 1228715 1411554 1332612 528792 -89153 412822
36623 412822 1354379 1514079 1095167 1147744 1507738 940233 -662835 -1749060 -1205613
36614 -1205613 159766 826207 405909 -340238 -726966 -726800 -620457 -573175 -493628 -126442
36604 -126442 577880 1177198 1160790 722935 686619 1462828 2461595 2787014 2225717 1324557
36594 1324557 764938 883550 1543096 2197677 2238060 1487237 299854 -820373 -1489032
36585 -1489032 -1423168 -647311 176424 182290 -629798 -1254597 -995322 -395815 -299070 -469398
36575 -469398 -7910 1067548 1641286 1093768 259954 352408 1464263 2617127 2950541
36566B950541n34606r13799q14586n64333m85538n36933l09838L02755O47348
36557b58989J03187p98437q60187M2651N93618j24668j190461j025509M25629
36548c093166J595199J307794J09065o30669l63200K70630M35364N6053k59226
36539e72156n5098M00235M84896Q5943j80106K30938R67408J072731J35276j083137
36529A486930j375664m52342O32699O52770k94660r23959n14078J27767k3499
36520f84036n80829m02402M89318R16692M87517J39415L76839M05090k20622m90608
36510D36374L20745J005624R2095j618811j936611l73442J326292J700705J023393
36501A976364R0563q70959j599413j443632l36073P73422J025427N28826j46648
$$ plain form
36566 2950541 2415935 1502136 687550 123217 -362321 -899254 -1209092 -906337 -258989
36557 -258989 -155802 -954239 -1814426 -1771775 -1178157 -1302825 -2493286 -3518795 -3093166
36548 -3093166 -1497967 -190173 -81108 -711777 -1074977 -804347 -368983 -312930 -572156
36539 -572156 -627254 -227019 257877 343820 163714 394652 1362060 2434791 2570067 1486930
36529 1486930 111266 -341076 291623 944393 649733 -274226 -788304 -660537 -684036
36520 -684036 -1264865 -1667267 -1177949 -261257 226260 365675 742514 1147604 926982 436374
36510 436374 757119 1762743 1854838 236027 -1700584 -2074026 -747734 952971 1976364
36501 1976364 2066927 1195968 -403445 -1847077 -2183150 -1409728 -384301 144525 -2123
36492b123o13357o17861j57092K21012N4936j25660M28705J115968O08179q08834
36482A03873j192539J83397J541037J126818l64038j033346l60648O10475Q45735
36473A460764J16801j038974j452650l38364J236183J160775o84862j783141n21328
36464a844796J294194J149639m42646j062325j67955O01451L62148r1019j52886
36455c54195j25843m9705L35209M74497l32135j220778o88135P52713J007545
36446b00827k21621q07092L27453J370968N33176j110897j324655L7012J132269
36437b64214P55174n13542j371230j049559J43312R50459L64573r27069j148309
36428c060405R3068J098785N80694m02876k01164Q07957R25865j29351q81109
$$ plain form
36492 -2123 -615480 -1233341 -1390433 -1169421 -1114485 -1240145 -811440 304528 912707 103873
36482 103873 -1088666 -905269 635768 1762586 1398548 365202 4554 615029 1460764
36473 1460764 1577565 538591 -914059 -1252423 -16240 1144535 459673 -1323468 -1844796
36464 -1844796 -550602 599037 156391 -905934 -1073889 -472438 -110290 -201309 -354195
36455 -354195 -480038 -529743 -194534 279963 -52172 -1272950 -1961085 -1208372 -200827
36446 -200827 -422448 -1229540 -902087 468881 1002057 -108840 -1433495 -1396483 -264214
36437 -264214 490960 -22582 -1393812 -2443371 -2300059 -1349600 -985027 -1912096 -3060405
36428 -3060405 -2967337 -1868552 -1287858 -1690734 -1891898 -1083941 -158076 -287427 -1168536
36419a168536m46623K79989J94002m15613m92336K21619R23882Q26971J4870p78543
36409h40318r78135o37536j94089O6839K08645M17688P32320R60075Q10122K45371
36399G90982k77026k33114J93848K25563l71843q08579l79136M78770Q26820M90916
36389I37201O1223O760L48449P86818O91871l76146j636157j552071p2020Q27120
36379B3048m3969j120444n67024O75466N86089l23758Q0523J601926J783415K4990
36369B720262j440527j244919o26135o23260m03391M29937O03669k91400n99249
36360a475013M62329J154098K89690n32605J40613Q68392l7859j290224q38073
36351a258652N01148N88956l10853m00103K22354J12017m17077P0073R60606L24872
$$ plain form
36419 -1168536 -1615159 -1335170 -1141168 -1556781 -2049117 -1827498 -903616 -76645 -61775 -840318
36409 -840318 -1818453 -2455989 -2650078 -2583239 -2374594 -1956906 -1224586 -264511 545611 790982
36399 790982 513956 280842 474690 700253 328410 -480169 -859305 -380535 446285 937201
36389 937201 998424 1005184 1353633 2140451 2832322 2456176 820019 -732052 -804072 23048
36379 23048 -20921 -1141365 -1708389 -1032923 -446834 -770592 -690069 911857 2695272 2720262
36369 2720262 1279735 34816 -591319 -1214579 -1617970 -1188033 -584364 -875764 -1475013
36360 -1475013 -1012684 141414 431104 -101501 39112 907504 869645 -420579 -1258652
36351 -1258652 -757504 -168548 -479401 -879504 -657150 -545133 -962210 -892137 68469 393341
36341C93341j379236j588767J58246J427971Q84131J12853M97457R82090L26662
36332A814748o26801n23828K76172N15734m1977o83557q78788m98911L28157R85081
36322F66030P41100k28299r32837q75613m59466n6964L50654N86329L70591K2474
36312A83999N3731J71703k20481p54682n89643O5472K93636P3203M4671M000o41352
36301a315743j205110n06141Q09034R04897k20153o66582J54087P07140K56051
36292a082520K2096N72209O36280k74717n91760M61769J138640Q7961j215701
36283b45743j013926j83436k89909n76548M13830J660730J082347p34934j216827
36274a104416R8945R81866J70150r89707j083616n21507j04297L42620R35818
$$ plain form
36341 393341 -985895 -2574662 -2416416 -988445 -104314 8539 505996 1488086 1814748
36332 1814748 1187947 664119 940291 1456025 1414048 730491 -148297 -647208 -319051 666030
36322 666030 1407130 1178831 245994 -629619 -1089085 -1146049 -795395 -209066 161525 183999
36312 183999 237730 409433 188952 -565730 -1155373 -1089901 -796265 -723062 -678391 -674391 -1315743
36301 -1315743 -2520853 -3026994 -2217960 -1313063 -1533216 -2199798 -2045711 -1338571 -1082520
36292 -1082520 -1060424 -488215 148065 -126652 -718412 -256643 881997 969958 -245743
36283 -245743 -1259669 -1443105 -1733014 -2309562 -1895732 -235002 847345 112411 -1104416
36274 -1104416 -1005471 -23605 146545 -843162 -1926778 -2448285 -2552582 -2209962 -1274144
36265a274144R63887K38836r1322P63508J744916J371856l3843q06901l09794
36256B566999L66145J56493n71934q40934n23476k35939j68921O2053M28136L24541
36246A563163k85552n21034J1156L80513k06130r75344q00147p8916N7200k11724
36236a066815J09881P14767L91222n82857o53131K13037L05846p01893r05702
36227b175645N22901J632065Q20031n28217m07125O77778J012956N53588L24197
36218B432529K15366m03222q69988k16601Q08614P56744j76339p65024r44285
36209H37794j355648j488486n00702P34911P24883n617K23703J150832R56845
36200A278515l85797r06681l1887N30221j12015o40334j16054M32972J20845k51224
$$ plain form
36265 -1274144 -310257 -71421 -162743 600765 2345681 3717537 3683694 2876793 2566999
36256 2566999 2933144 3089637 2517703 1676769 1153293 917354 748433 810486 1238622 1563163
36246 1563163 1277611 756577 767733 1148246 942116 -33228 -833375 -912291 -855091 -1066815
36236 -1066815 -956934 -242167 149055 -433802 -1086933 -873896 -568050 -1269943 -2175645
36227 -2175645 -1652744 -20679 799352 271135 -135990 541788 1554744 2108332 2432529
36218 2432529 2647895 2244673 1374685 1158084 1966698 2723442 2547103 1782079 837794
36209 837794 -517854 -2006340 -2507042 -1772131 -1047248 -1052865 -829162 321670 1278515
36200 1278515 892718 -13963 -45850 484371 372356 -267978 -384032 48940 169785 -81439
36190h1439L1986K41607j09859p4475Q43071J314956K73388j098878j110022j05674
36180A24661L55263q2723n45336n64016k88748K99469J052370J115782K0503j195033
36170B92192j193479k29971L52409J16880j73479J9935M28085O82035O59600K59457
36160A213664l95373p66955n89087l22554k50881J79502J167487J523700K28616
36151A988119j562600j765626l86669N24906N8022l73185L57076J182955P77291
36142H00289j44574j15996M85592P0561j295844j668500k36251J198559P40295
36133a65869q64816j373325k34562Q97772P70758J43318K25342O92526L42010
36124D33154q34299j433087n64827R19420J518926Q48287j61318n52906l37446
$$ plain form
36190 -81439 -49453 192154 82295 7820 850891 2165847 2439235 1340357 230335 124661
36180 124661 479924 397201 -148135 -712151 -1000899 -701430 350940 1466722 1487225 292192
36170 292192 -901287 -1131258 -778849 -661969 -835448 -815513 -387428 294607 954207 1213664
36160 1213664 818291 51336 -537751 -860305 -1111186 -931684 235803 1759503 1988119
36151 1988119 425519 -1340107 -1726776 -1201870 -1143848 -1517033 -1159957 22998 800289
36142 800289 655715 539719 1025311 1095872 -199972 -1868472 -2104723 -906164 -165869
36133 -165869 -1030685 -2404010 -2638572 -1740800 -970042 -826724 -601382 91144 433154
36124 433154 -401145 -1834232 -2399059 -1479639 39287 887574 726256 173350 -164096
36115a64096j37540j90247q0391M63860Q94038M56655n98909j104073n24398K41072
36105g44029J68246l68720k46686N54192Q13555j02463j246993j361267m36486
36096b970651N41738R34874R32220R12313Q90059O62884J95545k77445m81237
36087A340300m14161l86327o39475r63637q66504j65907P04766J039918N18659
36078A67632m06689q11053k07602Q15268J179903O02854j52878m44979n26249
36069B16207p52537p26341M379Q90933R61772K16716m59436o29858o12202n11187
36059a401554N694P80743J015868M52698j24609m6839K76647R7559n13304q37105
36049b94202n17408Q6100L95929J77302k75731m03804M876N12545N99462L41811
$$ plain form
36115 -164096 -301636 -491883 -572274 -108414 785624 1242279 643370 -460703 -985101 -744029
36105 -744029 -575783 -944503 -1191189 -636997 176558 74095 -1172898 -2534165 -2970651
36096 -2970651 -2428913 -1494039 -561819 350494 1240553 1903437 2098982 1821537 1340300
36087 1340300 926139 539812 -99663 -1063300 -1929804 -2095711 -1390945 -351027 167632
36078 167632 -239057 -1050110 -1257712 -442444 737459 1340313 1187435 742456 216207
36069 216207 -536330 -1262671 -1258292 -367359 594413 811129 351693 -278165 -890367 -1401554
36059 -1401554 -1395860 -615117 400751 853449 728840 682001 958648 1056207 542903 -294202
36049 -294202 -811610 -725510 -329581 -152279 -428010 -831814 -826938 -314393 285069 626880
36039F26880R7330j88110o59854q07421m3549J011889J007939j30479q99779m36414
36029d21568K06924j41816q35232m99856O93499J253943N62729m29608o75578
36020b86563j47606N80480R58334N87276m24695j144232o98280L96556O91618
36011E12888j85978r63031n88629L15526N89889K60986J49263L71318L93477K55297
36001A111006M82651P98921K21474j221008k071965j376086j7514O33049M99927
35992i39545L17640K10684q5562k29362K06683O57478L30032l19850k88369J56995
35982A6824Q031m18469N1685R53158N18091j081935j446502J35054J210525K07819
35972A54281p85755L57748J892614J039423j136587j369119L68846R95852l78714
$$ plain form
36039 626880 724210 536100 -123754 -931175 -974724 37165 1045104 914625 14846 -421568
36029 -421568 -214644 -356460 -1191692 -1691548 -998049 255894 818623 389015 -286563
36020 -286563 -434169 146311 1104645 1691921 1267226 122994 -575286 -178730 512888
36011 512888 326910 -636121 -1224750 -909224 -319335 -58349 90914 462232 855709 1111006
36001 1111006 1593657 2392578 2614052 1393044 -678921 -2055007 -2072521 -1439472 -939545
35992 -939545 -621905 -411221 -496783 -726145 -519462 138016 468048 148198 -140171 16824
35982 16824 24855 -393614 -341929 611229 1129320 47385 -1399117 -1264063 -53538 154281
35972 154281 -631474 -273726 1618888 2658311 1521724 152605 521451 1517303 1138589
35963A138589j226107j88261Q08545K25026n59749l2641Q38479N97369k71975
35954A329275o41219n83572l87036M01795J443295J095615q76584k085057r41313
35945a244801O66300L66736q79734o43431Q04959J214495K88537k11309J56564
35936E18316Q2505n93179n04045L97827M49055o28957r38615L17387J312321O65209
35926A077824l10201j06638L13504n32119j657268j028143R71416J990743J278374
35917A997492M07281L16979k2225j246611j989683j013987N44008P55085j80727
35908d32388m14205N32702J131541M51482m01994k50715K39851j54640j046342
35899c44708j024677Q5727R84931P99015j608o22801q13803o09437j57984Q7618
$$ plain form
35963 1138589 -87518 -275779 532766 757792 198043 165402 1003881 1601250 1329275
35954 1329275 688056 104484 -282552 119243 1562538 2658153 1781569 -303488 -1244801
35945 -1244801 -578501 -211765 -1091499 -1734930 -929971 284524 573061 361752 518316
35936 518316 600821 7642 -496403 -98576 350479 -278478 -1217093 -899706 412615 1077824
35926 1077824 767623 660985 974489 442370 -1214898 -2243041 -1271625 719118 1997492
35917 1997492 2404773 2721752 2699527 1452916 -536767 -1550754 -1006746 -251661 -432388
35908 -432388 -846593 -313891 817650 1269132 867138 616423 856274 701634 -344708
35899 -344708 -1369385 -1283658 -298727 500288 498680 -124121 -937924 -1547361 -1705345 -1617727
35889a617727j42566k80207L24710J113366R37037o1705n18960M0695N85729M27322
35879H07694K23109N36416P92011M55342k154j54504m43838j062183j188269l53357
35869c89733N02052L93504k57878n56582n13794m36798K4298J014819J613295
35860A393183J106966K79714J63003L43658j60833j129137j582200j273833m92047
35851a351526P33417J895055J594486m34619j962251r74293J129362J389352k84433
35842A734550j182656j03797J246345J548691J720740K404267K158846r1858k639079
35833F796049l000601j310762R9902m2659p37252o33391J73079O34506K46146
35824B225017m81491q15933o50443l94987k52264m1051K61074L74213K79271K74496
$$ plain form
35889 -1617727 -1760293 -2040500 -1715790 -602424 334613 272908 -246052 -205357 380372 807694
35879 807694 1030803 1567219 2359230 2814572 2812418 2657914 2214076 1151893 -36376 -389733
35869 -389733 112319 505823 247945 -308637 -822431 -1259229 -1234931 -220112 1393183
35860 1393183 2500149 2779863 2942866 3286524 3125691 1996554 414354 -859479 -1351526
35851 -1351526 -618109 1276946 2871432 2436813 474562 -499731 629631 2018983 1734550
35842 1734550 551894 448097 1694442 3243133 4963873 7368140 9526986 9435128 6796049
35833 6796049 3795448 2484686 2584588 2541929 1804677 1171286 1344365 1978871 2225017
35824 2225017 1743526 927593 277150 -117837 -370101 -411152 -150078 224135 503406 777902
35814G77902K56562k16035q30251n89062M68481R00698P3675o63596k01270M18302
35804C95406q9227q69389m93961L38545N3890q17977n54181N57031P54605J18273
35794f06985L05198J116152O19580j001119j196240N13827J337924j44050j519831
35785e75544p15610N09353j59511j475301q98657R46930J414228K75533k37520
35776i16099O08069J068114J08426r58002p01893L79733Q56675K69054n80085
35767A33992o44081K67238J123865P33655n45536r56117K11230J381161R18389
35758B623796m46560q17686J5893N62817R3768m95914l21523L42517P81310O90092
35748C028510Q6946q18119j466563j279741l26424O89338J112276Q06573J44953
$$ plain form
35814 777902 1034464 818429 -11822 -600884 -132403 768295 841970 178374 -22896 395406
35804 395406 306179 -563210 -1057171 -718626 -664736 -1482713 -2036894 -1479863 -725258 -606985
35794 -606985 -301787 814365 1433945 432826 -763414 -249587 1088337 944287 -575544
35785 -575544 -1291154 -781801 -941312 -2416613 -3315270 -2368340 -954112 -678579 -916099
35776 -916099 -308030 760084 868510 -89492 -791385 -411652 445023 714077 133992
35767 133992 -510089 -242851 881014 1614669 1069133 113016 324246 1705407 2623796
35758 2623796 2177236 1359550 1375443 1938260 2032028 1536114 1214591 1557108 2338418 3028510
35748 3028510 3115456 2297337 830774 -448967 -775391 -86053 1026223 1832796 1977749
35739A977749l00427l37371m32480r30590j176770l49914R01927R97348j38262
35730B11210o81993L90962J709279J537237P1320j317687j877002j461616o2064
35721a480354J465100J520059o5160j275090p08987L05669J1476r02663p83720
35712a913670k0315j20199p40040k65304J144353J670036Q40036J8479j14507
35703D98869k65195n76787k34648O51518Q68078K21165q9347L88094P24983N05915
35693B692645M41333O40683K11599q42266j224876n34971j9350l86893o64442
35684C13462r5700N40241M73506K17905L15543K95068j44495l45018m0717p1164
35674A458631p70800j079059k96466O51852P52707L50662O1105l11682p35517
$$ plain form
35739 1977749 1677322 1339951 907471 -23119 -1199889 -1549803 -647876 349472 211210
35730 211210 -470783 -79821 1629458 3166695 3238015 1920328 43326 -1418290 -1480354
35721 -1480354 -15254 1504805 1439645 164555 -544432 -238763 -227287 -1129950 -1913670
35712 -1913670 -1933985 -2054184 -2794224 -3059528 -1915175 -245139 594897 613376 498869
35703 498869 233674 -343113 -577761 73757 941835 1163000 1073653 1461747 2186730 2692645
35693 2692645 3133978 3774661 3986260 3143994 1919118 1384147 1364797 977904 313462
35684 313462 217762 758003 1231509 1449414 1764957 2060025 1915530 1570512 1529795 1458631
35674 1458631 687831 -391228 -687694 -35842 716865 1067527 1128632 816950 81433
35665H1433m17819N18214N49432o63248j084720M86885J912460Q11531j409591
35656G84577j551174L49699J214952q1088j173609k64751J180216J067178k31126
35647A294874r84153p57527l89887l12746l01331l26993n03097m82822J98552
35638b565130J292467J935541J547128L67933p67135j114022p07758l20754m34408
35629g66138n16288R0954Q66745O69588m25683r76569k18783P62613N57933o34418
35619e90046j365684p74341O03127J582878J384541J79429r85198j039682j6307
35610a021283R28359Q76404J55687l39614l57726k90945l52900m15394m64890
35601a282302n58384m11288K92186J137289J220209L78599m35264l91298J17248
$$ plain form
35665 81433 -336386 181828 731260 68012 -1016708 -529823 1382637 2194168 784577
35656 784577 -766597 -416898 798054 716966 -456643 -721394 458822 1526000 1294874
35647 1294874 310721 -446806 -836693 -1149439 -1450770 -1777763 -2280860 -2763682 -2565130
35638 -2565130 -1272663 662878 2210006 2577939 1810804 696782 -10976 -331730 -766138
35629 -766138 -1282426 -1191472 -324727 344861 -80822 -1057391 -1276174 -513561 44372 -590046
35619 -590046 -1955730 -2730071 -2126944 -544066 840475 1019904 34706 -1004976 -1021283
35610 -1021283 -92924 783480 939167 599553 241827 -49118 -402018 -817412 -1282302
35601 -1282302 -1840686 -2251974 -1959788 -822499 397710 776309 341045 -50253 66995
35592F6995J32217m64422q57291n13755J49079M51665K84519j1855j98232k23654
35582a184734l2374L52814P01391Q15245P55331N96103J92064m88563j045938
35573F61339j074277o96651k64029J78483N90303N04940k61971p99660j43636
35564a305159R70697Q05377o80833j424862k83528J135039R23346k50974m63646
35555e74543L15867N11525j39994k58872N21075Q11038m7530p91079m45625O7502
35545c0636k91390q62149o13180L2917J97092K39352Q30516J271474N34327o82824
35535F25499q12122P1980M73868N214k42455J09923J39535m34544o20917m9105
35525g33124L09519N6386K10721J151336J472239K45559j117221r11909J74749
$$ plain form
35592 66995 199212 -265210 -1122501 -1636256 -1487177 -1035512 -750993 -762848 -961080 -1184734
35582 -1184734 -1217108 -864294 -162903 652342 1407673 2003776 2195840 1707277 661339
35573 661339 -412938 -1109589 -1373618 -1195135 -604832 -99892 -361863 -1161523 -1305159
35564 -1305159 -334462 470915 -209918 -1634780 -1918308 -783269 140077 -110897 -574543
35555 -574543 -258676 252849 112855 -146017 375058 1186096 1138566 347487 -98138 -30636
35545 -30636 -322026 -1184175 -1797355 -1764438 -1567346 -1327994 -497478 773996 1308323 625499
35535 625499 -186623 -114643 359225 364439 121984 231907 371442 -63102 -684019 -733124
35525 -733124 -423605 -367219 -156498 994838 2467077 2712636 1595415 683506 858255
35516H58255K56285p38579j159965l19422P10456Q83626K79313n50100j057994
35507h38125o64686N30524J232882M55606p63204o54070N40323R10783n3972p64351
35497f8290k68661L61308J87782K485N58089R09316O9702j002792q21940J33159
35487F0158J52494r47631j546680o69718P55699J345299Q56794R261n06390n06685
35477i97399k76118k19420l16336p6128O69665J265120R87338K2972p86734r28780
35467f55820n51037j18693p2460m32103n02425L79257J534395J388345j84727
35458G84732j173293j65825J383079J191326m36207j204096m10697K71658k19296
35449B1381p47328j73305O87597N21344l69756p17378k12829M11358O58317N71543
$$ plain form
35516 858255 1114540 375961 -784004 -1103426 -392970 490656 769969 219869 -838125
35507 -838125 -1502811 -972287 260595 716201 -47003 -701073 -160750 750033 696061 -68290
35497 -68290 -336951 24357 212139 214624 772713 1682029 1751731 748939 -73001 60158
35487 60158 212652 -734979 -2281659 -2951377 -2195678 -850379 6415 15676 -490714 -997399
35477 -997399 -1273517 -1492937 -1809273 -1885401 -1215736 49384 1036722 1059694 272960 -655820
35467 -655820 -1206857 -1325550 -1398010 -1830113 -2332538 -1953281 -418886 969459 784732
35458 784732 -388561 -554386 828693 2020019 1583812 379716 -30981 240677 21381
35449 21381 -725947 -899252 -211655 309689 -60067 -777445 -990274 -578916 79401 650944
35439F50944J69888m78540q94687p04265k74960j40644r6638L56187R29504Q16172
35429C32961p715o43890n88555l60317m71776n26307M5686Q45535Q89377J6949
35419d68052q11044p72420j29407L92142O15800P83608Q24842M67487r3468l80586
35409D28902m47497p27097j030506o33137L93917R69581O29144L10286P23059
35400F16652R87324Q7058j161409j134869M8706O86078J43662l59010J7095L70766
35390C02053k23796r91001o45632N16927R76345J04700j108052j405484n93401
35381c067341N40163J116476Q87834L54015J72585L62945L23166k26311p12663
35372b49131m79843K29387N50593J36921m46496n18188j10577J76154j9696l74387
$$ plain form
35439 650944 820832 342292 -552395 -1256660 -1531620 -1672264 -1768902 -1412715 -483211 332961
35429 332961 325246 -318644 -907199 -1267516 -1739292 -2265599 -2219913 -1374378 -485001 -468052
35419 -468052 -1279096 -2051516 -2180923 -1788781 -1172981 -389373 435469 902956 809488 428902
35409 428902 -18595 -745692 -1776198 -2409335 -2015418 -1045837 -416693 -106407 616652
35400 616652 1603976 1691034 529625 -605244 -556538 129540 273202 -85808 -68713 302053
35390 302053 78257 -912744 -1558376 -1041449 -65104 39596 -1068456 -2473940 -3067341
35381 -3067341 -2527178 -1410702 -522868 -168853 3732 366677 689843 463532 -249131
35372 -249131 -728974 -499587 51006 187927 -258569 -776757 -887334 -711180 -730876 -1105263
35362a105263k87631L59040J008725J036478M02567l88052q05239o43365p4937
35353d97677M19703L72714j52399n29181l14835J72967L19834K6521k93045l02553
35343g77951M3655O32387J113187R58052J02333p22365q36498n22127m65781o01681
35333a076789l21943L48798P12567N05571J17253l30510j061642j583531p59850
35324c450076J370716K854156J951446n19573k046859j461089p6030L86372K5603
35315i65334J80651J149336J612555O12895q50453j111102k23895J69049o25031
35306e1329j313627o86066N28848Q79737L20150j09679o0874J1223R5914N68424
$$ plain form
35362 -1105263 -1392894 -1033854 -25129 1011349 1413916 1025864 220625 -422740 -497677
35353 -497677 -77974 294740 142341 -386840 -701675 -528708 -208874 -182353 -475398 -777951
35343 -777951 -734296 -101909 1011278 1969330 2071663 1349298 512800 -9327 -475108 -1076789
35333 -1076789 -1398732 -1049934 -337367 168204 285457 -45053 -1106695 -2690226 -3450076
35324 -3450076 -2079360 774796 2726242 2206669 159810 -1301279 -1377309 -990937 -965334
35315 -965334 -784683 364653 1977208 2590103 1739650 628548 404653 573702 -51329
35306 -51329 -1364956 -2051022 -1522174 -642437 -322287 -431966 -492840 -481617 -385703 182721
$$ [...]
##END NTUPLES=NMR SPECTRUM
##END=
