##TITLE=31Pdec_SR70
 , 24 sc
 9.07.2021
##JCAMPDX= 6.0         $$ Bruker NMR JCAMP-DX V2.0
##DATA TYPE= NMR SPECTRUM
##DATA CLASS= NTUPLES
##ORIGIN= UXNMR, Bruker Analytische Messtechnik GmbH
##OWNER= root
$$ XWIN-NMR		Version 3.5
$$ Fri Jul  9 13:11:24 2021 Russian Standard Time (UT+4h)  she@DPX200
##.OBSERVE FREQUENCY= 81.013821
##.OBSERVE NUCLEUS= ^31P
##.ACQUISITION MODE= SIMULTANEOUS
##.ACQUISITION SCHEME= undefined
##.AVERAGES= 24
##.DIGITISER RES= 16
##SPECTROMETER/DATA SYSTEM= spect
##.PULSE SEQUENCE= zgpg30
##.SOLVENT NAME= DMSO
##.SHIFT REFERENCE= (INTERNAL, DMSO, 0, 248.564)
##AUDIT TRAIL= $$ (NUMBER, WHEN, WHO, WHERE, WHAT)
$$ ##TITLE= Audit trail, XWIN-NMR		Version 3.5
$$ ##JCAMPDX= 5.01
$$ ##ORIGIN= Bruker BioSpin GmbH
$$ ##OWNER= she
$$ F:/spectra/data/she/nmr/P31/1/pdata/1/auditp.txt
$$ ##AUDIT TRAIL=  $$ (NUMBER, WHEN, WHO, WHERE, WHAT)
(   1,<2021-07-09 13:09:40.03 +0400>,<she>,<DPX200>,
      <created by zg, POWCHK disabled, PULCHK disabled
       configuration hash MD5:
       00 E9 B6 7A A2 85 ED C7 34 08 36 98 17 FE 4E 26
       data hash MD5: 32K
       55 5F BA B5 84 31 7E 3C 85 23 09 1E 02 89 84 1F>)
(   2,<2021-07-09 13:09:49.32 +0400>,<she>,<DPX200>,
      <Start of raw data processing
       efp BC_mod = 2 LB = 1 FT_mod = 6 PKNL = 1 PHC0 = -7805.113 PHC1 = 1106.475 SI = 64K 
       data hash MD5: 64K
       57 E2 86 7E 19 68 51 63 7F 28 F1 7C 78 5E F6 C0>)
(   3,<2021-07-09 13:10:55.32 +0400>,<she>,<DPX200>,
      <pk PHC0 = -129.4841 PHC1 = 432.6 
       data hash MD5: 64K
       D9 A2 02 29 A2 EE B2 7C C6 BD 95 5E F2 0F 30 8E>)
$$ ##END=
$$ 
$$ hash MD5
$$ 49 D9 76 FD 74 7E 59 0C 36 BE 30 82 E4 5C EC 5C
##$RELAX= 
##$RELAX= 
##$RELAX= 
##$RELAX= 
##$RELAX= 
##$RELAX= 
##$RELAX= 
##$RELAX= 
$$ Bruker specific parameters
$$ --------------------------
##$DU= <F:/spectra>
##$EXPNO= 1
##$NAME= <P31>
##$PROCNO= 1
##$TYPE= <nmr>
##$USER= <she>
##$AMP= (0..31)
100 100 100 100 100 100 100 100 100 100 100 100 100 100 100 100 100 100 
100 100 100 100 100 100 100 100 100 100 100 100 100 100 
##$AQSEQ= 0
##$AQ_mod= 1
##$AUNM= <au_zg>
##$AUTOPOS= <>
##$BF1= 81.014009
##$BF2= 200.13
##$BF3= 200.13
##$BF4= 200.13
##$BF5= 200.13
##$BF6= 200.13
##$BF7= 200.13
##$BF8= 200.13
##$BYTORDA= 1
##$CFDGTYP= 0
##$CFRGTYP= 5
##$CHEMSTR= <none>
##$CNST= (0..31)
1 1 145 1 1 1 1 1 1 1 1 1 1 1 1 1 1 1 1 1 1 1 1 1 1 1 1 1 1 1 1 1 
##$CPDPRG= <waltz16>
##$CPDPRG1= <>
##$CPDPRG2= <waltz16>
##$CPDPRG3= <>
##$CPDPRG4= <mlev>
##$CPDPRG5= <mlev>
##$CPDPRG6= <mlev>
##$CPDPRG7= <mlev>
##$CPDPRG8= <mlev>
##$CPDPRGB= <>
##$CPDPRGT= <>
##$D= (0..31)
0 1 0 0 0 0 0 0 0 0 0 0.03 2e-05 3e-06 0 0 0 0 0 0 0 0 0 0 0 0 0 0 0 0 
0 0 
##$DATE= 1625821779
##$DBL= (0..7)
120 120 120 11 120 120 24 19 
##$DBP= (0..7)
150 150 150 150 150 150 150 150 
##$DBP07= 0
##$DBPNAM0= <>
##$DBPNAM1= <>
##$DBPNAM2= <>
##$DBPNAM3= <>
##$DBPNAM4= <>
##$DBPNAM5= <>
##$DBPNAM6= <>
##$DBPNAM7= <>
##$DBPOAL= (0..7)
0.5 0.5 0.5 0.5 0.5 0.5 0.5 0.5 
##$DBPOFFS= (0..7)
0 0 0 0 0 0 0 0 
##$DE= 6
$$ [...]
##$SUBNAM2= <"">
##$SUBNAM3= <"">
##$SUBNAM4= <"">
##$SUBNAM5= <"">
##$SUBNAM6= <"">
##$SUBNAM7= <"">
##$SUBNAM8= <"">
##$SUBNAM9= <"">
##$SW= 501.771253377433
##$SWIBOX= (0..15)
0 1 3 0 0 0 0 0 0 0 0 0 0 0 0 0 
##$SW_h= 40650.406504065
##$TD= 32768
##$TD0= 1
##$TE= 0
##$TE2= 300
##$TE3= 300
##$TEG= 300
##$TL= (0..7)
0 120 53 12 22 120 120 120 
##$TP= (0..7)
150 150 150 150 150 150 150 150 
##$TP07= 0
##$TPNAME0= <>
##$TPNAME1= <>
##$TPNAME2= <>
##$TPNAME3= <>
##$TPNAME4= <>
##$TPNAME5= <>
##$TPNAME6= <>
##$TPNAME7= <>
##$TPOAL= (0..7)
0.5 0.5 0.5 0.5 0.5 0.5 0.5 0.5 
##$TPOFFS= (0..7)
0 0 0 0 0 0 0 0 
##$TUNHIN= 0
##$TUNHOUT= 0
##$TUNXOUT= 0
##$USERA1= <user>
##$USERA2= <user>
##$USERA3= <user>
##$USERA4= <user>
##$USERA5= <user>
##$V9= 5
##$VALIST= <valist>
##$VCLIST= <CCCCCCCCCCCCCCC>
##$VD= 0
##$VDLIST= <DDDDDDDDDDDDDDD>
##$VPLIST= <PPPPPPPPPPPPPPP>
##$VTLIST= <TTTTTTTTTTTTTTT>
##$WBST= 1024
##$WBSW= 4
##$XGAIN= (0..3)
0 0 0 0 
##$XL= 0
##$YL= 0
##$YMAX_a= 1395
##$YMIN_a= -4979
##$ZGOPTNS= <>
##$ZL1= 120
##$ZL2= 120
##$ZL3= 120
##$ZL4= 120
##$ABSF1= 0
##$ABSF2= 0
##$ABSG= 0
##$ABSL= 0
##$ALPHA= 0
##$AQORDER= 0
##$ASSFAC= 0
##$ASSFACI= 0
##$ASSFACX= 0
##$ASSWID= 0
##$AUNMP= <proc_1d>
##$AZFE= 0.1
##$AZFW= 0.5
##$BCFW= 0
##$BC_mod= 2
##$BYTORDP= 0
##$COROFFS= 0
##$CY= -3
##$DATMOD= 1
##$DC= 0
##$DFILT= <>
##$DTYPP= 0
##$F1P= 0
##$F2P= 0
##$FCOR= 1
##$FTSIZE= 65536
##$FT_mod= 6
##$GAMMA= 0
##$GB= 0
##$INTBC= 1
##$INTSCL= 5.30512e-09
##$ISEN= 30
##$LB= 1
##$LEV0= 0
##$LPBIN= 0
##$MAXI= 10000
##$MC2= 0
##$MEAN= 0
##$ME_mod= 0
##$MI= 50
##$NCOEF= 0
##$NC_proc= -8
##$NLEV= 6
##$NOISF1= 182.463
##$NOISF2= 159.3651
##$NSP= 0
##$NTH_PI= 0
##$NZP= 0
##$OFFSET= 248.5645
##$PC= 4
##$PHC0= -7934.597
##$PHC1= 1539.075
##$PH_mod= 1
##$PKNL= yes
##$PPARMOD= 0
##$PSCAL= 0
##$PSIGN= 0
##$REVERSE= no
##$SF= 81.014009
##$SI= 65536
##$SIGF1= 159.3651
##$SIGF2= -187.1042
##$SINO= 113.3802
##$SIOLD= 16384
##$SREGLST= <1H.CDCl3>
##$SSB= 0
##$STSI= 65536
##$STSR= 0
##$SW_p= 40650.406504065
##$SYMM= 0
##$S_DEV= 0
##$TDeff= 32768
##$TDoff= 0
##$TI= <>
##$TILT= no
##$TM1= 0
##$TM2= 0
##$TOPLEV= 0
##$USERP1= <user>
##$USERP2= <user>
##$USERP3= <user>
##$USERP4= <user>
##$USERP5= <user>
##$WDW= 1
##$XDIM= 65536
##$YMAX_p= 426663788
##$YMIN_p= -561707951
$$ End of Bruker specific parameters
$$ ---------------------------------
##NTUPLES= NMR SPECTRUM
##VAR_NAME=  FREQUENCY,     SPECTRUM/REAL,   SPECTRUM/IMAG
##SYMBOL=    X,             R,               I
##VAR_TYPE=  INDEPENDENT,   DEPENDENT,       DEPENDENT
##VAR_FORM=  AFFN,          ASDF,            ASDF
##VAR_DIM=   65536,         65536,           65536
##UNITS=     HZ,            ARBITRARY UNITS, ARBITRARY UNITS
##FACTOR=    0.620285442955139, 1,           1
##FIRST=     20137.2065510759, 0,            0
##LAST=      -20513.1999529892, 0,           0
##MIN=       -20513.1999529892, -561707951,  0
##MAX=       20137.2065510759, 426663788,    0
$$ Real data points
##PAGE= N=1
##DATA TABLE= (X++(R..R)), XYDATA
$$ [...]
13017C21103j104982j702525m204287j729493N202144P310961R56466n896816
$$ 321103 -783879 -2486404 -6690691 -8420184 -3218040 4092921 5049387 -847429
13009h47429n475851R1092M258910M268213O95157m776993q089459n186729J664210
$$ -847429 -6323280 -6232188 -1973278 2294935 2990092 -1786901 -9876360 -15063089 -13398879
13000a3398879N460966M162362K515647K659010P08193m262511o002215p90474
$$ -13398879 -7937913 -3775551 -1259904 1399106 2107299 -2155212 -8157427 -8947901
12992h947901N551533N950032J668646j820871l250464m150576l734985j095504
$$ -8947901 -3396368 2553664 4222310 2401439 -849025 -4999601 -8734586 -9830090
12984i830090J228307J202061J261318L398955M270734P24575l486735k685307
$$ -9830090 -8601783 -7399722 -6138404 -2739449 1531285 2255860 -1230875 -3916182
12976c916182J766209L588277Q33328k593209l314841j374966K043470N175254
$$ -3916182 -2149973 1438304 2271632 -321577 -3636418 -5011384 -2967914 2207340
12968B207340N085040Q35353l753628m325328j747708j06640n76116j116697p46508
$$ 2207340 7292380 8127733 4374105 48777 -1698931 -1805571 -2381687 -3498384 -4244892
12959d244892j42372Q05019K278023K480475r7861l266813l284209K02230L856431
$$ -4244892 -4387264 -3582245 -1304222 1176253 1078392 -2188421 -5472630 -5270400 -1413969
12950a413969M411286J095066l854449n816434j976697L635905L593734k301685
$$ -1413969 2997317 4092383 237934 -5578500 -7555197 -3919292 -325558 -2627243
12942b627243n397236p94859M796356L588176j030055p79249L630706M437877
$$ -2627243 -8024479 -8819338 -4022982 -434806 -1464861 -2244110 1386596 5824473
12934E824473J50435k938266k093542j589015l680622m626452k036241R31939
$$ 5824473 5974908 3036642 943100 -645915 -4326537 -8952989 -10989230 -10057291
12926a0057291J375245P41466Q18438R59024J214066K984740M787307K782816
$$ -10057291 -8682046 -7940580 -7122142 -6163118 -4949052 -1964312 2822995 5605811
12918E605811k397904m687074r35699M564623O352499M043239O9434m013974o295176
$$ 5605811 3207907 -1479167 -2414866 2149757 8502256 12545495 12614929 8600955 2305779
12909B305779m275041Q65645L700179J364869k547157l502189j677987M93630
$$ 2305779 -1969262 -1103617 2596562 3961431 1414274 -2087915 -3765902 -3272272
12901c272272K295627L155898J288730k466417l470191o3706K413752o85317n195723
$$ -3272272 -976645 2179253 3467983 1001566 -2468625 -2532331 -118579 -803896 -5999619
12892e999619l814133K476797N538119K068116k329065k241725N24496J737319
$$ -5999619 -9813752 -7336955 -1798836 269280 -2059785 -4301510 -3777014 -2039695
12884b039695J516680K244707K992185Q58669l239704m634347j443980K443011
$$ -2039695 -523015 1721692 4713877 5572546 2332842 -2301505 -3745485 -1302474
12876a302474K668555K07986o11162J475300L189389J699270j521455k945777
$$ -1302474 1366081 1574067 962905 2438205 5627594 7326864 5805409 2859632
12868B859632j500319M47388o9473l338732o045478m105700K255325P190645N567123
$$ 2859632 1359313 1806701 1737228 -1601504 -7646982 -11752682 -9497357 -2306712 3260411
12859C260411o3763k554452j47702J646901n18349k494294l25966K366555M37470
$$ 3260411 3196648 642196 494494 2141395 1623046 -871248 -1197214 1169341 1606811
12850A606811l555285l156951J328383L319468M17655k607488j964412K19915
$$ 1606811 -1948474 -5105425 -3777042 -457574 -39919 -2647407 -4611819 -4391904
12842d391904O62164m37499j292450j163781Q4260J787456J757619o71183j782299
$$ -4391904 -3729740 -4167239 -5459689 -6623470 -6539210 -4751754 -2994135 -3665318 -5447617
12833e447617J546397N133767K207278n347122q039614k546142L461733L348173
$$ -5447617 -3901220 1232547 3439825 -1907297 -9946911 -12493053 -9031320 -5683147
12825e683147O64079J445107M213016M068740J626096P88484R89169j259339m867022
$$ -5683147 -5019068 -3573961 639055 4707795 6333891 7122375 8111544 6852205 1985183
12816A985183m926068o81859K942289K455072k6903p46130R46886K976708L334889
$$ 1985183 -2940885 -3622744 -680455 1774617 1747714 1001584 1948470 4925178 8260067
12807H260067J534640j285546l270897l698446l641990m065759m092410k265091
$$ 8260067 9794707 8509161 5238264 1539818 -2102172 -6167931 -10260341 -12525432
12799a2525432J085457L713092L502116N45201k392897k248622M29683J455791
$$ -12525432 -11439975 -7726883 -4224767 -3679566 -6072463 -8321085 -7891402 -6435611
12791f435611j013754k617121J242901P366550Q210391K794590k234844l056634
$$ -6435611 -7449365 -10066486 -8823585 -1457035 6753356 9547946 7313102 4256468
12783D256468l075418m776313m678653n26198L190444K261548k78147M0568J449876
$$ 4256468 1181050 -3595263 -8273916 -8800114 -5609670 -3348122 -3626269 -3585701 -2135825
12774b135825M18853r17512R21996K926459K15237m258494l414695J861470L452785
$$ -2135825 -1716972 -2634484 -1712488 1213971 1429208 -2829286 -6243981 -4382511 -929726
12765i29726p98202l629306l27141M015810L153525r85638k580494q44613N47906
$$ -929726 -1727928 -5357234 -5684375 -1668565 1484960 499322 -2081172 -2925785 -2377879
12756b377879J31041j31852Q58646J701072J149752q7258o11844j68149R9554
$$ -2377879 -2246838 -2378690 -1520044 181028 1330780 1243522 631678 463529 563083
12747E63083r93419k930210l566275j703748J038444K102036J122304j20629j73191
$$ 563083 -430336 -3360546 -6926821 -8630569 -7592125 -5490089 -4367785 -4488414 -4661605
12738d661605J032013K654132L041973P13166k976242l934600o11502K765862
$$ -4661605 -3629592 -975460 2066513 2779679 -196563 -4131163 -4742665 -1976803
12730a976803J629620k007222k486870P04913K499641R09873K02275L044112M814056
$$ -1976803 -347183 -2354405 -4841275 -4136362 -1636721 -726848 -524573 2519539 7333595
12721G333595K60169p355691r163344k312307N847622O810206J232475k608435
$$ 7333595 7593764 238073 -8925271 -11237578 -5389956 1420250 2652725 44290
12713D4290J80164M991438M362256j649501n599824l039105J689860K140087j561517
$$ 44290 224454 5215892 9578148 7928647 2328823 -710282 979578 3119665 1558148
12704A558148m362370l986738k551088j692585n05321J632412L714980M874352
$$ 1558148 -2804222 -6790960 -9342048 -11034633 -11539954 -9907542 -6192562 -1318210
12696a318210M784906K698945j060223l455396k068980O38723M07076k034837
$$ -1318210 3466696 6165641 5105418 1650022 -418958 219765 626841 -1407996
12688a407996k030713J009048K148417r78917l902404k069524K421841M445718
$$ -1407996 -3438709 -2429661 -281244 -1260161 -5162565 -7232089 -4810248 -364530
12680c64530L044646J263279R12852J040656M88139p97728k312059l050409k038535
$$ -364530 2680116 3943395 4856247 5896903 6385042 5587314 3275255 224846 -1813689
12671a813689q5121N93347k82816k95541J501981K346576J54057k429747j705250
$$ -1813689 -1898810 -1305463 -1588279 -1883820 -381839 1964737 2118794 -310953 -2016203
12662b016203J295891K596293J679396J727437L407775K921593j944697p245184
$$ -2016203 -720312 1875981 3555377 5282814 8690589 11612182 9667485 2422301
12654B422301p352277k463435J382203q0792l999958m095302J243575O585281
$$ 2422301 -4929976 -7393411 -6011208 -6092000 -10091958 -14187260 -12943685 -6358404
12646f358404N997233M14024l683208k585947M80165P44073j223118r95790K490864
$$ -6358404 -361171 52853 -3630355 -6216302 -5736137 -4992064 -6215182 -7210972 -4720108
12637d720108M977093L072258o84312j429763J044019K171676m55239l220353
$$ -4720108 256985 3329243 2644931 1215168 2259187 4430863 3975624 755271
12629G55271j404613M055086P500671N640803R58253k266169k744871j968978
$$ 755271 -649342 3405744 10906415 16547218 17505471 15239302 12494431 10525453
12621A0525453j461245j824078k883035l286038j468434J653924K833430R33813
$$ 10525453 9064208 7240130 4357095 1071057 -397377 1256547 4089977 5023790
12613E023790j028941m76628O72262k60903j425645N51546L864426L352957j120304
$$ 5023790 3994849 3518221 4190483 3929580 2503935 3055481 6919907 10272864 9152560
12604I152560l854010k029587L32587n18681k241560j303125O68050N5755k258155
$$ 9152560 5298550 3268963 3601550 3082869 841309 -461816 206234 261989 -1996166
12595a996166k558012o73950K00462o52326m93386J684015L120093J742789m31752
$$ -1996166 -4554178 -5228128 -5027666 -5679992 -6173378 -4489363 -1369270 373519 -58233
12586e8233j19651K786074N026313L468635j660602o439987o604796k296435J444081
$$ -58233 -177884 2608190 7634503 11103138 9442536 3002549 -3602247 -5898682 -4454601
12577d454601O10408k483760k512345J048306L145966P59621k663922k519740
$$ -4454601 -3844193 -6327953 -8840298 -7791992 -4646026 -3886405 -6550327 -9070067
12569i070067L74556J706578K85460q25442P31865L621801N071515L763553K03153
$$ -9070067 -8695511 -6988933 -6703473 -7528915 -6797050 -3175249 1896266 5659819 5862972
12560E862972l598468m557341j185119L392066L755916r77337n214656l958569
$$ 5862972 2264504 -2292837 -3477956 -85890 3670026 2692689 -2521967 -6480536
12552f480536N69480K505539O90819p47615M11912J426891j57317k428880k601081
$$ -6480536 -5911056 -3405517 -2714698 -3462313 -3050401 -1623510 -1780827 -4209707 -6810788
12543f810788j260317l17845N80441K376497L467864J885291p75143j294344J43149
$$ -6810788 -8071105 -8388950 -7808509 -5432012 -1964148 -78857 -854000 -2148344 -2005195
12534b005195O07011l83732l63701J210733J749069J17261j494498j667966j803007
$$ -2005195 -1398184 -1781916 -2145617 -934884 814185 931446 -563052 -2231018 -4034025
12525d034025k244914n90746L254544M511039L26130m279628k868828K179548
$$ -4034025 -6278939 -6869685 -3615141 895898 1222028 -3057600 -5926428 -3746880
12517c746880K610445k804882n667879o46236N921035N048735j899471n562129
$$ -3746880 -1136435 -3941317 -9609196 -10255432 -4334397 714338 -1185133 -6747262
12509f747262j807505L827641M998374K119050o19793j293415p56461k35844q38538
$$ -6747262 -8554767 -4727126 271248 2390298 1770505 477090 -279371 -515215 -1353753
12500a353753l087262m983882l066248K501888O585655N326658J046616j867031
$$ -1353753 -4441015 -9424897 -12491145 -9989257 -3403602 1923056 2969672 1102641
12492A102641k806985k930533p98664M332191P403652K924882n245856p185719
$$ 1102641 -1704344 -4634877 -5433541 -1101350 6302302 9227184 3981328 -3204391
12484c204391r60724M418941K585830j630835j725417j6052j788024m829901l275966
$$ -3204391 -4165115 253826 2839656 1208821 -516596 -532648 -2320672 -7150573 -10426539
12475a0426539J557328K953278K7797j279642J334214L109960J038607j102108
$$ -10426539 -8869211 -5915933 -5888136 -7167778 -5833564 -2723604 -1684997 -2787105
12467b787105K79601K409521J013941k732902m200331j651825K654263N671966
$$ -2787105 -2507504 -97983 915958 -1816944 -6017275 -7669100 -5014837 657129
12459F57129N247173O84653n588182q544840n506540L60945L676116L023866J338375
$$ 657129 5904302 6588955 1000773 -7544067 -13050607 -12689662 -9013546 -5989680 -4651305
12450d651305R21687P76990o20832k058299q24764L192347O306829N025535N66176
$$ -4651305 -3729618 -2952628 -3573460 -5631759 -6456523 -3264176 3042653 8068188 8634364
12441H634364k313697j211158J097862O77853k568953n459399n544510k875966
$$ 8634364 6320667 5109509 6207371 6885224 4316271 -1143128 -6687638 -9563604
12433i563604Q14429K996068J963602o54118r10909J964261L624463R37035k613627
$$ -9563604 -8749175 -5753107 -3789505 -4443623 -5354532 -3390271 234192 1171227 -1442400
12424a442400j933733J657313K514754n81812l244928k709972r06299J08509Q37402
$$ -1442400 -3376133 -1718820 795934 214122 -3030806 -5740778 -6647077 -6538568 -5701166
12415e701166J645281J747573J574880K105927J821231j089413l755328j520719
$$ -5701166 -4055885 -2308312 -733432 1372495 3193726 2104313 -1651015 -3171734
12407c171734L884432N413069J132521k984723k621016o47700l11120J20726J893700
$$ -3171734 712698 6125767 7258288 4273565 1652549 1004849 693729 814455 2708155
12398B708155J596493k389315n023636j974706K952230L683823R73175m80325
$$ 2708155 4304648 1915333 -3108303 -5083009 -2130779 1553044 2526219 2045894
12390B045894k61291j066278k228583j100103J019257O56591j405904j326910
$$ 2045894 1784603 718325 -1510258 -2610361 -1591104 -934513 -2340417 -3667327
12382c667327J060093K142644O33718j038454j038028K10065J829924K523292
$$ -3667327 -2607234 -464590 169128 -869326 -1907354 -1697289 132635 2655927
12374B655927N26402l029081l522021L19754K740009n00981m120022j129026N036598
$$ 2655927 3182329 153248 -3368773 -3049019 -309010 -809991 -4930013 -6059039 -1022441
12365a022441N309766l34322l273397q77078J75948l057574m270158N33570N558848
$$ -1022441 4287325 3953003 679606 -197472 -21524 -3079098 -7349256 -6815686 -1256838
12356a256838M771459R28111p79684j028203k102466j799964J522789L337339
$$ -1256838 3514621 4442732 3663048 2634845 532379 -1267585 255204 3592543
12348C592543k98380m963804m414703r35255r87070l560939j910695M312862P752618
$$ 3592543 3294163 -1669641 -6084344 -7019599 -8006669 -11567608 -13478303 -9165441 -1412823
12339a412823M855966M45037j123727j834439l907117m428148o36097M124349
$$ -1412823 3443143 3888180 2764453 930014 -2977103 -7405251 -8041348 -3916999
12331c916999M631314J137672j757977j691577k25656P34967P11019n26748k698156
$$ -3916999 714315 1851987 94010 -1597567 -1823223 -1088256 -377237 -903985 -3602141
12322c602141l586890p72381M417300O945810L604895k615899n417025k453200
$$ -3602141 -7189031 -7961412 -3544112 3401698 7006593 4390694 -1026331 -3479531
12314c479531J807191J618858k527413m217497L23679O422285O346177o36994
$$ -3479531 -1672340 -53482 -2580895 -6798392 -6474713 -52428 6293749 5656755
12306E656755p038247o405726n05316M326567N073630L523655J836236K67717
$$ 5656755 -1381492 -7787218 -8292534 -3965967 1107663 4631318 6467554 6735271
12298F735271r66781q93196K26571M94560q09735j895647j310942m27325j188862
$$ 6735271 5768490 4875294 5101865 5596425 4786690 2891043 1580101 1152776 -36086
12289c6086k565886j665409J793700M432871L409253k1283k322250j972453n47900
$$ -36086 -2601972 -4267381 -2473681 1959190 5368443 5347160 3024910 1052457 504557
12280E04557o134l82052m93233R3723N52933k6739j471189k578094k225090n06865
$$ 504557 498423 116371 -376862 -283139 269794 243055 -1228134 -3806228 -6031318 -6538183
12270f538183J183573J448579M19304l47905J05637O68515l02512k004198j306402
$$ -6538183 -5354610 -3906031 -3486727 -3834632 -3728995 -3060480 -3362992 -5367190 -6673592
12261f673592L025907P423893O893349J191767m467392n521801k931149p18654
$$ -6673592 -3647685 3776208 10669557 11861324 7393932 1872131 -1059018 -1777672
12253a777672m54987l75969Q04481J678519L62988k446403l617568q32022M212074
$$ -1777672 -2232659 -2608628 -1804147 -125628 237360 -2209043 -5826611 -6658633 -2446559
12244b446559O285743J868783n622005q074695j991186O411554Q254096K720520
$$ -2446559 3839184 5707967 85962 -7988733 -9979919 -3568365 4685731 7406251
12236G406251k998871l836339k103105j457638p06979K592980N737250L459047
$$ 7406251 4407380 571041 -1532064 -2989702 -3696681 -1103701 4633549 8092596
12228H092596l555644p667984l662298M071967O631828J532550m544349m348905
$$ 8092596 4536952 -3131032 -6793330 -2721363 3910465 5443015 898666 -3450239
12220c450239J208825M926307K581507k485896m385203j624278K488663M425109
$$ -3450239 -2241414 2684893 5266400 2780504 -1604699 -3228977 -740314 3684795
12212C684795L208450k09842l840667n179465k994578J016396L541342K696809
$$ 3684795 6893245 6683403 2842736 -2336729 -5331307 -4314911 -773569 1923240
12204A923240o96694l910028l836072K83240M506750L421167k132125m189261
$$ 1923240 1226546 -2683482 -6519554 -6236314 -1729564 1691603 -440522 -4629783
12196d629783J628426Q327165O494916j781795n893873k594276L72732j952801
$$ -4629783 -3001357 5325808 11820724 10038929 4145056 1550780 1923512 -29289
12188b9289m043005m94968M206621L408773o09911j109285J848460K596091k67644
$$ -29289 -4072294 -4567262 -360641 3048132 2438221 1328936 3177396 5773487 5505843
12179E505843k815702l238232l323265l109582o41446K914999L966476K632800
$$ 5505843 2690141 -548091 -3871356 -6980938 -7622384 -4707385 -740909 1891891
12171A891891K472004L615564K084899k838119o242114m603615l07771K908531
$$ 1891891 4363895 7979459 10064358 7226239 984125 -3619490 -3927261 -1018730
12163a018730M413488M306844J271592l939833o671281l780600J625990M166272
$$ -1018730 3394758 7701602 8973194 5033361 -1637920 -5418520 -3792530 373742
12155C73742K843685P27855j56631l78833o48640q41899j140085j881067k471356
$$ 373742 3217427 3945282 3788651 3409818 2761178 1919279 779194 -1101873 -3573229
12146c573229k110253j181785m90872J92011J239750J608516J98336j583535r26521
$$ -3573229 -5683482 -6865267 -7356139 -7164128 -5924378 -4315862 -4117526 -5701061 -6627582
12137f627582K267034M450106K786148j077325l184631k291218p76205p64241
$$ -6627582 -4360548 89558 2875706 1798381 -1386250 -3677468 -4453673 -5217914
12129e217914j448507r47120R40863K937061L814042K637800q39970m597376n154635
$$ -5217914 -6666421 -7613541 -6672678 -3735617 78425 2716225 1876255 -2721121 -7875756
12120g875756k065472N89533J0842o35465K349487N564211K748609m164477n931801
$$ -7875756 -9941228 -9351695 -9340853 -9976318 -7626831 -2062620 685989 -3478488 -9410289
12111i410289N42325P196788O536189J335818j872854k382537k503606j091075
$$ -9410289 -8867964 -1671176 4865013 6200831 4327977 1945440 -558166 -1649241
12103a649241K882814M857707P49751m737317m054717J190098K724171j066806
$$ -1649241 1233573 6091280 6841031 2103714 -1951003 -760905 1963266 896460
12095H96460l274239l84074K669790J503930j311841k008176j455142j698237
$$ 896460 -2377779 -2761853 -92063 1411867 100026 -1908150 -3363292 -5061529
12087e061529j718891j56872J644834K210311K237066K207031J049021r97634
$$ -5061529 -6780420 -6937292 -5292458 -3082147 -845081 1361950 2410971 1413337
12079A413337j619842k71504N80229l72354j272754q46195p16801k179356l686403
$$ 1413337 -206505 -478009 102220 -270134 -1542888 -2389083 -3105884 -5285240 -8971643
12070h971643l302342j263835R66403K037105J018693j139124j261493J782420
$$ -8971643 -12273985 -13537820 -12571417 -10534312 -9515619 -10654743 -11916236 -10133816
12062a0133816M082425K240807l22703J343414M309892J785602m444955n404414
$$ -10133816 -6051391 -3810584 -4133287 -2789873 1520019 3305621 -1139334 -6543748
12054f543748L37232L958359J358665k62378L925923P008760K442885l929487
$$ -6543748 -6206516 -2248157 -889492 -1151870 2774053 9782813 12225698 8296211
12046H296211l590764O22775Q21320j737220l35826L528418K338589l486978n643128
$$ 8296211 4705447 5328222 6149542 4412322 4076496 7604914 9943503 6456525 813397
12037H13397j874097J148854M6707n95362J797847K835092j05433k669580j522323
$$ 813397 -1060700 88154 134861 -460501 1337346 4172438 4067005 1397425 -124898
12028a24898j44764j669371k545908Q14645M516185K878717k119601l852995j334510
$$ -124898 -269662 -1939033 -4484941 -3670296 845889 3724606 1605005 -2247990 -3582500
12019c582500J29309j928471l467643p11233M150413O420091M988545K319615
$$ -3582500 -3453191 -5381662 -8849305 -9560538 -5410125 1009966 5998511 8318126
12011H318126J81348j773926l716075m577646l880007k594625j181017J244368
$$ 8318126 8499474 6725548 3009473 -1568173 -5448180 -8042805 -9223822 -7979454
12003g979454M107756L934468j091342o419840n325036J919057P467373N912468
$$ -7979454 -3871698 62770 -1028572 -7448412 -12773448 -10854391 -3387018 2525450
11995B525450O11066k181298j219758R22817K966499M446745L207730j552990
$$ 2525450 3136516 955218 -264540 658277 3624776 8071521 11279251 9726261
11987I726261n673783m574933k79281J101451j745132m081520k866906o21117
$$ 9726261 4052478 -522455 -801736 299715 -1445417 -5526937 -8393843 -9014960
11979i014960l24361r05273J09270K594973M517912M620845L123529J228387L97891
$$ -9014960 -9339321 -10244594 -10135324 -7540351 -3022439 1598406 4721935 5950322 6348213
11970F348213P10998L11019j696361k868360p76518K262416J621088k631774n274175
$$ 6348213 7059211 7370230 5673869 2805509 2028991 4291407 5912495 3280721 -1993454
11961a993454l206185P42781K650257K507440K315479K140221P48047j437054
$$ -1993454 -5199639 -4456858 -1806601 700839 3016318 5156539 5904586 4467532
11953D467532k388118j122455Q73955R28408j910158m965104m227996L75466M000492
$$ 4467532 2079414 956959 1830914 2759322 849164 -4115940 -8343936 -7968470 -3967978
11944c967978L128654K75847o27728n48465k114820k762174J765418P989662P238205
$$ -3967978 -839324 -563477 -1191205 -1739670 -3854490 -6616664 -4851246 3138416 10376621
11935A0376621q38916n874483j772578L931254J816134m991532o271208l80992
$$ 10376621 9537705 3663222 1890644 5821898 7638032 2646500 -3624708 -4005700
11927d005700M494832L279490l63879k003421k468871l478971l303296m50647
$$ -4005700 489132 3768622 3404743 1401322 -1067549 -4546520 -7849816 -8300463
11919h300463K328693J545570j703990l040274l95671L809326N490693K683470
$$ -8300463 -5971770 -4426200 -6130190 -9170464 -9566135 -5756809 -266116 2417354
11911B417354k750620o320798m663173J034328N865501N885402J584982l047953
$$ 2417354 -333266 -6654064 -11317237 -10282909 -4417408 1467994 3052976 5023
11903E023m103685q68843L347560L961155J97469l223047j585552L273698M974905
$$ 5023 -4098662 -4967505 -1619945 2341210 2538679 -684368 -2269920 1003778 5978683
11894E978683J274196k935730k703430M58024J726741j77249k610024l510850
$$ 5978683 7252879 4317149 1613719 2071743 3798484 3621235 1011211 -2499639
11886b499639k715256j12502L634838N257622K007525l230693m311353l36519
$$ -2499639 -5214895 -5327397 -1692559 3565063 5572588 2341895 -1969458 -2305977
11878b305977K636269M73644k826600j425352L340676N179529K341008m76688
$$ -2305977 330292 803936 -2022664 -3448016 -107340 5072189 7413197 6936509
11870F936509J51585J697045M80583k611850l946553k472472m72121O8232m80692
$$ 6936509 7088094 8785139 9265722 6653872 2707319 234847 -237274 -169042 -649734
11861f49734q68434q15845q93861j363215j688677j103071O01230K902077M802353
$$ -649734 -1518168 -2334013 -3227874 -4591089 -6279766 -7382837 -6781607 -3879530 922823
11852I22823M905392K057913k614938m899975j515798M413492N358515r28772
$$ 922823 5828215 7886128 5271190 371215 -1144583 3268909 8627424 7698652
11844G698652p153519n666259R90051M053990J349024o38337K031232M578375
$$ 7698652 545133 -5121126 -4131075 -77085 1271939 633602 2664834 7243209
11836G243209J673053m054551o416717m595833k419379j211304J059507M236303
$$ 7243209 8916262 4861711 -1555006 -6150839 -8570218 -9781522 -8722015 -4485712
11828d485712M832083J507030k141556k185065N35011J930022K06500k084020
$$ -4485712 346371 1853401 -288155 -2473220 -1938209 -8187 198313 -1885707
11820a885707j775032O03806J754328N09876m54158J106608L356331L303795J322627
$$ -1885707 -3660739 -3056933 -1302605 -792729 -1246887 -140279 3216052 6519847 7842474
11811G842474m19291k112983m621371n259032r83884M647155M416696j562811
$$ 7842474 7423183 5310200 688829 -4570203 -5554087 -906932 3509764 1946953
11803A946953m849100j222072K964624J272970k763533k198152K082053L832454
$$ 1946953 -2902147 -4124219 -1159595 113375 -2650158 -4848310 -2766257 1066197
11795A066197J615274o41876j019665r25557n47372R41058J809337L710k256639
$$ 1066197 2681471 2039595 1019930 94373 -452999 488059 2297396 2301106 44467
11786D4467j465868J088595J752748J183811K371065L703302J183339l369868
$$ 44467 -1421401 -332806 1419942 2603753 4974818 8678120 9861459 6491591
11778F491591m027242o62077O89727j813278l134894q52646O61501j433213l333445
$$ 6491591 2464349 1802272 2491999 678721 -2456173 -3308819 -2647318 -4080531 -7413976
11769g413976j657808R56855J507762J768109L248827K857605j163736m139690
$$ -7413976 -9071784 -8114929 -6607167 -4839058 -1590231 1267374 103638 -4036052
11761d036052j642819K906345L282510k64281k639489j972761j77000K104071
$$ -4036052 -5678871 -2772526 509984 245703 -2393786 -4366547 -4543547 -2439476
11753b439476M944497N407659R39350m410665l895672J573920L728275q14955
$$ -2439476 2505021 7912680 8852030 4441365 545693 2119613 5847888 5032933
11745E032933n131316k324705M046760N205025r4040m104419j443504L472942
$$ 5032933 -98383 -2423088 1623672 6828697 6734657 2630238 1186734 4659676
11737D659676L113295k389174n543316k009384L730166N034939J741339j384160
$$ 4659676 7772971 5383797 -159519 -2168903 1561263 6596202 8337541 6953381
11729F953381k254956k663279k860128o25609L178026L589702j055659n137219
$$ 6953381 4698425 2035146 -824982 -1450591 1727435 5317137 4261478 -875741
11721h75741l055560K679688N066916K244031j141687j361363J32309M16563o31551
$$ -875741 -3931301 -1251613 3815303 6059334 4917647 3556284 3688593 4105156 3473605
11712C473605j326246j129580r19066j291852j777604j588162p19199j4909K05989
$$ 3473605 2147359 1017779 98713 -1193139 -2970743 -4558905 -5278104 -5293013 -5087024
11703e087024J038742L159166M452112J965353l007626m708363m5058O205524
$$ -5087024 -4048282 -889116 3562996 5528349 2520723 -2187640 -2232698 3972826
11695C972826O460835k40021o877106o721126o71710M397443L266064k394970
$$ 3972826 10433661 10193640 3316534 -3404592 -4076302 321141 3587205 1192235
11687A192235o059491l575998J945573L827782N20980k087010J078313O438436
$$ 1192235 -4867256 -8443254 -6497681 -2669899 -2148919 -4235929 -3157616 3280820
11679C280820O105428r62710o946246n540133n6308K000338n16922j967738O72835
$$ 3280820 9386248 8423538 1477292 -4062841 -4119149 -2118811 -2635733 -4603471 -3930636
11670c930636L268913J506234j884335j329942K386022K858862j685216m792006
$$ -3930636 -661723 844511 -1039824 -2369766 16256 2875118 1189902 -3602104
11662c602104j370881M008714L376255l012024p081820m084606K123080N354712
$$ -3602104 -4972985 -964271 2411984 -600040 -7681860 -11766466 -9643386 -4288674
11654d288674L848553k95812m107401m667405q55724M177563N632090L341136
$$ -4288674 -440121 -735933 -4843334 -9510739 -10366463 -6188900 -556810 2784326
11646B784326J657368K008795O47440l748190n843376j634945L892308L205271
$$ 2784326 4441694 6450489 7097929 3349739 -2493637 -4128582 -236274 2968997
11638B968997k478411m998331j335502K768615K067888j220576j987049O69492
$$ 2968997 490586 -4507745 -5843247 -3074632 -1006744 -2227320 -4214369 -3544877
11630c544877L738057M659092K811072j018315m272711l803053R6344K601921
$$ -3544877 193180 4852272 7663344 6645029 2372318 -1430735 -1334391 1267530
11622A267530J66375l940599l393138K241543O234749L566162k491137n200493
$$ 1267530 1433905 -2506694 -5899832 -3658289 2576460 6142622 3651485 -1549008
11614a549008l046166j3710J080731J087446P59195n74260j572335P99566N185456
$$ -1549008 -4595174 -4608884 -3528153 -2440707 -1681512 -2255772 -3828107 -3028541 2156915
11605B156915N205999j175614o510338l821044K232679J721066n125782p722738
$$ 2156915 7362914 6187300 -323038 -4144082 -1911403 -190337 -5316119 -13038857
11597a3038857r72162P442090Q658926L980581m431j440634k551432l339808k134011
$$ -13038857 -14011019 -6568929 2089997 6070578 6066147 4625513 2074081 -1265727 -3399738
11588c399738p9350K12632q74782j045823k23318J39447L05070J112929J182285
$$ -3399738 -3479088 -3266456 -4141238 -5187061 -5410379 -5270932 -4965862 -3852933 -2670648
11579b670648r20783l131895k431681J80483J166898L7038m36330R57608K511591
$$ -2670648 -3591431 -6723326 -9155007 -8974524 -7807626 -7770588 -8206918 -7249310 -4737719
11570d737719K739606J610495p02858l036836k327751K553106P071638N778135
$$ -4737719 -1998113 -387618 -1090476 -4127312 -6455063 -3901957 3169681 8947816
11562H947816K25586l018070k163326j912733m272036m524741J44316M199022
$$ 8947816 9173402 6155332 3992006 2079273 -2192763 -6717504 -6573188 -2374166
11554b374166J552012m441443n406425j47834M405996L994002J885722J511331
$$ -2374166 -822154 -5263597 -10670022 -10817856 -6411860 -2417858 -532136 979195
11546I79195P35541k839763n857173l659150K061104N326586M184125J897736
$$ 979195 1714736 -1125027 -6982200 -10641350 -8580246 -3253660 930465 2828201
11538B828201O06394p43727j919762p30449J714540J084681k244981j743586M509193
$$ 2828201 3434595 2690868 771106 40657 1755197 2839878 594897 -1148689 3360504
11529C360504Q123306K200078o591835o615396J491035O323535L168906j042781
$$ 3360504 11483810 13683888 7092053 476657 1967692 8291227 11460133 10417352
11521A0417352j322320j770381n185189o142310j030467L710544J355710l896992
$$ 10417352 9095032 7324651 2139462 -4002848 -5033315 -1322771 32939 -3864053
11513c864053m005981M0356J485546j79166q6824J731215R36932j198198J365835
$$ -3864053 -7870034 -7829678 -6344132 -6523298 -6610122 -4878907 -3941975 -5140173 -3774338
11504c774338P603441Q195791m77354r282410q222603M73937O400015M207445
$$ -3774338 3829103 12024894 11547540 2265130 -5957473 -5483536 916479 5123924
11496E123924k084516n681305l774274J217113M341405K667544j487980l115821
$$ 5123924 3039408 -2641897 -6416171 -5199058 -857653 1809891 321911 -2793910
11488b793910r45689J085024j1784j744560m00715K674223K957000M4212j233789
$$ -2793910 -3739599 -2654575 -2666359 -4410919 -4811634 -2137411 819589 863801 -369988
11479c69988J755892M561247J531821n255420p673820k852955K222465Q46344
$$ -369988 1385904 5947151 7478972 2223552 -5450268 -8303223 -6080758 -5234414
11471e234414l088048j166851N583695P270010M60610n993223m422276M93706
$$ -5234414 -8322462 -9489313 -3905618 3364392 3825002 -2168221 -6590497 -6096791
11463f096791M65073l182751l445410k04675P01392j281316q64052K593788L417523
$$ -6096791 -5631718 -8814469 -12259879 -12464554 -11763162 -13044478 -13908530 -11314742 -7897219
11454g897219j1023j839967J347962M766609L447128l32826j992383j696449j858742
$$ -7897219 -7908242 -9748209 -8400247 -3633638 -186510 -519336 -2511719 -4208168 -6066910
11445f066910j967180n91303Q55582P45130P35005K510309L706300J409808k365475
$$ -6066910 -8034090 -8625393 -7769811 -7024681 -6289676 -3779367 -73067 1336741 -1028734
11436a028734l038026Q5661L598578N041613M424495J824462k448499n740666
$$ -1028734 -4066760 -3981099 -382521 4659092 9083587 10908049 8459550 2718884
11428B718884n191154k244426j220477k694039k292325K123358N886883L608409
$$ 2718884 -2472270 -4716696 -5937173 -8631212 -10923537 -8800179 -2913296 695113
11420F95113k498827m814965n68721M471467M095983l11143k899931j765118Q5437
$$ 695113 -1803714 -6618679 -7187400 -2715933 1380050 1068907 -1831024 -3596142 -3510705
11411c510705Q01177J578685K202505J41021l863274m371652J028053O693703
$$ -3510705 -2709528 -1130843 1071662 1212683 -2650591 -7022243 -5994190 699513
11403F99513O055594O37609k915994k441704j493409k288138k913837j600437
$$ 699513 6755107 7392716 4476722 2035018 541609 -1746529 -4660366 -6260803
11395f260803P71491K780773L549364K055646j212957k917714r74570J487501
$$ -6260803 -5489312 -2708539 840825 2896471 1683514 -1234200 -2208770 -721269
11387g21269O97263j258145k31367J738414m51902m558453k851172M492246P655815
$$ -721269 -24006 -1282151 -1513518 224896 -227006 -4785459 -7636631 -3144385 4511430
11378D511430K371652k747704l4890M595634J255567p732883j1019207m820871
$$ 4511430 6883082 4135378 4100488 8696122 9951689 2218806 -8800401 -13621272
11370a3621272K849207M346464J193935o47097J243088M463943N266213K164855
$$ -13621272 -10772065 -6425601 -5231666 -5878763 -4635675 -171732 5094481 7259336
11362G259336k209406l387567o74939J504982j8501k456709k018262k34614o36301
$$ 7259336 5049930 1662363 987424 2492406 2473905 17196 -2001066 -2235680 -2871981
11353b871981j981967o12953K354050K590513L71323J34842K279505K362756n47266
$$ -2871981 -4853948 -5466901 -3112851 -522338 -151015 -16173 2263332 4626088 4078822
11344D078822j875962l8549K64303l161096m829630n47415M339370K585237l255643
$$ 4078822 2202860 2164311 2428614 -732482 -5562112 -6109527 -1770157 815080 -2440563
11335b440563m634411k09729L093945J900444P65053K796805L803621K6142m599184
$$ -2440563 -7074974 -7284703 -4190758 -2290314 -1525261 1271544 5075165 5101307 502123
11326E02123m498020j176111L39704L59272K645221N543465L216289l614825o314736
$$ 502123 -3995897 -5172008 -4832304 -4473032 -1827811 3715654 6931943 3317118 -2997618
11317b997618q93094N141750L535643k711655m625813p61923K131073N08285j572879
$$ -2997618 -3890712 1251038 4786681 2075026 -2550787 -3312710 -1181637 -673352 -2246231
11308b246231l66980J948317K149773J248695J550916K201190J125236j171162
$$ -2246231 -2613211 -664894 1484879 2733574 4284490 6485680 7610916 6439754
11300F439754k802859l426867l269846j372310K196729M294185K410261q54317
$$ 6439754 3636895 210028 -3059818 -4432128 -2235399 2058786 4469047 3614730
11292C614730r04616J798513K153158j417918l767005o14743M320463M189577
$$ 3614730 2710114 4508627 6661785 5243867 1476862 862119 5182582 9372159
11284I372159p33753l055756P03155M369804R01116o858122r604216m453880J541600
$$ 9372159 8638406 5582650 6285805 10655609 11556725 4698603 -4905613 -9359493 -7817893
11275g817893J810561j320454j673504J587992M168431L562480J297444o48280
$$ -7817893 -6007332 -7327786 -9001290 -7413298 -3244867 317613 1615057 966777
11267I66777j716711j455015K68266J789289J226238o19220j456076j072692r73802
$$ 966777 -749934 -2204949 -1936683 -147394 1078844 459624 -996452 -2069144 -3042946
11258c042946j112412k11016R71923K16755k037713k573984k01872K373122K591884
$$ -3042946 -4155358 -4366374 -3394451 -3177696 -5215409 -7789393 -7991265 -5618143 -3026259
11249c026259J312647P50465J273111J607750Q48999p03397j900614j750767p32829
$$ -3026259 -1713612 -963147 309964 1917714 2766713 2063316 162702 -1588065 -2320894
11240b320894m96768j424480j800169n96882Q15913J369606K167394L386567K485481
$$ -2320894 -2817662 -4242142 -6042311 -6639193 -5823280 -4453674 -2286280 1100287 3585768
11231C585768j123247l043833j99089L069434J088147l616970l846711R14014
$$ 3585768 2462521 -581312 -780401 2289033 3377180 -239790 -4086501 -3172487
11223c172487M316607L613544K210554J512792j258971n518316n884051j030702
$$ -3172487 1144120 4757664 6968218 8481010 7222039 1703723 -4180328 -5211030
11215e211030L426682L659500K130076R66104j305584l582428j464908L454959
$$ -5211030 -1784348 1875152 4005228 4971332 3665748 83320 -1381588 2073371
11207B073371K940099m082240o978514J36692P301946L780056m539285m890839
$$ 2073371 5013470 931230 -6047284 -5910592 1391354 5171410 632125 -4258714
11199d258714J819381M022602o35266k956274O11660K439009j770883n097537
$$ -4258714 -2439333 1583269 948003 -2008271 -1396611 1042398 -728485 -5826022
11191e826022j260419N015649N654590O89464l711149m132393j868995Q74179
$$ -5826022 -7086441 -2070792 3583798 4273262 562113 -3570280 -5439275 -4565096
11183d565096K698151K833995J836957J064871N63384n31941j494497q19165N88162
$$ -4565096 -1866945 967050 2804007 3868878 4432262 3900321 2405824 1586659 2174821
11174B174821M67427o78890l67121J073032Q13502j172873j766636k23136P32212
$$ 2174821 2642248 1963358 1596237 2669269 3482771 2309898 543262 320126 1052338
11165A052338J82614M03215J679105R22460k521324m632866k840814R6473J015359
$$ 1052338 1234952 1638167 3317272 4239732 1718408 -2914458 -5755272 -5658799 -4643440
11156d643440P99092R61806J39761k409074l727750j665376Q58951L97222j102430
$$ -4643440 -3844348 -2882542 -2742781 -5151855 -8879605 -10544981 -9686030 -9288808 -10391238
11147a0391238L90775L943901M962839K392550k58792q26397q87529j727421j941568
$$ -10391238 -10000463 -6056562 -1093723 1298827 1040035 213638 -673891 -2401312 -4342880
11138d342880m21065J305069J339862K6742j014936r84421n7767J293849K299944
$$ -4342880 -4763945 -3458876 -2119014 -2092272 -3107208 -4091629 -4149396 -2855547 -555603
11129e55603K170891J011346k75127j206354j945336k270450j592292k89791L52522
$$ -555603 1615288 2626634 2351507 1145153 -800183 -3070633 -4662925 -4952716 -4600194
11120d600194J38710N10601K156521L360125K130501r22086l378180l984113l141312
$$ -4600194 -4461484 -3950883 -1794362 1565763 3696264 2774178 -604002 -4588115 -7729427
11111g729427j156430J587460K967095Q13893k845811k668532K688843P229465
$$ -7729427 -8885857 -7298397 -4331302 -3517409 -6363220 -9031752 -6342909 886556
11103H86556M979531j659028n149509k945585M90359J315023N79382O9240p37199
$$ 886556 5866087 4207059 -942450 -3888035 -3397676 -2082653 -1503271 -1434031 -2171230
11094b171230j511958J42734L838132M835287R27804l209797k734063J36843N76105
$$ -2171230 -3683188 -3540454 297678 5132965 6060769 2850972 116909 253752 829857
11085H29857o93051Q5361J580296p59200n422451n391369N23506M461481J175015
$$ 829857 136806 222167 1802463 1043263 -4379188 -9770557 -9247051 -4785570 -3610555
11076c610555l590592j790964M545242O452528J484456l043452j102363L719523
$$ -3610555 -7201147 -8992111 -4446869 2005659 3490115 446663 -655700 3063823
11068C063823M095259o23857m238345k762002O33509R29414j564719k168648J109836
$$ 3063823 7159082 6535225 2296880 -465122 168387 1097801 -466918 -2635566 -1525730
11059a525730M633670M138391L68691k300571j828282o35961j361934k681034
$$ -1525730 3107940 7246331 7615022 5314451 3486169 2850208 1488274 -1192760
11051a192760j392971K058422L021895r67909n572046m724367N85155L127619
$$ -1192760 -2585731 -527309 2494586 1526677 -4045369 -8769736 -8184581 -5056962
11043e056962J2656k727030M76315N542685M809733q20673l186062N63256M468851
$$ -5056962 -5044306 -7771336 -7295021 -1752336 3057397 2236724 -949338 -386082 4082769
11034D082769L902026J574467O88843p32214m292185o112808k863781J619410
$$ 4082769 7984795 9559262 10248105 9515891 5223706 -889102 -3752883 -2133473
11026b133473J570662k077339l821094j866828R26048K407058K562862J232659
$$ -2133473 -562811 -2640150 -6461244 -8328072 -7402024 -4994966 -2432104 -1199445
11018a199445j117047j901185K20033K377223J865606R62443K773245M973678
$$ -1199445 -2316492 -4217677 -3997644 -1620421 245185 1207628 3980873 8954551
11010H954551L217303j376415l987149l536746k387777n68841K852269M317278
$$ 8954551 12171854 10795439 6808290 3271544 883767 314926 3167195 7484473
11002G484473k03005o241685m775385L721335Q190357K800523m854714n883483
$$ 7484473 7281468 1039783 -3735602 -14267 8176090 10976613 6121899 238416
10994B38416k453487j716272l751637l279436M14848K913356K438670J646325
$$ 238416 -2215071 -3931343 -7682980 -10962416 -10547568 -7634212 -5195542 -3549217
10986c549217J971642J607569l68314k037704j693479l6854J105561K89453k826301
$$ -3549217 -1577575 29994 -338320 -2376024 -4069503 -4106357 -3000796 -2711343 -5537644
10977e537644o153743n601680L30563P037361Q074364K984740k158172k473068
$$ -5537644 -11691387 -17293067 -16962504 -9925143 -1850779 1133961 -1024211 -3497279
10969c497279M64139K156381J167474n00577j209285j396693j932575k582462
$$ -3497279 -3033140 -876759 290715 -209862 -1419147 -2815840 -4748415 -7330877
10961g330877k326287m20158K593955M413086K612342j861206m025847k46797
$$ -7330877 -9657164 -10077322 -7483367 -3070281 -457939 -2319145 -6344992 -6591789
10953f591789O085913P526902K046273l939357m022479J34437K532410J607050
$$ -6591789 -505876 7021026 9067299 5127942 1105463 1239900 3772310 5379360
10945E379360M23674o5730k017542m915041m795419r93893J597693k33781k928619
$$ 5379360 5803034 5737304 3719762 -1195279 -5990698 -6984591 -5386898 -5620679 -8549298
10936h549298j692948K290726L901088J138099l035092m499343j528981L862403
$$ -8549298 -10242246 -7951520 -4050432 -2912333 -5947425 -10446768 -11975749 -8113346
10928h113346O753686L737302k325972m809969j691848K154431K411628O85725
$$ -8113346 -1359660 2377642 51670 -4758299 -6450147 -4295716 -1884088 -1198363
10920a198363J40407L38374k86339p77112K4620Q71463P67346P45300P24087r48064
$$ -1198363 -1057956 -719582 -1005921 -1783033 -1758413 -886950 -119604 625696 1349783 401719
10910D01719k662319j17850N429243O534156J211826k775917p86092N16436m326776
$$ 401719 -2260600 -2378450 3050793 9584949 10796775 8020858 7234766 7751202 3424426
10901C424426q113127k895450M720556L592626k673973j709317N840231P011558
$$ 3424426 -4688701 -7584151 -2863595 729031 -1944942 -3654259 2185972 9197530
10893I197530j270610p110018l478087K035469K009222J4236O69516J160325n59995
$$ 9197530 7926920 816902 -2661185 -625716 1383506 1397742 2067258 3227583 2667588
10884B667588j40138L522874L349864l604106q634986m570034K399904L095058
$$ 2667588 2527450 6050324 9400188 5796082 -2838904 -7408938 -5009034 -1913976
10876a913976m02826o07972K043902K085448J21813P62159K957744J929203j730150
$$ -1913976 -2316802 -2924774 -880872 1204576 1326389 2088548 5046292 6975495 5245345
10867E245345l352982k369269j497412l52668K462205L702125J23558l809299
$$ 5245345 1892363 -476906 -1974318 -2326986 135219 3837344 3960902 151603
10859A51603j675966L536700L361498k082146m269575p55166J323606j562956
$$ 151603 -1524363 2012337 5373835 3291689 -977886 -1733052 -409446 -1972402
10851a972402l296310K90871L456574P24879k958956m72725M739175L518810m075793
$$ -1972402 -5268712 -4977841 -1521267 -796388 -3755344 -4228069 511106 4029916 -45877
10842d5877q019230k866278M907435O595690K205659j974210k523269j253607
$$ -45877 -8065107 -10931385 -6023950 571740 2777399 803189 -1720080 -2973687
10834b973687o49472j084697j979590k521690j283984K266893N769976N877560
$$ -2973687 -3623159 -4707856 -6687446 -9209136 -10493120 -8226227 -2456251 3421309
10826C421309K493214j074818k472207k454912k291760j765400p89876l83050
$$ 3421309 5914523 4839705 2367498 -87414 -2379174 -4144574 -4934450 -5317500
10818e317500o21970j9421J664676K450857J379715K8957o00154j442069j951165
$$ -5317500 -5939470 -5958891 -4294215 -1843358 -463643 -434686 -1034840 -2476909 -4428074
10809d428074N21258N206619O292593R48448n054221m741838M75262M039484L796465
$$ -4428074 -3906816 1299803 7592396 8540844 3486623 -1255215 -779953 3259531 7055996
10800G055996K086364p50457n483446q323996m313124L579500O458180J749615
$$ 7055996 9142360 8391903 2908457 -5415539 -9728663 -6149163 309017 2058632
10792B058632l550025l505729m36703Q91164J82539l98456l13070L14447J950570
$$ 2058632 -1491393 -4997122 -5433825 -4542661 -4360122 -4758578 -5071648 -4757201 -2806631
10783b806631L612807L001336L48042j319805r56576p46158j528130j277830L30149
$$ -2806631 806176 3807512 4155554 2835749 1879173 1133015 -395115 -1672945 -1342796
10774a342796K62358k624233m423512j205612N124241Q581561N860625M7361k466006
$$ -1342796 -1080438 -3704671 -8128183 -9333795 -4209554 4372007 10232632 10279993 7813987
10765G813987P16077M141869Q14633p219452r748703k508907N817916N842399
$$ 7813987 8530064 12671933 13486566 6267114 -3481589 -5990496 -172580 5669819
10757E669819M22575j949924q78368j604323l290920r73669L193322K282549k589309
$$ 5669819 6092394 4142470 3264102 1659779 -1631141 -2604810 588512 2871061 281752
10748B81752l301859J114170K830687r10043l479063p75146K941305L781419L136204
$$ 281752 -3020107 -1905937 924750 14707 -3464356 -4239502 -1298197 2483222 5619426
10739E619426J647488k084553n078145k488141K109550L52581n549711m300831
$$ 5619426 7266914 5182361 104216 -2383925 -274375 78206 -5471505 -9772336
10731i772336M856326Q657090J171900o204809l741497J812047J085115k119222
$$ -9772336 -4916010 3741080 4912980 -1291829 -5033326 -3221279 -2136164 -4255386
10723d255386l50266L022100J199884k740857j990000J449879J605099j52735
$$ -4255386 -4605652 -1583552 -383668 -3124525 -5114525 -3664646 -2059547 -2212282
10715b212282O94306J891551q28020l985948j592840L914335N493217K696552
$$ -2212282 -1517976 373575 -454445 -4440393 -6033233 -2118898 3374319 6070871
10707F070871L36395n45785k073441l131285j313973J559232K437284K255770
$$ 6070871 6407266 5861481 3788040 656755 -657218 902014 3339298 5595068
10699E595068K526200J093417l023435n562210l648960j208937j995691l049538
$$ 5595068 8121268 9214685 6191250 629040 -3019920 -4228857 -6224548 -9274086
10691i274086j018944J298759R05706M94433K179799K478579q5106l09488L817637
$$ -9274086 -10293030 -8994271 -8088565 -7594132 -5414333 -2935754 -3020860 -3330348 487289
10682D87289N320136K33138l865546n82736L424753J30653n218704l448765K298576
$$ 487289 5807425 6040563 2175017 1592281 5017034 5147687 -71017 -3519782 -1221206
10673a221206K928685l06027M22145M213532L552895j439455l625357j564397
$$ -1221206 1707479 1401452 1823597 6037129 9590024 8150569 4525212 2960815
10665B960815j18675l31360O98007J847164k03662l231557k608093K62219Q85167
$$ 2960815 2842140 2510780 3208787 5055951 4852289 1620732 -987361 -725142 160025
10656A60025j98030l5449J98047j041037n79674L069769M566866J047856j141969
$$ 160025 -38005 -73454 124593 -916444 -1496118 1573651 6140517 7188373 6046404
10647F046404K057957L362991k668368p309657j711110O186255M017183l963707
$$ 6046404 8104361 11467352 8798984 1489327 -221783 5964472 9981655 6017948
10639F017948m832565P72872J900109k284380l013820N41356J321311n94484P22932
$$ 6017948 1185383 1958255 3858364 1573984 -1439836 -898480 422831 -171653 551279
10630E51279L216525K33393m878785l532881J565060R52349l538011k339923L075287
$$ 551279 3767804 4001197 -877588 -4410469 -2845409 -1893060 -5431071 -7770994 -4695707
10621d695707K954328j539767o45006M174228K404755m194883l068322N395794
$$ -4695707 -1741379 -3281146 -3926152 248076 2652831 -1542052 -4610374 785420
10613G85420O638267k599534q196260k774570L639155K997136R72641K644356
$$ 785420 7423687 4824153 -3372107 -6146677 -2507522 489614 1462255 4106611
10605D106611L340935O61083Q7967K338848J95526o353997p224001l03532L325874
$$ 4106611 7447546 8108629 8196596 10535444 10730970 4376973 -2847028 -3150560 175314
10596A75314j246703m081918J118582N229276p2109p732344p256899m16884M497147
$$ 175314 -1071389 -5153307 -4034725 1194551 1122442 -6609902 -13866801 -14283685 -9786538
10587i786538N332058M769942L584104J735066M60288n60488k657432l891918
$$ -9786538 -4454480 315462 3899566 5634632 6094920 5534432 2877000 -1014918
10579a014918j882323L27033p95025j493687K298259M826816k38311n734747j450368
$$ -1014918 -2897241 -2570208 -3365233 -4858920 -2560661 2266155 2027844 -3706903 -5157271
10570e157271O421047M233071m773123n482049K103735L256758m005353n272285
$$ -5157271 1263776 5496847 723724 -4758325 -2654590 602168 -3403185 -8675470
10562h675470L491091Q633528L509350j409175M54805J437648k517320l363378
$$ -8675470 -5184379 3449149 6958499 5549324 6004129 7441777 4924457 1561079
10554A561079K012794M487418k62231m366171l337837k331279k447644J652246
$$ 1561079 3573873 8061291 7799060 3432889 95052 -2236227 -4683871 -3031625
10546c031625O952759L616667n481519o365197K024314N992825J710133l35106
$$ -3031625 3921134 7537801 2056282 -4308915 -2284601 3708224 5418357 5083251
10538E083251K149472j11531o022516l692562M755861L901169n918448p471963
$$ 5083251 7232723 7121192 1098676 -2593886 2161975 6063144 144696 -7327267
10530g327267J713422N351214Q9106N04504P629406N196390o589225p832893L271828
$$ -7327267 -5613845 -262631 -173525 330979 7960385 13156775 6567550 -1265343 2006485
10521B006485N323232n399606o843222O137716J0598585j263392q244543k047340
$$ 2006485 7329717 1930111 -4913111 1224605 11823190 10559798 2315255 267915
10513B67915q76368q205918l080942J4203664J4985660l598822r011260N542035
$$ 267915 -608453 -8814371 -11895313 2308351 17294011 13695189 4683929 10225964
10505A0225964P365033r600079q889461J4860151J7340056j0740148j8332082
$$ 10225964 17590997 7990918 -898543 13961608 31301664 20561516 2229434
10498B229434R650004J7211884j4725182k2264711J7878946K7597822k5593683
$$ 2229434 11879438 29091322 14366140 -7898571 9980375 37578197 11984514
10491A1984514m1620552L0738401M8989574j10125413k87099898k14574577P6567072
$$ 11984514 -29636038 1102363 50091937 -60033476 -347133374 -561707951 -485140879
10484d85140879K64747507J79140946M174870l3995157K9207782L8085083j3080767
$$ -485140879 -220393372 -41252426 -37077556 -71072713 -41864931 -3779848 -16860615
10477a6860615k2695409J5082904K1960719p664891j0735355J5054746J3827096
$$ -16860615 -39556024 -24473120 -2512401 -10177292 -20912647 -5857901 7969195
10470G969195j4730930j6682772J0914012J6646748p307785j5001946M784568
$$ 7969195 -6761735 -23444507 -12530495 4116253 -3191532 -18193478 -13408910
10463a3408910J2989898k190629q057526M878551P296508p469916j0115568N838729
$$ -13408910 -419012 -2609641 -10667167 -5788616 1507892 -5962024 -16077592 -10238863
10455a0238863J0911843l216915q722391L854729Q505739m773220j0765285K509315
$$ -10238863 672980 -2543935 -11266326 -7411597 1094142 -3679078 -14444363 -11935048
10447a1935048J1606234J742432q080244k506294M634728O65604l310673J928526
$$ -11935048 -328814 1413618 -6666626 -9172920 -4538192 -3872588 -7183261 -5254735
10439e254735N224040r15039m651417J384999N490528P9217l998431O39431L994551
$$ -5254735 -30695 -945734 -5597151 -4212152 1278376 1357593 -2640838 -2001407 1993144
10430A993144r13285m738107n81995L632042K175289J859103N528959M012353
$$ 1993144 1079859 -3658248 -4240243 -608201 1567088 3426191 8955150 12967503
10422A2967503n507357j0920553m897961L136169L648408K21228j620056l644451
$$ 12967503 7460146 -3460407 -8358368 -5222199 -1573791 -1352563 -2972619 -6617070
10414f617070n864757l050885L252367L680159k445854m256952K009159O616624
$$ -6617070 -12481827 -15532712 -12280345 -8600186 -11046040 -15302992 -13293833 -6677209
10406f677209L642336m50431n49389k07106n79997K678852P038373L490187n946317
$$ -6677209 -3034873 -3485304 -4034693 -4241799 -4821796 -2142944 4895429 8385616 2439299
10397B439299p606812J441172P251566J880315m395391j946269L030033J835839
$$ 2439299 -5167513 -3726341 3525225 5405540 1010149 -936120 2093913 3929752
10389C929752k230757k752810j645428k379604k200430P37903K167424M50493
$$ 3929752 1698995 -1053815 -2699243 -5078847 -7279277 -6541374 -4373950 -3923457
10381c923457P44303M513168N192370R9070l858094k158085J89784q16697j239843
$$ -3923457 -3179154 1334014 6526384 6625454 2767360 609275 799059 -17638 -1257481
10372a257481J194615J279486l317490n916844j771856L926176N115527L332978
$$ -1257481 -62866 1216620 -2100870 -8017714 -9789570 -5863394 -747867 2585111
10364B585111J784703l48468k788220k107503Q11859K50778l710030l905487R27845
$$ 2585111 4369814 4021346 1233126 -874377 -62518 188260 -3521770 -7427257 -6499412
10355f499412K865743j108746l307852Q46843M716633K642340p20699l06990N35617
$$ -6499412 -3633669 -4742415 -8050267 -7203424 -2486791 155549 -565150 -872140 -336523
10346c36523j497447k296793R48747L000940J44342k429582k90039K043502J46130
$$ -336523 -1833970 -4130763 -3182016 -181076 -36734 -2466316 -2756355 -712853 -566723
10337e66723j898906M2285J953542j9183j648119O28158J717913k301901m937881
$$ -566723 -2465629 -2423344 -469802 -488985 -2137104 -1508946 208967 -2092934 -7030815
10328g030815M1564O542477N697939N35824n11684J275914j137188n930990n061887
$$ -7030815 -6989251 -446774 5251165 5786989 5275305 6551219 5414031 -516959 -5578846
10319e578846O96592K425422j338457k148896L211153O607836J903688m964778
$$ -5578846 -4882254 -2456832 -3795289 -5944185 -2733032 3874804 5778492 813714
10311H13714n323008n59829J269170j992443m275293j061233M080987M847501
$$ 813714 -4509294 -5069123 -3799953 -5792396 -10067689 -11128922 -7047935 -2200434
10303b200434P47582l132840l680058k874920k530768n00923M509059Q073527
$$ -2200434 -1452852 -4585692 -8265750 -11140670 -13671438 -14172361 -9663302 -1589775
10295a589775N240290j358236m285859j505132J878429K115256J139011J202856
$$ -1589775 3650515 2292279 -1993580 -3498712 -1620283 494973 1633984 2836840
10287B836840Q13993j448880l298360j900132J726450L674711J537064k808816
$$ 2836840 3650833 2201953 -1096407 -2996539 -1270089 2404622 3941686 1132870
10279A132870m496888j023368L427097K455890k670287l372484K842787O693691
$$ 1132870 -3364018 -4387386 -960289 1495601 -1174686 -4547170 -1704383 4989308
10271D989308J111918o509349n392135J552805L437970k68279o60042L371988
$$ 4989308 6101226 -408123 -5800258 -4247453 -809483 -1077762 -1737804 1634184
10263A634184L376200k279752m500353N73045M520126O86776n703561p136539
$$ 1634184 5010384 2730632 -1769721 -1196676 3323450 4010226 -1693335 -8829874
10255h829874m149394o78525K544972M866985L648669j09132j283456O35005J07030
$$ -8829874 -12979268 -13657793 -11112821 -6245836 -2597167 -2706299 -3989755 -3354750 -3247720
10246c247720l861142m523047R73854N723430M081175J64964m19352M79113q38302
$$ -3247720 -7108862 -11631909 -10658055 -4934625 -853450 -688486 -1107838 -628725 -1467027
10237a467027k278356m24250K837659L798386K399029R3878k786605m416917j996130
$$ -1467027 -3745383 -4169633 -1331974 2466412 4865441 4959319 2172714 -2244203 -4240333
10228d240333K387571K854860q98509k608586p3896J594662k3837p57147P33107
$$ -4240333 -1852762 1002098 103589 -2504997 -2578893 -984231 -1008068 -1765215 -1032108
10219a032108k75605m132069l804413K359252N744826J730095k157711K26657
$$ -1032108 -1307713 -5439782 -9244195 -6884943 -1140117 589978 -1567733 -1341076
10211a341076L094186N53107j923390J612142N182501J255463n004318m452631
$$ -1341076 1753110 2306217 382827 1994969 7177470 8432933 3428615 -1024016
10203a024016J95163K46043l120035k260705K071127K711555L2501P85955M535631
$$ -1024016 -828853 -582810 -3702845 -5963550 -3892423 -1180868 -1148367 -362412 4173219
10194D173219L878595j900826n099477k471943O47964O31912M58956K161760K680893
$$ 4173219 8051814 6150988 1051511 -1420432 -772468 -140556 318400 2480160 5161053
10185E161053K7186k942769l384604k152320j104097o94722p34093k93197K193201
$$ 5161053 5188239 2245470 -1139134 -3291454 -4395551 -5090273 -5824366 -6117563 -3924362
10176c924362N500916M781878j518334o878054m370145L280230P185888M012704
$$ -3924362 1576554 6358432 4840098 -2037956 -6408101 -3127871 4058017 8070721
10168H070721j540711m431455l858189j322015R07460M59712k039732k508678
$$ 8070721 6530010 2098555 -1759634 -3081649 -2174189 -1714477 -3754209 -6262887
10160f262887M63737K449862K93142k005686Q3554L617320L335163O91022L72476
$$ -6262887 -5799150 -3349288 -3056146 -5061832 -4978278 -1360958 1974205 2665227 3037703
10151C037703J335429o49937m097933l715542K92886K592531J478038K19738N35743
$$ 3037703 4373132 3723195 -374738 -4090280 -3797394 -1204863 273175 492913 1028656
10142A028656J246374K277182L706821K535796k897141p214945m186200K850462
$$ 1028656 2275030 4552212 8259033 10794829 7897688 682743 -3503457 -652995
10134f52995M661338m64873m963305l839566n21854L55490p52553j101687L15105
$$ -652995 4008343 3543470 -1419835 -5259401 -5781255 -5425765 -6178318 -7280005 -6964900
10125f964900K839687M570250L072936p83603j741764K520061N876376J699840
$$ -6964900 -4125213 445037 3517973 2734370 992606 3512667 9389043 11088883
10117A1088883o297731q469899k868522L137857M172636K271304Q27402J0182
$$ 11088883 4791152 -3678747 -6547269 -3409412 763224 3034528 3861930 3872112
10109C872112q97027j933106l420986m373157j810018L695177N437977m552n032884
$$ 3872112 2975085 1041979 -2379007 -6752164 -8562182 -4867005 570972 566420 -4466464
10100d466464j249528O401578O254255j746224o188078k232857K708421K812936
$$ -4466464 -5715992 685586 6939841 5193617 -994461 -3227318 -518897 2294039
10092B294039J443571J737715O55539l037700m430695j085223K166245J550329
$$ 2294039 3737610 5475325 6130864 3093164 -1337531 -2422754 -256509 1293820
10084A293820j00692j10249n52550k117601j307818J934081J865030k940009n240192
$$ 1293820 1193128 1082879 530329 -1587272 -2895090 -961009 904021 -2035988 -7276180
10075g276180o09447M571578L250641j303511k061275L70276Q79798n17615k71865
$$ -7276180 -7885627 -3314049 -63408 -1366919 -3428194 -3057918 -2178120 -2695735 -2967600
10066b967600J054750L72329j344790j018332K20090p36621k373146p44359L039291
$$ -2967600 -1912850 -1540521 -2885311 -3903643 -3683553 -4420174 -6793320 -7537679 -4498388
10057d498388L892643Q71509j567319o23337J527909K110815J297980M34607j97870
$$ -4498388 -605745 265764 -1301555 -1924892 -396983 1713832 3011812 3446419 3248549
10048C248549r38602j984336l285842l994825k769374J27019K285623K020068
$$ 3248549 2309947 325611 -2960231 -6955056 -9724430 -9597411 -7311788 -5291720
10040e291720L42061r02751q78594R68596M443676O338566K729489m311791o907211
$$ -5291720 -4949659 -5852410 -6731004 -5762408 -1318732 5019834 7749323 3437532 -3469679
10031c469679j789019M018624K838349k439492l280789J166996L563013O66949
$$ -3469679 -5258698 -1240074 1598275 -841217 -4122006 -2955010 608003 1274952
10023A274952k045171j31151K702259J429581j843639j824672R42355J204167
$$ 1274952 -770219 -901370 1800889 3230470 1386831 -437841 504514 1708681
10015A708681j942294l258988J70446L914547K684033j833871l784724j748912
$$ 1708681 -233613 -3492601 -3322155 592392 3276425 1442554 -2342170 -4091082
10007d091082K01750l36536p98446J074422K964099J808145j194484k735080k427313
$$ -4091082 -3889332 -4225868 -5024314 -3949892 -985793 822352 -372132 -3107212 -5534525
9998e534525k244456k370981j155239J452553L587175M307834M056510K725509
$$ -5534525 -7778981 -10149962 -11305201 -9852648 -6265473 -1957639 2098871 4824380
9990D824380J8508k577664k910925j175902M92624R99535N90892q37007k849121
$$ 4824380 4842888 2265224 -645701 -1821603 -1328979 -329444 261448 -575559 -3424680
9981c424680k968322K86939L551464K137335k461099l352431K039793P547718
$$ -3424680 -6393002 -6106063 -2554599 -417264 -2878363 -6230794 -4191001 3356717
9973C356717O310950j27532m331833k706508R77542J594185r19944k595877j302248
$$ 3356717 9667667 9540135 5208302 2501794 3479336 5073521 4153577 1557700 255452
9964B55452P14103N83446r65305j240795k38679l95700j749592j300158J497061
$$ 255452 969555 1553001 587696 -653099 -891778 -1287478 -3037070 -4337228 -2840167
9955b840167K656990l69048m216118m324555j135192J845438L329133L867901
$$ -2840167 -183177 -552225 -4768343 -9092898 -10228090 -8382652 -5053519 -1185618
9947a185618K865871P8932k080603j644949l27235r1885N28208K553901K652901
$$ -1185618 1680253 1759185 -321418 -1966367 -2293602 -2385487 -1857279 696622 3349523
9938C349523j387818m651757j311341N442784O951198J425822m323722n067096
$$ 3349523 1961705 -2690052 -4001393 1441391 8392589 9818411 5494689 427593
9930D27593k336426N16179K064303J423888j025644j658257K028606N858698L932282
$$ 427593 -1908833 -1392654 671649 2095537 1069893 -588364 1440242 7298940 11231222
9921A1231222j987781m954095l595347k624210l300260k003537J444802K834010
$$ 11231222 9243441 4289346 693999 -1930211 -5230471 -7234008 -5789206 -2955196
9913b955196J810854K360040M070447K133891k579038l333563M39212J301842
$$ -2955196 -1144342 1215698 5286145 7420036 4840998 1507435 1946647 3248489
9905C248489k931584m926234j155245J499431j605396m168190k88272M933362
$$ 3248489 316905 -4609329 -5764574 -4265143 -5870539 -10038729 -10327001 -5393639
9897e393639M460117Q67043K91612J874216J533400l8758p83284k217101l955447
$$ -5393639 -933522 -66479 225133 2099349 3632749 3593991 2810707 593606 -3361841
9888c361841j017957N815700O253937l243795r523076j764066R212394O973076
$$ -3361841 -4379798 1435902 7689839 4446044 -5077032 -6841098 2371296 9344372
9880I344372l070006k578910P052888M592919j5008028k7669284j4303646J0500672
$$ 9344372 6274366 3695456 10748344 15341263 333235 -27336049 -41639695 -31139023
9872c1139023J9298870Q625542k205110j770136K176790R87610j886424p26380
$$ -31139023 -11840153 -3214611 -5419721 -7189857 -5013067 -4025457 -5911881 -6638261
9864f638261J839940J197086k71278J727417M435977K306154k464024k219945
$$ -6638261 -4798321 -3601235 -3872513 -2145096 2290881 4597035 2133011 -86934
9856h6934L384874N550321k7649n751422l762272J912786K682768l70878L37705
$$ -86934 3297940 8848261 8820612 3069190 -693082 1219704 3902472 3531594 3869299
9847C869299M267524L028419m219306p676442k797810J998821m97664m578994
$$ 3869299 8136823 11165242 6945936 -730506 -3528316 -1529495 -2027159 -6606153
9839f606153k168354L429680M006588L21672p89156J192112J191765j096781j358564
$$ -6606153 -8774507 -5344827 -1338239 -1016567 -1805723 -613611 578154 -518627 -1877191
9830a877191M14470K03427j814951j814942k46041q06980k171637N14606N867674
$$ -1877191 -1462721 -1259294 -3074245 -4889187 -5135228 -5942208 -8113845 -7599239 -1731565
9821a731565O894723K309242j400991p43283M11280o00862p47167J348266J474785
$$ -1731565 5163158 7472400 6071409 5328126 5739406 5138544 4391377 5739643 7214428
9812G214428k428891n471717l601269l73994p63327l000065k040425K241912N437657
$$ 7214428 4785537 -686180 -4287449 -4661443 -5424770 -8424835 -10465260 -8223348 -2785691
9803b785691M990418K051847j375891l739942l715697j446872R48152J816960
$$ -2785691 2204727 4256574 2880683 -859259 -4574956 -6021828 -5073676 -3256716
9795c256716J634839J179441K7864j868385l054616k292359J03161L172237N769605
$$ -3256716 -1621877 -442436 -414572 -2282957 -5337573 -7629932 -7526771 -4354534 1415071
9786A415071O096979L197252r24160l149189l169721k940744k753874j277239
$$ 1415071 7512050 10709302 9785142 6635953 3466232 525488 -2228386 -3505625
9778c505625Q32047J319142M24907N23492J486563Q26848j098802q99524J773660
$$ -3505625 -2673578 -1354436 -929529 -406037 1080526 1907374 808572 -90952 1682708
9769A682708K907703N79221j998828j993454j011736j112741r23662J209818L461911
$$ 1682708 4590411 5169632 3170804 1177350 165614 -947127 -1870789 -660971 2800940
9760B800940K897761n88698m594676o443816m489638k6115K146911r62314m865453
$$ 2800940 5698701 5110003 515327 -5928489 -10418127 -10444242 -8297331 -9259645 -14125098
9751a4125098k552551M612491P587450K747292l043006l393378q76847j00729
$$ -14125098 -16677649 -12065158 -4477708 -1730416 -4773422 -8166800 -9043647 -9144376
9743i144376L40457K893622M461989J982606o62068J028283L432738P22187m166724
$$ -9144376 -8803919 -5910297 -1448308 534298 -127770 900513 4333251 5055438 888714
9734H88714l712808J274716K704406j278744l566789l41688K989634J356603k042368
$$ 888714 -2824094 -1549378 1155028 -123716 -3690505 -4032193 -1042559 314044 -1728324
9725a728324j780357J378678K664214L13223l216525m601780k103876K821332
$$ -1728324 -3508681 -2130003 534211 847434 -2369091 -6970871 -9074747 -6253415
9717f253415N376165K247902k849068l008562J568906K974531k300760p096910
$$ -6253415 -877250 1370652 -1478416 -4486978 -2918072 56459 -2244301 -9341211
9709i341211m083377L035815N279856J590307j109395O27769K792542J924203
$$ -9341211 -13424588 -10388773 -5108917 -3518610 -4628005 -4000236 -1207694 716509
9701G16509L68496J225512L181064L470583K378384J578894N41758k124062n165600
$$ 716509 1085005 2310517 5491581 8962164 11340548 12919442 13461200 11337138 6171538
9692F171538n576046k675234R06540K422640J664122K21044p22588j223627j592882
$$ 6171538 595492 -2079742 -1173202 1249438 2913560 3134604 2412016 1188389 -404493
9683d04493j353548k9313J093316k17995l238133l308160K066874P595368N677445
$$ -404493 -1758041 -1787354 -694038 -912033 -4150166 -7458326 -5391452 2203916 7881361
9674G881361k182161n624190L1551N870792J943037p333682r084233j084989N311762
$$ 7881361 5699200 75010 106561 5977353 7920390 586708 -8497525 -9582514 -4270752
9665d270752K693864k302729j316766K332850P31969m297348m013682K569155
$$ -4270752 -1576888 -3879617 -5196383 -2863533 -2131564 -6428912 -10442594 -7873439
9657g873439O818780L860378j006127j812184k99778o54223j843280o22876J676138
$$ -7873439 -1054659 2805719 1799592 -12592 -312370 -966593 -2809873 -3432749 -1756611
9648a756611J121609j837176k592523N73128L878069L369046j33835k795106k661870
$$ -1756611 -635002 -2472178 -5064701 -4491573 -613504 2755542 2621707 -173399 -2835269
9639b835269j302435j109740k050970j662271J575723N520305O265139K838591
$$ -2835269 -4137704 -5247444 -7298414 -8960685 -7384962 -1864657 4400482 7239073
9631G239073j460568l063400k035927q65127n88230O6589J927975L448444K362476
$$ 7239073 5778505 2715105 679178 -185949 -774179 -707590 1220385 4668829 7031305
9622G031305j204614m142549l461476J33497K704030J589703j591137l414429
$$ 7031305 5826691 1684142 -1777334 -1643837 1060193 2649896 1058759 -2355670
9614b355670k933548j793331r95200R7343J702018K871012L029422K306032M34529
$$ -2355670 -5289218 -7082549 -8077749 -7980406 -6278388 -3407376 -377954 1928078 2362607
9605B362607k345477l541126p92123L570086M096385k41834l891746k424481J278480
$$ 2362607 17130 -3523996 -4316119 -746033 3350352 3108518 -783228 -3207709 -1929229
9596a929229J919063l20377j204373L32922J384251O72980J3510P17r90101k521685
$$ -1929229 -10166 -330543 -1534916 -1201994 182257 855237 868747 869464 -120637 -2642322
9586b642322j515959K026234L118708j112439n891277m672823J443508M946970
$$ -2642322 -4158281 -2132047 986661 -125778 -6017055 -10689878 -9246370 -4299400
9578d299400K188894k202842k442290P36198K236832J94736j922039n79774L030342
$$ -4299400 -2110506 -4313348 -6755638 -6019440 -3782608 -3587872 -5509911 -6089685 -3059343
9569c059343M561800J849249k408750l509372p1849M093898M229436M22510k469904
$$ -3059343 1502457 3351706 942956 -2566416 -2638265 1455633 5685069 6107579 3637675
9560C637675j229682J446117R11576k802610n200035l573479J33166K984224M243368
$$ 3637675 2407993 3854110 4765686 1963076 -3236959 -6810438 -6677272 -3693048 550320
9551E50320L830750J056092k875823m082959q35596L013883K869182n4699r67553
$$ 550320 4381070 5437162 2561339 -1521620 -2357216 656667 3525849 3471150 2503597
9542B503597Q29582J213113j619527m036948k719542L84281J409073P5257r48829
$$ 2503597 3333179 4546292 2926765 -1110183 -3829725 -3445444 -2036371 -1961114 -2909943
9533b909943l51661P82523J171683M67723j030765k185295j407582J318997L737918
$$ -2909943 -3261604 -2479081 -1307398 -839675 -1870440 -4055735 -5463317 -4144320 -406402
9524d06402L943185K604707J285749o338j823193l233676l060062k213342k372748
$$ -406402 3536783 6141490 7427239 7420901 5597708 2364032 -696030 -2909372 -5282120
9515e282120k939577j883383N83974J899266J076290J39151P71865J950006K234730
$$ -5282120 -8221697 -10105080 -9521106 -7621840 -6545550 -6406399 -5634534 -3684528 -1449798
9506a449798K217562K753456K500566k54643m156225n778875m062278j385179
$$ -1449798 767764 3521220 6021786 5767143 1610918 -4167957 -8230235 -9615414
9498i615414K10145J429931L195165M038968K305824n21439j482966n50317l94373
$$ -9615414 -9405269 -7975338 -4780173 -741205 1564619 1043180 -439786 -990103 -1384476
9489a384476j631707j649794N95198J978097J2103k422375r04883L393159M718933
$$ -1384476 -3016183 -4665977 -4070779 -2092682 -2080579 -4502954 -5407837 -2014678 2704255
9480B704255R66055l251449l134332J45568K056947Q98287j338993k654032k699908
$$ 2704255 3670310 418861 -2715471 -2569903 -512956 385331 -953662 -3607694 -6307602
9471f307602j451004J065190L457014L498224P99465k243153k937542j142368
$$ -6307602 -7758606 -6693416 -3236402 261822 1061287 -1181866 -4119408 -5261776
9463e261776Q68832J060114k45917r39967L35473K619740L911682L426843J677511
$$ -5261776 -4392944 -3332830 -3578747 -4518714 -4183241 -1563501 2348181 5775024 7452535
9454G452535j100002m787721p536088o417472j347473L418102L731994M33588
$$ 7452535 6352533 1564812 -5971276 -12388748 -13736221 -10318119 -6586125 -6152537
9446f152537k298779k554547j953426j531827L11560M358817P708223O885214
$$ -6152537 -8451316 -11005863 -12959289 -14491116 -14179556 -9820739 -2112516 4772698
9438D772698K553397j370454k765301k943358l172301k379937K97895K876470
$$ 4772698 7326095 5955641 3190340 246982 -2925319 -5305256 -5007361 -2130891
9430b130891K732352M34445r74228k76652N61982k91467j869115k018993l06607
$$ -2130891 601461 1035906 61678 -214974 347008 55541 -1813574 -3832567 -4139174
9421d139174J754593K507748J449521n11834j643972j089599j00963l26817j011285
$$ -4139174 -2384581 123167 1572688 1060854 -583118 -1672717 -1773680 -2100497 -3111782
9412c111782p7029J766709J167447k204791l705682m05221L463340K187463k445953
$$ -3111782 -3188811 -1422102 -254655 -2459446 -6165128 -6570349 -3107009 -919546 -3365499
9403c365499l426023Q22249M185985K535485l77293R6748J768987j24612m227128
$$ -3365499 -6791522 -5969273 -1783288 752197 374904 471652 2240639 2116027 -2111101
9394b111101m572337J75076M553413M124976Q04047j396645k025518k794833l350469
$$ -2111101 -6683438 -6508362 -1954949 2170027 2974074 1577429 -448089 -3242922 -6593391
9385f593391k045150K87493Q34423r07256k247045j272936Q29787K312583L194387
$$ -6593391 -8638541 -8351048 -7516625 -8423881 -10670926 -11943862 -11114075 -8801492 -5607105
9376e607105L616368K344290q28434l191595k395210o3198Q75488R02266K155661
$$ -5607105 -1990737 353553 -474881 -3666476 -6061686 -6124884 -5249396 -4347130 -2191469
9367b191469L314496J302577k148684j590845L153054N223800Q57282m513217
$$ -2191469 1123027 2425604 276920 -1313925 1839129 7062929 7920211 3406994
9359C406994m498377q75508Q37780L77956Q81310J499278r42256m914498n858946
$$ 3406994 -1091383 -1966891 -1129111 -751155 130155 1629433 687177 -4227321 -10086267
9350a0086267l643938j606966M50574M724355P878301M055452l880477n620763
$$ -10086267 -13730205 -15337171 -14886597 -10162242 -2283941 1771511 -2108966 -7729729
9342g729729J398881P259357M299540k040952l085682m0960L06449k648268m074296
$$ -7729729 -6330848 928509 5228049 3187097 101415 60455 366904 -2281364 -6355660
9333f355660k665199j121440J19594K600037M692241L164056q49618k992044k068529
$$ -6355660 -9020859 -10142299 -10022705 -7422668 -2730427 433629 -415989 -3408033 -5476562
9324e476562l19429J454779L730616M380052P60766m702247o579296m002118r05459
$$ -5476562 -5795991 -4341212 -610596 3769456 4530222 -172025 -6751321 -10753439 -11658898
9315a1658898R34146L146260M911111K616451k888419n065584p93716M561415
$$ -11658898 -10724752 -7578492 -2667381 -50930 -2939349 -8004933 -8798649 -4237234
9307d237234M807633J304593l87366J131504K558017J793387K26221l88592k48704
$$ -4237234 570399 1874992 1487626 2619130 5177147 6970534 7196755 6808163 6559459
9298F559459m54475j353102k143623j608209K85476J520937K9526l368446n550317
$$ 6559459 6104984 4751882 2608259 1000050 1285526 2806463 2835989 -532457 -6082774
9289f082774m684204j643996J773518L870195K939490p27279l077948n04606L975724
$$ -6082774 -10766978 -12410974 -10637456 -6767261 -3827771 -4555050 -7632998 -8137604 -4161880
9280d161880L528919k316406n763009j802086M270179M907309J189949m03971
$$ -4161880 -632961 -2949367 -8712376 -10514462 -6244283 -1336974 -147025 -550996
9272e50996J206541J352232j207174k166525M12809K646952J483506o30644n55744
$$ -550996 655545 2007777 800603 -1365922 -953113 1693839 3177345 2546701 1990957
9263A990957O18839O01221o4175l19000j382433l543121l533793N07195M325089
$$ 1990957 2609796 3211017 3146842 2827842 1445409 -2097712 -5631505 -5124310 -799221
9254g99221K897894j614691k915789k45882J229688n65162j957285r75461o08496
$$ -799221 2098673 483982 -2431807 -2677689 -1448001 -2013163 -3970448 -4945909 -5554405
9245e554405k115210j758750J890071L678275J93173l245635n89451M519807M267915
$$ -5554405 -7669615 -9428365 -7538294 -3860019 -3666846 -6912481 -7501932 -2982125 1285790
9236A285790n63765k302935N34382J458174j939002l664213r9689L400253J470359
$$ 1285790 722025 -1580910 -1046528 411646 -1527356 -5191569 -5291258 -1891005 -420646
9227d20646k537398k432386J276131L398408K029889n33464k060678j466533J556832
$$ -420646 -2958044 -5390430 -4114299 -715891 1313998 780534 -1280144 -2746677 -1189845
9218a189845M528890L194520k093390n168244k964142n07797k032020k915930
$$ -1189845 3339045 6533565 4440175 -728069 -3692211 -4200008 -6232028 -9147958
9210i147958K205506Q293604O306915k063008o253136k763587R69985j56708j757422
$$ -9147958 -6942452 1351152 7658067 5595059 -658077 -3421664 -2451679 -2608387 -4365809
9201d365809N75983L440350K327059o02746j003575L61172J19620j595115k308591
$$ -4365809 -3789826 -349476 1977583 1374837 371262 732434 852054 -743061 -3051652
9192c051652j675377p18314R20833L339449M278530K081580j215798k732320k724297
$$ -3051652 -4727029 -5445343 -4524510 -1185061 3093469 5175049 3959251 1226931 -1497366
9183a497366k986328l321275k466763q40781K78899R12865J623145K125601K302781
$$ -1497366 -4483694 -7804969 -10271732 -11112513 -10833614 -9920749 -8297604 -6172003 -3869222
9174c869222K680491K527752J33511l369961l721719M53907M513749L741172l61502
$$ -3869222 -1188731 1339021 1472532 -1897429 -5619148 -5165241 -651492 3089680 2728178
9165B728178k972177k492482o74842J280039K815533K321987m80042k133062L42203
$$ 2728178 -243999 -2736481 -3411323 -2131284 684249 3006236 2526194 393132 735335
9156G35335M204447M360829R18393j333977n35453J07974j611957l332789k319769
$$ 735335 4939782 9300611 10219004 8885027 8349574 8457548 6845591 3512802 1193033
9147A193033K52975J323128R6441j496529j292896J008258L443361L464026P84913
$$ 1193033 1446008 2769136 2865577 1369048 76152 1084410 4527771 7991797 8776710
9138H776710k119371l134328k596676j222212J434865M311712L778801j154803
$$ 8776710 6657339 3523011 926335 -295877 1138988 5450700 9229501 8074698
9130H074698n392771m048114K43835J594308J01904J90317J406658p98185m994619
$$ 8074698 2681927 -1366187 -1122352 471956 573860 764177 2170835 1372650 -3621969
9121c621969l817280L349747O972156J594360m870586l089899L278616L883713
$$ -3621969 -7439249 -4089502 2882654 4477014 -393572 -3483471 -204855 3678858
9113C678858k102064n621629j844682M253149O615959M839318J120676l012859
$$ 3678858 1576794 -4044835 -5889517 -1636368 4979591 9818909 10939585 7926726
9105G926726n408608m205912j466838j105119k502951j436987K108013L277290
$$ 7926726 2518118 -1687794 -3154632 -4259751 -6762702 -8199689 -6091676 -2814386
9097b814386P74337q76765K07377j17540l223968l183196L083161Q071833M071663
$$ -2814386 -2040049 -2916814 -2709437 -2826977 -6050945 -9234141 -6150980 1920853 5992516
9088E992516m021361n521542j04150L062609Q37698k19468L134928M921660R91431
$$ 5992516 1971155 -3550387 -3654537 -591928 245770 26302 3161230 8082890 9074321
9079I074321l331620k417079M19262m09726k903156j901632J098838P98963j897388
$$ 9074321 5742701 3325622 3744884 3335158 432002 -1469630 -370792 428171 -1469217
9070a469217j110072L580767N863677K693441j413606j983535n72209n58130j758455
$$ -1469217 -2579289 1001478 6865155 9558596 8144990 6161455 5589246 5031116 3272661
9061C272661k233185j935688j839102j941521k009601k049456j099516J630373
$$ 3272661 1039476 -896212 -2735314 -4676835 -6686436 -8735892 -9835408 -8205035
9053h205035L897858K469132j167254j724406J645298L220060l73620m408802
$$ -8205035 -4307177 -1838045 -3005299 -4729705 -3084407 135653 -237967 -4646769
9045d646769l443550L32061J556329N43852J181169K696709Q46436l559473m499336
$$ -4646769 -8090319 -7758258 -6201929 -5658077 -4476908 -1780199 -933763 -4493236 -8992572
9036h992572R4118N141088N829571K963224n58736l480259m569783k253022J704139
$$ -8992572 -8898454 -3757366 2072205 5035429 4476693 996434 -3573349 -5826371 -4122232
9027d122232K645595k29195j929718N95793L291269J458532k571839l080969M61442
$$ -4122232 -1476637 -1705832 -3635550 -3039757 251512 1710044 -861795 -3942764 -3481322
9018c481322L465174L225645J171064r26522k580852k820839q15814J625070J586598
$$ -3481322 -16148 3209497 4380561 3454039 873187 -1947652 -2763466 -1138396 448202
9009D48202p49604k378628j893205p34494j34057K11930L41637j99386n79401
$$ 448202 -301402 -2680030 -4573235 -5307729 -5441786 -5229856 -4888219 -5087605 -5667006
9000e667006N73677K419930K587751Q89218k66839M27976J492178J102222p64515
$$ -5667006 -5093329 -2673399 -85648 803570 536731 964707 2456885 3559107 2794592
8991B794592k718948k877119k37975K985238K336774k651102n800656k367589
$$ 2794592 75644 -2801475 -3039450 -54212 2282562 -368540 -6169196 -8536785
8983h536785K937690K471744j870619j390079M398788N903169m88648n221096
$$ -8536785 -5599095 -3127351 -4997970 -6388049 -1989261 3913908 3425260 -1795836
8975a795836p02046N960994M410311k234157l199081J990387L526172j980763
$$ -1795836 -2497882 3463112 7873423 5639266 2440185 4430572 7956744 5975981
8967E975981o542904m229015N55301J769439N29922N99803J286335j26647k884138
$$ 5975981 -566923 -4795938 -4240637 -2471198 -1941276 -1341473 -55138 -181785 -3065923
8958c065923m070187k935909q80727Q96678J730872J392128Q48160J182770J537129
$$ -3065923 -7136110 -10072019 -10952746 -10056068 -8325196 -6933068 -6084908 -4902138 -3365009
8949c365009O76575J28360K081042M581612L506839n57923k723877j794263j926162
$$ -3365009 -2688434 -2560074 -479032 4102580 7609419 7051496 4327619 2533356 607194
8940F07194m628344n392862j409028L113584L365352Q34786m73894l79374n55212
$$ 607194 -4021150 -9414012 -10823040 -7709456 -4344104 -3509318 -3983212 -4362586 -4917798
8931d917798j35515J817436K716683L70743k131915n65026L364770M133985M55848
$$ -4917798 -5053313 -3235877 -519194 -148451 -2280366 -2845392 519378 4653363 5109211
8922E109211l348734l526627o66730K391462L426066J945490m52244j588163j706456
$$ 5109211 1760477 -1766150 -2432880 -41418 3384648 5330138 4877894 3289731 1583275
8913A583275k875093m358531k340167L448502P157829M598782l62970j677424
$$ 1583275 -1291818 -5650349 -7990516 -4542014 2615815 7214597 6851627 5174203
8905E174203K55022R93709j38375o28908p43343k477688l904625j084620M528976
$$ 5174203 5429225 6422934 6284559 5655651 4912308 2434620 -1470005 -2554625 1974351
8896A974351O535037K188766m172018p009472n039609o04279K864023K798170
$$ 1974351 8509388 10698154 6526136 -483336 -5522945 -6127224 -3263201 -465031
8888d65031o8836j917235j013186m80227k634041l891184l55043M679382N189936
$$ -465031 -533867 -2451102 -3464288 -3944515 -6578556 -10469740 -10824783 -6145401 -955465
8879i55465K010400Q16845K198562J552036j758994l212414j463807p3840j21791
$$ -955465 1054935 1871780 4070342 5622378 3863384 650970 -812837 -886677 -1008468
8870a008468J087544K876351J058616l229247l258186J786971L825835j258526
$$ -1008468 79076 2955427 4014043 784796 -2473390 -686419 3139416 1880890
8862A880890o213616l705413K371802L827931N10526j780771j313483p42270l10278
$$ 1880890 -4332726 -8038139 -5666337 -1838406 -1327880 -3108651 -4422134 -5164404 -5474682
8853e474682J874780M131162K435452k612454n382675k633306K319906L818272
$$ -5474682 -3599902 531260 2966712 354258 -5028417 -7661723 -5341817 -1523545
8845a523545J99025m556503m855917K76649N333784M688307J41615j518842J777551
$$ -1523545 -1324520 -5881023 -10736940 -10460291 -5126507 -438200 -296585 -1815427 -37876
8836c7876N159004M996391L348155K180141m96708n124834p203983m156113m80250
$$ -37876 5121128 10117519 13465674 15645815 15149107 10024273 2820290 -1335823 -1816073
8827a816073q05438k363238k02193L998933M749709J641494r02102r79031m16622
$$ -1816073 -2621511 -4984749 -5186942 -1188009 3561700 5203194 4301092 3322061 2905439
8818B905439J30341J654426K910243J155190l046460n725731m449869o17534K676293
$$ 2905439 3035780 4690206 7600449 8755639 5709179 -16552 -4466421 -5083955 -2407662
8809b407662K946062q1446l173080k158201K122735L624973m73809n009410m132690
$$ -2407662 538400 456954 -2716126 -4874327 -2751592 873381 399572 -4609838 -8742528
8800h742528N63221L650832L787398K901590J036673k153074l708530j291207
$$ -8742528 -8179307 -4528475 -741077 2160513 3197186 1044112 -2664418 -3955625
8792c955625J632928O34391k053630j248385K080538K634646J84735n15636J329399
$$ -3955625 -2322697 -1688306 -3741936 -4990321 -2909783 -275137 -90402 -606038 723361
8783G23361J412563j389157k871931r41844J317321J528461J055821P23161p63399
$$ 723361 2135924 746767 -2125164 -3067008 -1749687 -221226 834595 1557756 794357
8774G94357k561683j459201K265449L959259J530709j522728j871552n72180K31148
$$ 794357 -1767326 -3226527 -961078 2998181 4528890 3006162 1134610 562430 793578
8765G93578M04214p9007j855960l377688j606336K878508N504956L900513O02942
$$ 793578 1197792 1118785 -737175 -4114863 -5721199 -2842691 2662265 6562778 7165720
8756G165720j415455j797958p00605J606782K280621j528630o439387n219337
$$ 7165720 5750265 3952307 3251702 4858484 7139105 5610475 -828912 -6048249
8748f048249K428077P652962M336456k568869m738622j433187K144494L302426
$$ -6048249 -3620172 4032790 8369246 5800377 1061755 -371432 1773062 5075488
8740E075488L151851K080685o60714l826028m825574l301121j278129j33831N48664
$$ 5075488 8227339 10308024 9647310 5821282 995708 -2305413 -3583542 -3717373 -3168709
8731c168709J499776K475326K224730k32818l400017l576781K68957L433416J213567
$$ -3168709 -1668933 806393 3031123 2798305 -601712 -4178493 -3909536 -476120 737447
8722G37447l463192l445510J864473N415336L262029k22219l81411Q94821J78268
$$ 737447 -2725745 -6171255 -4306782 1108554 4370583 4148364 3766953 4661774 4840042
8713D840042j223059n78079J017085J172162M46106R2629j062609l784206n734503
$$ 4840042 3616983 3038904 4055989 5228151 5674257 5766886 4704277 920071 -4814432
8704d814432m986003k845998l10958L977819Q938656R308735L248349l061729
$$ -4814432 -9800435 -12646433 -12957391 -8979572 -40916 9267819 12516168 9454439
8696I454439l576826o92442Q9216q64770k60940M31566j960509m520393j841177
$$ 9454439 5877613 5185171 5274387 4409617 4148677 4580243 2619734 -1900659 -3741836
8687c741836M075760N699956J403980k690586k694650j397391j506286j336130
$$ -3741836 333924 6033880 7437860 4747274 2052624 655233 -851053 -2187183
8679b187183N52246K131050J786328R25590P61381M13679l84609m49373j243o26903
$$ -2187183 -1634937 496113 2282441 3208031 3969412 4383091 3998482 3549109 3547866 2920963
8669B920963j778113j207968P80772J729515J698942K711826L515908P24746m103519
$$ 2920963 1142850 -65118 715654 2445169 4144111 6855937 10371845 11096591 6993072
8660F993072n018855j083686J459636p79030k935973o25219K470603J373008j405203
$$ 6993072 1974217 890531 2350167 1571137 -1364836 -1990055 480548 1853556 448353
8651D48353p16633J720587L71656l921586m702757m19154L153946K071426n73191
$$ 448353 -268280 1452307 1823963 -2097623 -6800380 -7219534 -4065588 -1994162 -2567353
8642b567353p04740P65991Q92471l68575j199664j154753p65786j6762P97258
$$ -2567353 -3272093 -2506102 -1613631 -1982206 -3181870 -4336623 -5102409 -5119171 -4321913
8633d321913P23213K53192J292657L277928K455986k152875n249739j994658M013532
$$ -4321913 -3598700 -3345508 -2052851 1225077 3681063 1528188 -3721551 -5716209 -1702677
8624a702677M891321k39078m151553k501546M58346J3699j117637J833916O681301
$$ -1702677 3188644 2949566 -1201987 -3703533 -3245187 -3231488 -4349125 -2515209 4166092
8615D166092P114349K451674j898938l000853l044062l232632j646748J238186
$$ 4166092 11280441 13732115 11833177 8832324 5788262 2555630 908882 2147068
8607B147068J403824j525106k117409J903164M455494L25311n525947m896698
$$ 2147068 3550892 2025786 -91623 1811541 6267035 6592346 1066399 -3830299
8599c830299R58454L559402M60126k093605j23735K523730J842129j23451k62403
$$ -3830299 -2871845 687557 1147683 -945922 -1069657 1454073 3296202 3172751 2910348
8590B910348R5664j170262k307269j044547R00092R01920n8824k06623j199045
$$ 2910348 3006012 1835750 -471519 -1516066 -615974 285946 227122 20499 -1178546
8581a178546m516988o267719j788268N753355Q028868L244694j429073r51720
$$ -1178546 -5695534 -11963253 -13751521 -7998166 30702 3275396 1846323 894603
8573H94603O91676j461079m303942j862198M094812N967974J905999j679392l55717
$$ 894603 1586279 125200 -4178742 -6040940 -1946128 4021846 5927845 4248453 3892736
8564C892736K092414P31971k580253k909523k75421J202646J96561q98403j004322
$$ 3892736 5985150 6717121 4136868 1227345 951924 2154570 2351131 1452728 448406
8555D48406j314443j275193J272891M889614M410582j617853p438954p126660
$$ 448406 -866037 -2141230 -868339 4021275 8431857 6814004 -624950 -7751610
8547g751610k096902J706964J751115M31953K24156J075060K194156L174297L063744
$$ -7751610 -9848512 -8141548 -6390433 -5958480 -5734324 -4659264 -2465108 709189 3772933
8538C772933Q66436k440715m139017k532548J471669N295122O218526K882440
$$ 3772933 4639369 2198654 -1940363 -4472911 -3001242 2293880 8512406 11394846
8530A1394846k964903o738616n128777j36244K708836O15353l350759m072337
$$ 11394846 8429943 1691327 -3437450 -3573694 -864858 -249505 -3600264 -7672601
8522g672601l16904M086861M832901K043138k56418N12606K244673J568014j031148
$$ -7672601 -7989505 -3902644 930257 2973395 2716977 3229583 5474256 7042270 6011122
8513F011122k169828r66438o4518r46945j862312j538251j274323j600356o38498
$$ 6011122 3841294 2874856 2810338 1863393 1081 -1537170 -2811493 -4411849 -5050347
8504e050347J812097K443351j49279k120629n02254J171462j301520m645605k614100
$$ -5050347 -3238250 -794899 -944178 -3064807 -3567061 -2395599 -3697119 -8342724 -10956824
8495a0956824L248535N117235J180110j593899R41104L411361K29109m613228
$$ -10956824 -7708289 -2591054 -1410944 -3004843 -2063739 1347622 1576731 -3036497
8487c036497l377562L331298P107619L569560k327760l990524j505741M58576
$$ -3036497 -6414059 -3082761 4024858 7594418 5266658 1276134 -229607 228969
8479B28969N3333l15295P69348J077979j000391k594641j67306M301975N210221
$$ 228969 282302 -32993 736355 1814334 813943 -1780698 -1948004 2353971 7564192
8470G564192J411254k130053j919447m12735n94279r43655N05570J543072r3305
$$ 7564192 8975446 6845393 4925946 4513211 3918932 2975277 3480847 5023919 4930614
8461D930614j909004j272848r80024l867869n624272r88674N574527M885222k199814
$$ 4930614 3021610 1748762 768738 -3099131 -8723403 -9712077 -4137550 747672 -1452142
8452a452142n255396m73989M078491K318707j012416l59367J185245p29941k679407
$$ -1452142 -6707538 -7181527 -3103036 -784329 -1796745 -2156112 -970867 -1700808 -4380215
8443d380215J32286M316668L596130m53442j219805J990582L540951P03405l320118
$$ -4380215 -4247929 68739 3664869 3211427 1991622 3982204 7523155 8226560 4906442
8434D906442m958061l552156l5854L195670K787801r63348k622518O09393L185965
$$ 4906442 -51619 -3603775 -3639629 -443959 2343842 1380494 -1242024 -632631 2553334
8425B553334o71830o765287o562342m99131L168771J662647M22287K106323K430569
$$ 2553334 1881504 -4883783 -11446125 -11945256 -8776485 -7113838 -6691551 -4585228 -2154659
8416b154659o99668k784746j074351N63928o44280j130699J601792L250484M04003
$$ -2154659 -2854327 -5639073 -6713424 -6149496 -6793776 -7924475 -6322683 -3072199 -2668196
8407b668196k300303J18683L439057R42551m071261k408170N456946Q336719J090340
$$ -2668196 -4968499 -4849816 -1410759 -468208 -4539469 -6947639 -1490693 6846026 7936366
8398G936366o917539n282885K642775N606483P59309m181167l797860j491159
$$ 7936366 1018827 -4264058 -1621283 3985200 4744509 563342 -3234518 -4725677
8390d725677j194195l07138M025754P294988L670257l185076l792853K637456
$$ -4725677 -5919872 -6227010 -2201256 5093732 8763989 5578913 1786060 4423516
8382D423516O087111R08557n195405l113023L534738M361258j796896o095900
$$ 4423516 10510627 11419184 6223779 3110756 6645494 11006752 9209856 3113956
8374C113956l604084R86016K473519J826790J268252k36493k958752l642043r05825
$$ 3113956 -490128 495888 2969407 4796197 6064449 5827956 2869204 -772839 -1678664
8365a678664J123655j194456m998646n062228j175568K517663L490463K648820
$$ -1678664 -555009 -1749465 -6748111 -11810339 -12985907 -10468244 -6977781 -4328961
8357d328961J667946J313316J304778K36778k655568m841945k665002K734871
$$ -4328961 -2661015 -1347699 -42921 193857 -2461711 -7303656 -9968658 -7233787
8349g233787N682927L901413J449734J275768N47812k488835l169438J599152
$$ -7233787 -1550860 2350553 3800287 5076055 5623867 3135032 -34406 1564746
8341A564746N302987M36740q088981q107464J787765R406893O179197j928070
$$ 1564746 6867733 7304473 -784508 -8891972 -7104207 2302686 8481883 6553813
8333F553813m862144k178756l33558j648354k759671j524608M90426J720048K300038
$$ 6553813 1691669 -487087 -820645 -2468999 -5228670 -6753278 -6262852 -4542804 -2242766
8324b242766K074406L29136k074825k721423m14015L274648N304459L514144j491032
$$ -2242766 -168360 160776 -1914049 -4635472 -5049487 -1774839 3529620 7043764 5552732
8315E552732o091964o486094k727670J236002K385222J813427J856190K090179
$$ 5552732 -539232 -7025326 -9752996 -8516994 -6131772 -4318345 -2462155 -371976
8307c71976O08498j928156k435893K96719L745375M725666K725518m81883l098731
$$ -371976 236522 -1691634 -4127527 -3830808 -85433 4640233 7365751 6883868 3785137
8298C785137m163293l274813r86162P99429L26107j667746k302060j16174K786253
$$ 3785137 -378156 -3652969 -4639131 -3839702 -3513595 -5181341 -7483401 -7599575 -4813322
8289d813322L519909K425777K149224L039108K315956j311043m961403n326021
$$ -4813322 -1293413 1132364 3281588 6320696 8636652 7325609 2364206 -2961815
8281b961815k904973m06482J128050K174052K511864K055085K429055M500094
$$ -2961815 -5866788 -6273270 -5145220 -2971168 -459304 1595781 4024836 8524930
8273H524930N440454J866557m565107q293004o611800k041156J961281M062212
$$ 8524930 13965384 15831941 11266834 2973830 -3637970 -5679126 -3717845 344367
8265C44367L659617M69304l335522m066649j136429K001745K580276J413549L03150
$$ 344367 4003984 4473288 1137766 -2928883 -4065312 -2063567 516709 1930258 2233408
8256B233408k77304K4262J569434K568936M33850l442220m330729j348736N44042
$$ 2233408 1956104 1980366 3549800 6118736 6552586 3110366 -1220363 -2569099 -2025057
8247b025057j591897l510343n24512M589939N597718K068463q51287o43666l6952
$$ -2025057 -3616954 -7127297 -7651809 -3061870 2535848 4604311 3753024 3109358 3072406
8238C072406j331728k768610j884122O60767K280726J959107J303707K238863
$$ 3072406 1740678 -1027932 -2912054 -2251287 29439 1988546 3292253 5531116
8230E531116L835733K485864k982249p464994m853554K602990N528390J89856
$$ 5531116 9366849 11852713 8870464 1405470 -3448084 -845094 4683296 4873152
8222D873152n687403m027887K096465M166233J063802j430992j309748j816770
$$ 4873152 -814251 -4842138 -2745673 1420560 2484362 1053370 -256378 -2073148
8214b073148k850211L6801O095290P202811m46575q849463p974878R82831P797713
$$ -2073148 -4923359 -4886558 1208732 8411543 7964968 -884495 -8859373 -7876542 -78829
8205g8829O489397R50992k304371k035609j139299r37077N0753K168553K698774
$$ -78829 6410568 7361560 5057189 3021580 1882281 945204 995957 3164510 5863284
8196E863284k87927m087178m398615j514458J81512q77722j387107N92248K157668
$$ 5863284 5575357 1488179 -2910436 -4424894 -4243382 -5121104 -6508211 -5915963 -3758295
8187c758295J131640L51598K306191L808757J174388k891404l336833p26333Q79663
$$ -3758295 -2626655 -2275057 31134 3839891 5014279 2122875 -1213958 -1940291 -1060628
8178a060628J240272K467039K696852j203934o134650n860597r36748K236630
$$ -1060628 179644 2646683 5343535 4139601 -1995049 -7855646 -8792394 -6555764
8170f555764J704010J091529R42911j730577m769864k000379M951220O462871
$$ -6555764 -4851754 -3760225 -2817314 -4547891 -9317755 -11318134 -6366914 95957
8162I5957j0339n045201k116903K907569L141709J459726K313725K274472j971491
$$ 95957 85618 -4959583 -7076486 -4168917 -1027208 432518 2746243 5020715 3049224
8153C049224m535969M4349M992008J041901p076481o909585J619601N822192K68587
$$ 3049224 -1486745 -1442396 3549612 4591513 -2484968 -9394553 -7774952 -1952760 -1684173
8144a684173n561943k970891L326633L832179j859131n874523k858003M532885
$$ -1684173 -7246116 -10217007 -6890374 -3058195 -4917326 -10791849 -13649852 -9116967
8136i116967R075745N853669k684718q200383n227248K169149N503126K485608
$$ -9116967 -41222 5812447 3127729 -5072654 -10299902 -8130753 -2627627 -142019
8128a42019j581081k211771n77060M77086O05798P26251Q92507P01616j67612
$$ -142019 -1723100 -3934871 -4511931 -4034845 -3429047 -2702796 -1810289 -1108673 -1276285
8119a276285j896498l330289k114075J690519M149988K714262N56380J724083
$$ -1276285 -3172783 -6503072 -8617147 -6926628 -2776640 -62378 494002 2218085
8111B218085M405695L907881K97371k420155l168045l894028l886936n14077M372984
$$ 2218085 6623780 10531661 10829032 8408877 5240832 1346804 -2540132 -3054209 1318775
8102A318775N169799O98504l813169m145484j759902o0639j94547j310868j566056
$$ 1318775 6488574 7187078 3373909 -771575 -2531477 -2592116 -2786663 -4097531 -5663587
8093e663587P51087L868540K552816l939045p411031j273662P660381P303987
$$ -5663587 -4912500 -1043960 1508856 -2430189 -9841220 -11114882 -3454501 3849486
8085C849486j568001o361973k017002K837754J682403m48783J288702K132260
$$ 3849486 2281485 -4080488 -6097490 -3259736 -1577333 -2026116 -737414 1394846
8077A394846k040417n088745q70726M779283K861914l779633n103015K29877M263009
$$ 1394846 -645571 -5734316 -6605042 -1825759 1036155 -2743478 -7846493 -7616616 -3353607
8068c353607L191873J297287J550601J325515j104918l060430k465954j043674
$$ -3353607 -161734 1135553 2686154 4011669 2906751 -153679 -2619633 -3663307
8060c663307r23448k029052l379057l563444n44059N235718Q792376O114637M20713
$$ -3663307 -4586755 -6615807 -9994864 -13558308 -14102367 -8866649 -74273 6040364 6461077
8051F461077k067979j199947j799596m375658l955170R65298N139361M491872
$$ 6461077 4393098 3193151 1393555 -2982103 -6937273 -5971975 -832614 3659258
8043C659258J459213l05883j199858k371361k098782M80058K116781M45168j143746
$$ 3659258 5118471 4812588 3612730 1241369 -857413 -377355 1739426 2184594 1040848
8034A040848J338693M996752L541936k773330o744672m428965k15991M16164j605146
$$ 1040848 2379541 7376293 10918229 8144899 1400227 -3028738 -3244729 -2828565 -4433711
8025d433711k041660j51072J789496L025632L678944J666112m040072q234447
$$ -4433711 -6475371 -6626443 -4836947 -1811315 1867629 3533741 -506331 -8740778
8017h740778m540994L778966N963376n34529m907790P74170Q364757N833996l472442
$$ -8740778 -13281772 -9502806 -3539430 -4073959 -8981749 -8207579 157178 5991174 2518732
8008B518732n800432J460682O496904K446602l018348k008840J375993L19650
$$ 2518732 -3281700 -1821018 4675886 7122488 4104140 2095300 3471293 3790943
8000C790943k774097k304838j27242q91849k293604L89919M083706K221184l198209
$$ 3790943 1016846 -1287992 -1415234 -2307083 -4600687 -4210768 -127062 2094122 -1104087
7991a104087l939525Q73991L391795J98824k496760L36382M524055L741883j171671
$$ -1104087 -5043612 -4169621 -777826 -579002 -3075762 -2739380 1784675 5526558 4354887
7982D354887m508552l599434o01352J303243P73139j082613j596840M20862K441641
$$ 4354887 -153665 -3753099 -4354451 -3051208 -2278069 -3360682 -4957522 -4536660 -2095019
7973b095019J377696j460096k042864n6534P49051p25456p68632K625798N568702
$$ -2095019 -717323 -2177419 -4220283 -4276817 -3527766 -4253222 -5021854 -2396056 3172646
7964C172646L668592j657350n430830n311241k729361J52049J830618J356600
$$ 3172646 6841238 5183888 -246942 -5558183 -8287544 -8135495 -6304877 -4948277
7956d948277n69440j430120J31654K258321K550905J342969K55002r16091l012835
$$ -4948277 -5517717 -6947837 -6816183 -4557862 -2006957 -663988 -408986 -1325077 -4337912
7947d337912m247041j685394L600688O224610L046298k383366m347954k291037
$$ -4337912 -8584953 -10270347 -6669659 -445049 2601249 217883 -4130071 -6421108
7939f421108m71891r32607q17335K013997M609072L383634J30396q46514Q3351
$$ -6421108 -6892999 -7825606 -8642941 -6628944 -2019872 1363762 1494158 647644 730995
7930G30995j056853l938967l316490K003518N670319K771266k857260m778026
$$ 730995 -325858 -4264825 -7581315 -5577797 92522 2863788 6528 -4771498
7922d771498k944339j196241L08226L501077N865039L102691k345945l064800
$$ -4771498 -7715837 -8912078 -8603852 -5102775 762264 3864955 1519010 -1545790
7914a545790K050350N358266J733104m063628m988717j647108P1201j892839l782986
$$ -1545790 504560 5862826 7595930 3532302 -1456415 -3103523 -3032322 -4925161 -8708147
7905h708147k022469K351587N235000L763320n74585k752881L45546N210847N154672
$$ -8708147 -10730616 -8379029 -3144029 619291 44706 -2708175 -2362629 2848218 8002890
7896H002890q85325o478142o205668k183636O64356J961440M062290N706588L335330
$$ 8002890 7117565 639423 -5566245 -7749881 -7085525 -5124085 -1061795 4644793 7980123
7887G980123j866362m046521j083423K067696R18891j862477j122956K336211
$$ 7980123 6113761 2067240 983817 3051513 3970404 2107927 984971 3321182
$$ [...]
##END NTUPLES=NMR SPECTRUM
##END=
