##TITLE=31Pdec_SR6_K
 CDCl3, 24 sc
 27.1.2020
##JCAMPDX= 6.0         $$ Bruker NMR JCAMP-DX V2.0
##DATA TYPE= NMR SPECTRUM
##DATA CLASS= NTUPLES
##ORIGIN= UXNMR, Bruker Analytische Messtechnik GmbH
##OWNER= root
$$ XWIN-NMR		Version 3.5
$$ Mon Jan 27 14:15:28 2020 Russian Standard Time (UT+4h)  she@DPX200
##.OBSERVE FREQUENCY= 81.013821
##.OBSERVE NUCLEUS= ^31P
##.ACQUISITION MODE= SIMULTANEOUS
##.ACQUISITION SCHEME= undefined
##.AVERAGES= 24
##.DIGITISER RES= 17
##SPECTROMETER/DATA SYSTEM= spect
##.PULSE SEQUENCE= zgpg30
##.SOLVENT NAME= CDCl3
##.SHIFT REFERENCE= (INTERNAL, CDCl3, 0, 182.463)
##AUDIT TRAIL= $$ (NUMBER, WHEN, WHO, WHERE, WHAT)
$$ ##TITLE= Audit trail, XWIN-NMR		Version 3.5
$$ ##JCAMPDX= 5.01
$$ ##ORIGIN= Bruker BioSpin GmbH
$$ ##OWNER= she
$$ F:/spectra/data/she/nmr/P31/1/pdata/1/auditp.txt
$$ ##AUDIT TRAIL=  $$ (NUMBER, WHEN, WHO, WHERE, WHAT)
(   1,<2020-01-27 14:13:49.54 +0400>,<she>,<DPX200>,
      <created by zg, POWCHK disabled, PULCHK disabled
       configuration hash MD5:
       00 E9 B6 7A A2 85 ED C7 34 08 36 98 17 FE 4E 26
       data hash MD5: 32K
       E4 E4 91 FE 76 B7 FE DF 3A B1 6C CC 78 B7 20 E4>)
(   2,<2020-01-27 14:13:52.21 +0400>,<she>,<DPX200>,
      <Start of raw data processing
       efp BC_mod = 2 LB = 1 FT_mod = 6 PKNL = 1 PHC0 = -1684.506 PHC1 = 138.0012 SI = 64K 
       data hash MD5: 64K
       45 5D 57 E4 5B E5 34 C8 27 2A EC 4D 01 E7 ED 24>)
(   3,<2020-01-27 14:14:08.18 +0400>,<she>,<DPX200>,
      <pk PHC0 = -2.653953 PHC1 = 0 
       data hash MD5: 64K
       3F 90 C7 D8 79 63 84 BC 9F EA 46 50 A9 B9 90 CA>)
$$ ##END=
$$ 
$$ hash MD5
$$ 1E 5A F6 2F 39 51 2C 53 66 12 CE 2A ED 52 E9 4D
##$RELAX= 
##$RELAX= 
##$RELAX= 
##$RELAX= 
##$RELAX= 
##$RELAX= 
##$RELAX= 
##$RELAX= 
$$ Bruker specific parameters
$$ --------------------------
##$DU= <F:/spectra>
##$EXPNO= 1
##$NAME= <P31>
##$PROCNO= 1
##$TYPE= <nmr>
##$USER= <she>
##$AMP= (0..31)
100 100 100 100 100 100 100 100 100 100 100 100 100 100 100 100 100 100 
100 100 100 100 100 100 100 100 100 100 100 100 100 100 
##$AQSEQ= 0
##$AQ_mod= 1
##$AUNM= <au_zg>
##$AUTOPOS= <>
##$BF1= 81.014009
##$BF2= 200.13
##$BF3= 200.13
##$BF4= 200.13
##$BF5= 200.13
##$BF6= 200.13
##$BF7= 200.13
##$BF8= 200.13
##$BYTORDA= 1
##$CFDGTYP= 0
##$CFRGTYP= 5
##$CHEMSTR= <none>
##$CNST= (0..31)
1 1 145 1 1 1 1 1 1 1 1 1 1 1 1 1 1 1 1 1 1 1 1 1 1 1 1 1 1 1 1 1 
##$CPDPRG= <waltz16>
##$CPDPRG1= <>
##$CPDPRG2= <waltz16>
##$CPDPRG3= <>
##$CPDPRG4= <mlev>
##$CPDPRG5= <mlev>
##$CPDPRG6= <mlev>
##$CPDPRG7= <mlev>
##$CPDPRG8= <mlev>
##$CPDPRGB= <>
##$CPDPRGT= <>
##$D= (0..31)
0 1 0 0 0 0 0 0 0 0 0 0.03 2e-05 3e-06 0 0 0 0 0 0 0 0 0 0 0 0 0 0 0 0 
0 0 
##$DATE= 1580120028
##$DBL= (0..7)
120 120 120 11 120 120 24 19 
##$DBP= (0..7)
150 150 150 150 150 150 150 150 
##$DBP07= 0
##$DBPNAM0= <>
##$DBPNAM1= <>
##$DBPNAM2= <>
##$DBPNAM3= <>
##$DBPNAM4= <>
##$DBPNAM5= <>
##$DBPNAM6= <>
##$DBPNAM7= <>
##$DBPOAL= (0..7)
0.5 0.5 0.5 0.5 0.5 0.5 0.5 0.5 
##$DBPOFFS= (0..7)
0 0 0 0 0 0 0 0 
$$ [...]
##$SUBNAM2= <"">
##$SUBNAM3= <"">
##$SUBNAM4= <"">
##$SUBNAM5= <"">
##$SUBNAM6= <"">
##$SUBNAM7= <"">
##$SUBNAM8= <"">
##$SUBNAM9= <"">
##$SW= 369.568048894756
##$SWIBOX= (0..15)
0 1 3 0 0 0 0 0 0 0 0 0 0 0 0 0 
##$SW_h= 29940.119760479
##$TD= 32768
##$TD0= 1
##$TE= 0
##$TE2= 300
##$TE3= 300
##$TEG= 300
##$TL= (0..7)
0 120 53 12 22 120 120 120 
##$TP= (0..7)
150 150 150 150 150 150 150 150 
##$TP07= 0
##$TPNAME0= <>
##$TPNAME1= <>
##$TPNAME2= <>
##$TPNAME3= <>
##$TPNAME4= <>
##$TPNAME5= <>
##$TPNAME6= <>
##$TPNAME7= <>
##$TPOAL= (0..7)
0.5 0.5 0.5 0.5 0.5 0.5 0.5 0.5 
##$TPOFFS= (0..7)
0 0 0 0 0 0 0 0 
##$TUNHIN= 0
##$TUNHOUT= 0
##$TUNXOUT= 0
##$USERA1= <user>
##$USERA2= <user>
##$USERA3= <user>
##$USERA4= <user>
##$USERA5= <user>
##$V9= 5
##$VALIST= <valist>
##$VCLIST= <CCCCCCCCCCCCCCC>
##$VD= 0
##$VDLIST= <DDDDDDDDDDDDDDD>
##$VPLIST= <PPPPPPPPPPPPPPP>
##$VTLIST= <TTTTTTTTTTTTTTT>
##$WBST= 1024
##$WBSW= 4
##$XGAIN= (0..3)
0 0 0 0 
##$XL= 0
##$YL= 0
##$YMAX_a= 8674
##$YMIN_a= -6811
##$ZGOPTNS= <>
##$ZL1= 120
##$ZL2= 120
##$ZL3= 120
##$ZL4= 120
##$ABSF1= 0
##$ABSF2= 0
##$ABSG= 0
##$ABSL= 0
##$ALPHA= 0
##$AQORDER= 0
##$ASSFAC= 0
##$ASSFACI= 0
##$ASSFACX= 0
##$ASSWID= 0
##$AUNMP= <proc_1d>
##$AZFE= 0.1
##$AZFW= 0.5
##$BCFW= 0
##$BC_mod= 2
##$BYTORDP= 0
##$COROFFS= 0
##$CY= -3
##$DATMOD= 1
##$DC= 0
##$DFILT= <>
##$DTYPP= 0
##$F1P= 0
##$F2P= 0
##$FCOR= 1
##$FTSIZE= 65536
##$FT_mod= 6
##$GAMMA= 0
##$GB= 0
##$INTBC= 1
##$INTSCL= 5.30512e-09
##$ISEN= 30
##$LB= 1
##$LEV0= 0
##$LPBIN= 0
##$MAXI= 10000
##$MC2= 0
##$MEAN= 0
##$ME_mod= 0
##$MI= 50
##$NCOEF= 0
##$NC_proc= -9
##$NLEV= 6
##$NOISF1= 182.463
##$NOISF2= 159.3651
##$NSP= 0
##$NTH_PI= 0
##$NZP= 0
##$OFFSET= 182.463
##$PC= 4
##$PHC0= -1687.16
##$PHC1= 138.0012
##$PH_mod= 1
##$PKNL= yes
##$PPARMOD= 0
##$PSCAL= 0
##$PSIGN= 0
##$REVERSE= no
##$SF= 81.0140089999434
##$SI= 65536
##$SIGF1= 159.3651
##$SIGF2= -187.1042
##$SINO= 113.3802
##$SIOLD= 16384
##$SREGLST= <1H.CDCl3>
##$SSB= 0
##$STSI= 65536
##$STSR= 0
##$SW_p= 29940.119760479
##$SYMM= 0
##$S_DEV= 0
##$TDeff= 32768
##$TDoff= 0
##$TI= <>
##$TILT= no
##$TM1= 0
##$TM2= 0
##$TOPLEV= 0
##$USERP1= <user>
##$USERP2= <user>
##$USERP3= <user>
##$USERP4= <user>
##$USERP5= <user>
##$WDW= 1
##$XDIM= 65536
##$YMAX_p= 324728428
##$YMIN_p= -142996195
$$ End of Bruker specific parameters
$$ ---------------------------------
##NTUPLES= NMR SPECTRUM
##VAR_NAME=  FREQUENCY,     SPECTRUM/REAL,   SPECTRUM/IMAG
##SYMBOL=    X,             R,               I
##VAR_TYPE=  INDEPENDENT,   DEPENDENT,       DEPENDENT
##VAR_FORM=  AFFN,          ASDF,            ASDF
##VAR_DIM=   65536,         65536,           65536
##UNITS=     HZ,            ARBITRARY UNITS, ARBITRARY UNITS
##FACTOR=    0.456856943014862, 1,           1
##FIRST=     14782.0589164792, 0,            0
##LAST=      -15158.0608439998, 0,           0
##MIN=       -15158.0608439998, -142996195,  0
##MAX=       14782.0589164792, 324728428,    0
$$ Real data points
##PAGE= N=1
##DATA TABLE= (X++(R..R)), XYDATA
$$ [...]
$$ plain form
44381 -26183922 -15427879 -6047456 -3597908 -2403255 -1571800 -6628430 -14563236 -14539151
44373 -14539151 -5966676 -389398 -2379495 -3439969 1079799 3526343 -1689196 -8029625
44365 -8029625 -8212641 -5314170 -5683883 -9239829 -12581710 -14322422 -13031131 -7453816
44357 -7453816 -1942903 -3188689 -8921421 -9675968 -4479124 -3140511 -9064180 -13132108
44349 -13132108 -10936722 -11705727 -20233585 -23642324 -9884132 11106040 20261809 16103260
44341 16103260 12439506 13647331 9158729 -6689153 -23484976 -27412662 -16236265 920288
44333 920288 12396640 11954411 3311146 -4031395 -7389832 -14708983 -29829599 -41272702
44325 -41272702 -36589224 -22144733 -14609257 -15730003 -11559321 2488008 12473178 7294874
$$ packed form
44381b6183922J0756043R380423K449548J194653Q31455n056630p934806K4085
44373a4539151Q572475N577278j990097j060474M519768K446544n215539o340429
44365h029625j83016K898471l69713l555946l341881j740712J291291N577315
44357g453816N510913j245786n732732p54547N196844J338613n923669m067928
44349a3132108K195386p69005q527858l408739J3758192K0990172R155769m158549
44341A6103260l663754J207825m488602j5847882j6795823l927686J1176397J7156553
44333I20288J1476352m42229q643265p342541l358437p319151j5120616j1443103
44325d1272702M683478J4444491P535476j120746M170682J4047329R985170n178304
$$ plain form
44317 7294874 -4903239 -9901082 -6199794 -1522943 1572483 6916748 15496549 22570628
44309 22570628 22770844 14754512 2986466 -4383927 -3831778 -2244619 -7491874 -14004430
44301 -14004430 -8511735 8054268 17504517 9241377 -4600405 -8183836 -4309854 -4714024
44293 -4714024 -7214745 1067362 21237068 38904283 43325460 37617577 28739108 19078313
44285 19078313 10658557 7348234 8889365 10162452 8602168 5162856 -2442484 -17574670
44277 -17574670 -33758076 -37107590 -24658212 -10370370 -6730994 -9831956 -10121892 -8133633
44269 -8133633 -8762505 -7881548 1349895 12462118 10638124 -5469737 -20006288 -21602839
44261 -21602839 -17164823 -17804701 -20806856 -14888257 1964192 19152264 26053248 20741103
$$ packed form
44317G294874j2198113m997843L701288M676851L095426N344265Q579801P074079
44309B2570628K00216q016332j1768046p370393N52149J587159n247255o512556
44301a4004430N492695J6566003R450249q263140j3841782l583431L873982m04170
44293d714024k500721Q282107K0169706J7667215M421177n707883q878469r660795
44285A9078313q419756l310323J541131J273087j560284l439312p605340j5132186
44277a7574670j6183406l349514J2449378J4287842L639376l100962k89936J988259
44269h133633o28872Q80957R231443J1112223j823994j6107861j4536551j596551
44261b1602839M438016o39878l002155N918599J6852449J7188072O900984n312145
$$ plain form
44253 20741103 7486858 -6983623 -14136202 -7852199 7960735 19679288 16046880
44246 16046880 -626480 -17022443 -21747306 -14816951 -5810442 -4421943 -12384507 -23186982
44238 -23186982 -29178938 -29013054 -27881737 -30536766 -35056083 -34466157 -24523997 -8984261
44230 -8984261 4043474 11250813 17812682 29389698 41317750 40849197 23357537 2274400
44222 2274400 -3617827 7602097 18369539 14072470 2135476 2296716 20098794 37638365
44214 37638365 33558635 7903831 -17453635 -22010547 -5915440 14731945 26758055
44207 26758055 28785197 23671536 11430648 -5535798 -17296235 -16057436 -8835722 -10316620
44199 -10316620 -22011429 -29029262 -21815351 -10507542 -9257742 -14936178 -13609536 -3536430
$$ packed form
44253B0741103j3254245j4470481p152579O284003J5812934J1718553l632408
44246A6046880j6673360j6395963m724863O930355R006509J388499p962564j0802475
44238b3186982n991956J65884J131317k655029m519317N89926R942160J5539736
44230h984261J3027735P207339O561869J1577016J1928052m68553j7491660k1083137
44222B274400n892227J1219924J0767442m297069j1936994J61240J7802078J7539571
44214C7638365m079730k5654804k5357466m556912J6095107K0647385J2026110
44207B6758055K027142n113661j2240888j6966446j1760437J238799P221714j480898
44199a0316620j1694809p017833P213911J1307809J249800n678436J326642J0073106
$$ plain form
44191 -3536430 2358208 -2768950 -9731030 -8345516 -1511113 2229083 1635920 270290
44183 270290 -2938272 -11654320 -23450474 -31161017 -32117469 -29518818 -24981679 -16322891
44175 -16322891 -4130146 5156268 6062435 1046974 -2325547 127007 5781001 9652210
44167 9652210 9829624 7325133 2284469 -6222817 -15780771 -20093704 -16922399 -13901763
44159 -13901763 -20516306 -34921866 -45232395 -44569877 -37715204 -30885390 -23176280 -12851759
44151 -12851759 -4476071 -2798269 -5202708 -7313241 -10693699 -17144474 -20971143 -16819422
44143 -16819422 -10602073 -10972680 -13129814 -4764383 12494214 22365850 17112953 6804753
44135 6804753 623024 -5884462 -16253014 -20102512 -7963110 10736824 18825565 14165064
$$ packed form
44191c536430N894638n127158o962080J385514O834403L740196n93163j365630
44183B70290l208562q716048j1796154p710543r56452K598651M537139Q658788
44175a6322891J2192745R286414R06167n015461l372521K452554N653994L871209
44167I652210J77414k504491n040664q507286r557954m312933L171305L020636
44159a3901763o614543j4405560j0310529O62518O854673O829814P709110J0324521
44151a2851759Q375688J677802k404439k110533l380458o450775l826669M151721
44143a6819422O217349l70607k157134Q365431J7258597R871636n252897j0308200
44135F804753o181729o507486j0368552l849498J2139402J8699934Q088741m660501
$$ plain form
44127 14165064 7470730 2588119 -5459658 -14499908 -13398841 610876 15317778 18647771
44119 18647771 10971191 -612975 -10479305 -13536956 -6452050 4575407 6178214 -5352906
44111 -5352906 -16958039 -15485512 -5041255 -11350 -6067331 -16862334 -26522160 -36045932
44103 -36045932 -46490974 -52715591 -47533966 -30766540 -12667883 -6132843 -12315429 -16146505
44095 -16146505 -3406904 17744125 22692283 2034546 -23737649 -29887741 -18173173
44088 -18173173 -9644570 -13571987 -19001072 -15676672 -8132268 -5707712 -10271133 -18258980
44080 -18258980 -25853762 -28301721 -22266162 -12546425 -8993342 -13595425 -18125858 -17197466
44072 -17197466 -14838705 -14513563 -12252872 -5221494 1994220 6308344 12643306 23707804
$$ packed form
44127A4165064o694334m882611q047777r040250J101067J4009717J4706902L329993
44119A8647771p676580j1584166r866330l057651P084906J1027457J602807j1531120
44111e352906j1605133J472527J0444257N029905o055981j0795003r659826r523772
44103c6045932j0445042o224617N181625J6767426J8098657O535040o182586l831076
44095a6146505J2739601K1151029M948158k0657737k5772195o150092J1714568
44088a8173173Q528603l927417n429085L324400P544404K424556m563421p987847
44080a8258980p594782k447959O035559R719737L553083m602083m530433R28392
44072a7197466K358761L25142K260691P031378P215714M314124O334962J1064498
$$ plain form
44064 23707804 31541856 28632049 20319796 15723229 12652421 3750431 -6937204 -7597045
44056 -7597045 2027865 8461658 3997098 -2895121 -500162 11666667 25121461 31715695
44048 31715695 27409073 13995640 966736 -547063 10220225 22359637 26518968
44041 26518968 24215784 21705445 20841937 19759176 17333781 12992885 6275121 -506485
44033 -506485 -3704884 -4632055 -8485809 -14320857 -13731796 -4552854 2150417 -2909803 -11259780
44024 -11259780 -6283508 13591599 31878115 34767108 25480074 15276395 8562329 2447808
44016 2447808 -4292738 -8801648 -9561397 -8898129 -8767935 -7206203 -1461038 6274264 9044895
44007 9044895 2481912 -9446089 -18016971 -18378596 -12509381 -4602257 2918073 8501846
$$ packed form
44064B3707804P834052k909807q312253m596567l070808q901990j0687635o59841
44056g597045R624910O433793m464560o892219K394959J2166829J3454794O594234
44048C1715695m306622j3413433j3028904j513799J0767288J2139412M159331
44041B6518968k303184k510339q63508j082761k425395m340896o717764o781606
44033e06485l198399r27171l853754n835048N89061R178942O703271n060220q349977
44024a1259780M976272J9875107J8286516K888993r287034j0203679o714066o114521
44016B447808o740546m508910p59749O63268J30194J561732N745165P735302K770631
44007I044895o562983j1928001q570882l61625N869215P907124P520330N583773
$$ plain form
43999 8501846 10663008 10103031 9959047 11967044 14199054 13588032 8588786 -747057 -11889300
43990 -11889300 -18787656 -16557826 -8713387 -4666252 -7774674 -11165107 -8263444 -1634236
43982 -1634236 2496987 2365261 -1511540 -9845865 -19241753 -20137551 -9198441 1672627
43974 1672627 -598403 -11255731 -14928080 -9061296 -5527564 -8360710 -6206592 7148395
43966 7148395 19356709 16720324 4038164 -4313267 -5345429 -7010203 -11645025 -12862400
43958 -12862400 -7752002 -805818 4802881 9787224 11626000 5344493 -5543356 -8949318
43950 -8949318 -640209 7730959 4464202 -4983938 -5918946 4494220 14613423 16276974
43942 16276974 14855448 18187344 24347003 26496089 23875540 20722788 17766435 12352950
$$ packed form
43999H501846K161162n59977j43984K007997K232010o11022m999246r335843j1142243
43990a1889300o898356K229830P844439M047135l108422l390433K901663O629208
43982a634236M131223j31726l876801q334325r395888q95798J0939110J0871068
43974A672627k271030j0657328l672349N866784L533732k833146K154118J3354987
43966G148395J2208314k636385j2682160q351431j032162j664774m634822j217375
43958a2862400N110398O946184N608699M984343J838776o281507j0887849l405962
43950h949318Q309109Q371168l266757r448140r35008J0413166J0119203J663551
43942A6276974j421526L331896O159659K149086k620549l152752k956353n413485
$$ plain form
43934 12352950 5562934 1719863 571856 -2969941 -9944933 -15227899 -16881615 -20399247
43926 -20399247 -28938295 -35726199 -32795478 -22684192 -14096982 -9154591 -3010140 5554560
43918 5554560 11769190 13532410 14550984 17077652 18343603 16352882 12792881 7822633
43910 7822633 -1143016 -11801434 -15021102 -6443147 4823662 5733386 -5000207 -16412991
43902 -16412991 -18808255 -12643506 -5032037 -2287122 -5905938 -12080213 -14684363 -11037933
43894 -11037933 -4359634 1054976 5238965 10688889 17251607 22285695 24444501 23924535
43886 23924535 20296195 13542269 5986564 -271152 -6288970 -12803188 -15905190 -11679406
43878 -11679406 -4071959 -1605498 -5678469 -8766604 -6092380 -2016167 -781486 2467067
$$ packed form
43934A2352950o790016l843071j148007l541797o974992n282966j653716l517632
43926b0399247q539048o787904K930721J0111286Q587210M942391O144451Q564700
43918E554560O214630J763220J018574K526668J265951j990721l560001m970248
43910G822633q965649j0658418l219668Q577955J1266809R09724j0733593j1412784
43902a6412991k395264O164749P611469K744915l618816o174275k604150L646430
43894a1037933O678299N414610M183989N449924O562718N034088K158806n19966
43886B3924535l628340o753926p555705o257716o017818o514218l102002M225784
43878a1679406P607447K466461m072971l088135K674224M076213J234681L248553
$$ plain form
43870 2467067 14367483 30653519 38701696 32526255 18823206 7313549 1379643 813701
43862 813701 7630340 22871715 39776135 46640034 38351237 21773724 8018461 1938816
43854 1938816 1045541 1940616 3964478 7034399 9691968 10807516 11162378 11997224 13572960
43845 13572960 16305080 21282088 27442787 29765958 23709211 11882988 3274873 3778997
43837 3778997 8986830 8842404 -526742 -11592430 -13018777 -1494654 15008123 25048000
43829 25048000 23416052 13514117 2415358 -5013842 -8324474 -9967285 -12075032 -14034287
43821 -14034287 -13155573 -8155991 -1590171 1939307 -125989 -6417253 -13304011 -17608417
43813 -17608417 -17885579 -13900499 -5616234 6229535 17864365 22741964 17515783 7571625
$$ packed form
43870B467067J1900416J6286036Q048177o175441j3703049j1509657n933906n65942
43862H13701O816639J5241375J6904420O863899q288797j6577513j3755263o079645
43854A938816q93275Q95075K023862L069921K657569J115548L54862Q34846J575736
43845A3572960K732120M977008O160699K323171o056747j1826223q608115N04124
43837C778997N207833j44426r369146j1065688j426347J1524123J6502777J0039877
43829B5048000j631948r901935j1098759p429200l310632j642811k107747j959255
43821a4034287Q78714M999582O565820L529478k065296o291264o886758m304406
43813a7608417k77162L985080Q284265J1845769J1634830M877599n226181r944158
$$ plain form
43805 7571625 2146725 2425605 -499549 -12425131 -26143184 -30965634 -28033216 -27142075
43797 -27142075 -29396958 -23703471 -4453426 16021687 20218996 6575669 -9420253
43790 -9420253 -14004685 -8791526 -4727668 -7484741 -12710242 -14617132 -15015164 -20270275
43782 -20270275 -30166787 -35020236 -26889835 -9636770 6637483 17286991 22922305 21387596
43774 21387596 9990808 -4560427 -9373503 -1902850 5692124 2720910 -7898591 -17791892
43766 -17791892 -23970658 -25522892 -19138601 -6608860 1295385 -1612759 -6070916 -381536
43758 -381536 11905031 18871117 19013745 19156577 17432327 5148296 -13167684 -17898476
43750 -17898476 1086680 29567741 45647696 43058861 32139136 24737838 23731439
$$ packed form
43805G571625n424900K78880k925154j1925582j3718053m822450K932418Q91141
43797b7142075k254883N693487J9250045K0475113M197309j3643327j5995922
43790i420253m584432N213159M063858k757073n225501j906890l98032n255111
43782b0270275r896512m853449Q130401J7253065J6274253J0649508N635314j534709
43774B1387596j1396788j4551235m813076P470653P594974k971214j0619501r893301
43766a7791892o178766j552234O384291J2529741P904245k908144m458157N689380
43758c81536J2286567O966086J42628J42832j724250j2284031j8315980m730792
43750a7898476J8985156K8481061J6079955k588835j0919725p401298j006399
$$ plain form
43743 23731439 22493062 11404787 -10090834 -26990219 -22202837 1339644 20954362
43736 20954362 19972400 4204529 -10884681 -18262388 -17918318 -8844529 6351209 16398860
43728 16398860 13148386 4338147 3586495 10508110 11857415 1334031 -12731558 -20609174
43720 -20609174 -22185225 -21553338 -18752358 -12240651 -5055809 -3099692 -7900671 -13720921
43712 -13720921 -12682508 -2899687 9131238 15975679 18139741 21290903 24904868 21262113
43704 21262113 9109700 -227706 1840806 6363740 -1842746 -21127445 -32825650 -24675291
43696 -24675291 -4327466 12437906 17612523 12052478 148343 -10769716 -12968208
43689 -12968208 -7466616 -6135896 -17729835 -34805515 -41499311 -32937131 -20097969 -15189352
$$ packed form
43743B3731439j238377j1088275k1495621j6899385M787382K3542481J9614718
43736B0954362r81962j5767871j5089210p377707L44070R073789J5195738J0047651
43728A6398860l250474q810239p51652O921615J349305j0523384j4065589p877616
43720b0609174j576051O31887K800980O511707P184842J956117m800979n820250
43712a3720921J038413R782821J2030925O844441K164062L151162L613965l642755
43704B1262113j2152413r337406K068512M522934q206486j9284699j1698205Q150359
43696b4675291K0347825J6765372N174617n560045j1904135j0918059k198492
43689a2968208N501592J330720j1593939j7075680o693796Q562180J2839162M908617
$$ plain form
43681 -15189352 -19018113 -25373639 -31657913 -39171768 -45619905 -44529611 -33586054 -18308536
43673 -18308536 -4721959 7108787 18420817 25340153 23775788 18197400 17745213 23960522
43665 23960522 29940293 31672361 31316063 28127348 17100339 941864 -7722670 -3288396
43657 -3288396 3884815 4267544 4272247 12306295 19470983 11099727 -7849416 -17672161 -13011258
43648 -13011258 -7886327 -9169175 -5102739 11317202 25217867 19690982 723990 -12256345
43640 -12256345 -12784907 -9482831 -6421094 2838784 20210966 34778866 35042980 22552183
43632 22552183 8278045 -688082 -6053186 -11201738 -13957545 -9800541 -1119097 2269519
43624 2269519 -4440495 -12205300 -8231648 7007561 20258298 22438525 17127846 11755280
$$ packed form
43681a5189352l828761o355526o284274p513855o448137J090294J0943557J5277518
43673a8308536J3586577J1830746J1312030O919336j564365n578388m52187O215309
43665B3960522N979771J732068l56298l188715j1027009j6158475q664534M434274
43657c288396P173211L82729M703Q034048P164688q371256j8949143r822745M660903
43648a3011258N124931j282848M066436J6419941J3900665n526885j8966992j2980335
43640a2256345n28562L302076L061737R259878J7372182J4567900K64114j2490797
43632B2552183j4274138q966127n365104n148552k755807M157004Q681444L388616
43624B269519o710014p764805L973652J5239209J3250737K180227n310679n372566
$$ plain form
43616 11755280 9199960 9948741 13333210 13530817 3711668 -11749918 -18799291 -12478035
43608 -12478035 -4221471 -4302321 -7951947 -7506222 -7086926 -12848531 -17661261 -10664725 2871619
43599 2871619 6504637 -3988698 -15642076 -16775498 -8215717 4807865 19846521 32776312
43591 32776312 35724103 24554284 3846700 -17185959 -30128106 -30640772 -22254472 -15115243
43583 -15115243 -15026277 -16573342 -13487829 -10923459 -17928453 -31543661 -39376068 -35823274
43575 -35823274 -25356499 -12612510 -911442 2373879 -7327405 -21053106 -26424087
43568 -26424087 -27062058 -36342204 -52564669 -58452671 -47487645 -32314165 -23071105 -16407055
43560 -16407055 -11539954 -16612329 -29796645 -33910001 -21899891 -9533645 -9708382 -12470334
$$ packed form
43616A1755280k555320P48781L384469J97607r819149j5461586p049373O321256
43608a2478035Q256564q0850l649626M45725M19296n761605m812730O996536J3536344
43599B871619L633018j0493335j1653378j133422Q559781J3023582J5038656J2929791
43591C2776312K947791j1169819k0707584k1032659j2942147n12666Q386300P139229
43583a5115243Q8966j547065L085513K564370p004994j3615208p832407L552794
43575c5823274J0466775J2743989J1701068L285321r701284j3725701n370981
43568b6424087o37971r280146j6222465n888002J0965026J5173480R243060O664050
43560a6407055M867101n072375j3184316m113356J2010110J2366246j74737k761952
$$ plain form
43552 -12470334 -5872063 1710080 -986297 -4939182 3064156 14938099 15412700 10130741
43544 10130741 14195676 21462872 12893880 -8991063 -22047456 -20216064 -19831751 -27754537
43536 -27754537 -30391636 -21134402 -13518827 -17097169 -22288305 -20615360 -20085296 -27465534
43528 -27465534 -32673331 -25180422 -12305714 -7658665 -12276882 -18478157 -21999793 -20616342
43520 -20616342 -11711665 -224050 2853202 -1807575 -19382 10470442 10323151 -10615696
43512 -10615696 -29999569 -21272791 7288881 25263270 23688350 20840047 27390880 31792123
43504 31792123 24719672 15593172 15306620 19141402 17596458 12208701 9774239 8958262
43496 8958262 3112145 -7507654 -14658322 -12478396 -4092391 2451343 2950730 1298303
$$ packed form
43552a2470334O598271P582143k696377l952885Q003338J1873943M74601n281959
43544A0130741M064935P267196q568992k1884943j3056393J831392L84313p922786
43536b7754537k637099R257234P615575l578342n191136J672945N30064p380238
43528b7465534n207797P492909J2874708M647049m618217o201275l521636J383451
43520b0616342Q904677J1487615L077252m660777J788193J0489824j47291k0938847
43512a0615696j9383873Q726778K8561672J7974389j574920k848303O550833M401243
43504C1792123p072451r126500k86552L834782j544944n387757k434462q15977
43496H958262n846117j0619799p150668K179926Q386005O543734M99387j652427
$$ plain form
43488 1298303 4305894 12322524 18079208 16227410 9501535 2700634 -3644486 -9131294
43480 -9131294 -9692149 -4802695 -2339163 -7801505 -14171420 -12142860 -5369871 -4196715
43472 -4196715 -8221234 -8147307 -3013222 -1489903 -5263573 -4975164 3775691 12432886 12396370
43463 12396370 6144443 697295 -1568001 -1274360 1048885 2649785 538322 -1172689
43455 -1172689 5969275 21108244 31543602 28417208 17431952 9174634 5827340 2756384
43447 2756384 -2693665 -9212840 -13878029 -13104894 -5909163 1909968 2911550 -1134210
43439 -1134210 -996081 5682851 10777603 9042528 4657479 124149 -9591680 -24215061
43431 -24215061 -30615475 -19100869 677803 11536010 10379071 6443756 3453496 -2307994
$$ packed form
43488A298303L007591Q016630N756684j851798o725875o800901o345120n486808
43480i131294n60855M889454K463532n462342o369915K028560O772989J173156
43472d196715m024519P3927N134085J523319l773670K88409Q750855Q657195l6516
43463A2396370o251927n447148k265296K93641K323245J600900k111463j711011
43455a172689P141964J5138969J0435358l126394j0985256q257318l347294l070956
43447B756384n450049o519175m665189P73135P195731P819131J001582m045760
43439a134210J38129O678932N094752j735075m385049m533330r715829j4623381
43431b4215061o400414J1514606J9778672J0858207j156939l935315k990260n761490
$$ plain form
43423 -2307994 -7824452 -2246927 15953453 31915248 31251202 17447950 5816215 3802918
43415 3802918 4335823 -1176559 -9489292 -9842118 670465 12749795 17847652 18422747
43407 18422747 19434578 16453883 3323379 -11506037 -10577472 7934901 24226103 21762148
43399 21762148 7478592 -805959 1723914 5040745 416882 -10753487 -21113709 -23505044
43391 -23505044 -15624930 -3342513 3786976 3280765 1116192 528980 -2394172 -8282656
43383 -8282656 -9485240 -2048014 6156857 6739059 2262345 -617252 -878216 1035194
43375 1035194 6898367 11946983 4336359 -15611302 -28063017 -19862824 -6149456 -8109160
43367 -8109160 -19757696 -19045591 -5603252 -2087140 -17398833 -32668930 -30305608 -17250539
$$ packed form
43423b307994n516458N577525J8200380J5961795o64046j3803252j1631735k013297
43415C802918N32905n512382q312733l52826J0512583J2079330N097857N75095
43407A8422747J011831k980695j3130504j4829416R28565J8512373J6291202k463955
43399B1762148j4283556q284551K529873L316831m623863j1170369j0360222k391335
43391b3505044P880114J2282417P129489n06211k164573n87212k923152n888484
43383h282656j202584P437226Q204871N82202m476714k879597k60964J913410
43375A035194N863173N048616p610624j9947661j2451715Q200193J3713368j959704
43367h109160j1648536P12105J3442339L516112j5311693j5270097K363322J3055069
$$ plain form
43359 -17250539 -10097884 -12109138 -14928236 -12803396 -6816191 -1732174 -3333300 -13046133
43351 -13046133 -23846117 -27915636 -26871114 -26145479 -23201287 -13551900 -4835802 -9052982
43343 -9052982 -21691757 -25355809 -15264734 -4395302 -1547314 -2139326 -3656101 -10804039
43335 -10804039 -19834667 -17360522 -2642309 7785557 6612507 7508940 19511967 29692740
43327 29692740 26218877 20387509 27419818 40044223 40841056 29791987 20176265 15527614
43319 15527614 9485837 2494766 1027760 4097048 5372551 4578429 3947944 -400979
43311 -400979 -10024113 -14509938 -5794030 4544290 -702532 -17809582 -26545803 -17776810
43303 -17776810 -439265 15584263 26587294 27617727 15733698 613851 -3858501
$$ packed form
43359a7250539P152655k011254k819098K124840N987205N084017j601126r712833
43351a3046133j0799984m069519J044522P25635K944192R649387Q716098m217180
43343i052982j2638775l664052J0091075J0869432K847988n92012j516775p147938
43335a0804039r030628K474145J4718213J0427866j173050Q96433J2003027J0180773
43327B9692740l473863n831368P032309J2624405P96833j1049069r615722m648651
43319A5527614o041777o991071j467006L069288J275503p94122o30485m348923
43311d00979r623134m485825Q715908J0338320n246822j7107050q736221Q768993
43303a7776810J7337545J6023528J1003031J030433j1884029j5119847m472352
$$ plain form
43296 -3858501 1620358 5759250 6705086 11254949 16603022 12638381 2821196 2564617
43288 2564617 14197394 23403246 24136756 25927475 30398602 23094655 -143651 -19037785
43280 -19037785 -16066827 -1568103 4415574 2029861 5821757 18386539 27449287 24802867
43272 24802867 13816178 1140351 -7118152 -4258921 10089807 23518821 21813507
43265 21813507 6268032 -7812333 -9221081 -935349 6583160 6161415 -926092 -6032530
43257 -6032530 -1155842 10898155 17840093 12419601 534894 -8622281 -13509568 -15910839
43249 -15910839 -13585376 -5788324 56711 -2733433 -8470336 -6488912 2217959 5832103
43241 5832103 -1363534 -11874891 -15428178 -9372141 1298286 7716242 2058240 -13538508
$$ packed form
43296c858501N478859M138892R45836M549863N348073l964641r817185k56579
43288B564617J1632777R205852P33510J790719M471127p303947k3238306j8894134
43280a9037785K970958J4498724N983677k385713L791896J2564782R062748k646420
43272B4802867j0986689j2675827q258503K859231J4348728J3429014j705314
43265B1813507j5545475j4080365j408748Q285732P518509m21745p087507n106438
43257f032530M876688J2053997O941938n420492j1884707r157175m887287k401271
43249a5910839K325463P797052N845035k790144n736903J981424Q706871L614144
43241E832103p195637j0511357l553287O056037J0670427O417956n658002j5596748
$$ plain form
43233 -13538508 -23811548 -15402753 4013579 11591888 -2259125 -21016157 -24058872
43226 -24058872 -13299895 -7750445 -15601015 -23904339 -18537872 -4365643 2294657 -3563423
43218 -3563423 -10188397 -7084050 482914 240350 -9962254 -21465032 -27987989 -30444589
43210 -30444589 -28871280 -19557657 -4237850 5977989 2850402 -7148877 -10064094 -1477544
43202 -1477544 9822057 14513194 12937558 10614282 8122074 533721 -12636433 -21385868
43194 -21385868 -14467060 5263741 21002660 21214972 13020996 10250412 13674170 12847535
43186 12847535 4173278 -5391982 -12514040 -21466787 -30426054 -28063848 -11865651 2343801
43178 2343801 321977 -10105295 -10836666 417822 9033989 5678649 -2870072 -5488026
$$ packed form
43233a3538508j0273040Q408795J9416332P578309j3851013j8757032l042715
43226b4058872J0758977N549450p850570q303324N366467J4172229O660300n858080
43218c563423o624974L104347P566964k42564j0202604j1502778o522957k456600
43210c0444589J573309R313623J5319807J0215839l127587r999279k915217Q586550
43202a477544J1299601M691137j575636k323276k492208p588353j3170154q749435
43194b1385868O918808J9730801J5738919K12312q193976k770584L423758q26635
43186A2847535q674257r565260p122058q952747q959267K362206J6198197J4209452
43178B343801k021824j0427272p31371J1254488Q616167l355340q548721k617954
$$ plain form
43170 -5488026 628263 10652454 18313839 20238290 19062949 21367953 28080432 30382576
43162 30382576 21670798 9552545 6967717 14170620 19943199 19413706 18858864 21436435
43154 21436435 20327135 11102662 1006396 -1073829 3073856 5841935 6104286 9342264
43146 9342264 17735300 26456909 30009465 28381710 25903628 25205677 22880476 12565381
43138 12565381 -5739419 -21476345 -23397586 -13328318 -4521251 -5247626 -10280089 -11642595
43130 -11642595 -11238723 -16288690 -25772447 -29348907 -20651780 -6031279 2675605 1130006
43122 1130006 -4276358 -4450481 3638363 15491128 23801079 24151689 18042814 11512614
43114 11512614 9715102 12239327 15254224 18316340 25273092 36217488 43190018 39278345
$$ packed form
43170e488026O116289J0024191P661385J924451j175341K305004O712479K302144
43162C0382576q711778j2118253k584828P202903N772579n29493n54842K577571
43154B1436435j109300r224473j0096266k080225M147685K768079K62351L237978
43146I342264Q393036Q721609L552556j627755k478082o97951k325201j0315095
43138A2565381j8304800j5736926j921241J0069268Q807067p26375n032463j362506
43130a1642595M03872n049967r483757l576460Q697127J4620501Q706884j545599
43122A130006n406364j74123Q088844J1852765Q309951L50610o108875o530200
43114A1512614j797512K524225L014897L062116O956752J0944396O972530l911673
$$ plain form
43106 39278345 28903992 22143748 20660655 17687738 11631175 9274378 12360043 11350259
43098 11350259 -791653 -16557687 -23602725 -20774343 -16382360 -14885293 -13841202 -11819437
43090 -11819437 -11600407 -15743032 -23589535 -31232202 -31711955 -19903484 -1513678 8592951
43082 8592951 3231656 -7385072 -9478567 -3165560 2092584 3128140 3519137 3126758
43074 3126758 -1073338 -6449879 -8383191 -10341767 -18754511 -29454336 -31424872 -23601646
43066 -23601646 -15778715 -12542583 -8735875 -2131995 1993916 1683553 2137609 5662171
43058 5662171 8433691 9908958 14632822 21993833 25067544 22214217 18778980 15530739
43050 15530739 8192034 508825 2739788 13070923 16726940 9880021 7465974 18165066
$$ packed form
43106C9278345j0374353o760244j483093k972917o056563k356797L085665j009784
43098A1350259j2141912j5766034p045038K828382M391983J497067J044091K021765
43090a1819437K19030m142625p846503p642667m79753J1808471J8389806J0106629
43082H592951n361295j0616728k093495O313007N258144J035556L90997l92379
43074C126758m200096n376541j933312j958576q412744j0699825j970536P823226
43066b3601646P822931L236132L806708O603880M125911l10363M54056L524562
43058E662171K771520J475267M723864P361011L073711k853327l435237l248241
43050A5530739p338705p683209K230963J0331135L656017o846919k414047J0699092
$$ plain form
43042 18165066 28805404 26081828 17614887 15827184 15329611 5328111 -6581191 -4587222
43034 -4587222 7403854 9568467 -3410565 -15484496 -14963840 -9631972 -10891745 -16816593
43026 -16816593 -18420497 -13757529 -8793224 -8563863 -11319132 -9850015 609971 13869809
43018 13869809 16836071 6695633 -2510349 1463462 10262414 6134660 -12186329 -27778752
43010 -27778752 -28698228 -20390735 -13789596 -12221856 -13020838 -13212817 -10372172 -4110980
43002 -4110980 1749316 3482783 2875287 2841242 1118200 -3616850 -3307263 10738235 32471469
42993 32471469 46032361 45675891 39672806 34932756 30279609 25827961 25643188 27920361
42985 27920361 24960472 17046991 14462603 20634085 24700140 17424058 4778465 -1350346
$$ packed form
43042A8165066J0640338k723576q466941j787703m97573j0001500j1909302J993969
43034d587222J1991076K164613j2979032j2073931N20656N331868j259773n924848
43026a6816593j603904M662968M964305K29361k755269J469117J0459986J3259838
43018A3869809K966262j0140438r205982L973811Q798952m127754j8320989j5592423
43010b7778752r19476Q307493O601139J567740p98982j91979K840645O261192
43002d110980N860296J733467o07496l4045j723042m735050L09587J4045498K1733234
42993C2471469J3560892l56470o003085m740050m653147m451648j84773K277173
42985B7920361k959889p913481k584388O171482M066055p276082j2645593o128811
$$ plain form
42977 -1350346 1737965 7866296 10740792 7580794 229194 -4081425 300069 8175930
42969 8175930 9650783 6112618 8469443 17614704 20925722 13135151 5705294 7608945
42961 7608945 11515976 9472328 8153655 15228301 22883459 20510241 14132765 16343589
42953 16343589 23495005 20018413 2291907 -16894428 -25885471 -23438688 -13468593 -3476094
42945 -3476094 -4789648 -20057773 -32780796 -24266792 -209503 14568459 8081351 -7251852
42937 -7251852 -16234692 -18031767 -17539756 -14683948 -9465044 -6476455 -7904659 -10638438
42929 -10638438 -13802023 -19288589 -22464580 -14901143 -477103 4917951 -3709207 -11368493
42921 -11368493 -5681953 4284737 3240846 -6878051 -11876710 -6563010 1612459 5512023
$$ packed form
42977a350346L088311O128331K874496l159998p351600m310619M381494P875861
42969H175930J474853l538165K356825R145261L311018p790571p429857J903651
42961G608945L907031k043648j318673P074646P655158k373218o377476K210824
42953A6343589P151416l476592j7726506j9186335q991043K446783R970095R992499
42945c476094j313554j5268125j2723023Q514004K4057289J4777962o487108j5333203
42937g251852q982840j797075M92011K855808N218904K988589j428204k733779
42929a0638438l163585n486566l175991P563437J4424040N395054q627158p659286
42921a1368493N686540R966690j043891j0118897m998659N313700Q175469L899564
$$ plain form
42913 5512023 3978201 -1707429 -7862035 -8954820 -5739560 -6639407 -12967508 -11668133
42905 -11668133 5654451 25603733 30367849 24826760 27181467 36615428 32924700 10724627
42897 10724627 -8544464 -7550438 3048130 4172743 -3454930 -5960737 -786416 1730412
42889 1730412 -3782566 -12295697 -18443066 -20284002 -14412694 1755041 22157744 35028136
42881 35028136 34756613 25124892 12024834 -371760 -7664320 -7328452 -3223324 -1651803
42873 -1651803 -2643794 -710551 6229412 14461191 20207365 21774119 17303446 7342325
42865 7342325 -1479117 -3129115 -1752221 -6018266 -14680716 -18261344 -15623611 -16259999
42857 -16259999 -22727858 -24704116 -18112082 -16785455 -32451089 -52652319 -54110364 -33762550
$$ packed form
42913E512023j533822n685630o154606j092785L215260q99847o328101J299375
42905a1668133J7322584J9949282M764116n541089K354707R433961l690728k2200073
42897A0724627j9269091R94026J0598568J124613p627673k505807N174321K516828
42889A730412n512978q513131o147369j840936N871308J6167735K0402703J2870392
42881C5028136k71523r631721j3100058j2396594p292560L35868M105128J571521
42873a651803r91991J933243O939963Q231779N746174J566754m470673r961121
42865G342325q821442j649998J376894m266045q662450l580628K637733o36388
42857a6259999o467859j976258O592034J326627j5665634k0201230j458045K0347814
$$ plain form
42849 -33762550 -11325946 -1753675 19918 3894941 8070866 5883246 367807 1589963
42841 1589963 11429230 18808262 12332531 -5317234 -18477649 -15038600 -558397 7570587
42833 7570587 560118 -12409643 -18297288 -17134002 -17563519 -20456815 -18024076 -8831372
42825 -8831372 -2415748 -5234003 -10938818 -10096947 -2912609 3845064 7721213 11673527
42817 11673527 16752459 19994099 19885866 19764576 23869623 30891739 33123604 24711433
42809 24711433 11843764 10254312 27394882 50252516 58348036 47377622 31311555
42802 31311555 21569929 15213964 6448356 -2148989 -6843505 -11577375 -20729220 -29810212
42794 -29810212 -31965511 -28384268 -24402998 -20677334 -16128949 -13765051 -14729055 -12666276
$$ packed form
42849c3762550K2436604R572271J773593L875023M175925k187620n515439J222156
42841A589963R839267P379032o475731j7649765j3160415L439049J4480203Q128984
42833G570587p010469j2969761n887645J163286m29517k893296K432739R192704
42825h831372O415624k818255n704815Q41871P184338O757673L876149L952314
42817A1673527N078932L241640j08233j21290M105047P022116K231865q412171
42809B4711433j2867669j589452J7140570K2857634Q095520j0970414j6066067
42802C1311555r741626o355965q765608q597345m694516m733870r151845r080992
42794b9810212k155299L581243L981270L725664M548385K363898r64004K062779
$$ plain form
42786 -12666276 -4077458 2205123 -1773268 -6690568 1272718 15015786 13065443 -7373371
42778 -7373371 -23920553 -21645052 -12874137 -13283095 -15492241 -3619495 16867085 23455934
42770 23455934 7663176 -14743611 -25548631 -23061022 -16612849 -12782052 -11920987 -11831347
42762 -11831347 -10330471 -6918020 -3667726 -2964422 -5211509 -10250893 -17629481 -22775894
42754 -22775894 -18659134 -6932089 -1253397 -10608293 -24192332 -24163473 -10478360 133356
42746 133356 -513725 -2486531 3297022 11184131 13004721 11463522 11738585 10264069 3222835
42737 3222835 -2103429 2992243 13665217 19211746 21045875 28310959 37588303 33448962
42729 33448962 12415343 -8289342 -12646658 -4872804 1612894 4336457 9916781 17944898
$$ packed form
42786a2666276Q588818O282581l978391m917300P963286J3743068j950343k0438814
42778g373371j6547182K275501Q770915m08958k209146J1872746K0486580O588849
42770B3455934j5792758k2406787j0805020K487609O448173L830797Q61065Q9640
42762a1831347J500876L412451L250294P03304k247087n039384p378588n146413
42754b2775894M116760J1727045N678692r354896j3584039K8859J3685113J0611716
42746A33356o47081j972806N783553P887109J820590j541199K75063j474516p041234
42737C222835n326264N095672J0672974N546529J834129P265084R277344m139341
42729C3448962k1033619k0704685m357316P773854O485698K723563N580324Q028117
$$ plain form
42721 17944898 19006899 9035583 -3034264 -4663997 7508476 25763555 39161865
42714 39161865 41924105 35704769 25610790 15994287 11139289 16305321 31935197 47586043
42706 47586043 49564124 37028895 22945727 15476415 7592421 -7573937 -20189840
42699 -20189840 -15238187 3550973 15252572 7980959 -8622719 -19730427 -22164107
42692 -22164107 -19593148 -12387418 -1812319 3317155 -4423852 -18361202 -23796689 -16111318
42684 -16111318 -4531044 1919375 3534618 3548693 1525740 -2577345 -5170856 -6157674
42676 -6157674 -13504814 -32212312 -51657677 -53743726 -34679554 -10130556 3986888
42669 3986888 7354714 7244312 4184790 -4214405 -11263868 -6927997 4650945 6985353
$$ packed form
42721A7944898J062001r971316j2069847j629733J2172473J8255079J3398310
42714C9161865K762240o219336j0093979r616503m854998N166032J5629876J5650846
42706D7586043J978081j2535229j4083168p469312p883994j5166358j2615903
42699b0189840M951653J8789160J1701599p271613j6603678j1107708k433680
42692b2164107K570959P205730J0575099N129474p741007j3937350n435487P685371
42684a6111318J1580274O450419J615243J4075k022953m103085k593511r86818
42676f157674p347140j8707498j9445365k086049J9064172K4548998J4117444
42669C986888L367826j10402l059522q399195p049463M335871J1578942K334408
$$ plain form
42661 6985353 -5326279 -17335206 -15204114 -5756253 -3304236 -5217319 4291331 28216994
42653 28216994 49533399 53038553 42615780 31157065 22673620 12425106 -550778
42646 -550778 -9547348 -8173093 2853967 17052852 27371929 30165084 26442747 20243705
42638 20243705 15449294 13262258 10942698 2548386 -15754124 -38339129 -51409800 -46614813
42630 -46614813 -31480102 -20548507 -17221650 -11513078 2881963 16530401 14220078
42623 14220078 -6174262 -29394346 -37525645 -26914890 -9137866 4224975 13585188
42616 13585188 23697396 28718461 17469563 -4294302 -12501871 3940128 23828249
42609 23828249 21202398 1632525 -8694353 -2655532 3051461 459838 830801 8330589
$$ packed form
42661F985353j2311632j2008927K131092R447861K452017j913083R508650K3925663
42653B8216994K1316405L505154j0422773j1458715q483445j0248514j2975884
42646e50778q996570J374255J1027060J4198885J0319077K793155l722337o199042
42638B0243705m794411k187036k319560q394312j8302510k2585005j3070671M794987
42630d6614813J5134711J0931595L326857N708572J4395041J3648438k310323
42623A4220078k0394340k3220084q131299J0610755J7777024J3362841R360213
42616A3585188J0112208N021065j1248898k1763865q207569J6441999J9888121
42609B3828249k625851j9569873j0326878O038821N706993k591623L70963P499788
$$ plain form
42601 8330589 9896249 1637563 684421 15835718 28229457 19546899 868505 -7016240
42593 -7016240 -6092463 -11258678 -20826207 -21511436 -14593314 -12841910 -16419569 -14973368
42585 -14973368 -10353917 -14248623 -24492915 -26237656 -17269699 -10555230 -10006100 -5333947
42577 -5333947 5721824 11283635 6472546 796170 -886878 -4994245 -11104291 -8200608
42569 -8200608 3127297 6214138 -3264244 -5637564 11898284 32596837 36000077 29521474
42561 29521474 33513628 47267938 52141129 41709990 27902751 19590627 13186370 4910657
42553 4910657 -2193066 -5147884 -4398702 -128727 5968643 6761412 -3332118 -18494448
42545 -18494448 -26825377 -24398796 -17084718 -10562826 -5715747 -2003186 1319857 5983260
$$ packed form
42601H330589J565660q258686r53142J5151297J2393739q682558j8678394p884745
42593g016240R23777n166215r567529o85229O918122J751404l577659J446201
42585a4973368M619451l894706j0244292j744741Q967957O714469N49130M672153
42577e333947J1055771N561811m811089n676376j683048m107367o110046K903683
42569h200608J1327905L086841r478382k373320J7535848K0698553L403240o478603
42561B9521474L992154J3754310M873191j0431139j3807239q312124o404257q275713
42553D910657p103723k954818P49182M269975O097370P92769j0093530j5162330
42545a8494448q330929K426581P314078O521892M847079L712561L323043M663403
$$ plain form
42537 5983260 12042561 17237388 22178294 30264857 38313657 35750740 20191847 5236534
42529 5236534 3576874 10274447 13138506 11614842 12618636 14488705 10321905 3675210
42521 3675210 5498654 15910788 22901534 20333979 15193587 15212002 19752957 24592016
42513 24592016 26382340 21232901 7716909 -7567101 -15109464 -13318300 -7618542 -1243116
42505 -1243116 4739421 5750347 -1185972 -9179003 -9632260 -5940243 -6453740 -7242191 1704405
42496 1704405 14229680 11773619 -6432991 -16772169 -4372049 14312440 15283680 -54000
42488 -54000 -11338680 -9573132 -4068487 -2752199 -1869469 2235310 3324621 -6098370
42480 -6098370 -21771380 -29699354 -21778318 -6638871 -1695450 -13489339 -29775576 -34654816
$$ packed form
42537E983260O059301N194827M940906Q086563Q048800k562917j5558893j4955313
42529E236534j659660O697573K864059j523664J003794J870069m166800o646695
42521C675210J823444J0412134O990746k567555n140392J8415M540955M839059
42513B4592016J790324n149439j3515992j5284010p542363J791164N699758O375426
42505a243116N982537J010926o936319p993031m53257L692017n13497p88451Q946596
42496A704405J2525275k456061j8206610j0339178J2400120J8684489R71240j5337680
42488e4000j1284680J765548N504645J316288Q82730M104779J089311r422991
42480f098370j5673010p927974P921036J5139447M943421j1793889j6286237m879240
$$ plain form
42472 -34654816 -27159483 -18166969 -12851641 -6674360 1902119 6487899 3475192 -2584410
42464 -2584410 -8208040 -15721653 -23992714 -24679328 -14867113 -4505076 -2674300 -4054571
42456 -4054571 932334 8456807 5852981 -7966194 -18456677 -14637849 -3894921 -2116691
42448 -2116691 -12874174 -22206937 -15053898 6551672 25324931 28308722 19896427 13226028
42440 13226028 14011893 18066299 20278090 18714264 12782128 5299895 4122314 13014871
42432 13014871 22628137 19948148 5621317 -7666584 -12309835 -10254717 -2674728 10454129
42424 10454129 20581085 16772630 4668196 2673103 14233033 21124367 11844184 -1079477
42416 -1079477 -3015357 521232 -2020750 -6359929 -1666694 8764186 13042712 9349932
$$ packed form
42472c4654816P495333Q992514N315328O177281Q576479M585780l012707o059602
42464b584410n623630p513613q271061o86614R812215J0362037J830776j380271
42456d054571M986905P524473k603826j3819175j0490483L818828J0742928J778230
42448b116691j0757483r332763P153039K1605570J8773259K983791q412295o670399
42440A3226028P85865M054406K211791j563826n932136p482233j177581Q892557
42432A3014871R613266k679989j4326831j3287901m643251K055118P579989J3128857
42424A0454129J0126956l808455j2104434j995093J1559930O891334r280183j2923661
42416a079477j935880L536589k541982m339179M693235J0430880M278526l692780
$$ plain form
42408 9349932 3956185 -2081223 -9326906 -10485254 -460713 10413394 9472558 2252719
42400 2252719 2777547 8701916 5781692 -5368467 -8065233 2856560 11882953 6998361
42392 6998361 -3369160 -5187094 2168339 9695361 12298138 11426707 9964903 8838039
42384 8838039 5343415 -4563277 -17614279 -21342838 -9893769 2853749 -1427347 -19509095
42376 -19509095 -29803015 -21167886 -4343771 6645063 10452496 12721993 16960958 24669850
42368 24669850 34251264 38268612 32130634 24581393 26768361 32682152 26744422 10218250
42360 10218250 549132 2166414 -286164 -13110704 -20143569 -9444960 6436755 11008502
42352 11008502 7778817 8503555 12150330 11446375 8112139 6411735 2916162 -3046095
$$ packed form
42408I349932n393747o037408p245683j158348J0024541J0874107r40836p219839
42400B252719N24828N924369k920224j1150159k696766J0921793R026393m884592
42392F998361j0367521j817934P355433P527022K602777q71431j461804j126864
42384H838039l494624r906692j3051002l728559J1449069J2747518m281096j8081748
42376a9509095j0293920Q635129J6824115J0988834L807433K269497M238965P708892
42368B4669850R581414M017348o137978p549241K186968N913791n937730j6526172
42360A0218250r669118J617282k452578j2824540p032865J0698609J5881715M571747
42352A1008502l229685P24738L646775p03955l334236j700404l495573n962257
$$ plain form
42344 -3046095 -1217365 11858555 20101738 10965288 -1134136 4655648 21900555 26906119
42336 26906119 15507096 5568549 6295192 9488928 11154740 17755247 27538842 27560931
42328 27560931 15011009 2776549 -1094339 -1052978 2999404 19317489 42835018 50909450
42320 50909450 33095039 8195670 -1672156 1240067 2858704 2806246 9226521 18319777
42312 18319777 18604324 11030325 7494765 10941797 12092399 6026158 -1465462 -5402662
42304 -5402662 -7408456 -7437501 -616520 13149858 24672345 25783357 18882995 12070371
42296 12070371 8754745 5931706 394714 -6481118 -9550251 -4382400 8462417 23412814
42288 23412814 34228742 37330208 31354961 17566794 2922480 -1861951 7427778 22177428
$$ packed form
42344c046095J828730J3075920Q243183r136450j2099424N789784J7244907N005564
42336B6906119j1399023r938547P26643L193736J665812O600507R783595K2089
42328B7560931j2549922j2234460l870888M1361M052382J6318085K3517529Q074432
42320E0909450j7814411k4899369r867826K912223J618637n2458O420275R093256
42312A8319777K84547p573999l535560L447032J150602o066241p491620l937200
42304e402662k005794k9045O820981J3766378J1522487J111012o900362o812624
42296A2070371l315626k823039n536992o875832l069133N167851J2844817J4950397
42288B3412814J0815928L101466n975247j3788167j4644314m784431R289729J4749650
$$ plain form
42280 22177428 29803317 27706530 23587012 23014141 22922471 18799628 12747364 10376578
42272 10376578 11902818 10293642 -436989 -16193452 -24623093 -18638307 -6923692 -5539376
42264 -5539376 -17260213 -25820957 -16351579 4008350 14943681 9619746 1170966 1307056
42256 1307056 4591129 472751 -9070140 -14344666 -14229254 -15269270 -16604377 -9188706
42248 -9188706 7127504 17919609 12583803 -764334 -7683754 -7436915 -9363491 -14171396
42240 -14171396 -13276294 -6802764 -6804245 -16843805 -22251056 -11256983 4867615 6893460
42232 6893460 -3646895 -7212297 3659305 13966460 10083237 -1149029 -5765036 -3366209
42224 -3366209 -2951006 -5433184 -2813001 7777627 19574425 25351882 23481252 15966682
$$ packed form
42280B2177428P625889k096787m119518n72871r1670m122843o052264k370786
42272A0376578J526240j609176j0730631j5756463q429641N984786J1714615J384316
42264e539376j1720837q560744R469378K0359929J0935331n323935q448780J36090
42256A307056L284073m118378r542891n274526J15412j040016j335107P415671
42248i188706J6316210J0792105n335806j3348137o919420K46839j926576m807905
42240a4171396Q95102O473530j481j0039560n407251J0994073J6124598K025845
42232F893460j0540355l565402J0871602J0307155l883223j1232266m616007K398827
42224c366209M15203k482178K620183J0590628J1796798N777457j870630p514570
$$ plain form
42216 15966682 7773494 6399707 13597334 18744435 10761791 -2749502 -550181 22956714
42208 22956714 44992577 41031125 17022813 2795787 15181046 39296538 49143736
42201 49143736 37749818 20952670 16088394 23743298 30661566 26278005 13345658 2162595
42193 2162595 -3291611 -9458565 -21725141 -32954973 -29616948 -9474710 12855622 21051550
42185 21051550 13616162 1610611 -6084861 -8994985 -8160389 -1173691 12320287 25328268
42177 25328268 29212380 23086995 13329122 4985705 -1579573 -5947906 -5772229 -2077542
42169 -2077542 -955404 -5324406 -8890569 -4092219 6688542 14953883 19679998 27914194
42161 27914194 39974135 43911168 31119731 10359269 -1954049 -927170 5491841
$$ packed form
42216A5966682q193188j373787P197627N147101p982644j3511293K199321K3506895
42208B2956714K2035863l961452k4008312j4227026J2385259K4115492R847198
42201D9143736j1393918j6797148m864276P654904O918268m383561j2932347j1183063
42193B162595n454206o166954j2266576j1229832L338025K0142238K2330332Q195928
42185B1051550p435388j2005551p695472k910124Q34596O986698J3493978J3007981
42177B5328268L884112o125385r757873q343417o565278m368333J75677L694687
42169b077542J122138m369002l566163M798350J0780761Q265341M726115Q234196
42161B7914194J2059941L937033j2791437k0760462j2313318J026879O419011
$$ plain form
42154 5491841 10411484 13448186 14447265 12617146 12149175 18043068 25040132 22150052
42146 22150052 10962223 6635601 15096678 22809926 18472415 11556113 15592709 24397723
42138 24397723 23041632 15165225 18111719 32502649 38738891 28191795 17580074 23017968
42130 23017968 36461629 40070056 31397580 21567408 17721198 19376862 24790906 29699112
42122 29699112 26450869 15293139 9918272 20357704 36467208 40507499 30676471 19533905
42114 19533905 14450164 13911242 18787243 30769940 41295806 39090593 29561762 29839795
42106 29839795 42074544 49164780 42136464 34002231 37561856 45667495 45698988 40298022
42098 40298022 39500696 42217059 40544753 35908063 36326619 41541703 44249926 43723156
$$ packed form
42154E491841M919643L036702R99079j830119m67971N893893O997064k890080
42146B2150052j1187829m326622Q461077P713248m337511o916302M036596Q805014
42138B4397723j356091p876407K946494J4390930O236242j0547096j0611721N437894
42130B3017968J3443661L608427q672476r830172l846210J655664N414044M908206
42122B9699112l248243j1157730n374867J0439432J6109504M040291r831028j1142566
42114A9533905n083741n38922M876001J1982697J0525866k205213r528831K78033
42106B9839795J2234749P090236p028316q134233L559625Q105639L1493n400966
42098D0298022p97326K716363j672306m636690M18556N215084K708223n26770
$$ plain form
42090 43723156 45593492 49339055 48367463 43115095 42508202 50000641 58142337 60625893
42082 60625893 61446183 67516584 78210908 86975706 89853238 88863715 88622879 91219975
42074 91219975 93582312 90682280 82823798 77045687 77968566 80384217 76007093 65140024
42066 65140024 55811774 53198740 55990387 61327535 66455907 67412748 64434866 67403700
42058 67403700 85611965 111210901 124218976 117930514 108277364 111254431 121549799
42051 121549799 124128138 119228130 121719965 137731123 156254207 167373234 176403005
42044 176403005 191540528 205931992 204610288 188153107 177282182 188400844 212574438
42037 212574438 227452986 225956829 222534465 230676575 245432477 253731921 253406114 253485874
$$ packed form
42090D3723156J870336L745563r71592n252368o06893P492439Q141696K483556
42082F0625893Q20290O070401J0694324Q764798K877532r89523k40836K597096
42074I1219975K362337k900032p858482n778111R22879K415651m377124j0867069
42066F5140024r328250k613034K791647N337148N128372R56841k977882K968834
42058F7403700J8208265K5598936J3008075o288462r653150K977067J0295368
42051A21549799K578339m900008K491835J6011158J8523084J1119027R029771
42044A76403005J5137523J4391464j321704j6457181j0870925J1118662K4173594
42037B12574438J4878548j496157l422364Q142110J4755902Q299444l25807P9760
$$ plain form
42029 253485874 260661862 274016094 289803025 302595357 304032299 290570843 272854807
42022 272854807 267988517 280406284 298183377 309864744 316135415 321683074 324728428
42015 324728428 321188238 313441804 308281097 308504104 310193151 306298915 292099546 270990256
42007 270990256 254376504 249495421 248175392 237203049 220126087 215360262 228070050
42000 228070050 238858025 230499355 212665156 205774495 210470065 210389343 199037966 185212667
41992 185212667 173769026 159826746 144123239 136469580 138291710 136800026 124232458
41985 124232458 110571698 108457234 115180403 118393409 112322558 100762250 90397664
41978 90397664 87486371 94418397 103508879 101528295 86929899 74788282 77017816 85601909
$$ packed form
42029B53485874P175988J3354232J5786931J2792332J436942j3461456j7716036
42022B72854807m866290J2417767J7777093J1681367O270671N547659L045354
42015C24728428l540190p746434n160707K23007J689047l894236j4199369k1109290
42007B70990256j6613752m881083j320029j0972343j7076962m765825J2709788
42000B28070050J0787975q358670j7834199o890661M695570q0722j1351377j3825299
41992A85212667j1443641j3942280j5703507p653659J822130j491684j2567568
41985A24232458j3660760k114464O723169L213006o070851j1560308j0364586
41978I0397664k911293O932026R090482j980584j4598396j2141617K229534Q584093
$$ plain form
41970 85601909 84726979 72433110 59483312 52389122 49109599 47660990 47527372 45402123
41962 45402123 40577509 41381177 53988974 67658691 65611353 50067527 40706790 45970616
41954 45970616 52219613 46941181 36676772 32638955 32718629 29937388 27177447 29397295
41946 29397295 30130134 21431259 11428138 15254770 30746955 39679741 34088642 25449972
41938 25449972 23927384 23919333 17993791 12121798 15557334 23724386 23481085 12176135
41930 12176135 1140210 757274 9964220 20965686 27960560 29839153 28754806 27710714
41922 27710714 27569096 26702058 25042061 25897141 30433411 33162872 28090787 17841832
41914 17841832 10947257 10607140 12462714 14130976 19592232 30510651 39420878 37855502
$$ packed form
41970H5601909q74930j2293869j2949798p094190l279523j448609j33618k125249
41962D5402123m824614Q03668J2607797J3669717k047338j5543826r360737N263826
41954D5970616O248997n278432j0264409m037817P9674k781241k759941K219848
41946B9397295P32839q698875j0003121L826632J5492185Q932786n591099q638670
41938B5449972j522588q051n925542n871993L435536Q167052k43301j1304950
41930A2176135j1035925l82936R206946J1001466O994874J878593j084347j044092
41922B7710714j41618q67038j659997Q55080M536270K729461n072085j0248955
41914A7841832o894575l40117J855574J668262N461256J0918419Q910227j565376
$$ plain form
41906 37855502 28423746 22496431 25967871 32226401 30603379 18516787 3483521 -4872038
41898 -4872038 -3026402 5020821 12449784 15106665 12959744 7566103 112577 -7236487
41890 -7236487 -10242538 -6078754 1915224 6077979 2892064 -2348238 -1604746 6514899
41882 6514899 15919011 20137192 16624906 5317777 -10599369 -20748952 -12439227 13231127
41874 13231127 35124484 32085495 8437948 -10602401 -10013073 299944 6168538 10578711
41866 10578711 22469009 34762410 31853944 16319841 9269660 20240658 33737289
41859 33737289 34037840 28247461 31501918 40535062 39023983 24055455 9717003 4331658
41851 4331658 747245 -6260971 -7970353 3549030 19146035 22590939 11657808 -1191842
$$ packed form
41906C7855502r431756n927315L471440O258530j623022j2086592j5033266q355559
41898d872038J845636Q047223P428963K656881k146921n393641p453526p349064
41890g236487l006051M163784P993978M162755l185915n240302P43492Q119645
41882F514899R404112M218181l512286j1307129j5917146j0149583Q309725K5670354
41874A3231127K1893357l038989k3647547j9040349N89328J0313017N868594M410173
41866A0578711J1890298J2293401k908466j5534103p050181J0970998J3496631
41859C3737289L00551n790379L254457R033144j511079j4968528j4338452n385345
41851D331658l584413p008216j709382J1519383J5597005L444904j0933131j2849650
$$ plain form
41843 -1191842 -6559768 -6678070 -6434204 -5147376 -449762 5915521 10304531 11826390
41835 11826390 11724973 10551831 8550683 6961672 6536699 6118913 4699971 3398673
41827 3398673 3093806 1628307 -3188819 -8122224 -6059267 5241603 18744214 24890529
41819 24890529 21034870 11977412 3203357 -2921946 -5449566 -3921100 -18349 3317580
41811 3317580 5417870 7473603 8301138 5085719 -266672 -1021950 4941142 11044285
41803 11044285 12077872 12914823 20337642 30684901 34564301 31331153 28746242 28617193
41795 28617193 23723621 11424001 -51693 -3378844 -1144724 1979499 6800408 12469311
41787 12469311 10871336 -2081592 -16165693 -18656154 -12044288 -9126450 -13594111 -17088248
$$ packed form
41843a191842n367926j18302K43866J286828M697614O365283M389010J521859
41835A1826390j01417j173142k001148j589011m24973m17786j418942j301298
41827C398673l04867j465499m817126m933405K062957J1300870J3502611O146315
41819B4890529l855659r057458q774055o125303k527620J528466L902751L335929
41811C317580K100290K055733Q27535l215419n352391p55278N963092O103143
41803A1044285J033587Q36951P422819J0347259L879400l233148k584911j29049
41795B8617193m893572j2299620j1475694l327151K234120L124223M820909N668903
41787A2469311j597975j2952928j4084101k490461O611866K917838m467661l494137
$$ plain form
41779 -17088248 -14211137 -8550558 -3088660 3733972 9884398 8795519 1011459 -2951010
41771 -2951010 2916082 10809997 10296323 1890094 -6586596 -10870345 -10951729 -6637594 100379
41762 100379 2326932 -5055894 -18024721 -28295147 -32214296 -29679223 -19074160 -1166794
41754 -1166794 15021259 19115306 11829884 3390185 -136786 -1915314 -5690983 -9520753
41746 -9520753 -10018170 -6922388 -1390385 5245277 9230268 5883939 -4157027 -14004944
41738 -14004944 -17932623 -16483818 -12888562 -8426441 -3705197 -1137967 -2825180 -7177927
41730 -7177927 -9813674 -7956532 -3968049 -4453746 -13684903 -26556166 -31482467 -23410691
41722 -23410691 -10110675 -1076844 4731575 12445538 17603872 11217027 -2538528 -7971268
$$ packed form
41779a7088248K877111N660579N461898O822632O150426j088879p784060l962469
41771b951010N867092P893915n13674q406229q476690m283749q1384M314135O737973
41762A00379K226553p382826j2968827j0270426l919149K535073J0605063J7907366
41754a166794J6188053M094047p285422q439699l526971j778528l775669l829770
41746i520753m97417L095782N532003O635662L984991l346329j0040966r847917
41738a4004944l927679J448805L595256M462121M721244K567230j687213m352747
41730g177927k635747J857142L988483m85697r231157j2871263m926301Q071776
41722b3410691J3300016R033831N808419P713963N158334o386845j3755555n432740
$$ plain form
41714 -7971268 -885380 3967724 -3961363 -13209852 -7554700 8344126 15385100 7591907
41706 7591907 -1866315 -1961543 2941579 4600055 3982476 6562847 12371561 17345159 19907820
41697 19907820 20942557 20663587 19800972 20795413 23701348 23542119 16146082 5173193
41689 5173193 -746632 2345970 9876339 14359331 12368648 5908988 -396406 -2294760
41681 -2294760 1708517 8369623 10768303 4742329 -4316686 -4724621 7225707 18756321
41673 18756321 13530029 -6076279 -17782695 -5251214 21683323 39781574 40025073
41666 40025073 33000161 29810901 29344205 25972102 19350291 12113075 5735874 3341721
41658 3341721 9552829 22366191 31756621 32373597 31533060 37518706 45612196 44848620
$$ packed form
41714g971268P085888M853104p929087r248489N655152J5898826P040974p793193
41706G591907r458222r5228M903122J658476o17579K580371N808714M973598K562661
41697A9907820J034737k78970q62615R94441K905935j59229p396037j0972889
41689E173193n919825L092602P530369M482992j990683o459660o305394j898354
41681b294760M003277O661106K398680o025974r059015m07935J1950328J1530614
41673A8756321n226292j9606308j1706416J2531481K6934537J8098251K43499
41666D0025073p024912l189260m66696l372103o621811p237216o377201k394153
41658C341721O211108J2813362R390430O16976q40537N985646Q093490p63576
$$ plain form
41650 44848620 35024717 26806994 25940377 27373205 26209501 24881660 25848844 25093327
41642 25093327 17994727 6212164 -5821487 -16389509 -23946602 -24109335 -15276062 -3853582
41634 -3853582 2497510 4645920 8644315 14250476 14337826 6380980 -2697343 -5728885
41626 -5728885 -3351443 550583 5861579 13376436 18605986 14861858 2077209 -11962111
41618 -11962111 -19346465 -17943127 -10398520 -1148241 5419158 7375013 6820883 6916318
41610 6916318 7448979 5803904 1782352 -1659372 -2159064 636187 6328832 12188643
41602 12188643 11609011 625646 -13481407 -17356010 -7806875 3998848 7566942 4257433
41594 4257433 -1258735 -10888565 -24862390 -31574865 -19641829 2616300 13833593 6634206
$$ packed form
41650D4848620r823903q217723q66617J432828j163704j327841R67184p55517
41642B5093327p098600j1782563j2033651j0568022p557093j62733Q833273J1422480
41634c853582O351092K148410L998395N606161Q7350p956846r078323l031542
41626e728885K377442L902026N310996P514857N229550l744128j2784649j4039320
41618a1962111p384354J403338P544607R250279O567399J955855n54130R5435
41610F916318N32661j645075m021552l441724m99692K795251N692645N859811
41602A2188643n79632j0983365j4107053l874603R549135J1805723L568094l309509
41594D257433n516168r629830j3973825o712475J1933036K2258129J1217293p199387
$$ plain form
41586 6634206 -5016250 -7999134 -5742499 -5657940 -4306018 4009207 13439973 14442346
41578 14442346 10002086 11044475 18373532 22148235 18894121 15570765 13999528 4760123
41570 4760123 -16026783 -34504717 -34398095 -18877056 -6724082 -9258485 -20474695 -28844292
41562 -28844292 -28899281 -19815455 -2686875 15504694 22731143 14336201 1186777 -1274571
41554 -1274571 9362523 21350769 24197608 19370125 15061257 15528212 18163408 18656102
41546 18656102 17007603 18240730 25746138 33626813 30588663 15566359 3948700 9836094
41538 9836094 25455691 29347871 14745482 -2594921 -7467874 -2746495 2420974 8553732
41530 8553732 18819013 26071124 20516654 5064422 -8661732 -15099619 -14870429 -6219272
$$ packed form
41586F634206j1650456k982884K256635Q4559J351922Q315225R430766J002373
41578A4442346m440260J042389P329057L774703l254114l323356j571237r239405
41570D760123k0786906j8477934J06622J5521039J2152974k534403j1216210q369597
41562b8844292n4989R083826J7128580J8191569P226449q394942j3149424k461348
41554a274571J0637094J1988246K846839m827483m308868M66955K635196M92694
41546A8656102j648499J233127P505408P880675l038150j5022304j1617659N887394
41538I836094J5619597L892180j4602389j7340403m872953M721379N167469O132758
41530H553732J0265281P252111n554470j5452232j3726154o437887K29190Q651157
$$ plain form
41522 -6219272 10369865 23677577 22679896 13411366 10398911 14022094 12777806 5991970
41514 5991970 4794218 9592196 7981784 -243704 1658856 18097906 28797200 18850868
41506 18850868 1449864 -5010672 -3807686 -5129249 -2271344 13565074 28505853 23575412
41498 23575412 8927341 11801294 33186417 45464897 35567557 22116371 21744512 24567801
41490 24567801 16563352 4767722 3154769 8841086 9835485 6249640 7569063 15120823
41482 15120823 21226004 21958559 19402189 14288384 6268975 -600121 -991263 4171055
41474 4171055 9025702 9765101 6347459 673894 -3294891 -2088672 1109340 -1460469
41466 -1460469 -9985490 -13908814 -6193702 6305613 13091198 13420771 11676896 6456599
$$ packed form
41522f219272J6589137J3307712r97681r268530l012455L623183j244288o785836
41514E991970j197752M797978j610412q225488J902560J6439050J0699294r946332
41506A8850868j7401004o460536J202986j321563K857905J5836418J4940779m930441
41498B3575412j4648071K873953K1385123J2278480r897340j3451186l71859K823289
41490B4567801q004449j1795630j612953N686317R94399l585845J319423P551760
41482A5120823O105181P32555k556370n113805q019409o869096l91142N162318
41474D171055M854647P39399l417642n673565l968785J206219L198012k569809
41466a460469q525021l923324P715112J2499315O785585L29573j743875n220297
$$ plain form
41458 6456599 -5396108 -18406823 -22974892 -18544750 -13188033 -11392121 -10844341 -10268513
41450 -10268513 -11306336 -11832436 -5772047 7676484 20534908 24829528 21613531 19315606
41442 19315606 24588510 34812481 38974643 28175071 6474218 -12232919 -19699826
41435 -19699826 -20524036 -21529624 -21445876 -16742258 -10535926 -7571692 -5821693 -1716377
41427 -1716377 1304838 -990360 -3681570 -36520 5297686 3472426 -635981 7172208
41419 7172208 26910566 40352620 34969140 18666282 4902440 -4028974 -10878925 -12592850
41411 -12592850 -6867542 -1388328 -4632937 -12117390 -12441241 -4093188 3472389 3839974
41403 3839974 -142644 -3507349 -4571972 -2850582 1810672 7302876 11503394 15928968
$$ packed form
41458F456599j1852707j3010715m568069M430142N356717J795912N47780N75828
41450a0268513j037823n26100O060389J3448531J2858424M294620l215997k297925
41442A9315606N272904J0223971M162162j0799572k1700853j8707137p466907
41435a9699826q24210j005588Q3748M703618O206332K964234J749999M105316
41427a716377L021215k295198k691210L645050N334206j825260m108407P808189
41419G172208J9738358J3442054n383480j6302858j3763842q931414o849951j713925
41411a2592850N725308N479214l244609p484453l23851Q348053P565577L67585
41403C839974l982618l364705j064623J721390M661254N492204M200518M425574
$$ plain form
41395 15928968 21794736 23539852 13182003 -8173339 -29353394 -40869799 -42140181
41388 -42140181 -36374186 -25486782 -13157186 -6304981 -8046248 -12836281 -13270191 -8948258
41380 -8948258 -4578874 -2297097 -666027 897978 1769325 2698814 3711227 757486
41372 757486 -9585702 -22380847 -27841366 -23736879 -17913276 -16578607 -17258325 -16963927
41364 -16963927 -19303985 -26330582 -29905637 -21591089 -8230062 -6154589 -18649353 -29612861
41356 -29612861 -23952673 -6071075 7866826 9881791 5147378 600709 -3309120 -8808401
41348 -8808401 -14420875 -15624116 -10504554 -2700833 2021799 1520469 -2003429 -6812009
41340 -6812009 -13269395 -18569388 -15201189 -899478 13474409 14354536 2559723 -8478625
$$ packed form
41395A5928968N865768J745116j0357849k1355342k1180055j1516405j270382
41388d2140181N765995J0887404J2329596O852205j741267m790033m33910M321933
41380h948258M369384K281777J631070J564005Q71347R29489J012413k953741
41372G57486j0343188j2795145n460519M104487N823603J334669o79718K94398
41364a6963927k340058p026597l575055Q314548J3361027K075473j2494764j0963508
41356b9612861N660188J7881598J3937901K014965m734413m546669l909829n499281
41348h808401n612474j203241N119562P803721M722632n01330l523898m808580
41340f812009o457386n299993L368199J4301711J4373887Q80127j1794813j1038348
$$ plain form
41332 -8478625 -10843728 -8650163 -6064070 -755486 6912681 9717667 5020798 669857
41324 669857 2590715 5659880 4374796 3345759 8329968 15351845 18397684 20041447
41316 20041447 24283138 26559464 21793115 14838629 11396355 6625105 -3991796 -10780937
41308 -10780937 -2901151 11529113 16048624 11287113 10288968 12177338 2849010 -17502077
41300 -17502077 -30183611 -25945046 -16600233 -12814015 -10321956 -5940932 -7355076 -16324298
41292 -16324298 -20012614 -10988332 -22226 2650912 2725474 5831506 3071838 -11234299
41284 -11234299 -22261448 -13968175 5643247 17363228 19224110 22480559 26837457 20767042
41276 20767042 3112778 -14756228 -26647073 -34189552 -33998091 -20608959 -2452059
$$ packed form
41332h478625k365103K193565K586093N308584P668167K804986m696869m350941
41324F69857J920858L069165j285084j029037M984209P021877L045839J643763
41316B0041447M241691K276326m766349o954486l442274m771250j0616901o789141
41308a0780937P879786J4430264M519511m761511r98145J888370r328328k0351087
41300a7502077j2681534M238565R344813L786218K492059M381024j414144q969222
41292a6324298l688316R024282J0966106K673138P4562L106032k759668j4306137
41284a1234299j1027149Q293273J9611422J1719981J860882L256449M356898o070415
41276B0767042j7654264j7869006j1890845p542479J91461J3389132J8156900
$$ plain form
41269 -2452059 3066471 -6630012 -15657544 -12643303 -2882153 5437136 12439075 18918975
41261 18918975 20523207 16149429 12365213 13908691 17595039 19106038 18098161 14579159
41253 14579159 8673339 5262848 9462972 16496626 16669177 11522205 12559296 21057452
41245 21057452 22735770 8424475 -12171880 -24677122 -27286061 -26041116 -22940172 -17766758
41237 -17766758 -13556721 -11389196 -6916338 -247579 -1259164 -15059867 -29195189 -27137061
41229 -27137061 -10205108 5464226 10734939 10064465 7420516 -843085 -15086722 -25244977
41221 -25244977 -22102384 -9990618 -1188154 -473999 -1858426 -331483 -330091 -8732479
41213 -8732479 -22704042 -30262693 -24142164 -10945007 -3342975 -5492835 -9896861 -7880503
$$ packed form
41269b452059N518530r696483r027532L014241R761150Q319289P001939O479900
41261A8918975J604232m373778l784216J543478L686348J510999j007877l519002
41253A4579159n905820l410491M200124P033654J72551n146972J037091Q498156
41245B1057452J678318j4311295k0596355j2505242k608939J244945L100944N173414
41237a7766758M210037K167525M472858O668759j011585j3800703j4135322K058128
41229b7137061J6931953J5669334N270713o70474k643949q263601j4243637j0158255
41221b5244977L142593J2111766Q802464P14155j384427J526943J392q402388
41213h732479j3971563p558651O120529J3197157P602032k149860m404026K016358
$$ plain form
41205 -7880503 385150 6965691 5423931 -1660123 -4946148 130383 5362421 -1273517
41197 -1273517 -17862982 -27432977 -18923907 -1991175 5521943 -1819236 -16340275 -29668213
41189 -29668213 -35948918 -29876480 -14347213 -4755938 -11392572 -21714496 -16091824 2034687
41181 2034687 10592896 2921199 -3889698 1582057 9292628 9572739 9447502 14454866
41173 14454866 13384664 -2095825 -17801187 -15620162 -737977 7957131 5922132 2979961
41165 2979961 1975256 -3336179 -12032702 -15495112 -12847104 -11860215 -14417731 -14643572
41157 -14643572 -11336917 -9064730 -6714947 1988656 15491700 24185818 24812554 23887100
41149 23887100 25126404 24074886 17014720 5601782 -8250590 -22463617 -29888043 -24365028
$$ packed form
41205g880503Q265653O580541j541760p084054l286025N076531N232038o635938
41197a273517j6589465r569995Q509070J6932732P513118p341179j4521039j3327938
41189b9668213o280705O072438J5529267R591275o636634j0321924N622672J8126511
41181B034687Q558209p671697o810897N471755P710571K80111j25237N007364
41173A4454866j070202j5480489j5705362K181025J4882185Q695108k034999k942171
41165B979961j004705n311435q696523l462410K648008R86889k557516k25841
41157a4643572L306655K272187K349783Q703603J3503044Q694118O26736r25454
41149B3887100J239304j051518p060166j1412938j3852372j4213027p424426N523015
$$ plain form
41141 -24365028 -12354903 -7187486 -10778200 -13023436 -10437635 -11259393 -18203310 -20644839
41133 -20644839 -11459607 234277 1822443 -6475489 -15700018 -19877202 -16116653 -2151087
41125 -2151087 16827591 26616511 19849231 7686066 5028306 8871250 3865013 -12205832
41117 -12205832 -21994673 -11765715 8697125 16610675 2705313 -18795779 -26136707
41110 -26136707 -12181875 9961428 20779290 11887676 -9015765 -27565755 -35344809
41103 -35344809 -34295677 -30821727 -27321625 -21542795 -14531857 -14123842 -24466765 -35110337
41095 -35110337 -30366909 -10425032 7538620 12384950 10825657 10449373 6026791 -5078853
41087 -5078853 -8111104 9504905 32850217 35579916 17305939 2545361 2931269 4222210
$$ packed form
41141b4365028J2010125N167417l590714k245236K585801q21758o943917k441529
41133b0644839R185232J1693884J588166q297932r224529m177184L760549J3965566
41125b151087J8978678R788920o767280j2163165k657760L842944n006237j6070845
41117a2205832r788841J0228958K0462840P913550j3905362k1501092p340928
41110b6136707J3954832K2143303J0817862q891614k0903441j8549990p779054
41103c5344809J049132L473950L500102N778830P010938M08015j0342923j0643572
41095c5110337M743428J9941877J7963652M846330j559293l76284m422582j1105644
41087e078853l032251J7616009K3345312K729699j8273977j4760578L85908J290941
$$ plain form
41079 4222210 -4847843 -14492628 -14182917 -10248538 -10505939 -8803742 854383 9586993
41071 9586993 8317280 4907663 10802524 20356890 19429753 7502631 -3446243 -6658049
41063 -6658049 -4567587 -1018419 -1241908 -12323499 -30993469 -38868505 -24567546 -3554852
41055 -3554852 79960 -14405405 -27746661 -30247119 -27856003 -21727991 -4964315 16942793
41047 16942793 24444430 11532713 -2490302 470869 12938407 15721878 5511896
41040 5511896 -3960327 -2204651 7689375 16411122 18109476 13665520 9023846 9321579
41032 9321579 12788087 12919514 7393631 907423 -1538217 91103 2638257 2580076 -2000406
41023 -2000406 -7284228 -3976000 11134581 26510675 28272485 19382018 14869087 18553337
$$ packed form
41079D222210r070053r644785L09711L934379k57401J702197R658125Q732610
41071I586993j269713l409617N894861R554366r27137j1927122j0948874l211806
41063f658049K090462L549168k23489j1081591j8669970p875036J4300959K1012694
41055c554852L634812j4485365j3341256k500458K391116O128012J6763676K1907108
41047A6942793P501637j2911717j4023015K961171J2467538K783471j0209982
41040E511896r472223J755676R894026Q721747J698354m443956m641674K97733
41032I321579L466508J31427n525883o486208k445640J629320K547154n8181m580482
41023b000406n283822L308228J5110581J5376094J761810q890467m512931L684250
$$ plain form
41015 18553337 18635736 9142740 830579 3909058 12661255 15884487 12124558 5818207
41007 5818207 -1818399 -8546646 -7142104 3268344 9401842 -1191437 -22894264 -39993662
40999 -39993662 -45761788 -42791812 -31457461 -12606335 2321617 230551 -13869977
40992 -13869977 -20401645 -11279135 417224 982066 -5764087 -7401165 -197162 10462301
40984 10462301 19755023 25073484 22671766 11354272 -1886254 -6915899 -1723568 5988426
40976 5988426 9155411 9381641 12735470 19930615 24037734 19129363 9231300 5035173
40968 5035173 10715451 17904250 16312561 7420043 2188197 6266734 13774258 16760653
40960 16760653 14537985 10590839 5912534 689784 -1085985 4589543 13763771 16051383
$$ packed form
41015A8553337Q2399r492996q312161L078479Q752197L223232l759929o306351
41007E818207p636606o728247J404542J0410448O133498j0593279k1702827j7099398
40999c9993662n768126K969976J1334351J8851126J4927952k091066j4100528
40992a3869977o531668R122510J1696359N64842o746153j637078P204003J0659463
40984A0462301R292722N318461k401718j1317494j3240526n029645N192331P711994
40976E988426L166985K26230L353829P195145M107119m908371r898063m196127
40968E035173N680278P188799j591689q892518n231846M078537P507524K986395
40960A6760653k222668l947146m678305n222750j775769N675528R174228K287612
$$ plain form
40952 16051383 5780509 -11805558 -26500382 -31875210 -27197072 -15579486 -3872457
40945 -3872457 -456672 -7280432 -15457317 -14720652 -7098335 -4571770 -11763418 -18599873
40937 -18599873 -14665397 -4106532 748984 -3979404 -11322670 -14579284 -12437135 -4976635
40929 -4976635 6148977 13787507 10954325 1682063 -2627643 829556 3396211 161550
40921 161550 -2694415 272858 5868801 12007059 23285047 37852558 40502101 21939489
40913 21939489 -3733768 -15472498 -12845981 -10984882 -12406286 -3423839 19636987 39663630
40905 39663630 41909353 33291033 28534751 28097643 21629809 6678928 -7940331 -15180831
40897 -15180831 -16519870 -15374566 -11131891 -2435198 7180413 10151533 2237687 -11330917
$$ packed form
40952A6051383j0270874j7586067j4694824n374828M678138J1617586J1707029
40945c872457L415785o823760q176885P36665P622317K526565p191648o836455
40937a8599873L934476J0558865M855516m728388p343266l256614K142149P460500
40929d976635J1125612P638530k833182r272262m309706L457199K566655l234661
40921A61550k855965K967273N595943O138258J1277988J4567511K649543j8562612
40913B1939489k5673257j1738730K626517J861099j421404Q982447K3060826K0026643
40905C9663630K245723q618320m756282m37108o467834j4950881j4619259p240500
40897a5180831j339039J145304M242675Q696693R615611K971120p913846j3568604
$$ plain form
40889 -11330917 -19287237 -15926875 -6921947 -455125 3647600 9642702 14121291 8682885
40881 8682885 -5080026 -13692654 -8693451 3185151 11268188 14301655 16815723 19201403
40873 19201403 18453162 14401403 9795820 7978404 13400868 27805802 42036285 40402941
40865 40402941 20019753 -2365224 -10969510 -10183760 -13275619 -20397335 -21493223 -15266017
40857 -15266017 -9555261 -5526065 2065933 8914132 3017787 -13492187 -21122690 -9423717
40849 -9423717 7646281 12438515 6805984 2260820 -1951575 -14324814 -29841843 -30874770
40841 -30874770 -11529709 11948834 20141703 11444890 -619182 -4889585 -2081558 173233
40833 173233 -2551735 -6589797 -5056650 2064527 5241501 -3676075 -19553022 -28042995
$$ packed form
40889a1330917p956320L360362R004928O466822M102725N995102M478589n438406
40881H682885j3762911q612628M999203J1878602Q083037L033467K514068K385680
40873A9201403p48241m051759m605583j817416N422464J4404934J4230483j633344
40865D0402941k0383188k2384977q604286P85750l091859p121716j095888O227206
40857a5266017N710756M029196P591998O848199n896345j6509974p630503J1698973
40849i423717J7069998M792234n632531m545164m212395j2373239j5517029j032927
40841c0874770J9345061K3478543Q192869q696813j2064072m270403K808027K254791
40833A73233k724968m038062J533147P121177L176974q917576j5876947q489973
$$ plain form
40825 -28042995 -21583817 -6628142 5370183 8694959 3548373 -8227534 -22679075
40818 -22679075 -32537023 -32472711 -25529619 -20320888 -21045288 -23075480 -19442646 -9397532
40810 -9397532 1045933 5558153 2623207 -4691004 -11350364 -12513222 -6336946 2931593
40802 2931593 6799803 1163527 -7411697 -7876982 2346039 14467063 19416547 17209749
40794 17209749 12724762 7192130 -894845 -9560787 -14358388 -14716193 -13693177 -11664448
40786 -11664448 -5929083 2812484 9403901 11419536 12122283 13987646 14768915 13561345
40778 13561345 15344229 23524220 31173187 26822184 9307356 -8464713 -12432912 -1159295
40770 -1159295 14508620 23012961 21492794 15040576 9193028 4788599 -23311 -5269869
$$ packed form
40825b8042995O459178J4955675J1998325L324776n146586j1775907j4451541
40818b2679075r857948O4312O943092N208731p24400k030192L632834J0045114
40810i397532J0443465M512220k934946p314211o659360j162858O176276R268539
40802B931593L868210n636276q575224m65285J0223021J2121024M949484k206798
40794A7209749m484987n532632q086975q665942m797601l57805J023016K028729
40786a1664448N735365Q741567O591417K015635P02747J865363P81269j207570
40778A3561345J782884Q179991P648967m351003j7514828j7772069l968199J1273617
40770a159295J5667915Q504341j520167o452218n847548m404429m811910n246558
$$ plain form
40762 -5269869 -9196054 -11520526 -13095739 -12721466 -8595599 -3174097 -1159769 -1250939 3552463
40753 3552463 14109176 20846956 17311310 11278671 13624402 21150567 21374964 11917547
40745 11917547 3151040 1381572 1613744 -331836 -628154 2471368 2523380 -3998974 -10401072
40736 -10401072 -11824867 -14896120 -24713844 -31038774 -21432773 -2637376 6702804 2621220
40728 2621220 -879390 3714659 6179007 -2327305 -13265185 -13582675 -4597326 2248070
40720 2248070 1725778 -2465670 -5920887 -5506173 2068944 14202267 18700631 6334065
40712 6334065 -14794796 -27262337 -25834800 -21075988 -21350744 -22080363 -16098863 -5316036
40704 -5316036 3088136 5414331 1794316 -6421573 -15271034 -19326439 -18053175 -15793706
$$ packed form
40762e269869l926185k324472j575213L74273M125867N421502K014328r1170M803402
40753C552463J0556713O737780l535646o032639K345731P526165K24397r457417
40745A1917547q766507j769468K32172j945580k96318L099522N2012o522354o402098
40736a0401072j423795l071253r817724o324930R606001J8795397R340180m081584
40728B621220l500610M594049K464348q506312j0937880l17490Q985349O845396
40720B248070n22292m191448l455217M14714P575117J2133323M498364j2366566
40712F334065k1128861j2467541J427537M758812k74756p29619N981500J0782827
40704e316036Q404172K326195l620015q215889q849461m055405J273264K259469
$$ plain form
40696 -15793706 -12392418 -1330342 17440423 30733602 26736708 10786753 -2441897
40689 -2441897 -7525104 -8854729 -7432576 -750613 5476454 613782 -12854948 -18945392
40681 -18945392 -11947328 -7105338 -17973864 -34503262 -36424834 -20859327 -2991484
40674 -2991484 6103715 8320764 7297146 2768968 -2188224 -955703 5627118 8119818
40666 8119818 2273038 -5222080 -8746791 -12008769 -18732073 -23869322 -21375281 -14100730
40658 -14100730 -8621398 -5345277 -433444 6902015 14834892 21902028 24399305 17155736
40650 17155736 3198078 -4770532 -912442 3397817 -3399610 -13189520 -9921590 3923230
40642 3923230 10405555 4833851 2084081 9871180 14611014 3930612 -12286231 -16900652
$$ packed form
40696a5793706L401288J1062076J8770765J3293179l996894j5949955j3228650
40689b441897n083207j329625J422153O681963O227067m862672j3468730o090444
40681a8945392O998064M841990j0868526j6529398j921572J5565507J7867843
40674b991484R095199K217049j023618m528178m957192J232521O582821K492700
40666H119818n846780p495118l524711l261978o723304n137249K494041P274551
40658a4100730N479332L276121M911833P335459P932877P067136K497277p243569
40650A7155736j3957658p968610L858090M310259o797427r789910L267930J3844820
40642C923230O482325n571704k749770P787099M739834j0680402j6216843m614421
$$ plain form
40634 -16900652 -10446164 -6271449 -8091567 -7730759 -1943330 3091905 4377156 6894185
40626 6894185 13306365 18394038 17052251 10902148 4185982 -1448204 -5921893 -8970009
40618 -8970009 -11041508 -12806510 -13815573 -14586697 -17847441 -23161424 -23483221 -14041285
40610 -14041285 -2286103 -388486 -8844956 -16911812 -18955416 -19040704 -17622960 -7218820
40602 -7218820 12104585 25265144 21117033 10503955 12898332 29593779 42737511
40595 42737511 39581723 25687456 12606292 3470918 -4256185 -9369714 -6974759 4471267
40587 4471267 19943411 30843027 30508369 19008750 3381607 -8230209 -12255866 -8875989
40579 -8875989 476982 10687600 12484757 2344958 -9247668 -9147555 -1271475 -3548850
$$ packed form
40634a6900652O454488M174715j820118L60808N787429N035235J285251K517029
40626F894185O412180N087673j341787o150103o716166n634186m473689l048116
40618h970009k071499j765002j009063p71124l260744n313983l21797R441936
40610a4041285J1755182J897617q456470q066856k043604q5288J417744J0404140
40602g218820J9323405J3160559m148111j0613078K394377J6695447J3143732
40595D2737511l155788j3894267j3081164r135374p727103n113529K394955J1446026
40587D471267J5472144J0899616l34658j1499619j5627143j1611816m025657L379877
40579h875989R352971J0210618J797157j0139799j1592626J00113P876080k277375
$$ plain form
40571 -3548850 -21430127 -36327546 -29129161 -6197384 9511875 7743294 -1273237 -6037886
40563 -6037886 -7092824 -8502263 -7908597 -1889991 5846022 8558271 5307833 981682
40555 981682 198403 4454887 12150631 18297393 17503542 10435422 3972012 1883485 -582854
40546 -582854 -9061499 -21562185 -32460715 -39995500 -42951232 -34889210 -12279959 13172157
40538 13172157 22424732 12329736 670883 2951933 13494875 16974520 10608169 4482657
40530 4482657 4559718 6873148 7419413 6736293 3389151 -6241871 -17565110 -17146488 42177
40521 42177 19782867 24067789 13214002 2820946 546275 -2861966 -16666050 -34346112
40513 -34346112 -41897674 -36301962 -27559998 -24129197 -23811504 -20209674 -12472713 -5629770
$$ packed form
40571c548850j7881277j4897419P198385K2931777J5709259j768581r016531m764649
40563f037886j054938j409439N93666O018606P736013K712249l250438m326151
40555I81682p83279M256484P695744O146762p93851p068120o463410k088527k466339
40546e82854q478645j2500686j0898530p534785k955732Q062022K2609251K5452116
40538A3172157R252575j0094996j1658853K281050J0542942L479645o366351o125512
40530D482657P7061K313430N46265o83120l347142r631022j1323239M18622J7188665
40521D2177J9740690M284922j0853787j0393056k274671l408241j3804084j7680062
40513c4346112p551562N595712Q741964L430801L17693L601830P736961O842943
$$ plain form
40505 -5629770 -4269817 -8515930 -14627043 -17585225 -14052225 -4400094 8090265 19893627
40497 19893627 28266931 30561767 25301873 14649893 3428765 -5363787 -11946455 -16040089
40489 -16040089 -15290644 -9896090 -5714748 -8509636 -15994789 -19351950 -12802385 1162697
40481 1162697 15966392 26865963 31549485 28185142 16535154 1183621 -9031822
40474 -9031822 -7779881 1625406 7945348 3533892 -6824974 -11889836 -7985491 -2047556
40466 -2047556 -236271 -384570 873159 572644 -4408870 -9077139 -6737566 -652521
40458 -652521 -348814 -7470444 -13855782 -13293776 -6784128 3458144 15615499 23402737
40450 23402737 20547291 12699910 13684045 25530470 33640966 28160990 18633527 18210493
$$ packed form
40505e629770J359953m246113o111113k958182L533000R652131J2490359J1803362
40497A9893627Q373304K294836n259894j0651980j1221128q792552o582668m093634
40489a6040089P49445N394554M181342k794888p485153l357161O549565J3965082
40481A162697J4803695J0899571M683522l364343j1649988j5351533j0215443
40474i031822J251941R405287O319942m411456j0358866n064862L904345N937935
40466b047556J811285j48299J257729l00515m981514m668269K339573O085045
40458f52521L03707p121630o385338N62006O509648J0242272J2157355P787238
40450B3402737k855446p847381R84135J1846425Q110496n479976r527463m23034
$$ plain form
40442 18210493 23717317 23358312 16288319 10990975 9208557 5231831 -1343994 -5096191
40434 -5096191 -5551375 -5864807 -1799434 13922739 34926322 43305333 33078825 18857751
40426 18857751 14931883 17288152 14559394 6938311 3799234 8606331 16151879 21635557
40418 21635557 24311888 23915733 19965658 13653366 6321392 -1729656 -7776481 -6249620
40410 -6249620 3784577 15147614 21728506 26296731 32658252 35289724 26589368 11996399
40402 11996399 6523871 14388474 21923644 15379269 -1564913 -13856291 -13466500 -5232762
40394 -5232762 2639110 6713594 6878082 2944942 -4418190 -12445511 -18532120 -22121838
40386 -22121838 -22998838 -20365313 -15967029 -14899596 -18685323 -19865337 -10314708 5228018
$$ packed form
40442A8210493N506824l59005p069993n297344j782418l976726o575825l752197
40434e096191m55184l13432M065373J5722173K1003583Q379011j0226508j4221074
40426A8857751l925868K356269k728758p621083l139077M807097P545548N483678
40418B1635557K676331l96155l950075o312292p331974q051048o046825J526861
40410f249620J0034197J1363037O580892M568225O361521K631472q700356j4592969
40402A1996399n472528P864603P535170o544375j6944182j2291378L89791Q233738
40394e232762P871872M074484J64488l933140p363132q027321o086609l589718
40386b2121838q77000K633525M398284J067433l785727j180014R550629J5542726
$$ plain form
40378 5228018 12261823 5949171 -1198922 3086808 13643880 17120985 11709908 5902623
40370 5902623 1733598 -6620750 -17709960 -20632947 -11594926 -410963 3986441 2876074
40362 2876074 -2146202 -14902187 -32163719 -38389933 -25051672 -5362725 3505682 4627496
40354 4627496 12666429 27230305 32487429 21938175 6529666 -3938580 -11659695 -18400322
40346 -18400322 -17124938 -4652177 8343050 10017029 2987518 -1961551 -2714739 -6959673
40338 -6959673 -18611058 -31297710 -36001722 -30121753 -18430331 -8491933 -5199312 -7004271
40330 -7004271 -7375635 -1984575 5660675 7430556 -567162 -13619816 -23091270 -24625258
40322 -24625258 -21210424 -18487343 -18325774 -18334359 -16788342 -15245870 -15786303 -18504049 -22736338
$$ packed form
40378E228018P033805o312652p148093M285730J0557072L477105n411077n807285
40370E902623m169025q354348j1089210k922987R038021J1183963M397404j110367
40362B876074n022276j2755985j7261532o226214J3338261J9688947Q868407J121814
40354D627496Q038933J4563876N257124j0549254j5408509j0468246p721115o740627
40346a8400322J275384J2472761J2995227J673979p029511m949069p53188m244934
40338f959673j1651385j2686652m704012N879969J1691422R938398L292621j804959
40330g004271l71364N391060P645250J769881p997718j3052654r471454j533988
40322b4625258L414834K723081J61569q585J546017J542472n40433k717746m232289
$$ plain form
40313 -22736338 -27661105 -30428947 -27634939 -20918644 -17087199 -19752922 -24856166 -27588501
40305 -27588501 -29026577 -31898459 -34845039 -35792902 -35771533 -33874809 -24642303 -7756609
40297 -7756609 5992934 7690575 3589836 4986324 10545423 11563274 9816912 14061724
40289 14061724 20832185 16779214 1994945 -6927787 -2044424 4894378 3675240 940438
40281 940438 3932582 4623848 -5788511 -18327319 -17725331 -5155614 4540496 3377523
40273 3377523 -3935708 -10061796 -10050385 -802978 14325010 25051968 27399467 30679733
40265 30679733 40876425 45612524 30328916 2942455 -14790027 -17132009 -17614852 -23269794
40257 -23269794 -24921515 -17128949 -10008130 -12971474 -20089552 -20650106 -14515019 -8996685
$$ packed form
40313b2736338m924767k767842K794008O716295L831445k665723n103244k732335
40305b7588501j438076k871882k946580r47863K1369J896724R232506J6885694
40297g756609J3749543J697641m100739J396488N559099J017851j746362M244812
40289A4061724O770461m052971j4784269q922732M883363O938802j219138k734802
40281I40438K992144O91266j0412359j2538808O01988J2569717R696110j162973
40273C377523p313231o126088J1411R247407J5127988J0726958K347499L280266
40265C0679733J0196692M736099j5283608k7386461j7732482k341982m82843n654942
40257b3269794j651721P792566P120819k963344p118078n60554O135087N518334
$$ plain form
40249 -8996685 -8149191 -11631628 -17279658 -19570230 -12577317 851419 10061824 10830086
40241 10830086 10546807 14812482 17993571 13005285 1623601 -11516419 -25990074 -38821186
40233 -38821186 -40246151 -26625560 -9637177 -1359617 2178387 9427357 12898265 -1592576
40225 -1592576 -27898254 -41870805 -34336202 -23024463 -23602692 -26544757 -16763375 -2228973
40217 -2228973 -3377738 -20213595 -30686303 -23027947 -10979025 -10265880 -15955334 -14511045
40209 -14511045 -6474169 -2574895 -4197720 -3694189 -1955020 -9213071 -25310782 -34081779
40201 -34081779 -24912050 -8505302 -1750403 -5576496 -8664396 -6873337 -6353441 -9525105
40193 -9525105 -10272094 -5085519 277629 -1078369 -8266847 -14831395 -16183145 -13345352
$$ packed form
40249h996685Q47494l482437n648030k290572O992913J3428736R210405P68262
40241A0830086k83279M265675L181089m988286j1381684j3140020j4473655j2831112
40233c8821186j424965J3620591J6988383Q277560L538004P248970L470908j4490841
40225a592576k6305678j3972551P534603J1311739n78229k942065R781382J4534402
40217b228973j148765j6835857j0472708P658356J2048922P13145n689454J444289
40209a4511045Q036876L899274j622825N03531J739169p258051j6097711q770997
40201c4081779R169729J6406748O754899l826093l087900J791059N19896l171664
40193i525105p46989N186575N363148j355998p188478o564548j351750K837793
$$ plain form
40185 -13345352 -11951871 -17055586 -25947874 -28218860 -17363736 186692 13094899 19026645
40177 19026645 23030957 24794954 17855674 2222944 -11832157 -15277482 -8349815 3994602
40169 3994602 16389849 21787151 15742024 4811297 1203859 6096262 8634513 4901075
40161 4901075 4981324 14363065 21638220 15682241 3889299 -71222 2337552 686278
40153 686278 -3474229 564731 11203407 13686134 2980402 -7868262 -6733289 3157067
40145 3157067 12582586 17768936 16560125 5557108 -10203914 -15366280 -3148217 11506718
40137 11506718 9559239 -6630316 -18144209 -16904622 -13971334 -18959218 -25179510 -22341701
40129 -22341701 -13899490 -11616631 -17870228 -23310365 -20632680 -11795184 -976175 11135603
$$ packed form
40185a3345352J393481n103715q892288k270986J0855124J7550428J2908207N931746
40177A9026645M004312J763997o939280j5632730j4055101l445325O927667J2344417
40169C994602J2395247N397302o045127j0930727l607438M892403K538251l733438
40161D901075Q0249R381741P275155n955979j1792942l960521K408774j651274
40153F86278m160507M038960J0638676K482727j0705732j0848664J134973R890356
40145C157067R425519N186350j208811j1003017j5761022n162366J2218063J4654935
40137A1506718j947479j6189555j1513893J239587K933288m987884o220292K837809
40129b2341701Q442211K282859o253597n440137K677685Q837496J0819009J2111778
$$ plain form
40121 11135603 22790179 27864503 22369608 10252439 -1645053 -10597594 -15676032 -13419942
40113 -13419942 -2976636 7640174 8938278 2678480 -1042931 761723 685901 -5528015
40105 -5528015 -12306834 -15109751 -18126840 -24555753 -27858536 -21755053 -12835285 -13055397
40097 -13055397 -22712655 -30295348 -28096977 -19742114 -12426665 -8985657 -8218395 -7058923
40089 -7058923 -1734663 8534138 19082348 25024470 27464984 30029446 31652304 28731318
40081 28731318 22425978 17175885 13448682 8871330 5196912 6424010 10514238 10825283
40073 10825283 5803740 -400212 -6457355 -13875621 -18206459 -11001803 6297321 20243852
40065 20243852 21721572 15890493 11233749 7551066 1131475 -6033892 -9955070 -11975603
$$ packed form
40121A1135603J1654576N074324n494895j2117169j1897492q952541n078438K256090
40113a3419942J0443306J0616810J298104o259798l721411J804654p5822o213916
40105e528015o778819k802917l017089o428913l302783O103483Q919768k20112
40097a3055397r657258p582693K198371Q354863P315449L441008P67262J159472
40089g058923N324260J0268801J0548210N942122K440514K564462J622858k920986
40081B8731318o305340n250093l727203m577352l674418J227098M090228L11045
40073A0825283n021543o203952o057143p418266m330838P204656J7299124J3946531
40065B0243852J477720n831079m656744l682683o419591p165367l921178k020533
$$ plain form
40057 -11975603 -15357743 -19095252 -21141909 -22946011 -24897396 -22751933 -15294234 -9854440
40049 -9854440 -11973555 -14449202 -6237707 10802377 23815850 26015593 22384380 18949997
40041 18949997 15958627 12672177 9963244 5956257 -2891584 -13625259 -17160213 -10187479
40033 -10187479 127764 7016374 12384789 18623262 19030433 5746558 -15050145 -25467699
40025 -25467699 -16148685 1898485 10178249 4358677 -2218992 3264215 16778327 23444945
40017 23444945 17042184 6793724 3344009 4564673 406550 -12288035 -26279524 -33388033
40009 -33388033 -31326044 -22251820 -11139982 -5311013 -8206536 -12415161 -6367379 9611787
40001 9611787 21540905 19584517 9473792 925347 -6211793 -15287069 -20640340 -15707597
$$ packed form
40057a1975603l382140l737509k046657j804102j951385K145463P457699N439794
40049i854440k119115k475647Q211495J7040084J3013473K199743l631213l434383
40041A8949997k991370l286450k708933m006987q847841j0733675l534954O972734
40033a0187479J0315243O888610N368415O238473M07171j3283875k0796703j0417554
40025b5467699R319014J8047170Q279764n819572o577669N483207J3514112O666618
40017B3444945o402761j0248460l449715J220664m158123j2694585j3991489p108509
40009c3388033K061989R074224J1111838N828969k895523m208625O047782J5979166
40001I611787J1929118j956388j0110725q548445p137140r075276n353271M932743
$$ plain form
39993 -15707597 -9227977 -17148174 -36841500 -45462077 -30736573 -9520066 -5089132 -16874940
39985 -16874940 -26116001 -23699582 -16356516 -8942404 1456364 11657796 9664414 -6714025
39977 -6714025 -21651795 -21327400 -12245082 -9374656 -14383184 -17599856 -15812690 -14917624
39969 -14917624 -17181299 -18433871 -18112175 -20622451 -24735348 -21981967 -9398915 4264460
39961 4264460 9082668 4386036 -4314948 -12499442 -17505463 -18019165 -16091265 -15081838
39953 -15081838 -13653609 -7150451 3451660 10333993 8904643 2974366 -1967461 -3707766
39945 -3707766 83198 11380173 24732694 30067085 27005408 26401867 31954560 31809014
39937 31809014 17524746 284160 -4562531 -691984 -3814171 -16710836 -26577717 -25291476
$$ packed form
39993a5707597O479620p920197j9693326q620577J4725504K1216507M430934j1785808
39985a6874940r241061K416419P343066P414112J0398768J0201432j993382j6378439
39977f714025j4937770L24395R082318K870426n008528l216672J787166Q95066
39969a4917624k263675j252572L21696k510276m112897K753381J2583052J3663375
39961D264460M818208m696632q700984q184494n006021n13702J927900J009427
39953a5081838J428229O503158J0602111O882333j429350n930277m941827j740305
39945c707766L790964J1296975J3352521N334391l061677o03541N552693j45546
39937C1809014j4284268j7240586m846691L870547l122187j2896665r866881J286241
$$ plain form
39929 -25291476 -17993593 -11558059 -7703013 -8506434 -16271256 -25912870 -28723420 -25494239
39921 -25494239 -24952638 -28012479 -26002605 -16818725 -9369991 -7744473 -4661404 3100137
39913 3100137 6469907 -32957 -7033050 -6003607 -4923986 -14888191 -30133482 -36665694
39905 -36665694 -34649690 -35700510 -40716320 -37908323 -24767694 -15562500 -20391470 -29676009
39897 -29676009 -28610725 -17801183 -8975352 -5868357 -1254808 7657264 11991529 4208453
39889 4208453 -8312922 -9925179 4476744 23132647 30666543 22809659 6334445 -9812276
39881 -9812276 -18578873 -15050888 -716952 13842326 18282242 14636438 12799733 14233497
39873 14233497 10216414 -1391087 -9259230 -5131282 2826079 2758527 -2638852 -2134171
$$ packed form
39929b5291476P297883O435534L855046q03421p764822r641614k810550L229181
39921b5494239N41601l059841K009874R183880P448734J625518L083069P761541
39913C100137L369770o502864p000093J029443J079621r964205j5245291o532212
39905c6665694K016004j050820n015810K807997J3140629R205194m828970r284539
39897b9676009J065284J0809542Q825831L106995M613549Q912072M334265p783076
39889D208453j2521375j612257J4401923J8655903P533896p856884j6475214j6146721
39881i812276q766597L527985J4333936J4559278M439916l645804j836705J433764
39873A4233497m017083j1607501p868143M127948P957361o7552n397379N04681
$$ plain form
39865 -2134171 4964437 8462405 4139464 -1367191 -3331126 -5507849 -11334087 -18017039
39857 -18017039 -22863160 -27333376 -30971199 -28864688 -19943933 -11394296 -9326417 -10029712
39849 -10029712 -6287457 1129732 4310842 -628732 -7825838 -7527559 4246533 21583392
39841 21583392 33621325 34872471 30513723 29313421 32322328 32746931 26714740 18263588
39833 18263588 11940663 6719342 1198425 -720452 4380982 10954756 8741299 -4197893
39825 -4197893 -17870660 -21546098 -15360515 -8580290 -8045493 -11189959 -11237698 -6988367
39817 -6988367 -4019938 -6088891 -9987182 -11919934 -14406459 -20985996 -27349532 -25973377
39809 -25973377 -18647333 -14866952 -16122538 -12123807 2301415 16234874 17067953 8771593
$$ packed form
39865b134171P098608L497968m322941n506655j963935k176723n826238o682952
39857a8017039m846121m470216l637823K106511Q920755Q549637K067879p03295
39849a0029712L742255P417189L181110m939574p197106K98279J1774092J7336859
39841B1583392J2037933J251146m358748j200302L008907M24603o032191q451152
39833A8263588o322925n221321n520917j918877N101434O573774k213457j2939192
39825d197893j3672767l675438O185583O780225N34797l144466m7739M249331
39817f988367K968429k068953l898291j932752k486525o579537o363536J376155
39809b5973377P326044L780381j255586L998731J4425222J3933459Q33079q296360
$$ plain form
39801 8771593 5293039 9649627 10960179 2022490 -10677234 -17337709 -17025734 -15113807
39793 -15113807 -14429490 -14288411 -15087225 -18223052 -21245209 -16953652 -357061 23191558
39785 23191558 39365923 37821896 23596414 11449310 8102416 5857746 -3327800 -14624854
39777 -14624854 -18032981 -13742318 -10257071 -9900902 -6853130 134764 3661813 -633946
39769 -633946 -7257463 -9930252 -9798169 -9939261 -9048502 -6501880 -7228179 -14202744 -20589675
39760 -20589675 -16964791 -3903367 9104294 15269601 15027535 10947638 4832016 -400582
39752 -400582 -1604319 1195180 5777057 10871921 14435973 11368408 -768900 -14861457
39744 -14861457 -20126199 -15682280 -11924917 -16840227 -26965867 -34211293 -35603323 -32363322
$$ packed form
39801H771593l478554M356588J310552q937689j2699724o660475L11975J911927
39793a5113807O84317J41079p98814l135827l022157M291557J6596591K3548619
39785B3191558J6174365j544027j4225482j2147104l346894k244670r185546j1297054
39777a4624854l408127M290663L485247L56169L047772O987894L527049m295759
39769f33946o623517k672789J32083j41092Q90759K546622p26299o974565o386931
39760b0589675L624884J3061424J3007661O165307k42066m079897o115622n232598
39752d00582j203737K799499M581877N094864L564052l067565j2137308j4092557
39744a4861457n264742M443919L757363m915310j0125640p245426j392030L240001
$$ plain form
39736 -32363322 -24423322 -11777950 599312 4721509 -2083045 -12967583 -17323910 -11297055
39728 -11297055 -2399473 -2006744 -12236638 -22850344 -23815896 -17884812 -15790883 -21208124
39720 -21208124 -27302338 -27889318 -24443971 -20399950 -16056049 -12623708 -14456685 -22181140
39712 -22181140 -28799767 -27774856 -20830499 -13349916 -6946213 -1798634 -1001356 -5364165
39704 -5364165 -7803786 -1056498 10982223 17125152 12789031 2969727 -7142179 -16450274
39696 -16450274 -23295337 -25139009 -24283939 -26122418 -29628823 -27016861 -15610728 -2921671
39688 -2921671 3671556 5611947 7213917 7378410 3053885 -3644785 -7868553 -8752277
39680 -8752277 -8626688 -8101581 -6936905 -7737956 -13607679 -22957871 -30867067 -34913720 -35852862
$$ packed form
39736c2363322P940000J2645372J2377262M122197o804554j0884538m356327O026855
39728a1297055Q897582L92729j0229894j0613706r65552N931084K093929n417241
39720b1208124o094214n86980L445347M044021M343901L432341j832977p724455
39712b2181140o618627J024911O944357P480583O403703N147579P97278m362809
39704e364165k439621O747288J2038721O142929m336121r819304j0111906r308095
39696a6450274o845063j843672Q55070j838479l506405K611962J1406133J2689057
39688b921671O593227J940391J601970J64493m324525o698670m223768q83724
39680h752277J25589N25107J164676q01051n869723r350192p909196m046653r39142
$$ plain form
39671 -35852862 -33206467 -24660545 -11128039 560438 2620268 -5650893 -15587117 -16686012
39663 -16686012 -7708901 1736188 3431486 1802137 7542896 21448858 32279658 31980630
39655 31980630 25060190 19619170 16962902 15123760 15170172 17193975 16453089 11316549
39647 11316549 9217049 15433785 20897574 12686437 -5371385 -14830083 -7013556 5281164
39639 5281164 4517595 -10942877 -27670941 -33422869 -28044934 -20471712 -17427692 -15290788
39631 -15290788 -5538147 10304464 17787435 8627992 -3603782 1042785 20469135 32121960
$$ packed form
39671c5852862K646395Q545922J3532506J1688477K059830q271161r936224j098895
39663a6686012Q977111R445089J695298j629349N740759J3905962J0830800k99028
39655C1980630o920440n441020k656268j839142M6412K023803p40886n136540
39647A1316549k099500O216736N463789q211137j8057822r458698P816527J2294720
39639E281164p63569j5460472j6728064n751928N377935P573222L044020K136904
39631a5290788R752641J5842611P482971r159443j2231774M646567J9426350J1652825
$$ [...]
##END NTUPLES=NMR SPECTRUM
##END=
