##TITLE=31Pdec_SR69_rm15min
 , 24 sc
 6.07.2021
##JCAMPDX= 6.0         $$ Bruker NMR JCAMP-DX V2.0
##DATA TYPE= NMR SPECTRUM
##DATA CLASS= NTUPLES
##ORIGIN= UXNMR, Bruker Analytische Messtechnik GmbH
##OWNER= root
$$ XWIN-NMR		Version 3.5
$$ Tue Jul  6 13:26:22 2021 Russian Standard Time (UT+4h)  she@DPX200
##.OBSERVE FREQUENCY= 81.013821
##.OBSERVE NUCLEUS= ^31P
##.ACQUISITION MODE= SIMULTANEOUS
##.ACQUISITION SCHEME= undefined
##.AVERAGES= 24
##.DIGITISER RES= 16
##SPECTROMETER/DATA SYSTEM= spect
##.PULSE SEQUENCE= zgpg30
##.SOLVENT NAME= CDCl3
##.SHIFT REFERENCE= (INTERNAL, CDCl3, 0, 248.564)
##AUDIT TRAIL= $$ (NUMBER, WHEN, WHO, WHERE, WHAT)
$$ ##TITLE= Audit trail, XWIN-NMR		Version 3.5
$$ ##JCAMPDX= 5.01
$$ ##ORIGIN= Bruker BioSpin GmbH
$$ ##OWNER= she
$$ F:/spectra/data/she/nmr/P31/1/pdata/1/auditp.txt
$$ ##AUDIT TRAIL=  $$ (NUMBER, WHEN, WHO, WHERE, WHAT)
(   1,<2021-07-06 13:24:03.54 +0400>,<she>,<DPX200>,
      <created by zg, POWCHK disabled, PULCHK disabled
       configuration hash MD5:
       00 E9 B6 7A A2 85 ED C7 34 08 36 98 17 FE 4E 26
       data hash MD5: 32K
       1C 8A 05 9B 63 D2 9B F2 F3 8D A7 6A 31 BB 36 CD>)
(   2,<2021-07-06 13:24:30.32 +0400>,<she>,<DPX200>,
      <Start of raw data processing
       efp BC_mod = 2 LB = 1 FT_mod = 6 PKNL = 1 PHC0 = -7187.329 PHC1 = -415.3142 SI = 64K 
       data hash MD5: 64K
       01 76 94 7A CA BE 83 6B DC 69 B9 3E BB 98 12 B9>)
(   3,<2021-07-06 13:25:29.87 +0400>,<she>,<DPX200>,
      <pk PHC0 = -228.6785 PHC1 = 571.2001 
       data hash MD5: 64K
       72 96 08 F6 E8 FA 3A FC 93 96 B0 09 0B 14 71 F5>)
(   4,<2021-07-06 13:25:33.59 +0400>,<she>,<DPX200>,
      <abs ABSG = 5 
       data hash MD5: 64K
       90 8D 65 DE DF 02 4B FE 88 70 AA 82 D5 AD 84 C1>)
$$ ##END=
$$ 
$$ hash MD5
$$ 96 34 30 B7 5D C7 51 8C D7 FA C8 04 74 4B 05 27
##$RELAX= 
##$RELAX= 
##$RELAX= 
##$RELAX= 
##$RELAX= 
##$RELAX= 
##$RELAX= 
##$RELAX= 
$$ Bruker specific parameters
$$ --------------------------
##$DU= <F:/spectra>
##$EXPNO= 1
##$NAME= <P31>
##$PROCNO= 1
##$TYPE= <nmr>
##$USER= <she>
##$AMP= (0..31)
100 100 100 100 100 100 100 100 100 100 100 100 100 100 100 100 100 100 
100 100 100 100 100 100 100 100 100 100 100 100 100 100 
##$AQSEQ= 0
##$AQ_mod= 1
##$AUNM= <au_zg>
##$AUTOPOS= <>
##$BF1= 81.014009
##$BF2= 200.13
##$BF3= 200.13
##$BF4= 200.13
##$BF5= 200.13
##$BF6= 200.13
##$BF7= 200.13
##$BF8= 200.13
##$BYTORDA= 1
##$CFDGTYP= 0
##$CFRGTYP= 5
##$CHEMSTR= <none>
##$CNST= (0..31)
1 1 145 1 1 1 1 1 1 1 1 1 1 1 1 1 1 1 1 1 1 1 1 1 1 1 1 1 1 1 1 1 
##$CPDPRG= <waltz16>
##$CPDPRG1= <>
##$CPDPRG2= <waltz16>
##$CPDPRG3= <>
##$CPDPRG4= <mlev>
##$CPDPRG5= <mlev>
##$CPDPRG6= <mlev>
##$CPDPRG7= <mlev>
##$CPDPRG8= <mlev>
##$CPDPRGB= <>
##$CPDPRGT= <>
##$D= (0..31)
0 1 0 0 0 0 0 0 0 0 0 0.03 2e-05 3e-06 0 0 0 0 0 0 0 0 0 0 0 0 0 0 0 0 
0 0 
##$DATE= 1625563442
##$DBL= (0..7)
120 120 120 11 120 120 24 19 
##$DBP= (0..7)
150 150 150 150 150 150 150 150 
##$DBP07= 0
##$DBPNAM0= <>
##$DBPNAM1= <>
##$DBPNAM2= <>
$$ [...]
##$SUBNAM3= <"">
##$SUBNAM4= <"">
##$SUBNAM5= <"">
##$SUBNAM6= <"">
##$SUBNAM7= <"">
##$SUBNAM8= <"">
##$SUBNAM9= <"">
##$SW= 501.771253377433
##$SWIBOX= (0..15)
0 1 3 0 0 0 0 0 0 0 0 0 0 0 0 0 
##$SW_h= 40650.406504065
##$TD= 32768
##$TD0= 1
##$TE= 0
##$TE2= 300
##$TE3= 300
##$TEG= 300
##$TL= (0..7)
0 120 53 12 22 120 120 120 
##$TP= (0..7)
150 150 150 150 150 150 150 150 
##$TP07= 0
##$TPNAME0= <>
##$TPNAME1= <>
##$TPNAME2= <>
##$TPNAME3= <>
##$TPNAME4= <>
##$TPNAME5= <>
##$TPNAME6= <>
##$TPNAME7= <>
##$TPOAL= (0..7)
0.5 0.5 0.5 0.5 0.5 0.5 0.5 0.5 
##$TPOFFS= (0..7)
0 0 0 0 0 0 0 0 
##$TUNHIN= 0
##$TUNHOUT= 0
##$TUNXOUT= 0
##$USERA1= <user>
##$USERA2= <user>
##$USERA3= <user>
##$USERA4= <user>
##$USERA5= <user>
##$V9= 5
##$VALIST= <valist>
##$VCLIST= <CCCCCCCCCCCCCCC>
##$VD= 0
##$VDLIST= <DDDDDDDDDDDDDDD>
##$VPLIST= <PPPPPPPPPPPPPPP>
##$VTLIST= <TTTTTTTTTTTTTTT>
##$WBST= 1024
##$WBSW= 4
##$XGAIN= (0..3)
0 0 0 0 
##$XL= 0
##$YL= 0
##$YMAX_a= 11154
##$YMIN_a= -15805
##$ZGOPTNS= <>
##$ZL1= 120
##$ZL2= 120
##$ZL3= 120
##$ZL4= 120
##$ABSF1= 248.5645
##$ABSF2= -253.2056
##$ABSG= 5
##$ABSL= 3
##$ALPHA= 0
##$AQORDER= 0
##$ASSFAC= 0
##$ASSFACI= 0
##$ASSFACX= 0
##$ASSWID= 0
##$AUNMP= <proc_1d>
##$AZFE= 0.1
##$AZFW= 0.5
##$BCFW= 0
##$BC_mod= 2
##$BYTORDP= 0
##$COROFFS= 0
##$CY= -3
##$DATMOD= 1
##$DC= 0
##$DFILT= <>
##$DTYPP= 0
##$F1P= 0
##$F2P= 0
##$FCOR= 1
##$FTSIZE= 65536
##$FT_mod= 6
##$GAMMA= 0
##$GB= 0
##$INTBC= 1
##$INTSCL= 5.30512e-09
##$ISEN= 30
##$LB= 1
##$LEV0= 0
##$LPBIN= 0
##$MAXI= 10000
##$MC2= 0
##$MEAN= 0
##$ME_mod= 0
##$MI= 50
##$NCOEF= 0
##$NC_proc= -7
##$NLEV= 6
##$NOISF1= 182.463
##$NOISF2= 159.3651
##$NSP= 0
##$NTH_PI= 0
##$NZP= 0
##$OFFSET= 248.5645
##$PC= 4
##$PHC0= -7416.008
##$PHC1= 155.8859
##$PH_mod= 1
##$PKNL= yes
##$PPARMOD= 0
##$PSCAL= 0
##$PSIGN= 0
##$REVERSE= no
##$SF= 81.014009
##$SI= 65536
##$SIGF1= 159.3651
##$SIGF2= -187.1042
##$SINO= 113.3802
##$SIOLD= 16384
##$SREGLST= <1H.CDCl3>
##$SSB= 0
##$STSI= 65536
##$STSR= 0
##$SW_p= 40650.406504065
##$SYMM= 0
##$S_DEV= 0
##$TDeff= 32768
##$TDoff= 0
##$TI= <>
##$TILT= no
##$TM1= 0
##$TM2= 0
##$TOPLEV= 0
##$USERP1= <user>
##$USERP2= <user>
##$USERP3= <user>
##$USERP4= <user>
##$USERP5= <user>
##$WDW= 1
##$XDIM= 65536
##$YMAX_p= 356421923
##$YMIN_p= -45503085
$$ End of Bruker specific parameters
$$ ---------------------------------
##NTUPLES= NMR SPECTRUM
##VAR_NAME=  FREQUENCY,     SPECTRUM/REAL,   SPECTRUM/IMAG
##SYMBOL=    X,             R,               I
##VAR_TYPE=  INDEPENDENT,   DEPENDENT,       DEPENDENT
##VAR_FORM=  AFFN,          ASDF,            ASDF
##VAR_DIM=   65536,         65536,           65536
##UNITS=     HZ,            ARBITRARY UNITS, ARBITRARY UNITS
##FACTOR=    0.620285442955139, 1,           1
##FIRST=     20137.2065510759, 0,            0
##LAST=      -20513.1999529892, 0,           0
##MIN=       -20513.1999529892, -45503085,   0
##MAX=       20137.2065510759, 356421923,    0
$$ Real data points
##PAGE= N=1
##DATA TABLE= (X++(R..R)), XYDATA
$$ [...]
45699 -1684758 -3117550 -2975689 -2193122 -1994883 -2353664 -2905403 -3408908 -3133115 -1775038
45690 -1775038 -881547 -2083787 -4088958 -4137794 -2497372 -2352634 -4638488 -6342264 -5275547
45681 -5275547 -3337300 -3066992 -3781772 -3618425 -3085410 -3670502 -4514625 -3546149 -1174025
45672 -1174025 -41718 -1217435 -2924156 -3220473 -2089563 -599900 476197 825691
45664 825691 492299 -68293 -477253 -831455 -991382 -85337 2163935 4148806 3898373
45655 3898373 1759636 44901 -146527 -161787 -1243131 -2260799 -1301000 1322808 3205953
45646 3205953 2943679 1710806 1265189 1508705 1063101 -379724 -1614590 -1727402 -1011731
45637 -1011731 114732 1643133 2842637 2215242 -223328 -2048026 -1443131 63509
45629 63509 -160233 -1859310 -2500323 -1257587 280156 1232826 2397774 3732167 3743440
45620 3743440 2243845 1018478 707358 -224115 -2098326 -2589857 -625612 1136350 280721
45611 280721 -1452562 -1239896 97297 20416 -830596 142705 2250362 1946680 -1260822
45602 -1260822 -3521048 -2336543 108769 915686 560876 916217 1760192 1751090 1157135
45593 1157135 1229479 1952648 2482070 2942940 3812811 4168453 2613117 -193379 -1792807
45584 -1792807 -1003296 739963 1603684 1689683 2333837 3826482 4881672 4397353 2983625
45575 2983625 2185868 2411798 2393944 1077863 -612953 -765444 989478 2909023 3254241
45566 3254241 2081677 558799 -650158 -1578645 -2044518 -1490198 97194 1650976 1897375
45557 1897375 834242 5095 828732 2695747 3447891 2105877 311757 223847 1605809
45548 1605809 2239081 1020574 -712797 -1189828 -293486 898751 1599274 1543860 572962
45539 572962 -984335 -1915141 -1163038 718430 1986803 1796031 1130270 1192881 1515676
45530 1515676 659492 -1306166 -2276116 -781528 1741978 2554214 955897 -1377459 -3104755
45521 -3104755 -4441070 -5469365 -5310697 -3928593 -2925383 -3189574 -3329116 -1995322 -278212
45512 -278212 42606 -697533 -1023843 -837529 -649334 457932 3264948 5743512 5263055
45503 5263055 3065001 2886968 4901238 4945925 934992 -3715118 -4997338 -3397711 -1672846
45494 -1672846 -401955 1260436 2453550 1443065 -1433278 -4189350 -5714779 -5852130
45486 -5852130 -4224541 -1334108 357623 -880081 -3050858 -2767141 -35158 1932116
45478 1932116 1311153 -635251 -2308806 -3377322 -3360407 -1447780 1478492 3090989 2797776
45469 2797776 2406746 2674809 1702898 -1612409 -4750926 -4516875 -1513571 667605 122884
45460 122884 -1691646 -2911947 -3781214 -5358026 -7087284 -7107155 -4845226 -2194696 -1443367
45451 -1443367 -2511675 -3215827 -2258454 -693137 145578 676334 1600799 1672656 -731822
45442 -731822 -4270699 -5569613 -3927028 -2400333 -3029888 -3611244 -1382812 2115687 2860313
45433 2860313 152304 -2433817 -2055965 111774 1380582 1068001 223340 -444388 -772576
45424 -772576 -410502 529317 827928 -307871 -1627774 -1334340 218826 1124266 1030127
45415 1030127 1454667 2575082 2172227 -770772 -3518583 -2935474 -125997 911153 -1161314
45406 -1161314 -3453603 -3145661 -936353 728045 931094 494534 220869 213951 223779 -163054
45396 -163054 -1043399 -1515069 -442730 1697455 2893128 2012981 -14675 -1829308 -3025733
45387 -3025733 -3454830 -2828879 -1767325 -1552320 -2070166 -1824778 -723016 -526988 -1506470
45378 -1506470 -1444605 374091 1267108 -345802 -1709691 -309025 1308231 -427876 -3643965
45369 -3643965 -3708531 -880412 298370 -1318509 -2250438 -1250230 -1469631 -4179461 -5789875
45360 -5789875 -3609945 54430 2180291 3118600 3653125 2280688 -1157613 -3002469
45352 -3002469 -846431 2094343 1601430 -1364501 -3031437 -2653372 -1777618 -222767 2541641
45343 2541641 4102922 2220135 -334727 710017 3899207 3974356 576565 -1048235
45335 -1048235 1226588 3011090 785067 -2634583 -3033128 -960007 463628 628812
45327 628812 802710 792436 -350801 -1881526 -2542323 -2903997 -3920952 -4455586 -3035393
45318 -3035393 -1113031 -1560716 -4148910 -5355445 -3145530 383450 2025924 1355183
45310 1355183 376102 452254 1010539 973238 225295 -688208 -1516237 -2260717 -2600175 -2267774
45300 -2267774 -1931527 -2609537 -3922076 -4098482 -2333446 45634 1559521 2386181 3080398
45291 3080398 2979091 1514010 -220254 -1106785 -1904149 -3335221 -3757543 -1606649 1077049
45282 1077049 1039830 -1084637 -1993503 -1556889 -2757249 -5398405 -5134435 -615082 3335899
45273 3335899 2558793 -716705 -2357676 -2536797 -3318644 -3533875 -1093357 1938731 1828392
45264 1828392 -651982 -1588930 -570129 -756623 -2573432 -2749131 -427377 931106 -571251
45255 -571251 -2105671 -1110900 628146 667620 118103 882325 1572826 -9047 -2223191
45246 -2223191 -1412682 2367516 5067672 4238252 1930676 1307732 2642968 3783361 3201308
45237 3201308 1525587 509835 905911 1337866 -190904 -3305336 -4870593 -2733765
45229 -2733765 1133733 2891274 1544353 -572962 -1609743 -2001270 -2179062 -1239539 738156
45220 738156 1385803 -787971 -3514430 -3557510 -1457780 -685940 -2230794 -3025330 -655011
45211 -655011 3005435 4606760 3874397 3169943 3637080 4103797 3496719 2296943 1419397
45202 1419397 1232730 1891337 3198778 3929616 2782687 451405 -653182 604643 2544438
45193 2544438 2816012 1063330 -1267805 -2859184 -3448475 -3464389 -3406267 -3243634 -2302055
45184 -2302055 -350510 1393486 1503817 526623 402155 1547343 2325554 1897631 1547254
45175 1547254 2227718 2873074 2512288 2051035 2233845 1792483 -222763 -2064401 -1871631
45166 -1871631 -1166294 -2659658 -5455717 -5889584 -3114014 -491222 -656041 -2102824 -1998881
45157 -1998881 -132709 1496612 1523485 322879 -731616 -320416 1512196 2676380 1035203
45148 1035203 -2368421 -3713071 -1079533 2672770 3170189 -170753 -3648406 -3889318
45140 -3889318 -1574741 -22902 -853334 -2229881 -1775316 -110290 103514 -1636711 -2674553
45131 -2674553 -1172562 1194360 2115637 2033439 2335200 2139195 11800 -2495677 -2650882
45122 -2650882 -1194371 -1424175 -3791792 -5261057 -4337822 -2812408 -1817831 -233893 1785306
45113 1785306 1844019 -319707 -1460440 -82156 771556 -1306578 -3842164 -3704033 -2192296
45104 -2192296 -2125781 -2804597 -2069351 -932102 -1637136 -2953364 -2047136 229576 524575
45095 524575 -1421782 -2896630 -3254688 -4148250 -5067706 -3632470 -649707 71313 -2150710
45086 -2150710 -3712965 -2939309 -2531366 -3887160 -3912205 -535894 2859542 2360025 -335477
45077 -335477 -752708 1610564 3353041 2591679 694214 -609262 -744318 503755 2585490
45068 2585490 3494137 1948092 -256020 -448698 918116 1006011 -1027657 -3022815 -3309287
45059 -3309287 -2753287 -2786578 -3429048 -4005192 -4280535 -4172323 -3419793 -2043330 -425235
45050 -425235 1118874 2250370 2516892 2085403 1770299 1423572 -363133 -3419753 -4547590
45041 -4547590 -1550478 2515779 2599348 -1190549 -3502758 -1379197 1920454 2230773 -12184
45032 -12184 -1885709 -2454308 -2206557 -610130 2324580 3900497 1871905 -1404804 -1703554
45023 -1703554 818759 2001019 234595 -1533969 -1198311 -711632 -1929649 -2883512 -1180294
45014 -1180294 1495929 1689208 -600482 -2369130 -2435486 -2453637 -3202330 -3106058 -1260534
45005 -1260534 669456 821215 -475257 -1852998 -2841385 -3397559 -2961772 -1526652 -622686
44996 -622686 -1580111 -3390526 -3913473 -2942228 -2393435 -3234418 -3846146 -2361853 411497
44987 411497 1695991 160270 -2397096 -3033694 -681207 3160410 6183375 7120964 6162069
44978 6162069 4382441 2970261 2406046 2062029 1002715 -618921 -1506291 -857844 583651
44969 583651 1597025 1906446 1857879 1408979 484029 -197001 73085 593593 55656 -1228961
44959 -1228961 -1368894 403500 2395082 2557032 893695 -1047583 -2202302 -2498913 -1958875
44950 -1958875 -501400 1311991 2207981 1363436 -500333 -1514895 -515754 1442044 1982190
44941 1982190 237468 -1904108 -2211260 -1078018 -766166 -2117618 -3702617 -4222299 -3914578
44932 -3914578 -3166939 -1630666 375813 1265926 270966 -1121577 -1121244 -47944 469961
44923 469961 -97466 -843734 -965270 -571173 -296593 -773346 -1992286 -2809053 -1938845
44914 -1938845 188063 1707881 1840569 1598916 1444466 284961 -2006843 -3225424 -1866553
44905 -1866553 271498 722008 64301 553412 2263152 3255795 2771347 1624226 77363
44896 77363 -1987240 -3255403 -2158228 276039 1424369 839137 321598 354495 -448192
44887 -448192 -2031055 -2292658 -689598 555890 55726 -697185 -244063 523411 539309
44878 539309 534637 1008766 603050 -1347841 -2694834 -1305894 1561267 3089206 2819231
44869 2819231 2383405 2374411 1961109 1066034 623427 824270 1006955 1208133 2131167 3560383
44859 3560383 4288856 3758694 2640712 1728374 1125788 458750 -701604 -2255063 -3038038
44850 -3038038 -1847011 388861 926167 -1072505 -2729577 -1306759 1493313 1704012
44842 1704012 -1175288 -3676928 -3675594 -3011350 -3703788 -4433832 -2965621 -161546 1096255
44833 1096255 260994 -186124 1322459 2946249 2007109 -1215592 -3680232 -3182466 -573693
44824 -573693 1655486 2019624 947134 -152570 -213760 555799 684639 -963146 -3208688
44815 -3208688 -3239212 -206607 2918699 2638750 -597515 -3039772 -2433158 -126872 1625622
44806 1625622 2146532 1500193 -457957 -2865261 -3627875 -2126089 -688722 -1565589 -3596346
44797 -3596346 -3861477 -1842117 179275 580321 219666 545141 1599409 2593122 3262909
44788 3262909 3766418 3845834 3008538 1564395 825437 1670898 3040958 2812492 708158
44779 708158 -751428 496789 2730579 2393710 -928487 -3885826 -4038586 -2614837 -1680822
44770 -1680822 -1139606 -207935 309885 -629893 -2207133 -3002623 -3147897 -3436406 -3609152
44761 -3609152 -3346850 -3539989 -4548992 -4700905 -2887516 -1213915 -2232378 -4678435 -5167736
44752 -5167736 -3479266 -2686370 -4034677 -5164609 -4166694 -2312260 -1504553 -1540555 -1373091
44743 -1373091 -1134188 -1391625 -1723524 -1265501 116240 1713320 2223811 320959 -3553172
44734 -3553172 -6267237 -5013369 -1351631 154274 -2134582 -4897509 -4736425 -2533261
44726 -2533261 -1273981 -1682982 -2183775 -1808420 -1014398 -374712 -205911 -961566 -2545023
44717 -2545023 -3686135 -3253443 -1816338 -920716 -1293440 -2622249 -4418243 -6041673 -6493484
44708 -6493484 -5387016 -3797882 -3104303 -3253399 -3157787 -2557009 -2363210 -3056401 -3718834
44699 -3718834 -3161252 -1518857 -158748 13057 -254223 530227 2578373 4380127 4565604
44690 4565604 3448618 2094433 696309 -1034567 -2540606 -2917116 -2401736 -1893189 -1248851
44681 -1248851 236393 1745549 1387444 -786847 -2175468 -967687 1533016 2984315
44673 2984315 2913599 2267697 1346393 -157142 -1697498 -2057656 -1043853 -8360 -389564
44664 -389564 -2044391 -3170855 -2113976 476941 1818509 143041 -2812010 -3698182
44656 -3698182 -1612131 1233605 2683650 2667552 1990079 1143214 815383 1597925 2475303
44647 2475303 1554895 -878124 -2102978 -858318 613025 -100611 -2151950 -3155229
44639 -3155229 -2695728 -2153299 -2298982 -2950312 -3925661 -4609758 -3734039 -1371226 101022
44630 101022 -958743 -2636860 -1972095 685580 2344343 1783014 638448 230055 -86913
44621 -86913 -998511 -1895883 -2162207 -2103982 -1976724 -1460027 -607350 -168219 -594449 -1617080
44611 -1617080 -2809325 -3627801 -3187358 -1225879 923393 1559911 576401 -915329 -2268379
44602 -2268379 -3163670 -2666933 -490948 1432900 1095988 -223141 451769 2808088 3113671
44593 3113671 -50600 -3192427 -2833994 -299951 756614 -468070 -1829898 -1920738 -1246616
44584 -1246616 -482789 137186 86288 -867236 -1693846 -1448744 -1098860 -2182576 -4114348
44575 -4114348 -4877655 -4172374 -3655996 -3925642 -3551474 -1725524 249611 1110289 1441042
44566 1441042 2116912 2499518 1631174 84564 -764351 -429957 830104 2726014 4181715
44557 4181715 3168743 -789712 -4837355 -5640723 -3516429 -1565904 -1168311 -942034 -158446
44548 -158446 -123402 -1229367 -1484728 349147 2434322 2557160 1237784 184608 -519092
44539 -519092 -1426254 -1600077 -141250 1397635 918553 -799173 -1364016 -598660 -27646
44530 -27646 708044 3233217 6323192 6396817 2936382 -301266 -755017 -162902 -538788
44521 -538788 -693294 704303 1717891 -35454 -3318211 -5066401 -4643627 -3593406 -2702317
44512 -2702317 -2040510 -2462183 -4176980 -5046313 -3226630 -459629 235149 -847716 -1026655
44503 -1026655 38800 109823 -1378201 -2441657 -2261140 -2345034 -3250603 -3319690 -1716688
44494 -1716688 139900 1265855 2434983 3617182 3003988 267893 -1906543 -1582801
44486 -1582801 -440016 -624237 -1098730 -8957 1271905 60722 -2635468 -2878278 242052
44477 242052 2958298 2289772 120766 -134167 1390675 1924383 751333 -12915 756128
44468 756128 1439562 703461 -67800 875583 2491475 2360777 388992 -1243285 -1475892
44459 -1475892 -1255228 -954873 332609 2101035 1806981 -1344679 -4273398 -3879555 -1295538
44450 -1295538 85435 -574476 -1335384 -1112594 -748465 -823285 -973960 -1356135 -2473194
44441 -2473194 -3506584 -3019660 -1449667 -780303 -1542841 -2172702 -1540089 -132522 1420239
44432 1420239 2971554 3940580 3915493 4137606 5916316 7603986 6248864 2764316 1921199
44423 1921199 5674408 9732317 9048133 4181135 -315867 -1815683 -1297592 -660800 -1029824
44414 -1029824 -2801892 -5054593 -5571547 -3382344 -497577 693293 731294 1664406 3247643
44405 3247643 3192764 991254 -1089952 -1310141 -649341 -831564 -1685419 -1592878 151749
44396 151749 2316663 3014923 1770610 157338 4635 1024744 1118236 -659148 -2611461
44387 -2611461 -2658517 -951716 859096 1962414 2592755 2638065 1636280 -61966 -1458641
44378 -1458641 -2217788 -2832312 -3586530 -4158322 -4080150 -3016709 -1046640 784577 1011255
44369 1011255 -360730 -1481071 -1213991 -939841 -2291994 -4127856 -3845492 -1322713 619639
44360 619639 -75908 -2318713 -3656572 -2997894 -1026204 878792 1527009 645139 -698172
44351 -698172 -930821 480008 2655464 4260518 4308359 2553084 54705 -1093115 179796
44342 179796 2359493 3008426 1678089 -144359 -1566546 -2967254 -4236162 -4434519 -3700223
44333 -3700223 -3506414 -4174199 -3999565 -2039631 -10004 223220 -407621 206913 1675323
44324 1675323 1402591 -1448293 -4374851 -4565099 -2082674 688924 1705038 666507
44316 666507 -1275859 -2367544 -1498730 495286 1272643 -404110 -2951719 -3884016 -3039768
44307 -3039768 -2470610 -3121411 -3422653 -2028654 -316786 -478473 -2056331 -2454197 -821564
44298 -821564 559453 -565600 -3372687 -5084377 -4240636 -1919222 -292517 -750909 -2974159
44289 -2974159 -5098595 -5087376 -2584732 670746 2612466 2849856 2677472 3294578 4259852
44280 4259852 3822296 1064209 -2354523 -3595747 -2345471 -1687091 -3801089 -6325620
44272 -6325620 -5663861 -2839590 -2168587 -3976062 -3347756 1869121 6338413 4324350 -1779235
44263 -1779235 -4799591 -2746274 -208066 -415535 -1339725 -712003 -82666 -1530975 -3853560
44254 -3853560 -4707085 -4102860 -3294821 -2131332 13575 2059103 2323529 1017700 -211987
44245 -211987 -562397 -434526 -332007 -746537 -2162110 -3763587 -3306887 -61449 3137301
44236 3137301 2897023 -270396 -2642379 -2105312 -51997 1532442 2522597 3520085 4205912
44227 4205912 3872543 2399096 38348 -2642508 -4256089 -3533464 -1383012 -436715 -1675964
44218 -1675964 -3092668 -2794131 -1715936 -1640137 -2126320 -1630608 -551501 -606621 -1763389
44209 -1763389 -2457384 -2638486 -3671890 -4935170 -3748922 175431 3349664 3442583 2744245
44200 2744245 4164507 6317912 5957916 3490867 2132038 2440329 1835883 -375531 -1607281
44191 -1607281 -593208 385363 -414021 -1155933 219858 2200394 1906158 -659540 -3046370
44182 -3046370 -3759462 -2998496 -1124340 1346741 2929131 2377986 363966 -1409363 -2017279
44173 -2017279 -1131939 1514432 4771818 5678248 2699873 -1699598 -3969765 -3864390 -3509594
44164 -3509594 -3385454 -2467788 -1622694 -3067761 -6193014 -7544344 -5879321 -3888869 -3577096
44155 -3577096 -3258524 -1232760 506780 -814849 -4026094 -5334924 -3526103 -992778
44147 -992778 189519 566022 1180627 1393683 142745 -1823210 -2458849 -996939 1039736
44138 1039736 1722729 947814 141778 122721 302529 179884 392435 1464668 2534962
44129 2534962 2558384 2060371 2265379 2924928 2554906 693836 -1516443 -2933295 -3185830
44120 -3185830 -1974678 724812 3552682 4467913 3049376 872240 -633602 -1408738
44112 -1408738 -1767573 -1729646 -1623010 -1859052 -1875444 -871065 297553 -121018 -1825948
44103 -1825948 -2475345 -1245725 -5101 57590 432699 2271434 3702660 2475523 -363517
44094 -363517 -1899065 -1433592 -831713 -1374980 -2371425 -2660825 -1791937 143853 2444528
44085 2444528 3746595 3212621 1541319 -23548 -1053293 -1495709 -971189 249780 648194
44076 648194 -652213 -2349871 -2884906 -2815155 -3383463 -3775559 -2235526 655370 2421080
44067 2421080 2351171 2186046 2841568 2936913 1392976 -633044 -1485189 -1030087 20986
44058 20986 1308009 2369153 2376843 1408612 915223 1990940 4036969 5680463 5905260
44049 5905260 3918144 -364970 -4833292 -6165641 -3956443 -2225276 -4640807 -9356132
44041 -9356132 -11086805 -7830533 -2930596 -354033 -506412 -1506728 -2195146 -2310895 -1446026
44032 -1446026 207550 1010081 -391440 -2952671 -4463801 -4548883 -4744051 -5627648 -5684665
44023 -5684665 -3614115 -367743 1945323 2295433 1255786 87790 -190929 407372 644685
44014 644685 -443365 -1702832 -984388 1417636 2395053 352713 -2023374 -1390814 1351679
44005 1351679 2472298 946917 -377286 694176 2752413 3236893 1771846 -19653
43997 -19653 -649287 64253 971108 609598 -640991 -26084 3962334 8135878 7964400
43988 7964400 4414851 3416758 7162743 10199722 7125155 575663 -2624434 -890424
43980 -890424 1323813 1076439 304428 1174117 2454806 2177443 736678 -511324 -1409685
43971 -1409685 -2041285 -1580851 75779 1060982 -190791 -2374237 -2740585 -594652 2011886
43962 2011886 2786072 1307917 -1105089 -2669180 -2356850 -613230 1115755 1956548 2447859
43953 2447859 3377811 4263495 3871331 2163920 747263 927518 1979222 2063611 569137
43944 569137 -1310772 -2363864 -2765632 -3251284 -3794011 -3948692 -3765510 -3275208 -1769322
43935 -1769322 923946 2992169 2433555 194633 -727035 343905 785331 -984468 -2823136
43926 -2823136 -2267315 -296770 646917 555771 1035614 1895776 1525191 56874 -623350
43917 -623350 178118 1420067 2456507 3310379 3150012 1146286 -1252518 -1661869 -439246
43908 -439246 -104758 -901963 -353020 1921719 2641546 25124 -2767979 -2069383 925879
43899 925879 2311828 1227626 104442 58957 -541621 -2690562 -4724697 -4663445 -2753717
43890 -2753717 -664237 720860 1736721 2684663 2944182 1596141 -1055606 -2976450
43882 -2976450 -2233432 569166 2680591 2383134 674755 -703340 -1444386 -1838714 -1272711
43873 -1272711 645628 2385940 1956173 -221057 -1736802 -1483332 -742153 -752561 -988338
43864 -988338 -597129 -69007 -348150 -1227383 -1782125 -1854992 -1987931 -2108711 -1434189 67049
43854 67049 1080522 547736 -650250 -619795 896585 1879896 686410 -1545525 -2290099
43845 -2290099 -951561 668228 1186199 1253813 1779716 2142926 1396517 111955 -458703
43836 -458703 -360207 -532217 -838533 -193613 1261210 1759785 335175 -1594766 -1974965
43827 -1974965 -669820 651729 728898 -120917 -908117 -1169541 -1022080 -647736 -209819
43818 -209819 -10734 -240641 -610092 -674101 -572149 -930314 -1798785 -2271242 -1678190 -646194
43808 -646194 -189533 -102595 727028 2481534 4005732 4436963 4121089 3476690 2124740
43799 2124740 -12575 -1707353 -1671045 -311407 788979 827775 260179 -376263 -980433
43790 -980433 -1209922 -402650 1353829 2757383 2450813 440509 -1880003 -3008546 -2637191
43781 -2637191 -1859806 -2001457 -3083378 -3726713 -2885509 -1258365 -335967 -320327 83625
43772 83625 1666147 3395383 3642589 2175554 296776 -709442 -605541 202514 1286179
43763 1286179 2086833 1858178 456507 -1055041 -1406343 -766242 -536656 -1251319 -1698787
43754 -1698787 -826775 487105 750101 163781 20382 210842 -683853 -2651389 -3726578
43745 -3726578 -3016009 -2215293 -2725045 -3071304 -1215070 1841476 3154871 1986134 466780
43736 466780 173745 371122 120625 -37429 516561 1170098 1374222 1851595 3182401
43727 3182401 4267796 3621954 1488569 -606308 -1809985 -2186392 -1578707 228321 2313722
43718 2313722 3012204 1776644 -330382 -2108057 -3196992 -3550164 -3138706 -2549463 -2747646
43709 -2747646 -3646476 -3846543 -2468330 -421828 871594 1230041 1306021 1133873 204955
43700 204955 -1350544 -2716357 -3394733 -3380311 -2533715 -789505 1056907 1810447 1302787
43691 1302787 517740 203401 265541 630352 1590231 2897302 3558873 3141578 2440645
43682 2440645 2262211 2340302 2082266 1579732 1144686 577404 -300647 -1025038 -1177746 -1045912
43672 -1045912 -806574 155684 2054269 3497507 2781897 105181 -2605224 -3833265 -3531406
43663 -3531406 -2522334 -1941286 -2742172 -4448273 -4891893 -2724073 263617 1146484 -114409
43654 -114409 -891736 -193075 -67318 -1819768 -3500593 -3002741 -1528575 -1536444 -2675083
43645 -2675083 -2580373 -1129498 -964871 -3341265 -5926918 -5890200 -3465286 -1127721 -396442
43636 -396442 -836492 -1501479 -1917568 -1813543 -1097918 -315538 -311746 -1197381 -2193744 -2573099
43626 -2573099 -2159414 -941751 877391 2213761 1610588 -834669 -2985767 -3116293 -2061282
43617 -2061282 -1745148 -2379410 -2759169 -2698055 -2968748 -2959426 -979599 2487160 4406352
43608 4406352 3255443 1077295 13350 -676156 -2096644 -2845078 -1567381 -187762
43600 -187762 -1053139 -2605290 -1981287 -567891 -2004933 -5085819 -4379108 900810 4362768
43591 4362768 1586814 -3146638 -3334226 322502 1832802 -1054069 -4784447 -6090354
43583 -6090354 -5520468 -4691330 -3916972 -3469446 -4178251 -5622323 -5889836 -4112013 -1644986
43574 -1644986 -181122 -166612 -1389932 -3515841 -5546514 -6115313 -4811055 -2341516 437048
43565 437048 2526326 2476856 3849 -2386128 -1706949 1355834 3016680 1710788 217245
43556 217245 1121296 2702914 1749114 -1205066 -2438557 -473315 1862387 1524661 -751388
43547 -751388 -2039933 -1550626 -1420841 -3232807 -5482147 -5547286 -3263407 -1066133 -633428
43538 -633428 -848498 218881 2438358 3911641 3612483 2511439 2116451 2907486 4392591
43529 4392591 5845725 6537339 5766807 3319811 66561 -2092627 -1417781 1906564 5313941
43520 5313941 6053396 4134489 2242949 2351732 3473734 3502617 2130711 651669 -307578
43511 -307578 -1184208 -1836938 -1201050 914169 2804205 2436586 -249744 -2970424 -3096129
43502 -3096129 -270437 2913144 3364360 769355 -2323720 -3801126 -4061989 -4233686 -4003428
43493 -4003428 -2699633 -1179127 -616275 -199124 1771470 4761447 6188100 4997818
43485 4997818 3184212 3175406 5127000 7282563 7828045 6102144 3160969 1342275 2020559
43476 2020559 3616885 3157981 3500 -3395797 -4706830 -4132932 -3198250 -2758301 -3019002
43467 -3019002 -4093216 -5476290 -5975000 -5086950 -3679605 -2661272 -1866451 -870391 63897
43458 63897 563505 777918 762222 141801 -922419 -1415275 -936630 -543296 -1160764 -2019898
43448 -2019898 -1821825 -800446 -336597 -829024 -1212683 -671305 214964 421569 -71878
43439 -71878 -324033 221726 859090 408895 -1136159 -2263655 -1676233 21155 1114196
43430 1114196 1099781 1295564 2913616 5305835 6623111 5858033 3854450 2355905 2139316
43421 2139316 2188828 1062668 -985551 -2119639 -1501685 -630937 -1226104 -2853954 -3933926
43412 -3933926 -4149459 -4294063 -4491895 -4319381 -4056449 -3949875 -2905490 -122833 2528302
43403 2528302 2372531 -69173 -1759226 -1765130 -1937459 -2600485 -1399153 2099116 4345720
43394 4345720 2788494 -79832 -483712 1209131 1851851 471700 -1216602 -1938753 -1647984
43385 -1647984 -297901 1461687 1466994 -1275847 -4062801 -3514398 -240269 2459984 3567125
43376 3567125 4541897 5244918 3739988 419462 -1678425 -1620684 -1948014 -3961003 -5247216
43367 -5247216 -3878250 -1845984 -1817986 -3095588 -3521859 -3258445 -3705008 -4230776 -3055688
43358 -3055688 -547229 1139789 1327413 1365616 2166406 3213464 3770216 3288854 1134535
43349 1134535 -2167641 -4052138 -2591497 345199 1115028 -695178 -2011308 -1108629
43341 -1108629 374256 942975 1504394 2591376 2372744 -248297 -2953063 -3078623 -1523050
43332 -1523050 -853513 -1148244 -810842 -238095 -1086820 -2454193 -1604029 1224823 2424672
43323 2424672 377382 -2224037 -2854576 -2678005 -3478957 -3986990 -2118393 1117471 2934627
43314 2934627 2736941 2014105 1233664 -325003 -2060096 -2119174 -220089 1700600 1957897
43305 1957897 630246 -1378416 -3165573 -3786380 -3000582 -2012004 -1969557 -2029915 -639575
43296 -639575 1615333 2575248 1893789 1576411 2747042 4070019 4121362 3355930 2758331
43287 2758331 2210804 1251601 143089 -710326 -1302279 -1379069 -451504 1047459 1929112
43278 1929112 2071688 2669593 4125721 5241598 5252331 5123195 5801585 6480162 5752929
43269 5752929 3626164 1467714 583008 1307327 2775457 3413254 2575410 1630240 2227958
43260 2227958 3777876 4311478 3580177 3132798 3339962 2889387 1610187 1052959 1474262
43251 1474262 1016409 -1018660 -2836582 -3340660 -3735557 -4406728 -3387206 -157011 2095340
43242 2095340 894134 -1396078 -1020373 1700023 3615359 3669275 3171978 2570916 1420977
43233 1420977 636145 1497732 3034800 3229868 2069525 756707 -929954 -3510679 -5326638
43224 -5326638 -4608352 -2954091 -3115249 -4303171 -3716484 -1927403 -2133379 -4224547 -4536244
43215 -4536244 -2150119 -527984 -1488481 -2282962 -787766 688242 -485448 -2928902
43207 -2928902 -3968222 -3714090 -3507001 -2891337 -1154570 252384 -213643 -1411750 -1469807
43198 -1469807 -855565 -918006 -1055532 -129468 786697 33153 -1426587 -1438936 -463245 -905038
43188 -905038 -3109710 -4951328 -5268369 -4950220 -4586157 -3769277 -3017416 -3663895 -5160313
43179 -5160313 -5042881 -2661458 -706741 -1628587 -4333988 -5985537 -5661607 -4585679 -3769793
43170 -3769793 -3199292 -2842835 -2810676 -2532893 -1124364 1146265 2664278 2056676 -562154
43161 -562154 -3901279 -6329742 -6474346 -4110852 -959249 358540 -991972 -2987755
43153 -2987755 -3177194 -1580367 -115584 307953 579497 1327344 1784687 1269449 350149
43144 350149 -256176 -701795 -1067136 -639697 820844 2214866 2596228 2436187 2322596
43135 2322596 1767668 710651 674170 2470581 4129216 3500101 1796865 1752033 3049379
43126 3049379 2835977 548771 -1281486 -1498845 -2010372 -3753682 -4335521 -1802916 1801134
43117 1801134 3047042 1521619 -508442 -1359157 -838164 793497 2683405 3176291 1702333
43108 1702333 178928 794450 3023010 4458304 3991779 2503731 897292 -778513
43100 -778513 -2323142 -3059891 -2842669 -2451473 -2728203 -3744767 -4735343 -4656889 -3245475
43091 -3245475 -1575784 -794166 -374570 1015082 2853686 2989941 1200739 200736 1627192
43082 1627192 3269971 2537277 797444 1319482 3947587 5053936 2745836 -752823
43074 -752823 -2498938 -2276195 -1737601 -1863129 -2325361 -2336980 -1396381 175603 1242093
43065 1242093 1019652 25078 -927395 -2029943 -3468461 -3857212 -1776795 1293975 1999932
43056 1999932 -342824 -2464717 -1514339 1293802 2970332 2974348 2992424 3550740 3427789
43047 3427789 2449800 2416270 4193915 5678796 4375753 1141376 -592440 623472 2286646
43038 2286646 1337289 -1934036 -4753948 -5648702 -5504616 -5168612 -4060157 -1710934 994988
43029 994988 3014035 4297208 4900620 4262859 2504851 1260726 1753116 2836086 2425162
43020 2425162 334113 -1723554 -2530056 -2306735 -1544607 -457792 297955 -208411 -1832556
43011 -1832556 -3152663 -3081496 -2049316 -1310689 -1574825 -2451824 -2832511 -1817490 319468
43002 319468 2123667 2209770 429678 -2214313 -4280849 -4447120 -2356780 571510 2162103
42993 2162103 1973929 1730133 2542329 3136516 2094178 371348 -273870 -143020 -612402
42984 -612402 -1210818 -399964 1134663 1028287 -603184 -665543 2097836 4627296 3799144
42975 3799144 972925 -64577 1693527 3743510 3839561 2205185 111493 -1720210
42967 -1720210 -2919189 -3235176 -3122683 -3485834 -4319651 -4530470 -3667730 -2927722 -3545567
42958 -3545567 -4813445 -4921225 -3710815 -3254129 -4994597 -7349328 -7461981 -4923495 -2220083
42949 -2220083 -1367994 -1759305 -2006474 -2171532 -2716751 -2667105 -946492 1139117 1054839
42940 1054839 -1356276 -3581161 -4050115 -3845208 -4069407 -3745812 -1793931 652447 1718773
42931 1718773 1402890 927375 436222 -683170 -1774380 -1369371 331224 1387663 866676
42922 866676 -48250 -138752 340447 906496 1893524 3157116 3245040 1346472 -1054954
42913 -1054954 -2093291 -2168331 -2833882 -3766090 -3210175 -1438586 -1207726 -3808978 -6730611
42904 -6730611 -6733031 -3825988 -660107 926115 1114276 669358 54048 -314740 -385322
42895 -385322 -898034 -2318544 -3680721 -3752707 -2980376 -2835881 -3496275 -3712716 -2870968
42886 -2870968 -1600345 -364276 886207 1589772 944401 -278460 -173617 1448690 2511798
42877 2511798 1837830 1046493 1994603 3786871 3957449 1860252 -526460 -956375 741524
42868 741524 2603830 2646752 1232968 756777 2176797 3015098 781969 -2598957 -2926043
42859 -2926043 -154201 1119722 -1344325 -3900338 -2782425 114002 533779 -1658167
42851 -1658167 -3120058 -2576841 -1869059 -2099733 -2183316 -1250110 219121 1688614 2772023
42842 2772023 2431147 208835 -2080792 -2156868 -454794 688176 560329 348977 263885
42833 263885 -850266 -2865416 -3920673 -3178574 -1938787 -1480238 -1556796 -1414313 -781838
42824 -781838 288867 1257746 1096892 -148352 -622002 670217 1498482 -800281 -4992724
42815 -4992724 -7253773 -6272643 -4070842 -2170515 -354302 784765 -238579 -2628496
42807 -2628496 -3431511 -1821009 -190203 -11042 238813 1757552 3090434 2752224 1605463
42798 1605463 1056381 1086775 1276941 1558344 1088496 -1071779 -3427355 -3212748 -940197
42789 -940197 -266574 -2071170 -2652289 149652 3127307 2907828 1226575 1426880 2893706
42780 2893706 3000230 2053849 2104456 2786023 2503705 2151727 3452453 4915008 3804007
42771 3804007 1213153 682634 2208607 2260702 -47452 -1461184 -234213 1095145 338974
42762 338974 -708351 357952 2489590 3118109 2073014 1037291 545004 -77475 -703381
42753 -703381 -605095 -263069 -930219 -2283078 -2282155 -54858 2334647 2094693 -832720 -3638314
42743 -3638314 -3977973 -2359700 -810021 -316999 -556723 -1121753 -1538236 -832464 1078169
42734 1078169 2130815 472272 -2294930 -2899733 -1350241 -799421 -1979011 -1732384 1239469
42725 1239469 3226757 1059115 -2625735 -3421906 -1793801 -1410556 -2728648 -2866128 -1003554
42716 -1003554 611736 1006905 1717198 3211336 3727848 2477318 913246 26783 -868500
42707 -868500 -1986557 -2344815 -1858281 -1705929 -2053430 -1787641 -924435 -824532 -1657365 -2178012
42697 -2178012 -2276169 -2981606 -3698054 -2596161 -278312 375733 -1098468 -1828153 -673526
42688 -673526 -378538 -2616882 -4631467 -3675761 -1594960 -1581696 -2924242 -2714046 -954004
42679 -954004 -129780 -787134 -1233930 -1139069 -1934064 -3592575 -4173036 -3066043 -2028441
42670 -2028441 -2294643 -2930848 -2854521 -2518811 -2657741 -2956366 -2924944 -2837317 -2923974 -2689437
42660 -2689437 -1906031 -1439320 -2162918 -3574976 -4350033 -4043105 -3475938 -3298108 -2776992
42651 -2776992 -677735 2642639 4829491 3974556 1035991 -1236828 -1618221 -1309723 -1448659
42642 -1448659 -1477633 -797223 -329011 -960175 -1688487 -1051999 466389 1300473 1414780
42633 1414780 1985155 2773435 2193782 382854 -145692 1906964 4226496 3740347 689097
42624 689097 -1947106 -2436386 -1837938 -1652629 -1793413 -1529134 -1030461 -901521 -953538 -509534
42614 -509534 421688 1129904 1122456 344291 -1176371 -3022505 -4002278 -3118047 -855942
42605 -855942 1450654 3277758 4626072 4442507 1477651 -2863700 -4956244 -3581192
42597 -3581192 -1998720 -3529244 -6908945 -8381885 -6910367 -4574021 -2914278 -1966727
42589 -1966727 -2232044 -4162397 -5738351 -4104251 -175224 1818003 273779 -1791261
42581 -1791261 -1926405 -1560844 -2065199 -1491142 1421407 3382228 1058093 -2902458 -3207517
42572 -3207517 50506 1848481 355436 -838008 425352 1135688 -1265779 -4080012
42564 -4080012 -3850076 -2337173 -3569726 -6845691 -7436332 -3949349 -598631 -1119221 -3954489
42555 -3954489 -5348778 -4671792 -4325787 -5750000 -7733553 -8258074 -6500134 -3296286 -704114
42546 -704114 -609882 -2692358 -4372489 -3980240 -3170096 -4471391 -7100998 -7654202 -5082104
42537 -5082104 -2276658 -1659357 -1778828 -262864 1939332 2026950 -102927 -1803836 -1914999
42528 -1914999 -2056047 -3161048 -3526488 -1699131 863741 1851857 1342955 1069355 1485640
42519 1485640 1694094 1821903 3169708 5611121 6888618 5609633 3430213 2676457 2806019
42510 2806019 1386655 -1557622 -2713593 -151565 3308848 3608862 976976 -874639
42502 -874639 -512286 -343944 -1865482 -2928725 -1637232 145581 21936 -628085 914789
42493 914789 3548467 3632658 908332 -854405 459285 2584573 2864230 1827062 1359200
42484 1359200 1861547 2704422 3381375 2942099 392539 -3057959 -4283277 -2223946 378671
42475 378671 640121 -1080215 -2911178 -4386676 -5733594 -6245406 -5543077 -4832624 -4840611
42466 -4840611 -4164328 -1890931 -111451 -1113362 -3434583 -3677788 -1367528 968950
42458 968950 1981010 2659816 3406502 3001986 1139825 -492134 -563712 259841 699213
42449 699213 384416 -446923 -1427648 -1953272 -1739786 -1411805 -1415153 -966931 326198 731394
42439 731394 -1316291 -3817594 -3209228 142742 1837817 -247826 -2911972 -2651974 -655622
42430 -655622 -116577 -911303 -273010 2366468 4481248 4316887 2968637 2124719 1816295
42421 1816295 1186515 31822 -1223109 -2161815 -2477731 -2201805 -2113709 -3092566 -4757685
42412 -4757685 -5616755 -4952954 -3694988 -2898178 -2297199 -1237637 -248423 -365971 -1185006
42403 -1185006 -1098820 185658 808037 -650027 -2864658 -3487931 -2526032 -2219169 -3482166
42394 -3482166 -4322276 -2753150 32372 834784 -1642265 -5204557 -6514200 -4415016
42386 -4415016 -979111 425398 -1629110 -5094073 -6600602 -5235431 -3195423 -2346876
42378 -2346876 -1706522 328987 2639043 2583760 188544 -1372769 -135889 1907580 1735976
42369 1735976 -560121 -2322796 -2217108 -1638744 -2172553 -3335408 -3623016 -2699422 -1469973
42360 -1469973 -549173 149146 420314 -337133 -1793942 -2389666 -1261368 327834 611504
42351 611504 -185388 -315669 794559 1854868 1871509 1496849 1720573 2548315 3625608
42342 3625608 4875942 5660958 4578680 1371392 -1804644 -2374381 -273602 2126777
42334 2126777 2755992 1662912 334219 -44130 356227 382257 -538543 -1392820 -875523
42325 -875523 485617 812560 -323830 -1213741 -797728 -435943 -1642990 -3487391 -3868385
42316 -3868385 -2475711 -915078 -427021 -789060 -1120526 -796083 110277 776571 686014
42307 686014 887543 2835191 5634638 6375648 4008568 759255 -1368126 -2953659 -4488183
42298 -4488183 -4336124 -1961654 -461122 -2514715 -5980542 -7163442 -6478319 -6662321 -7063745
42289 -7063745 -4776187 -719365 818815 -937627 -2007751 -304732 1500316 1411262
42281 1411262 1427194 2874483 3001420 -229176 -3586419 -2914804 397358 1371295 -1499547
42272 -1499547 -4776837 -5054555 -2400099 978635 3104909 3200095 1935043 754100 139134
42263 139134 -783716 -2293851 -3134283 -2531748 -1561062 -1181666 -614718 673698 1098448
42254 1098448 -773836 -3397651 -4058051 -2678693 -1534268 -1654734 -1748059 -675244 917746
42245 917746 1783313 1567971 766802 -51311 -795652 -1852353 -3216671 -3754124 -2457901
42236 -2457901 -573042 -787289 -3614013 -6329421 -6557275 -5155708 -4187654 -3769729 -2730763
42227 -2730763 -1033274 350152 1008062 965399 5735 -1463749 -2074746 -1458798 -1141007
42218 -1141007 -1935073 -2153482 -407857 1530827 1184368 -705997 -1443923 -489192 553496
42209 553496 1169025 2013302 2227443 38295 -3659121 -5371969 -3502023 -368557 1084748
42200 1084748 553681 -426497 -686884 46526 1407675 2441699 2358067 1427183 290722
42191 290722 -1098879 -2548522 -2536571 -144455 2537830 2439725 -261647 -2531696 -3017933
42182 -3017933 -3210840 -3672642 -2459158 1233870 4656230 4773349 2058315 -732590 -1893720
42173 -1893720 -1249744 940320 3528250 4241409 2057217 -943955 -1957625 -1015421 -295676
42164 -295676 -448417 120677 2098997 3590784 2747683 687726 182852 1863738 3347712
42155 3347712 2583270 669471 45752 686787 102902 -2674664 -5253796 -5219387 -3566107
42146 -3566107 -2994662 -4003523 -4790280 -4331984 -3357111 -2517836 -1670791 -903745 -329498
42137 -329498 988191 3723247 5969725 4839728 861031 -1898533 -1146670 727083
42129 727083 575818 -1039459 -1472662 -300626 587965 327204 -20107 233160 349660
42120 349660 -128947 -273641 780108 2190796 2114501 -177092 -3409626 -5558001 -5680270
42111 -5680270 -4347585 -2537567 -680061 1081824 2366218 2808645 2434662 1394659
42103 1394659 -149466 -1584986 -2185742 -2350798 -3302130 -4821654 -4866436 -2687121 -543524
42094 -543524 -408792 -779640 564663 2249639 1312895 -1381616 -1836416 933694 3583776
42085 3583776 3965674 3761781 4154019 3092483 -597366 -3958423 -3905369 -1784520 -732164
42076 -732164 -742320 170889 1567875 1042976 -1607683 -3918730 -4313188 -3530624 -2591259
42067 -2591259 -1619279 -752682 -361666 -304514 -288549 -539105 -877757 -116923 1982770 3285029
42057 3285029 1933944 -520617 -1126427 22102 161443 -1466486 -2368183 -980285 579495
42048 579495 -519434 -3823806 -6225453 -5766987 -3504724 -1801078 -1622039 -1792371 -819368
42039 -819368 888004 1314456 -487604 -2978915 -4015156 -3251772 -1838240 -574210 579153
42030 579153 1752543 2859193 3566173 3114862 1114412 -1072809 -1253430 523478 1637084
42021 1637084 763089 -80282 919494 2060227 896569 -1617065 -2812069 -2644083 -2959673
42012 -2959673 -3512071 -2470685 -466415 -235912 -1959583 -2661052 -1064399 356042 -603180
42003 -603180 -2795726 -4106270 -4340058 -4232257 -3794739 -3177129 -3347707 -4538300 -5485561
41994 -5485561 -5201396 -4092164 -2761070 -1330072 -269093 28197 619979 2564833 4012234
41985 4012234 1887664 -2898478 -5489027 -3665757 -782092 -206254 -589870 498689
41977 498689 1708293 476079 -2080399 -2955476 -2257372 -2379084 -3328362 -2949530 -1226152
41968 -1226152 -383865 -731966 -170087 1759365 2889160 2300001 1850029 2604686 2746618
41959 2746618 737950 -1891006 -2847768 -2326169 -2012491 -2201710 -1837910 -653870 431094
41950 431094 765975 590793 322397 77496 -135151 -271687 -238520 205502 1301488 2879232
41940 2879232 4302995 4862276 4131656 2356809 826761 1126695 3157556 4568779 3385517
41931 3385517 691189 -780702 -333317 265386 -31351 -163731 606365 1080934 297447
41922 297447 -416172 675150 2899386 4052039 3386556 1985674 620610 -862726 -2048701
41913 -2048701 -1797394 -227701 695025 -426644 -2462036 -3269413 -2373359 -899008 603814
41904 603814 2642850 4933361 5707128 3934769 1287296 486695 1916128 3147672 2096464
41895 2096464 -423391 -1900424 -1155371 624509 1583094 1191277 446879 484240 1248684
41886 1248684 1640588 972504 -24084 -9449 1374557 3254306 4648309 5071431 4128505
41877 4128505 1594943 -1728980 -4138264 -4531934 -3243386 -1212986 778924 1884972
41869 1884972 1495213 389086 328019 1632328 2372054 1034878 -1193947 -2139779 -1548872
41860 -1548872 -760830 -412315 -217127 -346347 -1193173 -2214893 -2731563 -3315147 -4473306
41851 -4473306 -4636458 -1972630 2058450 3861833 2772501 1961795 3331980 4593823
41843 4593823 3249776 721179 -122976 498003 316051 -640802 -130473 2065523 3199156
41834 3199156 1623016 -786387 -1548764 -907264 -593703 -727089 1994 1601797 2276476
41825 2276476 1048554 -608205 -663840 812805 2005910 2030914 2051540 3411376 5621168
41816 5621168 6983402 6726407 5648070 4763258 4135284 3247747 1932290 562542 -371117
41807 -371117 -556963 145627 1655037 3327881 3779346 1802735 -1790350 -3795348 -1522070
41798 -1522070 3768876 7849245 8431616 7361649 7030279 6808966 5060862 2804370 2389115
41789 2389115 3462673 3445072 1783760 583270 837712 1302450 1695058 3509210 6345882
41780 6345882 6981454 4311964 2136324 4117717 8388179 10423878 9491019 8658763 9426129
41771 9426129 10063469 9322887 8531940 9170359 10668438 11523591 11125972 9987233 9267861
41762 9267861 10055495 11994546 13036907 11859172 9860034 9158735 9495951 9265166 8794598
41753 8794598 9774757 11681380 11959303 10276078 9434115 10863756 12159992 10942387 8637707
41744 8637707 7998109 8680990 8069914 5594283 3563884 3758541 5340813 6553901 6853492
41735 6853492 6698179 6362509 5772904 5004155 4333124 3950702 3887412 4056207 4138865 3611836
41725 3611836 2349342 1327483 2097537 4812014 7142953 6415431 3019045 336124
41717 336124 656627 2593214 3567243 3316907 3296139 3926444 4635210 5740346 7782095
41708 7782095 9322738 8038641 4280703 1245737 1134011 3166821 5734975 8218785
41700 8218785 10050417 10336461 9553954 9726013 11795434 14398473 15992719 16400975 15585846
41691 15585846 13136471 10059447 8786682 9892189 10855028 9714352 7948090 7857452
41683 7857452 9002707 9454677 9057853 9096537 9772608 10181269 10014282 9446961 8157933
41674 8157933 6180754 4849130 5194761 6236332 6399726 5677382 4916615 4178227 3414675
41665 3414675 3433453 4350921 4397055 2198382 -992885 -3160488 -4063321 -3990318 -2044551
41656 -2044551 1639613 3938610 2374200 -717803 -1140887 1249711 3231650 3639477
41648 3639477 3971192 4381959 3607245 2631744 3727828 5634730 4634210 1185383 290195
41639 290195 3636626 6511805 5063051 1935928 1472925 3415350 5065437 6177142
41631 6177142 7591559 7826939 5381470 2465620 2242324 3722312 3362902 723671 -1348132
41622 -1348132 -1534409 -1205928 -880264 756805 3633689 5213035 3835289 1053948 -437009
41613 -437009 119008 1185568 815252 -1254874 -2924045 -1797970 1507085 3528380 2465300
41604 2465300 626666 601564 1122089 -428092 -3060032 -3352818 -867081 1294950 1363848
41595 1363848 854936 1158656 1514869 1399893 1932389 3460659 4219218 2984514 1150675
41586 1150675 710862 1736540 3016036 3663835 3092896 1034431 -1306248 -1704978 279977
41577 279977 2398157 2687308 1846412 1479225 1634842 1628517 1826548 2771878 3599240 3171025
41567 3171025 2027875 1438663 1127958 -189700 -2289382 -3249161 -1913339 850025 3459733
41558 3459733 4939625 4876475 3429818 1730687 1093842 1385543 1223952 267761 115708
41549 115708 2022706 4685118 5611584 4267642 2496381 1885875 2212404 2915525 4505336
41540 4505336 7218596 9382272 8945540 6354649 4183699 3850964 4409796 4810921 5282656
41531 5282656 5604677 4160067 414786 -3256098 -4240393 -3059461 -2015079 -1515318 -253104
41522 -253104 1549542 1960149 641410 -317655 348176 1305485 1162604 726842 1298211
41513 1298211 2321104 2369794 1459354 874259 1226459 1807025 1589439 263840 -1364361
41504 -1364361 -1822804 -540468 1029380 1015265 -117572 -76570 1667963 2904578 2248983
41495 2248983 1425505 2201390 3070230 1654358 -798631 -488789 3352108 6832926 6356591
41486 6356591 3095618 1082891 2173403 4523975 5514228 4563890 2732541 721524
41478 721524 -1571722 -3653741 -3879530 -1325183 2278663 3855318 2493474 502987
41470 502987 418213 2030395 3282361 3193504 2616649 2482163 2599897 2393903 1930073 1776662
41460 1776662 2205193 2854449 3210278 3344158 3875206 4897826 5380918 4430655 2886254
41451 2886254 2518298 3623191 4730371 4931918 4952851 5320383 5203574 4233857 3879503
41442 3879503 5308030 7037679 6688386 4451378 2882610 3476984 5241154 6670954
41434 6670954 7407112 7583809 7068091 6056451 5429328 5832394 6942178 8007953 8711287
41425 8711287 9288146 10041940 10747329 10601411 9360316 8563501 10381712 14575793 17982666
41416 17982666 18211679 16471768 15124367 13981884 11575760 9003746 9091717 11618511
41408 11618511 12819385 10809451 8537736 9502275 12864313 15052239 14555822 12786060
41400 12786060 11276768 10409583 10432630 11571435 13051932 13621991 13193512 12792778 12973093
41391 12973093 13420085 13927147 14492601 14558405 13472731 11754346 10644805 10336797 9961138
41382 9961138 9468103 9997981 11853580 13523109 13545319 12180753 10370523 8229374 5719074
41373 5719074 3733798 3010947 2709276 1732850 951950 2144292 4810263 6258019 5465856
41364 5465856 4695791 5948379 7671476 7013061 4217336 2470254 3663287 6383600
41356 6383600 8259447 8460428 7464941 6045832 5192626 5640127 6689634 6667996 5246368
41347 5246368 4094686 4490831 5583460 5981466 5732597 5445574 4669913 2822116 927411
41338 927411 637128 1794394 2526976 1677953 -145571 -1808341 -2654198 -2348048 -953607
41329 -953607 724299 1794386 2171139 2046039 1091783 -545045 -1136307 873185 4173681
41320 4173681 5627667 4230822 2133116 1271406 1021185 154542 -749030 -399863 896227
41311 896227 1653060 1393614 1152497 1962676 3635365 4966848 4894713 3793941 3550718
41302 3550718 5510376 8402762 9544646 8228325 6353452 5317075 4228429 2195847
41294 2195847 366241 -9306 107442 -735939 -1682128 -897144 1037374 1673855 530385
41285 530385 -152671 1084523 2937700 3662423 3368218 2865768 1959342 377148 -838910
41276 -838910 -501001 887609 1949817 2594844 3818120 5496120 6018205 4616388 2790418
41267 2790418 2506858 3748476 4900079 5182328 5446206 6329861 6865964 5897323 4150406
41258 4150406 3489427 4139611 4162119 2385697 583472 1380484 4625065 7414151 7769963
41249 7769963 6819547 6693320 7405172 6994802 4432092 1275733 52363 1455675 3654006
41240 3654006 4402094 3475426 2648584 3387821 5192134 6531973 6821335 6699243 6628204
41231 6628204 6183740 4955022 3360695 2075588 1149077 251871 -487018 -493966 385763
41222 385763 1488347 1993780 1774108 1371510 1234240 1281241 1333251 1602031 2289894 2936904
41212 2936904 2946605 2807432 3721741 5477156 5881017 3584968 633602 407711 3241222
41203 3241222 5998684 6283599 5075686 4411492 4468766 4407123 4412122 4988886 5463730 5268166
41193 5268166 5659881 7722565 9455127 7897217 4076360 2467882 4674567 6978638
41185 6978638 5952170 3449588 3310552 5453375 6634840 5712093 4544387 4106932 3257481
41176 3257481 1797561 1559202 3291239 4992149 4768625 3437179 2899253 3505701 4400252
41167 4400252 5200519 6010285 6671279 7007312 7021974 6302213 4373713 2146762 1499732
41158 1499732 2693732 3810883 3586201 2947613 2709366 1957845 391853 28397 2213914
41149 2213914 4781595 4926492 3409614 2835805 2985460 1539859 -999379 -1117196 2288972
41140 2288972 5808396 6234857 4550130 3594031 4185796 5445309 7044910 9017723 10477547
41131 10477547 10414655 9221803 8170520 7874342 8121545 8545991 8681995 8021912 6677601
41122 6677601 5404099 4667948 4486648 5199375 7056014 8856365 8716692 6792407 5481284
41113 5481284 6040254 6800377 5955703 4346008 3797741 4175416 4081275 3503529 3699981
41104 3699981 4927278 6175054 7012015 8024228 9282436 9760244 8693779 6699584
41096 6699584 5231824 5279223 6492071 7332425 6497609 4518202 3375853 4180137 5938784
41087 5938784 7039339 7096356 6820620 6992268 8162812 10370320 12441602 12606397 10606810
41078 10606810 8211652 6912808 6299914 5566871 5218405 6008462 7384543 8381951 9053190
41069 9053190 9685595 9672255 8625850 7643737 7972964 9283203 10587712 11767645 12746219
41060 12746219 12523840 10874910 9648518 10198482 10815863 9328580 7149394 7556538 10408392
41051 10408392 11999723 10561586 8715809 9410276 12049945 14022676 14018110 12477962 10394240
41042 10394240 8968150 9216033 10778537 11994412 11856419 11044626 10664945 11004626 11806415
41033 11806415 12641486 12804326 12013220 11281686 11794253 13009373 13464519 13331495 14169095
41024 14169095 16016135 16990381 16256706 15072025 14169418 12631916 10535842 10066964 12080386
41015 12080386 13820289 12557126 9867020 9550247 12288670 15234772 16580311 17596696
41007 17596696 19505618 20878666 19786422 17089576 15642704 16488783 17511876 16476624
40999 16476624 14231042 13596258 15518297 17988543 19133408 19589917 20647479 21680172
40991 21680172 21445250 20902003 22269271 25515453 28129083 28550784 27690087 26786354 26020382
40982 26020382 25779803 27011754 29362642 30899376 30623413 29544095 28641496 27871470 27904954
40973 27904954 30226800 34082302 35895833 33802042 30659848 30276484 32440112 34223206
40965 34223206 34702307 35454691 37129833 38414860 38487742 38311272 39153735 41227628 43774097
40956 43774097 45442173 45152518 43828923 44442326 48693109 54329078 57604380 57983218
40948 57983218 58516162 61709544 66878239 71758546 75116032 77348631 79752031 83657232
40940 83657232 89492421 96368181 102945754 108597708 113526842 118399695 124261254 131936423
40932 131936423 140985409 150217987 159626637 170372250 182355689 193838467 204504225
40925 204504225 216549365 231108923 246133590 260102951 275131434 293025757 310588233
40918 310588233 323210932 331729684 340776345 350703645 356421923 355231010 350880059 347771040
40910 347771040 345251483 340258048 332126193 321705447 308501262 292198617 275273836
40903 275273836 260729786 248129340 234691675 219684072 205104848 192335322 180622928
40896 180622928 169097079 158235602 148777136 140585962 133093522 125945423 119000078 112428709
40888 112428709 106778510 102180199 97679359 92282140 86566742 82177635 79492461 76818748
40880 76818748 72569736 67565202 64157830 63102548 62374163 59855904 56450792 55005159
40872 55005159 56045467 56374070 53035803 47338924 43273365 42731076 44098315 45125561
40864 45125561 45218438 44878591 44729971 45420385 46973397 48074312 47546148 46567684 47560928
40855 47560928 50610784 52971221 52638849 50441680 47967910 45596493 43578827 42900157
40847 42900157 43597396 44025058 43340143 43082179 44628517 46571020 46465103 44050971 41036914
40838 41036914 38762084 37758080 38503151 40631131 42145076 41352642 39144105 37719175
40830 37719175 37603942 37638095 37440913 37990711 39741349 41709463 42654674 42175228 40702673
40821 40702673 39221990 38710377 39199974 39958100 41045594 43472159 47014941 49552841
40813 49552841 49980237 50078465 51624235 53396099 53537018 53301582 55301728 59096781 62079513
40804 62079513 64201980 67867740 72908316 75849768 75465627 75266351 78405472 83264204
40796 83264204 86559926 88261060 90666008 94556686 99103797 104209452 110161340 115851769
40788 115851769 119983779 123617615 129229236 137495851 146991513 156670424 166514645 175944562
40780 175944562 183921488 190959279 199002687 208738867 218764917 228024755 237363520 247783234
40772 247783234 258684912 269038887 279139688 289803256 300520097 309866902 317579572
40765 317579572 324861690 332256038 338226927 340708177 339654485 337044365 334129942 329664650
40757 329664650 321765225 310899394 299540507 288805781 277129712 263074877 247935743
40750 247935743 234170120 222375618 211470923 200999092 191278552 181789983 171664509
40743 171664509 161753018 153892166 147716552 140578540 131506147 122870819 116713136 111656355
40735 111656355 105492610 98940159 94222819 91162308 87600136 83188395 79787875 77889062
40727 77889062 75429731 71040171 66154815 62709890 60579489 58557533 56353612 54320067
40719 54320067 52474754 51014578 50592237 50885987 50198818 47898136 45931995 46094573 46872690
40710 46872690 45236651 41000869 37066064 35380818 34937743 34142478 32965360 31870632
40702 31870632 30533203 28931933 28316945 29632022 31861828 33282395 33727852 34311209
40694 34311209 35241233 35209626 33088564 29400637 25879425 23997650 23935922 24636996 24860590
40685 24860590 24307885 23522944 22774025 21775947 20793554 20989182 22715900 24202771 23356250
40676 23356250 20732763 19236014 20430075 22487618 22743600 21258334 20371051 21093448
40668 21093448 21704407 20477337 18310860 17325960 17664782 17354181 15286945 12725939 11369619
40659 11369619 11348162 11966976 13125897 14721836 15634398 14929663 13607728 13553156 14887623
40650 14887623 15871844 15445909 14326962 13373220 12463981 11585790 11585210 12926888 14683967
40641 14683967 15561745 15210526 14075666 12841628 12394389 13201818 14240649 13812019 12053402
40632 12053402 11196386 12429927 14074776 14203329 13572607 14117891 15638010 16120137 14856962
40623 14856962 13233078 12547228 12766416 13343140 13682630 12969861 11185974 10074988 11174196
40614 11174196 12950609 12185728 8677980 6217956 7780284 11776046 14558747 14904939
40606 14904939 14118865 13009734 11145941 8799126 7482822 8016745 9340433 9831886
40598 9831886 9069581 7916601 7423423 8023506 9524206 11532659 13693911 15421249 15819396
40589 15819396 14686908 13533958 14384997 17030959 18690338 17433054 14890433 14105464
40581 14105464 15428059 16356965 15219586 13050765 11491054 10689759 10138744 10017474 10509842
40572 10509842 10920347 10731789 10699300 11672418 13066956 13771129 13870672 14043400 13883618
40563 13883618 12600996 11046130 11000237 12296200 12709302 11288269 9782808 9801547 10517204
40554 10517204 10637541 10900603 12676383 15366063 17333891 18579273 20282861 22262104
40546 22262104 23243126 23493728 24711006 26924077 27855228 26207806 23594047 22127560
40538 22127560 21796389 21414992 20724244 20205922 19872912 19457252 19022343 18540769 17762326
40529 17762326 17154189 17725943 19083443 19087692 16632179 13443307 11816642 11877830 12526378
40520 12526378 13614680 15223250 16007967 14679170 12488349 11882949 12983992 13652900
40512 13652900 12882159 11726545 10718057 8868181 6006974 3958242 4253731 6242856
40504 6242856 8425274 10206998 11369498 11209471 9465065 7194547 5688793 5150820
40496 5150820 5117743 5378330 5798070 6038040 6106124 6440723 6915994 6635392 5306420 3937039
40486 3937039 3538629 4025822 5029908 6762465 9138650 10890379 10672075 8697111 6565050
40477 6565050 5806781 6918005 9060366 10285328 9059404 6264413 4694823 5764245
40469 5764245 7763072 8354940 7627965 7265793 7671694 7717966 6907401 5988558 5418039
40460 5418039 4775331 3974126 3794699 4829463 6757233 8795839 10126705 10083498 8960871
40451 8960871 8411803 9719728 11719887 11923936 9870138 7696405 6919756 6506064 5220037
40442 5220037 4158925 5143018 7633303 9303807 9361895 9360346 10465691 11606751 11081222
40433 11081222 8862039 6486580 5390438 6035251 8026196 10276274 11435899 10981561
40425 10981561 9853339 9492446 10246958 11080392 10807680 9321438 7631853 6907556 7453579
40416 7453579 8578458 9555804 10512105 11888984 13224638 13436756 12545559 12003898 12684066
40407 12684066 13640968 13805876 13738813 14310867 14755530 13994806 13119810 14058630 15976921
40398 15976921 15856581 13261324 11664829 13619024 17105397 18661473 18082206 17676986
40390 17676986 18427430 19455740 20278772 21036853 21137644 20114096 19317274 20249162 21570641
40381 21570641 20500462 17220446 15030260 15542297 16460419 15239446 12569889 10766229
40373 10766229 10572599 11093647 11447268 11111115 9865070 8575891 8787366 10384711 11029530
40364 11029530 9279640 6954203 6681284 8036697 8041213 5208105 1458857 -168932 1320160
40355 1320160 4214736 6021388 5959473 5584839 6579846 8212654 8173575 6007703 4039075
40346 4039075 4149575 5312155 5561271 4917820 4705413 5112333 5340590 5471762 6226645
40337 6226645 7146322 6869641 5352409 4269403 4869884 6603475 8188443 9053282 9335066
40328 9335066 9184030 8553658 7502809 6573313 6631311 7716183 8148395 6068865 2358209
40319 2358209 482122 2229057 4964706 4857890 1872746 -481121 124064 2507346
40311 2507346 4391798 5055548 4961975 4375076 3308900 2005589 817136 66467 124760
40302 124760 1025251 2079480 2573719 2681921 3001349 3571084 4165853 4940586 5662114
40293 5662114 5042437 2404859 -572032 -1644907 -1128099 -1062505 -1520544 -498535 2016457
40284 2016457 2850291 49572 -3899251 -5241911 -3552512 -1123388 612708 1622711
40276 1622711 1474648 -87613 -1142225 926642 5462501 8532638 7816724 5361048
40268 5361048 4166839 4004558 2680986 256545 -579455 1594996 4830660 6435383
40260 6435383 6158820 5560029 5280423 4535714 2992376 1589934 1180589 1535743 2231654
40251 2231654 3503844 5429777 7044306 7304533 6576238 6184933 6598425 6948562 6439942
40242 6439942 5420725 4726799 4526481 4288902 3736667 3464077 4340054 6138774 7063522
40233 7063522 5412348 1961417 -191113 1086455 4446353 6741484 6669781 5535790
40225 5535790 4732880 4132590 3369153 3155595 4203166 5747884 6418697 6169362 6124223
40216 6124223 6553555 6254676 4432247 2214033 1416072 2333437 3714620 4590267 4916500
40207 4916500 4459101 2674574 405509 56514 2543781 5208856 4732262 1476638 -1226751
40198 -1226751 -1722144 -1345976 -980716 571162 3487888 5075120 3266584 -7240 -1353328
40189 -1353328 -357151 900946 1498861 2146658 2761088 2329822 1072193 376506 553537
40180 553537 688848 603696 888029 1166223 595167 14790 1135075 3395985 4226318
40171 4226318 2969549 1988794 3002633 4804985 5817405 6546571 7864753 8756129 7663494
40162 7663494 4925547 2425593 1677143 3033933 5483372 6531533 4109764 -279631
40154 -279631 -2156994 774664 5796621 9024596 10148422 11219125 12489257 12364995
40146 12364995 10709423 9336237 9195221 9376462 9155325 9035972 9344884 9483117 9125485
40137 9125485 8808439 8803638 8546585 7708501 6922750 6955378 7806479 8930496 9773682 9951659
40127 9951659 9519338 9231102 9955427 11619649 13193781 13954345 14454447 15932041 18673376
40118 18673376 21062100 20730060 17171990 12868615 10931124 11781687 13228868 13664195
40110 13664195 13615321 13942602 14461562 15172937 16830081 18867717 18716156 15290685 11701735
40101 11701735 11972345 15894605 19680895 21177817 21642224 22388103 22735119 22193466 21979951
40092 21979951 22731444 22733058 20399113 17220651 16207408 18024501 20496896 21681026 21671054
40083 21671054 21231515 20440407 19595151 20106673 22896418 26316720 27362946 25426331 23448651
40074 23448651 24298307 27064388 28537370 27799623 27295154 29090269 32119864 34137168
40066 34137168 34686757 34671810 34250873 32973568 31342380 30468506 30332076 29839832 28622878
40057 28622878 27516896 27086608 26693014 25331471 22809194 19982884 18134139 17853666
40049 17853666 18269186 17929130 16749257 16186998 17007581 18077298 18184876 17713636 17364020
40040 17364020 16660398 15237079 14121970 13818494 12593887 9138587 5647427 5246557
40032 5246557 7209227 8107099 7240981 7022399 7763635 6547058 2792903 718839 3470152
40023 3470152 8038752 9320404 6917344 4511950 4161457 4777012 5325313 5969733 6137170
40014 6137170 4657902 2354296 1881517 4175561 7042663 8000807 6853276 4884801
40006 4884801 3216300 2723355 4032047 6542427 8478027 8728613 7811582 6489386 4573099
39997 4573099 1961118 -133851 -238356 1444966 3117338 3342982 2304495 1170279
39989 1170279 788672 1182423 2019520 3183081 4567760 5391762 4428173 1567771 -1269014
39980 -1269014 -1757502 250700 2629811 3621485 3660072 4145352 5280004 5965826 5449253
39971 5449253 4241078 3358280 3141009 3020132 2383469 1600735 1907878 3881885 6241962
39962 6241962 6927296 5509615 3744982 3360664 4106854 4654766 4679741 5013475 6051970
39953 6051970 7104543 7423867 7050240 6426512 5841385 5498847 5586090 6004558 6459605
39944 6459605 6986149 7887998 8912203 9027750 7557751 5352864 4363358 5824657 8838000
39935 8838000 10868789 10042072 7170396 5065629 5428217 7007551 7568901 6897877 6402736
39926 6402736 6219287 4900295 2447445 1373782 3302661 6270828 7368525 6830849
39918 6830849 7211270 9142878 10482317 9864752 8747161 8956265 9932638 9732142 7824441
39909 7824441 5704561 5071389 6168583 7821055 8693327 8442792 7623979 6624904 5368435
39900 5368435 4255296 4286417 5453106 6158180 5439335 4580396 4925997 5389933 4337963
39891 4337963 2778570 2841036 3929308 3839135 3309183 5295477 9178227 10254942 6811332
39882 6811332 3436182 4519564 8086563 9398067 7568097 4924629 2502751 301449
39874 301449 -129201 2205143 4573437 3887829 2002962 2989169 6115234 6871750 4806758
39865 4806758 4534243 7817971 10326730 8690132 5800815 5710358 7274220 6916532 4865686
39856 4865686 4323827 5940732 7064476 6051953 4187360 3223124 3310112 3616676 3482859
39847 3482859 2858375 2428332 2887558 3595861 3075370 1504896 1094771 2871604 4883214
39838 4883214 5141179 4531936 4828759 5560088 5365480 5047008 6288556 8152973 8034227
39829 8034227 5943971 4723872 5582743 6427835 5612301 4546206 4947854 5791615 5141553
39820 5141553 3478900 2882166 3741052 4574395 4808467 5428867 6550358 6600896 5071270
39811 5071270 4243253 6317310 9870335 11322211 9607296 7209862 6366763 6554619 6599220
39802 6599220 6962028 8239393 9211851 8516950 7003812 6291118 6119054 5468513 5203562
39793 5203562 6728957 8703203 8305033 5649074 3671824 3406246 2832026 1122134 417858
39784 417858 1970444 3844861 4276951 4323847 5236292 6083037 6096773 6517045 7765094
39775 7765094 7697758 5391486 3784574 5337684 7731315 7571248 6044367 6728402 9521439
39766 9521439 11111307 10353724 8955430 7663016 5993334 5122127 6743302 9386479
39758 9386479 10077109 9319617 10014608 11802394 11593818 9875966 10773404 14677118 16653423
39749 16653423 14377478 12007293 13052729 14728945 13555857 11916836 13902914 17999052
39741 17999052 19326227 17040851 14427287 13102665 12026987 11387366 12714824 15304252
39733 15304252 16683595 16675988 17267200 18591744 18944021 18745808 20245284 22720191 22374805
39724 22374805 18391998 14982203 15325149 17082953 16576864 14406428 13759493 15264924
39716 15264924 16844876 17497260 18123288 19021621 19248155 18648566 18480096 19538833 21012251
39707 21012251 21589388 20882246 19590678 18758669 18737398 18657894 17553437 16216606 16689447
39698 16689447 19191431 21092350 20374601 18732213 19157696 21387258 22333500 20893782
39690 20893782 19579210 20550112 22395754 22424578 20566577 19113662 19313473 20021056 19778507
39681 19778507 18870823 18705703 19746541 20752030 20236047 18394068 17025852 17331780 18424101
39672 18424101 18665116 17908873 17411436 17883347 18834357 19678410 20200832 20051800 19251552
39663 19251552 19101828 20758266 22808969 22545825 20150647 18964408 20444010 21723629
39655 21723629 20181097 17659139 17330358 18760830 19573150 20063490 21989823 24006925
39647 24006925 22979142 19507225 17400681 17384305 16329589 13694578 13261336 16182920
39639 16182920 17595761 13828577 8598060 7596211 10396880 12614456 13337346 14979325
39631 14979325 17444302 18051505 16715244 16035135 16282436 15252796 13380868 13862105 16674151
39622 16674151 17582195 14971877 12875195 14476380 16863066 15768636 12202267 10381509
39614 10381509 11341648 12600190 12813930 12923191 13126786 12096182 9504365 6897949 5680877
39605 5680877 5934899 7220932 8955234 10102507 9988867 9297873 8999665 8714138 7546815
39596 7546815 6010024 5363096 5316759 4286660 2083584 619297 1438892 3873328 6133774
39587 6133774 7155361 6933530 6051793 5434402 5845333 7096655 8072381 7689421 5647703
39578 5647703 2630024 322565 598521 3502589 6356533 6306145 3842709 2313512 3556080
39569 3556080 5635136 5843866 4417691 3601310 3998691 4068038 3217317 3075152 4659857
39560 4659857 6222531 5768544 4436616 4890513 6838398 7104651 4737885 2996460 4519965
39551 4519965 7227623 7717812 6616027 6984962 8686370 8519350 5864133 3872113 4088826
39542 4088826 4059128 2154176 885022 2576902 5003552 4869180 3204394 3370210 5313502
39533 5313502 5947293 4483675 3297209 3470899 3337520 2119345 1538216 2596493 3692399
39524 3692399 3425043 2876897 3554147 5011560 5988946 6221387 5778935 4234241 1896937
39515 1896937 383390 454936 586000 -759694 -2546582 -2534535 -467183 1698182 2305597
39506 2305597 1407822 26383 -744751 -88704 1978408 4343608 5727326 5783226 4960864
39497 4960864 3829511 3055369 3378175 4820537 6335544 6902319 6635218 6381699 6731768
39488 6731768 7758815 8987276 9254116 7644841 5135013 4030035 4857044 5213462 3127866
39479 3127866 266808 -197611 1920589 3776917 3696964 3010884 3275381 3905828 3658959
39470 3658959 2820981 2586691 3272755 4285812 5117825 5390969 4584945 2749784 1063763
39461 1063763 744930 1625103 2512649 2715503 2521271 2385212 2346197 2207441 1780445 1003723
39451 1003723 201106 37357 792369 1892851 2613236 2952381 3228498 3130043 2086233
39442 2086233 551969 -160532 238079 304265 -1071997 -2602162 -1963218 835191 2952579
39433 2952579 2309780 452653 463737 2694774 4367654 3488227 1288341 8770 -15796
39424 -15796 315484 964514 2159471 2645939 977242 -1658869 -2382533 -679132 980979
39415 980979 1242554 1836280 4026988 5817641 5079586 3325302 3378792 4723050 4463910
39406 4463910 2176625 340391 22663 -397250 -1629463 -1991395 -782162 -63166 -1222125
39397 -1222125 -2333734 -1179135 1104138 1810640 719416 5737 941493 2716882 4031758
39388 4031758 4274633 3625985 3148529 3951198 5311658 5008229 2688661 1032794 1775636
39379 1775636 2620688 722463 -2477226 -3146703 -753601 1601286 2101346 1987136 2299198
39370 2299198 2202137 1230670 353067 61894 -74016 538849 3224876 7173382 9563487
39361 9563487 9304509 8063412 6965692 5167799 2511640 529303 -277757 -1136777 -1961591
39352 -1961591 -989118 1338250 1975682 448658 158523 2133866 2193241 -1988574 -5561429
39343 -5561429 -3326822 1812696 3255290 912198 278412 2645176 3465932 868840
39335 868840 -1126648 198286 1879269 965843 -405422 788318 3008272 2802101 388340
39326 388340 -1022429 -22373 1801126 2554013 1769787 252742 -332289 1258211 3890822
39317 3890822 4807813 3319362 1882630 2314413 3166019 2610583 1676444 2163021 3115229
39308 3115229 2220478 -327063 -2148552 -2367267 -2369884 -2936480 -3012681 -1846895 -477951
39299 -477951 -246116 -938471 -1164824 -67801 1752351 2864993 2506388 1348890 433801
39290 433801 -338100 -1688726 -3138525 -3230603 -1872661 -809540 -1145377 -2063043 -2753830
39281 -2753830 -3685231 -4779852 -4365474 -1701992 1136594 1895780 1255211 1281401 2131489
39272 2131489 2620375 2946861 4267115 6215827 7341286 7543715 7660128 7066235 4336112
39263 4336112 180027 -2900280 -4002991 -4320461 -4144937 -2324655 642682 2000668
39255 2000668 602730 -1186318 -1131944 -364543 -920256 -2009443 -1340846 893647 1973373
39246 1973373 460655 -1988251 -2980412 -2179736 -1243433 -1688046 -3185400 -3873083 -2525407
39237 -2525407 -303275 475178 -567205 -1268083 -56844 1754818 2126504 1564600 2344269
39228 2344269 4894022 6930981 6518488 4431343 2799329 2467335 2481577 1604007 -263830
39219 -263830 -1865074 -1585521 864267 3649255 4399957 2890957 1314647 1361165 2003739
39210 2003739 1321626 -210073 -102845 2290117 4283805 3449051 1133881 387380 1260707
39201 1260707 884972 -1559140 -2925269 -770387 2463731 2576466 -499435 -3025523
39193 -3025523 -3176617 -3033102 -4249886 -5086399 -3649801 -1524598 -1451971 -2843923 -2524342
39184 -2524342 465026 3432426 3730899 1781793 -215719 -872968 -120693 1400282 2456390
39175 2456390 1854325 19360 -920311 287507 2043321 1709572 -992090 -3655639 -4214157
39166 -4214157 -3080655 -1957122 -1571548 -1357594 -805145 -198347 57599 240913 1072103
39157 1072103 2822770 4954449 6648329 7402243 6982228 5250887 2658797 682296
39149 682296 758046 2390373 3225461 1798305 -490434 -1186413 -53837 841955 189384
39140 189384 -1023075 -1411140 -1092665 -792260 -376262 433729 838310 -55213 -1567008
39131 -1567008 -2234989 -1944868 -1757340 -1760080 -809856 1259621 2816740 2616442 1550196
39122 1550196 1271664 2040702 2946500 3537020 4098772 4665742 4763328 4140136 3123456
39113 3123456 2219118 1669347 1270671 502854 -759369 -1585202 -840088 898979 1262013
39104 1262013 -1136085 -4531143 -5845326 -4377705 -2341281 -1644737 -1572212 -469861 1295910
39095 1295910 1554986 -437686 -2341206 -1345290 2116490 4695351 4354639 2693288 2079699
39086 2079699 2065958 730173 -1344140 -1347815 1171038 2927920 1528909 -934978 -999830
39077 -999830 1279421 3017368 2858591 1946698 1128972 -18416 -1271068 -1434371 -570864
39068 -570864 -367296 -1384518 -1841307 -315787 1866622 2327662 715444 -1220867 -2032841
39059 -2032841 -1886295 -1702088 -1875943 -1997583 -1554438 -792033 -540712 -841208 -363503
39050 -363503 1817092 4331304 4867040 3342552 2064029 2368365 2832708 1640856 -799641
39041 -799641 -2721140 -3242480 -2550543 -896558 1238225 2731247 2891705 2445422 2381821
39032 2381821 2451445 1945099 1239617 1136413 1215388 494581 -570608 -600186 117573 -406304
39022 -406304 -2518672 -3430067 -644676 4246749 7102549 6263524 4246784 4069611 5537183
39013 5537183 6264950 5229457 3649859 2682393 2011409 1169233 701710 1014908 1255589
39004 1255589 709416 487133 2144892 4948680 6265421 4858667 2239299 356780
38996 356780 -517742 -912806 -612079 820424 2771832 3911550 3484365 1803345 1905
38987 1905 -418577 1302761 4012780 5452462 4768201 3307260 2460467 1957779 1092680
38978 1092680 338161 569198 1673027 3040293 4410754 5109503 3749583 328914 -2486428
38969 -2486428 -2156817 365357 2064094 2072697 2228597 3664780 5245552 5733479 5401286
38960 5401286 4913590 4429220 4373119 5311910 6411952 5781893 3136664 464362 -726981
38951 -726981 -1040288 -1172057 -329378 1838689 3610113 3515791 2909453 3990601 6227303
38942 6227303 7102031 5881071 4232241 3232397 2261100 1289251 1809970 4312781 6732934
38933 6732934 6974705 5703709 5008121 5134938 4317704 1605116 -1753268 -4005691 -4721426
38924 -4721426 -4406317 -3301536 -1402148 811429 2484775 3194313 3144522 2607915 1667684
38915 1667684 615712 129101 671767 1837275 2547309 1956820 178834 -1729405 -2459497
38906 -2459497 -1427674 635651 2157016 2069290 738633 -611714 -1363015 -2092378 -3538083
38897 -3538083 -5210965 -5512383 -3504073 -296456 1879536 2085616 1567404 1850701 2605970
38888 2605970 2289406 545594 -1223898 -1795481 -1458147 -1030888 -695237 -469640 -786311
38879 -786311 -1684800 -2307582 -2192801 -2254972 -3357549 -4679569 -4817013 -3869734 -2997703
38870 -2997703 -2469592 -1770928 -1174728 -1314834 -1452144 -304183 1327044 1094613 -1205841
38861 -1205841 -2872961 -2200943 -788088 -478210 -277862 1480672 3644698 3608744 1316290
38852 1316290 -718977 -1146405 -1138229 -1808689 -2440021 -2026964 -1011375 -548883 -960748
38843 -960748 -1593089 -1666280 -927160 130316 670238 549296 686956 1861958 3557436
38834 3557436 4672062 4845519 4324635 3274494 2220041 2213320 3159790 3017279 605737
38825 605737 -1693404 -608404 3072322 5175469 3946722 1982608 1510381 1133783 -801938
38816 -801938 -2585641 -1687362 1066052 2765132 2531115 1596595 405031 -1360674 -2492672
38807 -2492672 -1180995 1676939 2965899 1675996 199583 584008 1850987 2064087
38799 2064087 989666 -486478 -1794662 -2292473 -1090213 1347427 2832906 2132047
38791 2132047 805832 939269 2182016 2706363 2210889 2115179 3148574 4394127 4651245
38782 4651245 3469333 1004751 -1880220 -3497049 -2624228 -103152 1822161 1868627 664704
38773 664704 -522772 -1121459 -1349575 -1723973 -2382197 -2423218 -544847 2895461 5386041
38764 5386041 5120578 3460558 2834736 3039228 1959751 -508327 -2169732 -2398667 -3144696
38755 -3144696 -4992538 -5343514 -2534260 882789 1617548 385276 188162 1309805 1369010
38746 1369010 -268871 -1498654 -1074654 -249868 -193362 -290949 159781 727696 1149754
38737 1149754 1877562 2565593 2038917 604961 250460 1464070 2115167 944377 -131048
38728 -131048 772794 2056169 1021441 -1750507 -3309727 -2793280 -2013710 -1867832 -1127288
38719 -1127288 781265 2441208 2772795 2561277 2724767 2952043 3029685 3637768 4605847
38710 4605847 4192960 1714479 -665070 -723663 414691 -13579 -1915087 -2186140 586836
38701 586836 3694728 3868754 1618192 251957 1360922 3129443 3229647 1833831 957022
38692 957022 1699621 3159706 3839723 3291076 2234133 1571985 1494132 1335513 357613
38683 357613 -1098030 -1543235 -21696 2399032 3717518 3520709 3256986 3776953 4053621
38674 4053621 3136739 1946759 1745983 1927364 1078923 -442892 -981400 -372916 -202372
38665 -202372 -1035423 -1385424 -105140 1919139 3317511 3926377 3943843 2908145 845269
38656 845269 -778056 -756645 62312 195873 38073 1244939 3822226 5504292 4463755
38647 4463755 1568577 -597590 -457409 1120697 1908032 788505 -986690 -1503537 -940741
38638 -940741 -1352750 -3320189 -4494614 -2796997 340904 1894038 1530610 1643846 3307283
38629 3307283 4666928 3951258 1941164 369936 -415737 -874522 -753086 214449 973107
38620 973107 288542 -1057250 -899702 1188293 2861188 1985239 -233811 -465991 2364771
38611 2364771 5241247 4606965 1043210 -1260473 96509 2714305 2959878 887569
38603 887569 -586543 -468740 -700825 -2152783 -2682538 -743539 1548075 1356893 -451723
38594 -451723 -635696 1397639 2849337 2010464 644129 760602 1347908 175990 -2621141
38585 -2621141 -4832265 -5290153 -4730048 -3821176 -2324563 -477948 578115 496113 437026
38576 437026 1228643 2069907 2118449 2144347 3128397 4152189 3557919 1819563 1263309 2741413
38566 2741413 4417043 4424365 3120722 1886369 1120816 495264 90071 147867 413191
38557 413191 545024 482773 -105915 -1639407 -3285016 -3258924 -1406063 118223 34836
38548 34836 58408 1992319 4395296 4632343 3010011 2020798 2227701 1937789 635326
38539 635326 -458850 -1354860 -3480127 -6246302 -6780943 -4397244 -2259971 -2791858 -4111632
38530 -4111632 -3216691 -474203 1475166 1629669 1094654 859620 1193069 2242505 3443960
38521 3443960 3378902 1807308 554032 767474 951924 -250329 -1121812 589026 3634293
38512 3634293 4888691 4051793 3415278 3482655 2463703 335559 -259570 1740616 3806639
38503 3806639 3571532 1998469 1078150 600502 -725720 -2538984 -3310558 -2650990 -1442220
38494 -1442220 -341380 475656 754169 662099 1257291 3118477 4921612 4742626 2691994
38485 2691994 1004754 1231509 2303664 2012386 -26739 -1649042 -682611 2170139 3759939
38476 3759939 2046717 -1516615 -3798210 -3536593 -2117354 -1282584 -1325776 -1511338 -1110566
38467 -1110566 163575 1834069 2721060 2246097 1570559 2267599 3894783 4320420 2754799
38458 2754799 987058 948152 2282667 3165682 2561295 854855 -940674 -1760030 -870846
38449 -870846 1481302 4015680 5382438 4993196 3023581 310852 -1775208 -2327048 -1986787
38440 -1986787 -2161837 -2995877 -3141733 -1829299 -78299 639215 89216 -767170 -765710
38431 -765710 667289 2855636 3996943 2977845 969327 -40667 -42875 -573822 -1633036
38422 -1633036 -1411075 423745 1726105 1252647 574254 1104177 1668476 1107392 1004253
38413 1004253 3056688 5445653 5024901 2194395 358692 826467 1400929 368825 -1027257
38404 -1027257 -1030222 73129 1016543 1382807 1211765 225715 -1405859 -2586140 -2504753
38395 -2504753 -1473114 22761 1962259 3793815 4135469 2637346 1081100 1180473 1997450
38386 1997450 1217924 -1224135 -2627069 -1168588 1480069 2404374 1344213 675841 1666114
38377 1666114 2551377 1159592 -1872455 -3829518 -3183992 -789423 1781197 3600356
38369 3600356 4139487 3207023 1563998 416680 -113666 -909230 -1902382 -1535283 1054075
38360 1054075 4308534 5608295 3913174 733468 -1061343 339906 3477878 4346096
38352 4346096 1000613 -3063447 -2698685 1730331 4307297 1752914 -1964612 -1611660
38344 -1611660 1865237 3396661 1267963 -1379341 -1708425 -220160 1417543 2589095
38336 2589095 3303071 3674752 4107649 4478158 3618364 1301025 -246712 883936 2947267
38327 2947267 2778980 680673 -116934 1395996 2845703 2760718 2531061 3173767 3413101
38318 3413101 2421433 1648924 2227853 2932765 2499660 1939321 2659388 3855035 3602929
38309 3602929 1551415 -850382 -2039695 -1447817 178936 1116425 405809 -639000 -119106
38300 -119106 1422107 1786107 948473 1379205 3935485 6308061 6666142 6000998 5385183
38291 5385183 3833815 952224 -976867 -127251 1787341 2244451 1941378 3252834 5979997
38282 5979997 7519878 6605283 4479498 2855150 2654569 4065743 5963573 6053016 3430049
38273 3430049 198826 -1151283 -884874 -702991 -652430 294058 1703868 2364898 2691064
38264 2691064 3739117 4433324 2690557 -848635 -3091548 -2742574 -1652393 -1500069 -1659366
38255 -1659366 -1102544 -155767 618986 1431587 2182681 1928044 354369 -1409134 -2133300
38246 -2133300 -1637739 -318664 1275853 2218070 1903203 1187568 1409401 2119722 1453783
38237 1453783 -870804 -2711581 -2361264 -624419 800250 1430127 1439082 523589 -1185123
38228 -1185123 -2184718 -1265582 482375 989353 326948 760284 3217570 5296677 4138438
38219 4138438 497893 -1825345 -786788 1462643 1957408 1070996 1253510 2683486 3065379
38210 3065379 1798188 1214993 2533159 3449043 1750830 -1010154 -1926389 -1065103 -728478
38201 -728478 -1608434 -2360520 -2242642 -1698139 -879755 166627 497954 -366480 -925951
38192 -925951 126524 1228948 158388 -2123707 -3032516 -2895812 -4140743 -6292432 -6006624
38183 -6006624 -2599346 593733 1481203 1870199 3293758 4045265 2603904 653786 107893
38174 107893 -46074 -1292210 -2536366 -2292667 -1657584 -2158966 -2584684 -1074364 1197189
38165 1197189 1709267 894972 1429030 3711144 5243726 4592675 3117803 2246190 1484337
38156 1484337 59917 -1367146 -1813927 -1600863 -1729364 -2184192 -1819930 -46791 1914067
38147 1914067 2142360 600228 -258303 1555541 4701864 6174346 5374391 4421141 4433449
38138 4433449 4093324 2621191 1531009 1977212 2609842 1831438 333467 -388398 -371004
38129 -371004 -271828 264132 1493427 2340811 2127561 2094700 3361109 4784638 4698901 3346971
38119 3346971 1785165 -31010 -2120602 -3133782 -2279249 -988510 -598025 -232194 857009
38110 857009 1183510 -31821 -375773 1844561 3670745 1697247 -1871348 -2209078 624288
38101 624288 2448327 2197017 2585848 3884376 3330054 1471119 2603977 6969297 8755582
38092 8755582 4901702 243653 70521 2571122 3246258 2562247 3869996 6702397 7656075
38083 7656075 6260970 5010228 4628292 3868334 3248231 4468631 6300149 5398962 1752002
38074 1752002 -495767 1352219 5210005 7552898 7465507 6184905 4787180 3671241
38066 3671241 2988353 2657229 2715568 3644277 5287452 5968303 4342646 1708440 515333
38057 515333 906593 996315 413059 866800 2755834 3981155 3275860 2330786 3090350
38048 3090350 4851340 5675873 5115483 3913116 2440625 1203887 1595688 4029431 6210363
38039 6210363 5587063 3122878 2144732 3250698 3046368 -786678 -5442203 -6323488 -3248132
38030 -3248132 -554275 -971290 -2180849 -842136 2224278 3424083 1926425 781180
38022 781180 2111449 3936138 3304929 649702 -1077241 -567870 661307 912137 219483
38013 219483 -533309 -910866 -1004970 -1295394 -2507238 -4479616 -5264792 -2925125 1438409
38004 1438409 4125228 3159651 723145 67443 1269153 1757350 309935 -1523762 -2027139
37995 -2027139 -1410553 -632505 213709 1132226 1128101 -419703 -1984550 -1484311 398245
37986 398245 615004 -1874703 -4251118 -3793088 -1805480 -1299698 -2033789 -934523 2673542
37977 2673542 5509116 5086523 3257897 3094775 4330377 4414893 2904537 2047639 3158789
37968 3158789 4824987 5304447 4887590 4868164 5315238 5066089 3613206 2056003 1805834
37959 1805834 2632906 2648445 685815 -1829495 -2463907 -1083834 -70575 -815824 -1739451
37950 -1739451 -951490 692377 1030629 73752 -122964 1228613 2523553 2239256 891169
37941 891169 -31725 109115 886171 1568760 1669560 1253941 838151 631109 231780 -340997
37931 -340997 30091 2143725 4833150 5951789 4784538 2414487 82135 -1542153
37923 -1542153 -1815255 -440919 1568623 2562799 2075637 1025264 244699 -148698 -216159
37914 -216159 -155160 -399973 -681437 221623 2408482 3694203 2559852 1075216 2112852
37905 2112852 4585593 4953377 3094692 2557824 4433547 5379234 3376134 1283104 2105886
37896 2105886 4345519 5178182 5171955 6214744 7204257 5834959 3136529 2305771 3866605
37887 3866605 5507653 6054425 6177851 5697672 3795931 1864105 2568876 5560625 7304403
37878 7304403 6006927 3889338 3550330 4540459 4739730 3250398 974604 -198878 1561374
37869 1561374 6104072 10354528 11311637 9930609 9613183 10937453 11078599 9048251 7934820
37860 7934820 10256722 14150654 16345208 16395709 15672093 14450899 12664478 11692259 12570564
37851 12570564 13726006 13216816 12180267 13280437 16483370 19252194 20615211 22117105
37843 22117105 24479410 26102241 25831060 25011676 25497517 27144432 28626254 29742360
37835 29742360 31560245 34613349 38037278 40699286 42653266 45050194 48620837 52715027
37827 52715027 56274494 59291724 62353141 64998826 65984417 65392519 64848638 64997563 64511798
37818 64511798 62706753 61372367 62298062 64321242 64731437 62625904 59083710 55046945
37810 55046945 51032791 47988862 46177220 43962126 40060329 36228904 34956343 35050866
37802 35050866 32860448 28012290 24386485 24397120 25663111 25068755 23185661 22334136 22507268
37793 22507268 21894067 20111129 18459492 17659084 17243840 16691827 15682495 13856044 11572988
37784 11572988 10107395 9908431 9754325 8979439 9163337 11623163 14344800 13968263 10522390
37775 10522390 7691054 8032607 10108436 11126385 10566859 9852911 9550363 8518204 5869194
37766 5869194 2740590 1403884 2692654 4987812 6250380 6425816 6751064 7202129 6536094
37757 6536094 5046161 4933943 6797669 7922385 5908035 2236736 26333 -286574
37749 -286574 -424456 -559344 790593 3436636 5060994 4477057 2944896 1846338 1306667
37740 1306667 1503669 2947832 4735796 4767548 2682886 679235 521092 1592318 2766689
37731 2766689 4170284 5859385 6585494 5385494 3105547 1145901 -93340 -570456
37723 -570456 153854 1914201 3432627 3786023 3230438 2039157 187862 -1235816 -499127
37714 -499127 1896812 3143936 2241197 1640375 3062400 4429266 3394764 1311048 614670
37705 614670 557976 -867908 -2636674 -2361213 -928065 -1103788 -2298660 -1370052 1494571
37696 1494571 2604070 1138467 706861 2896302 4064969 1300571 -2516293 -3101878
37688 -3101878 -1118790 -347833 -1699548 -2873254 -2635844 -1803510 -637331 1425280 3591801
37679 3591801 4123401 3065475 2215772 2256837 2092357 1209214 619770 1040280 1843660
37670 1843660 2200906 1860576 716676 -938722 -1839557 -1126536 -188912 -1057645 -2813497
37661 -2813497 -2076678 2019634 5738963 5326217 1927506 -137610 1048662 3329089
37653 3329089 3988738 2850847 1473310 838899 743173 730066 806893 1293909 2237731 2997555
37643 2997555 2575369 654442 -1757648 -3057309 -2484860 -703814 974701 1779117 1976096
37634 1976096 2305088 2856801 2695355 1107731 -844156 -1018145 1055302 3156114 3155344
37625 3155344 1910465 1789642 2882753 2902519 1081961 -301991 505664 1883717 1540918
37616 1540918 298496 502305 1783698 1608356 -169981 -709170 1148574 2873082 2453573
37607 2453573 1631081 2625580 4135716 3612511 1805879 1636870 3345362 4187865 2979338
37598 2979338 1778361 2434210 4165077 5448566 5923940 5390803 3189329 -60391 -2019479
37589 -2019479 -1440923 107391 708888 768629 1646937 2979943 3238411 2159969 926172
37580 926172 416509 706216 1802454 3472959 4677182 4456383 3201856 2034638 1304045
37571 1304045 737431 560079 1112879 1604731 713541 -1368176 -2713310 -1969226 -50066
37562 -50066 1035485 555402 -342248 -346802 201801 -215577 -1949689 -3175258 -2097498
37553 -2097498 460366 2035405 1777041 1004817 526552 -427510 -1940208 -2370121 -964713
37544 -964713 463333 226728 -580844 -118796 1089343 1474379 1560931 2979519 5087199
37535 5087199 5565671 4251132 3455517 4174653 4816578 4429972 4403262 5579318 6084903
37526 6084903 3970281 378604 -1910591 -2082479 -1593108 -1521613 -1435860 -823909 -141756
37517 -141756 -45545 -511513 -1124463 -1636274 -1844335 -1353912 -37551 1321854 1454659
37508 1454659 69949 -1495694 -1731628 -813729 -158815 -261529 -194441 532924 1052101
37499 1052101 710026 170998 87218 122906 370507 2030182 5017728 6528781 4283132
37490 4283132 45870 -2613421 -3227590 -4263787 -6427939 -7220477 -4656229 126816
37482 126816 4592164 6933808 6124911 2407478 -1466150 -2001149 754697 2748766 983302
37473 983302 -2880111 -5223297 -4836188 -3039731 -1154690 327151 1144865 1423977 1719379
37464 1719379 1916632 1064588 -867082 -2356809 -2497176 -2488418 -3729740 -5519277 -5921724
37455 -5921724 -4146821 -1169595 1200954 1406793 -389822 -1493500 766933 4861519
37447 4861519 5783025 1537363 -3381747 -3439887 672251 3098676 404996 -4657712 -7076566
37438 -7076566 -5135898 -1535058 -203715 -2375299 -5365080 -5569897 -2845404 -646701
37430 -646701 -1232969 -2575088 -1460519 2040889 5170796 6180678 5302279 3155207 496929
37421 496929 -1241409 -1417599 -1517142 -2936533 -4331232 -3592090 -1546247 -763347 -1266597
37412 -1266597 -769190 881169 1147517 -569144 -1360355 514810 2538361 1804608 -454426
37403 -454426 -861644 1222265 3470330 4256479 3993935 3252377 1974575 743415 755409
37394 755409 1902832 2463007 1517924 465339 1120350 3165186 4630279 4440654 3266294
37385 3266294 1985426 677322 -497090 -772316 -14771 638269 492501 514375 1298437
37376 1298437 1042845 -1988971 -5649721 -5711419 -1818764 1611791 1519863 -84422 -390030
37367 -390030 -418500 -2330422 -4696537 -4292157 -1221483 1422748 2202126 2107021 1236447
37358 1236447 -1534424 -5357043 -7334080 -6354687 -4183214 -2248616 -243892 1569891
37350 1569891 1845025 934913 1153983 2921664 3547712 1499917 -894699 -1068856 -71497
37341 -71497 -371909 -1773133 -2201203 -1292679 -600231 -900018 -1526233 -2019548 -2543972 -2844658
37331 -2844658 -2373262 -1407207 -847470 -993461 -1393008 -1605772 -1355635 -420593 831132
37322 831132 1341825 606723 -534376 -1097206 -1292906 -1835566 -2573619 -2812342 -2575004
37313 -2575004 -2581330 -3106971 -3505894 -2816359 -651695 2181382 3959876 3592692 1899945
37304 1899945 583598 126539 -149675 -270031 337877 946472 -10755 -1898334 -1751753
37295 -1751753 1406198 4391002 4010754 1550424 688973 2257754 3733339 3270932 1621033
37286 1621033 142037 -733132 -790500 131167 1071433 454433 -1619613 -2960207 -1961919
37277 -1961919 289334 1337949 157043 -1967187 -2985182 -2123587 -493783 265915
37269 265915 -63557 -96928 1193805 2995318 3690679 2788573 1111621 -401839 -1262333
37260 -1262333 -1237164 -472827 458947 1317935 2557453 4199462 4993958 3848920 1757830
37251 1757830 1040873 2577068 4741982 5260622 3430186 452104 -1831062 -2478324 -2158592
37242 -2158592 -2244757 -3014573 -3313211 -2423673 -1382493 -1443244 -1943684 -1113315 1198587
37233 1198587 3005577 2624056 537312 -1506132 -2337960 -1921376 -891328 -169825 -550032
37224 -550032 -1975760 -3275454 -3067625 -1161226 1085105 2117939 1963796 2152247 3477069
37215 3477069 4526196 3490140 976343 -601971 -544343 -829286 -2726423 -4393119 -3554888
37206 -3554888 -1151070 -47746 -787854 -1087510 274363 1439129 429921 -1591015
37198 -1591015 -1737837 597118 2844839 2603913 601986 -587123 -80871 482597 -182407
37189 -182407 -891797 33276 1786398 2011136 440955 -466702 1041346 3786570 5592143
37180 5592143 5760017 4682720 2635978 261464 -1084760 -863481 -198530 -43905 265059
37171 265059 1385917 2356887 2297638 2384381 4063168 6307862 6921955 5913992 5266771
37162 5266771 5721422 6113301 5773139 5240405 4470119 2726545 721105 468530 2106889
37153 2106889 3053060 1633610 -342924 -335962 1072688 1162891 -766481 -2319764 -1238264
37144 -1238264 1919269 4912248 6413605 6562146 5772447 4346826 3164122 3355481 4716687
37135 4716687 5582728 5200392 5121161 6772983 8559399 7532011 3775653 847103 1428178
37126 1428178 4624963 8129416 10798830 12187916 11884059 10695377 10377124 10765545 9523911
37117 9523911 6448150 5297161 8646158 13213729 13633085 9331566 4324151 1409272
37109 1409272 146548 -188012 560726 1641533 1807986 1743153 3081888 4927151 4500049
37100 4500049 1620187 -606903 -263779 1116160 1566503 1261239 1160148 1500779 2432623
37091 2432623 3915948 4536948 2904475 594921 887671 4011842 6631852 6753542 5897853
37082 5897853 5415217 4192157 1698260 -16387 495692 1735710 2137638 2462594 3196716
37073 3196716 2597211 23513 -1609376 95296 2818343 2824037 590861 -432161 682218
37064 682218 1783042 1844566 2179845 3515315 4844406 5412876 5459228 4920190 3558441
37055 3558441 2338200 2610969 3954735 4695278 4413261 4063007 3848586 3020216 1738886
37046 1738886 1134866 1311162 1059779 -152094 -1417882 -1830681 -1392502 -430753 657252
37037 657252 1120065 534703 -270304 -62550 1165297 2367208 2894710 2861870 2635184
37028 2635184 2874332 4194092 5730926 5309934 2518233 156710 593976 2126014 1686713
37019 1686713 48565 851311 4624618 7374320 6004590 2180204 -486934 -680817
37011 -680817 570689 2032086 2866884 2518009 1297308 179115 -562434 -1301005 -1471120
37002 -1471120 58323 2510104 3319171 1740011 126026 231978 485840 -1104498 -3350292
36993 -3350292 -3750266 -2537120 -1968946 -2296959 -1458122 1084344 2952733 2153482 -324426
36984 -324426 -2202290 -2504101 -1435153 692163 2965830 3535494 1533893 -1185616 -1814102
36975 -1814102 55623 2171162 2633271 1745300 691845 -68691 -376147 335111 2137153
36966 2137153 3772962 3850617 2418933 451814 -1635697 -3848474 -5544427 -5925359 -5416459
36957 -5416459 -5185545 -5296458 -4685386 -3055739 -1405571 -469181 -61660 -242725 -1500214
36948 -1500214 -3165495 -3283180 -1102707 1545683 2412217 1363937 -120452 -958679 -1072424
36939 -1072424 -963835 -1496186 -3094370 -4529373 -3850536 -1311909 302679 -522560 -1670574
36930 -1670574 -528147 2098482 3371768 2586257 1564666 1492187 1656976 1236430 417024
36921 417024 -345401 -739783 -402488 497135 950891 588218 605077 1755291 2535727 1355251
36911 1355251 -543352 -787738 263262 172320 -1376913 -1999862 -435553 1894877 3660775
36902 3660775 5172170 6341651 5818283 3440890 1240185 574499 279219 -892953 -1914501
36893 -1914501 -1295764 252411 798015 -97657 -1166834 -1333193 -715700 -225855 -802707
36884 -802707 -2398021 -3433685 -2305005 333022 2118720 2108233 1720573 2125161 2606929
36875 2606929 2354421 1932244 1849496 1509116 839624 1081963 2456060 2971908 1431059
36866 1431059 -220623 186484 1395308 783014 -1004555 -681447 2507896 5234184 4463462
36857 4463462 1128146 -1628675 -2209847 -1401484 -583811 -345593 -509963 -689309 -671229
36848 -671229 -422919 125759 969317 1677426 1774968 1637258 2122816 2965223 2747310 1259078
36838 1259078 510968 2002368 4114926 4096056 2005124 655302 1754248 4052838 5563738
36829 5563738 5749589 4860912 2767982 -373953 -3252914 -4352194 -3494013 -1840414 -643377
36820 -643377 -388159 -852656 -1553070 -2091863 -2153433 -1329814 529117 2530772 3017475
36811 3017475 1429552 -552477 -739997 803936 1725197 268056 -2570183 -4112920
36803 -4112920 -2898465 -390959 198487 -2690968 -6551927 -6813577 -2081139 3718540
36795 3718540 5804580 4159706 2682440 3395705 4308839 3503710 2422060 3253551 5049090
36786 5049090 4895732 2166324 -683054 -1566137 -1145201 -1195158 -1946779 -2095246 -989585
36777 -989585 133082 -533829 -3064707 -5365734 -5360765 -3188029 -614698 1260334 2571651
36768 2571651 3181198 2345806 496281 -316346 995328 2782521 2947577 1939582 1672498
36759 1672498 2273293 2161280 1175992 1198689 3034826 4752790 4249457 1937477 -300603
36750 -300603 -1548141 -1948401 -1445743 12892 1543055 1946545 1092463 -205203 -1266384
36741 -1266384 -1641627 -794611 1099487 2523028 2163509 851157 540107 1448987 1775826
36732 1775826 512778 -1015493 -1107249 82678 1141477 1277383 666604 -349606 -1394955
36723 -1394955 -1789747 -1116234 30846 574615 259961 -111104 172630 787088 826247
36714 826247 35289 -712408 -371365 958730 2087240 2232034 1945032 2148220 2766366
36705 2766366 2985534 2528226 1894569 1458020 997741 110143 -1333940 -2923058 -3627394
36696 -3627394 -2653393 -854969 -301554 -1607472 -2892755 -2625572 -2026124 -2699675 -3348834
36687 -3348834 -1732965 966599 1242337 -1282562 -3128778 -2386481 -1187145 -1373903 -1384371
36678 -1384371 240020 1439732 -216066 -3254396 -4352937 -3170513 -2158607 -2527863
36670 -2527863 -3076656 -2527927 -962774 653508 1040342 -375758 -2023382 -1415834 1155302
36661 1155302 2533023 1654440 1412562 3353900 4240697 1438849 -1845694 -1477898 472887
36652 472887 -675197 -3632768 -2922784 1480577 3485226 774611 -1512015 639390
36644 639390 3897235 3378844 -130304 -2602232 -2827026 -2281411 -1565505 -441250 323522
36635 323522 -82238 -972012 -1380194 -1373752 -1039245 -133025 451991 -554226 -1789238 -228226
36625 -228226 3699654 5592989 3291011 -191556 -1884803 -2831061 -4163018 -3589853 346119
36616 346119 4124243 3734398 615090 -1038462 -462537 265326 602471 997827 167553
36607 167553 -2538729 -4030972 -1542850 1969655 1692843 -1216104 -1416579 1719293 3206261
36598 3206261 900192 -1260730 -161903 1752884 1215230 -786804 -1574907 -1034984 -443549
36589 -443549 299234 1524548 1896137 201974 -2273768 -3195236 -2067702 -250555 1078394
36580 1078394 1895978 2911481 4682588 6531946 6587536 4093092 1197250 711289 2481313
36571 2481313 3972273 4003497 3509320 2912440 1553605 -135680 -660662 39205 751983
36562 751983 1682220 3903131 6024928 5135473 1823906 353592 2433538 4727139 4521925
36553 4521925 3932408 5627719 7897685 7590679 5364664 4197460 4459621 4202811 3197217
36544 3197217 3121633 4259010 5076641 4867748 4297975 3706971 3186816 3746146 5893858
36535 5893858 7599395 6373600 3140334 1286082 1843237 2488173 1775767 1413084 3062062
36526 3062062 5320715 5696827 4024696 2165345 1295416 1117287 1228335 1745584 2497059
36517 2497059 2678666 1780672 418022 -207684 288194 895155 431369 -691373 -633472
36508 -633472 1479269 3965098 4262580 1939350 -878805 -2068220 -1618237 -994743 -1237861
36499 -1237861 -2203284 -3144317 -3379486 -2547221 -813339 993875 1843007 1464534 759609
36490 759609 900529 2008813 3090699 3343854 3011706 2691575 2403826 1886866 1308421
36481 1308421 992575 855688 875292 1650070 3425084 4823753 3864588 494772 -2901515
36472 -2901515 -3905241 -2329581 -10155 955058 -183466 -2100092 -2334536 84890
36464 84890 3085764 3765513 1986558 244824 -41751 -120241 -1156182 -2004856 -1223420
36455 -1223420 218175 167664 -1486635 -2631675 -1829905 57733 1328078 1411947 1013492
36446 1013492 971565 1434717 1924027 1897683 1158230 -195363 -1855325 -3173678 -3533463
36437 -3533463 -3414776 -4393881 -7008318 -9172356 -8244363 -4533309 -1097658 67319 -140495
36428 -140495 -255005 -338312 -806106 -1074929 -809728 -989795 -2163337 -2980917 -2237610 -1228747
36418 -1228747 -1992800 -3933965 -4435842 -2643633 -458006 492984 801087 1423835 1657853
36409 1657853 305372 -2161342 -3973231 -4151017 -3083432 -1339584 766860 2293812
36401 2293812 1847645 -371795 -1807157 -434452 2101510 2296298 -122321 -1394643
36393 -1394643 793273 3551543 2916255 -190436 -1490352 104175 1363987 380303
36385 380303 -654253 262771 1392102 360903 -1858793 -2838006 -2612382 -2813294 -3233197
36376 -3233197 -2310367 -427125 207578 -925832 -1727372 -586291 1513482 2698949 2562669
36367 2562669 2019341 1744792 1505106 740185 -475559 -1120690 -279061 1434388 2382195
36358 2382195 2181078 2257453 3398443 4183244 3179632 1428691 967993 1779679 2172077
36349 2172077 1651952 1372573 1901554 2510291 2783390 3121290 3398436 2847831 1685762
36340 1685762 1245497 1962795 2693472 2597974 2240133 2106203 1525967 132186 -876676
36331 -876676 -309819 1003566 1215403 55026 -957176 -783154 7969 652062 1423813
36322 1423813 2675306 3603424 3168785 1842502 1153876 1440565 1310064 -229488 -2293499
36313 -2293499 -3488470 -3607341 -2985170 -1381836 1010650 2494445 1789097 424905 989558
36304 989558 3190348 4058766 2295873 -56424 -902426 -559914 110351 1593115 4087446
36295 4087446 5959172 5717750 4152021 2851819 1879249 498646 -935840 -1381586 -512541
36286 -512541 1376848 3762294 5369070 4904718 3279974 3078779 4621359 5027062 2901685
36277 2901685 1129173 2410052 4698289 4455268 2273231 1396407 2236027 2473474 1573504
36268 1573504 987506 519347 -1160478 -2648101 -1050895 2557568 3586657 872019
36260 872019 -1337022 -5974 2321963 2136114 210510 -583109 285280 1696847 3583698
36251 3583698 5973974 7271473 6385000 5098064 5641689 7180451 7311911 5949181 5016564
36242 5016564 5043323 4809677 4165870 4622628 6697899 8610488 8336582 5885352 3164158
36233 3164158 2259856 3742058 5951877 6278074 3936118 1124850 594945 2462662 4348656
36224 4348656 4328905 2715043 1034848 304968 605504 1631816 3031777 4204802 4223037
36215 4223037 2583753 220084 -972293 -267850 887087 893922 258354 493780 1498965
36206 1498965 1947995 1952256 2986007 4865715 5262564 3233871 1080445 1184268 2651197
36197 2651197 2817358 996722 -967672 -1382894 -626480 -481451 -2103969 -4416786 -4668496
36188 -4668496 -1557067 2415142 3354512 910184 -1200700 -208314 2380763 3687686
36180 3687686 3550728 3756758 4672701 4917197 3874176 2680529 2564896 3164644 2708041
36171 2708041 -112351 -4068222 -5829505 -3831321 -1032451 -1488005 -4463288 -5128988
36163 -5128988 -1620665 2259409 2910612 1815189 2039951 3154014 2949008 1717067 1279716
36154 1279716 1621257 1824382 2568353 4292517 4730622 2087480 -1030468 -1075455 599505
$$ [...]
##END NTUPLES=NMR SPECTRUM
##END=
