##TITLE=31Pdec_SR69_oil
 CDCl3, 24 sc
 7.07.2021
##JCAMPDX= 6.0         $$ Bruker NMR JCAMP-DX V2.0
##DATA TYPE= NMR SPECTRUM
##DATA CLASS= NTUPLES
##ORIGIN= UXNMR, Bruker Analytische Messtechnik GmbH
##OWNER= root
$$ XWIN-NMR		Version 3.5
$$ Wed Jul  7 13:43:35 2021 Russian Standard Time (UT+4h)  she@DPX200
##.OBSERVE FREQUENCY= 81.013821
##.OBSERVE NUCLEUS= ^31P
##.ACQUISITION MODE= SIMULTANEOUS
##.ACQUISITION SCHEME= undefined
##.AVERAGES= 24
##.DIGITISER RES= 16
##SPECTROMETER/DATA SYSTEM= spect
##.PULSE SEQUENCE= zgpg30
##.SOLVENT NAME= CDCl3
##.SHIFT REFERENCE= (INTERNAL, CDCl3, 0, 248.564)
##AUDIT TRAIL= $$ (NUMBER, WHEN, WHO, WHERE, WHAT)
$$ ##TITLE= Audit trail, XWIN-NMR		Version 3.5
$$ ##JCAMPDX= 5.01
$$ ##ORIGIN= Bruker BioSpin GmbH
$$ ##OWNER= she
$$ F:/spectra/data/she/nmr/P31/1/pdata/1/auditp.txt
$$ ##AUDIT TRAIL=  $$ (NUMBER, WHEN, WHO, WHERE, WHAT)
(   1,<2021-07-07 13:42:39.57 +0400>,<she>,<DPX200>,
      <created by zg, POWCHK disabled, PULCHK disabled
       configuration hash MD5:
       00 E9 B6 7A A2 85 ED C7 34 08 36 98 17 FE 4E 26
       data hash MD5: 32K
       1D 8A E6 05 7C 9C 05 CE A9 8B 61 E8 B1 D4 A0 64>)
(   2,<2021-07-07 13:42:41.98 +0400>,<she>,<DPX200>,
      <Start of raw data processing
       efp BC_mod = 2 LB = 1 FT_mod = 6 PKNL = 1 PHC0 = -7979.911 PHC1 = 693.0863 SI = 64K 
       data hash MD5: 64K
       A4 BF 64 51 1B 9F 88 31 6A 91 76 75 DF 7E 80 DD>)
(   3,<2021-07-07 13:43:00.28 +0400>,<she>,<DPX200>,
      <pk PHC0 = 25.34594 PHC1 = -39.80001 
       data hash MD5: 64K
       25 D4 D0 F7 92 00 D1 2D 71 2D E5 74 94 59 48 61>)
(   4,<2021-07-07 13:43:03.42 +0400>,<she>,<DPX200>,
      <abs ABSG = 5 
       data hash MD5: 64K
       09 57 47 EC AF 4F C1 8F 7B 1F EC B2 9C 6E 53 59>)
$$ ##END=
$$ 
$$ hash MD5
$$ D4 56 BF 5E 00 69 FD 80 67 CF E1 24 B0 D6 D4 14
##$RELAX= 
##$RELAX= 
##$RELAX= 
##$RELAX= 
##$RELAX= 
##$RELAX= 
##$RELAX= 
##$RELAX= 
$$ Bruker specific parameters
$$ --------------------------
##$DU= <F:/spectra>
##$EXPNO= 1
##$NAME= <P31>
##$PROCNO= 1
##$TYPE= <nmr>
##$USER= <she>
##$AMP= (0..31)
100 100 100 100 100 100 100 100 100 100 100 100 100 100 100 100 100 100 
100 100 100 100 100 100 100 100 100 100 100 100 100 100 
##$AQSEQ= 0
##$AQ_mod= 1
##$AUNM= <au_zg>
##$AUTOPOS= <>
##$BF1= 81.014009
##$BF2= 200.13
##$BF3= 200.13
##$BF4= 200.13
##$BF5= 200.13
##$BF6= 200.13
##$BF7= 200.13
##$BF8= 200.13
##$BYTORDA= 1
##$CFDGTYP= 0
##$CFRGTYP= 5
##$CHEMSTR= <none>
##$CNST= (0..31)
1 1 145 1 1 1 1 1 1 1 1 1 1 1 1 1 1 1 1 1 1 1 1 1 1 1 1 1 1 1 1 1 
##$CPDPRG= <waltz16>
##$CPDPRG1= <>
##$CPDPRG2= <waltz16>
##$CPDPRG3= <>
##$CPDPRG4= <mlev>
##$CPDPRG5= <mlev>
##$CPDPRG6= <mlev>
##$CPDPRG7= <mlev>
##$CPDPRG8= <mlev>
##$CPDPRGB= <>
##$CPDPRGT= <>
##$D= (0..31)
0 1 0 0 0 0 0 0 0 0 0 0.03 2e-05 3e-06 0 0 0 0 0 0 0 0 0 0 0 0 0 0 0 0 
0 0 
##$DATE= 1625650958
##$DBL= (0..7)
120 120 120 11 120 120 24 19 
##$DBP= (0..7)
150 150 150 150 150 150 150 150 
##$DBP07= 0
##$DBPNAM0= <>
##$DBPNAM1= <>
##$DBPNAM2= <>
$$ [...]
##$SUBNAM3= <"">
##$SUBNAM4= <"">
##$SUBNAM5= <"">
##$SUBNAM6= <"">
##$SUBNAM7= <"">
##$SUBNAM8= <"">
##$SUBNAM9= <"">
##$SW= 501.771253377433
##$SWIBOX= (0..15)
0 1 3 0 0 0 0 0 0 0 0 0 0 0 0 0 
##$SW_h= 40650.406504065
##$TD= 32768
##$TD0= 1
##$TE= 0
##$TE2= 300
##$TE3= 300
##$TEG= 300
##$TL= (0..7)
0 120 53 12 22 120 120 120 
##$TP= (0..7)
150 150 150 150 150 150 150 150 
##$TP07= 0
##$TPNAME0= <>
##$TPNAME1= <>
##$TPNAME2= <>
##$TPNAME3= <>
##$TPNAME4= <>
##$TPNAME5= <>
##$TPNAME6= <>
##$TPNAME7= <>
##$TPOAL= (0..7)
0.5 0.5 0.5 0.5 0.5 0.5 0.5 0.5 
##$TPOFFS= (0..7)
0 0 0 0 0 0 0 0 
##$TUNHIN= 0
##$TUNHOUT= 0
##$TUNXOUT= 0
##$USERA1= <user>
##$USERA2= <user>
##$USERA3= <user>
##$USERA4= <user>
##$USERA5= <user>
##$V9= 5
##$VALIST= <valist>
##$VCLIST= <CCCCCCCCCCCCCCC>
##$VD= 0
##$VDLIST= <DDDDDDDDDDDDDDD>
##$VPLIST= <PPPPPPPPPPPPPPP>
##$VTLIST= <TTTTTTTTTTTTTTT>
##$WBST= 1024
##$WBSW= 4
##$XGAIN= (0..3)
0 0 0 0 
##$XL= 0
##$YL= 0
##$YMAX_a= 3050
##$YMIN_a= -3273
##$ZGOPTNS= <>
##$ZL1= 120
##$ZL2= 120
##$ZL3= 120
##$ZL4= 120
##$ABSF1= 248.5645
##$ABSF2= -253.2056
##$ABSG= 5
##$ABSL= 3
##$ALPHA= 0
##$AQORDER= 0
##$ASSFAC= 0
##$ASSFACI= 0
##$ASSFACX= 0
##$ASSWID= 0
##$AUNMP= <proc_1d>
##$AZFE= 0.1
##$AZFW= 0.5
##$BCFW= 0
##$BC_mod= 2
##$BYTORDP= 0
##$COROFFS= 0
##$CY= -3
##$DATMOD= 1
##$DC= 0
##$DFILT= <>
##$DTYPP= 0
##$F1P= 0
##$F2P= 0
##$FCOR= 1
##$FTSIZE= 65536
##$FT_mod= 6
##$GAMMA= 0
##$GB= 0
##$INTBC= 1
##$INTSCL= 5.30512e-09
##$ISEN= 30
##$LB= 1
##$LEV0= 0
##$LPBIN= 0
##$MAXI= 10000
##$MC2= 0
##$MEAN= 0
##$ME_mod= 0
##$MI= 50
##$NCOEF= 0
##$NC_proc= -8
##$NLEV= 6
##$NOISF1= 182.463
##$NOISF2= 159.3651
##$NSP= 0
##$NTH_PI= 0
##$NZP= 0
##$OFFSET= 248.5645
##$PC= 4
##$PHC0= -7954.565
##$PHC1= 653.2863
##$PH_mod= 1
##$PKNL= yes
##$PPARMOD= 0
##$PSCAL= 0
##$PSIGN= 0
##$REVERSE= no
##$SF= 81.014009
##$SI= 65536
##$SIGF1= 159.3651
##$SIGF2= -187.1042
##$SINO= 113.3802
##$SIOLD= 16384
##$SREGLST= <1H.CDCl3>
##$SSB= 0
##$STSI= 65536
##$STSR= 0
##$SW_p= 40650.406504065
##$SYMM= 0
##$S_DEV= 0
##$TDeff= 32768
##$TDoff= 0
##$TI= <>
##$TILT= no
##$TM1= 0
##$TM2= 0
##$TOPLEV= 0
##$USERP1= <user>
##$USERP2= <user>
##$USERP3= <user>
##$USERP4= <user>
##$USERP5= <user>
##$WDW= 1
##$XDIM= 65536
##$YMAX_p= 480505797
##$YMIN_p= -19501792
$$ End of Bruker specific parameters
$$ ---------------------------------
##NTUPLES= NMR SPECTRUM
##VAR_NAME=  FREQUENCY,     SPECTRUM/REAL,   SPECTRUM/IMAG
##SYMBOL=    X,             R,               I
##VAR_TYPE=  INDEPENDENT,   DEPENDENT,       DEPENDENT
##VAR_FORM=  AFFN,          ASDF,            ASDF
##VAR_DIM=   65536,         65536,           65536
##UNITS=     HZ,            ARBITRARY UNITS, ARBITRARY UNITS
##FACTOR=    0.620285442955139, 1,           1
##FIRST=     20137.2065510759, 0,            0
##LAST=      -20513.1999529892, 0,           0
##MIN=       -20513.1999529892, -19501792,   0
##MAX=       20137.2065510759, 480505797,    0
$$ Real data points
##PAGE= N=1
##DATA TABLE= (X++(R..R)), XYDATA
$$ [...]
##PAGE= N=2
##DATA TABLE= (X++(I..I)), XYDATA
15102 -598358 5756601 6709232 2904743 -899011 -2291666 -2438194 -2317868 -1339512 -208350
15093 -208350 -1604310 -5679901 -7657397 -3594549 2969367 4502211 -641542 -6450802
15085 -6450802 -8127196 -7698149 -8483040 -8901415 -6085263 -2164224 -1581582 -3718536 -3527094
15076 -3527094 499213 3792046 2412276 -1497781 -3089878 -1248252 640389 -617319
15068 -617319 -4327732 -7046429 -6711757 -5027344 -5130701 -7228238 -8145962 -5692486 -1506829
15059 -1506829 1667964 3581900 5520003 7500064 8640505 8905861 8277664 5705483
15051 5705483 1354928 -1738955 -1274547 499956 -41946 -2261065 -2807933 -1821610 -2630029
15042 -2630029 -5076735 -4410237 1364587 7419011 8013339 3314789 -2116368 -4916513
15034 -4916513 -4575718 -1960535 1135905 2645151 2651850 3662097 6597766 8394124 5915374
15025 5915374 783840 -2182563 -533486 3763878 6986354 6643845 2830075 -1548972
15017 -1548972 -2721398 64680 3420533 4074943 2975882 3164101 4865708 5435063 3616725
15008 3616725 987742 -1020492 -2886330 -5054421 -6519498 -6567435 -6228394 -6580576 -6764051
14999 -6764051 -5201687 -2248762 -165354 -281740 -1186313 -385773 2478220 4728205 3425541
14990 3425541 -1093415 -5058847 -4954106 -1067666 2796337 2789599 -1777950 -7810991 -10558385
14981 -10558385 -7439578 -919582 3031196 814913 -4517645 -6345695 -2119195 3739025
14973 3739025 5499323 2945640 450568 317544 299528 -1557589 -2948096 -864045 2961763
14964 2961763 3878722 1117886 -1004603 549625 3463792 4050960 2283016 472659
14956 472659 -511055 -842120 299358 2945725 4116109 1320976 -2480673 -1690285 3871663
14947 3871663 7783223 5140537 -1521251 -6036396 -5485152 -1486306 2809221 4744628
14939 4744628 2930266 -1676697 -6085438 -7951163 -7400805 -5834080 -4186972 -2771313
14931 -2771313 -1358598 813306 3438701 3811139 -226749 -5933646 -7770401 -4734884
14923 -4734884 -1792459 -2405146 -3819928 -2488590 -31244 193724 -906780 -357034 1162637
14914 1162637 982706 167058 1979560 5335472 5566488 2095911 -287266 900871 2307830
14905 2307830 1018883 -814922 -808129 -1143818 -4215030 -7088358 -5537469 -1405867 -355748
14896 -355748 -3038734 -4200777 -1363845 1079858 -985166 -4618668 -4268539 -304443
14888 -304443 1620210 -1039357 -4493476 -4543423 -1879277 313689 900930 422386 -1461114
14879 -1461114 -5049909 -8527932 -9870259 -9925259 -10566232 -10681474 -7760933 -3221521 -1816183
14870 -1816183 -4825965 -7965381 -7619423 -5161431 -3103696 -1346259 -289251 -3180109
14862 -3180109 -10629195 -16185013 -13160378 -4158943 1818656 946429 -2242202 -3007395
14854 -3007395 -1979225 -1526909 -1688220 -1645498 -1369454 -297367 2049055 3248850 74814
14845 74814 -5414901 -6740844 -1945733 3289762 4098352 2732407 2751455 2387620 -733811
14836 -733811 -2735588 1515431 8964570 11272180 6496555 1015550 -512566 -325138
14828 -325138 -1189410 -1377077 927395 3501088 4188577 4971706 7773090 9531858 6225801
14819 6225801 -192462 -3647770 -2010316 922429 1548198 726613 1079014 3163917 5720081
14810 5720081 7457977 7260106 4449506 360995 -1706051 315907 4777475 8105929
14802 8105929 8430294 6515944 3990102 2040873 1455783 2431634 4103073 5228793 5511080
14793 5511080 5451696 5027316 3736207 2140923 1842949 3066307 3570050 1300642 -2750894
14784 -2750894 -5782596 -6494979 -5386716 -2420785 2917814 8792291 11070525 8028985
14776 8028985 3171808 1241605 2579152 3577314 1839540 -1608513 -4927799 -7559794
14768 -7559794 -9163321 -8918568 -7199000 -6162854 -7069466 -8059508 -6148141 -996634 4406579
14759 4406579 6651492 4951331 1686911 224394 1599952 3361313 2756804 825211
14751 825211 1136896 4036274 5253599 2243303 -1221084 -470526 2300863 816457 -5339432
14742 -5339432 -9353354 -7116341 -2837070 -1529734 -1046478 3128471 8632825 8458285
14734 8458285 1523721 -5331377 -6708837 -4363147 -1868861 875050 4536992 6378335
14726 6378335 4021808 331694 -228683 1573293 1232213 -2079502 -4471959 -3937148 -3203846
14717 -3203846 -4462626 -5341074 -2796148 1784160 4377347 3712220 2156697 1873675 2371121
14708 2371121 2014768 526536 -536946 457175 2905467 3830900 1225055 -2638584 -3173472
14699 -3173472 662593 4630674 4639858 1859963 398601 1556969 3105406 3459163 3624041
14690 3624041 4714865 6011104 6450641 6366279 6523530 6315024 4074751 -716188 -5909835
14681 -5909835 -7958779 -5557120 -1836667 -1178924 -3199872 -2331013 4514679 12085654
14673 12085654 12208785 4143372 -4586758 -7912374 -7322030 -6705973 -5707225 -1988258 2864757
14664 2864757 4618095 2855980 1693002 3274374 4351112 1309071 -4063212 -6627329
14656 -6627329 -4659120 -1954450 -2972243 -7691773 -12029035 -12240261 -8092919 -2478615
14648 -2478615 1058656 784887 -2066211 -4465853 -4688827 -4090214 -4744261 -5707706 -3771979
14639 -3771979 1500425 6019021 6208458 3612856 1913064 1297909 -590590 -3309752
14631 -3309752 -3767229 -1878808 -1344235 -3394782 -4370556 -1989089 336171 -962290 -3586025
14622 -3586025 -3630337 -2889369 -5975080 -11498293 -12632975 -7149809 -819119 1421330 2292847
14613 2292847 6367039 11543709 11584242 5490288 -818822 -2590058 -1691402 -2142103 -3529964
14604 -3529964 -2395142 1027881 1626847 -3509749 -9937292 -11082856 -7165242 -4675332
14596 -4675332 -6748175 -8818018 -6155561 -1341898 29812 -1920645 -2328272 81443
14588 81443 1398746 -394363 -2182730 -1271556 315535 -437061 -2895997 -4434517 -4302947
14579 -4302947 -3685985 -3698767 -4631224 -5332361 -3032136 3238894 8815969 7353313 -95734
14570 -95734 -4892542 -2153764 2842980 3199422 147280 -1005820 -300999 -1771913 -5275290
14561 -5275290 -6666741 -5008610 -3037713 -991154 3286259 7749707 6702266 -158750
14553 -158750 -5515642 -4168156 280293 1830460 518961 354165 2406126 4479372
14545 4479372 5563362 6478928 7141187 6507029 4674996 2551049 203304 -2147157 -2456758
14536 -2456758 997269 5909474 7048634 2071700 -5236127 -8642636 -5843136 -320152
14528 -320152 3027879 3042612 2196343 2173271 1818118 33981 -1837816 -2353096 -2486700
14519 -2486700 -3348636 -3409485 -1221886 793467 -728298 -4360498 -5348724 -2434556 1098804
14510 1098804 3044461 4235574 4597319 2348965 -1671732 -3748020 -2886894 -2011438 -2091093
14501 -2091093 -338904 3591001 5180108 2030336 -1837417 -2349368 -1243543 -1591826
14493 -1591826 -2238925 -1321278 -893083 -2974253 -5039523 -4702538 -4805193 -7974606 -10117089
14484 -10117089 -6186348 870724 4376389 4455317 6162964 8857924 6454277 -1576940
14476 -1576940 -8070882 -8632141 -6730968 -6282113 -6047043 -4121394 -2006634 -1328405 -1429453
14467 -1429453 -2341066 -5169719 -7823459 -5954771 -310341 2633594 17972 -3199711
14459 -3199711 -2500890 -372439 -649692 -1874617 -1189967 -134245 -1210640 -2534810 -1423981
14450 -1423981 -208761 -2703727 -6947163 -7162785 -2264167 2370602 1849757 -2687559
14442 -2687559 -5658943 -2604372 4898462 9216662 4260783 -5924894 -10361835 -4995159
14434 -4995159 1783389 1073436 -4641644 -7225052 -5598191 -5013804 -6562114 -6042450 -2914541
14425 -2914541 -2357499 -6862200 -12114517 -13322414 -10757446 -7370514 -5262176 -5837083
14417 -5837083 -9226513 -12261701 -11001312 -6310485 -2932491 -2394981 -1617518 444918
14409 444918 395288 -3058068 -5562796 -3595142 122371 1583846 1710580 2988132 3457819
14400 3457819 -340491 -6503237 -9556223 -8395922 -7118264 -7754224 -7382615 -3931377
14392 -3931377 -271526 195723 -1217110 -935178 1096407 1537251 -957775 -3572053 -3242958
14383 -3242958 -581432 1281892 439864 -2308835 -4746161 -4932570 -2502778 547375
14375 547375 1259841 -649610 -1551838 1616338 6469167 7695127 4313851 877922 611778
14366 611778 1248149 -180400 -2087673 -1303364 1379727 2612097 1799288 1061802 931233
14357 931233 36516 -1350680 -1206742 738281 2550173 3074841 2514280 675756 -2012610
14348 -2012610 -2599210 1106753 5777596 5784183 1289215 -1930153 -1368945 -823287 -2818941
14339 -2818941 -3942815 -1042641 2985891 3744785 1630825 -609891 -2959903 -6167303
14331 -6167303 -7911419 -6095798 -3683969 -4993010 -8667297 -9467641 -6078023 -2069740
14323 -2069740 376371 2568926 5020307 6085447 5690827 5859540 6493303 5134399 2270562
14314 2270562 2080122 5528527 7274364 3001565 -3788281 -6567069 -4735812 -2921107
14306 -2921107 -2704782 -539283 5290952 10386502 9519162 3357206 -2848809 -5503625
14298 -5503625 -4816481 -2055099 1743882 4153775 2108087 -3779971 -8099717 -6430284
14290 -6430284 -925308 2306236 399817 -4172612 -7687290 -8157491 -4773673 1705114
14282 1705114 7357031 7751514 3653611 552200 860138 651208 -3105389 -6320759 -3384458
14273 -3384458 3899907 8342501 6999018 3551711 1504824 341431 -689253 108886
14265 108886 3546029 6990248 7579930 5882741 4594887 5223984 7243300 9020074 8779071
14256 8779071 6093518 2798848 944757 114115 -1150747 -1944429 -259419 2493686
14248 2493686 2243890 -1516346 -4253131 -2877048 9989 622997 -748156 -1844467
14240 -1844467 -2681710 -4196710 -4939042 -2798020 1231947 4023846 3999136 1505223 -2786517
14231 -2786517 -7176623 -8477397 -5484198 -1474947 -60632 -98281 1695385 4728321
14223 4728321 5673549 4678266 5235318 7617542 7749637 4143519 1086521 2289887 5303679
14214 5303679 5518034 2838907 899397 1477744 3039853 3884382 3847542 3197408 2100554
14205 2100554 1180784 983435 913977 -89218 -1924784 -3213529 -2598973 254116 4269230
14196 4269230 7110357 6707369 3360857 -411274 -2501898 -2727553 -1697857 61252
14188 61252 1390294 1027827 -102874 743045 4069621 6558416 5366197 2013881 -112104
14179 -112104 -183094 596774 1961416 3916654 4660437 2727201 220924 210668 1591911
14170 1591911 617609 -2681771 -4188593 -2458572 -1010137 -2094970 -2739012 102701
14162 102701 4246169 5754550 4823156 4232027 4023800 2039368 -1230741 -2497012 -441013
14153 -441013 2708031 4688845 5500332 5876364 6065144 6543062 7650551 8254787 7002907
14144 7002907 4845734 3612874 2166291 -2331368 -8415710 -9848543 -3863305 3550181
14136 3550181 4559441 -326423 -3395898 -419399 4351583 4846844 894217 -3089758
14128 -3089758 -4436995 -4147661 -3669148 -2922951 -1783167 -1018063 -724833 397333 2810706
14119 2810706 4440499 2996249 -635562 -3279700 -3690501 -3760784 -4933483 -5685508 -4224278
14110 -4224278 -1908870 -1563227 -3259188 -4407810 -3946316 -3849339 -5888890 -9132773 -11586491
14101 -11586491 -12398711 -11481470 -8923360 -6005762 -4803998 -5235156 -4527267 -1530663 679178
14092 679178 -727946 -3321853 -2757860 54020 -68388 -4126311 -6536076 -3252815 2064436
14083 2064436 3356238 410131 -2171403 -2117672 -1315363 -1515530 -2364465 -3464776 -4556735
14074 -4556735 -3641982 1030133 6598810 7559015 3445221 163924 1458473 3567878
14066 3567878 1922197 -1055121 -54610 4018581 5242898 2026278 -941780 -598224
14058 -598224 498906 -227007 -1184721 -781111 -1027452 -3368616 -4851890 -2718542 295890
14049 295890 37180 -1953943 -794258 3221656 4080492 -1136479 -7654851 -9224426 -5577202
14040 -5577202 -1447848 -431821 -2004957 -3428312 -2912658 -1200972 -509165 -1574879
14032 -1574879 -2406809 -1184101 623850 299938 -1650394 -2093329 -357352 653618 -655360
14023 -655360 -1880451 -554631 2028391 3162714 2755116 2620138 3317491 4012475 4399068
14014 4399068 4632094 4076691 1983984 -1023744 -3495366 -4645853 -4346095 -2587578 -76001
14005 -76001 1687156 2140058 2496414 3758648 5118988 5555585 5546013 5540921 4215086 584315
13995 584315 -2947661 -2313288 3064364 8674771 9338159 4489557 -1466531 -3908315 -2786052
13986 -2786052 -2027751 -3899110 -5625105 -3676913 24144 -2380 -4675925 -8542850 -7587377
13977 -7587377 -4555613 -3892402 -5383193 -6381830 -6798728 -7448336 -6327652 -1760356 2536168
13968 2536168 1004318 -5704412 -11188942 -11700183 -9449467 -7438322 -5758328 -3911976
13960 -3911976 -2572625 -1765205 -674854 40774 -830752 -1572291 935796 5606321 7571436
13951 7571436 5428855 3393755 4270045 4942025 1874844 -2875323 -4901180 -3898287
13943 -3898287 -3119316 -4113297 -5317927 -4970801 -2987133 -664293 -110953 -2846597 -7549142
13934 -7549142 -10373461 -8717912 -3662553 1784665 5291252 5905333 4363707 2952827
13926 2952827 2759083 1377717 -3426379 -8309557 -7331446 -832831 4088162 3562587 1703046
13917 1703046 2724234 4199572 2331519 -1143725 -2329848 -1493149 -1110540 -1053279 -396013
13908 -396013 -569624 -2058026 -1788277 1107010 1301927 -4610828 -10219311 -7310095 1298725
13899 1298725 5493593 2388172 -2022350 -4601472 -8218474 -12200609 -10209100 -1505890
13891 -1505890 4585698 1038956 -6646513 -8337351 -2530093 3845985 5433091 3011241
13883 3011241 -45814 -1682030 -2090954 -2849835 -4535796 -5202611 -3316446 -1289489 -2179800
13874 -2179800 -3714860 -1229089 3387739 2652888 -4825057 -10841849 -9120316 -3547718
13866 -3547718 -510461 570473 3402656 6962829 7976491 7351361 7833952 8158858 5311343
13857 5311343 186367 -4160237 -7318622 -9692629 -9003935 -4155388 389674 107332
13849 107332 -2297045 -1327890 2079603 2722008 618344 736291 3885668 5395280 3358609
13840 3358609 1368350 1976703 3485084 4311546 4916301 4468181 1227077 -2743816 -2873750
13831 -2873750 698047 2664726 526409 -2509932 -3891767 -5122415 -6942056 -6901256
13823 -6901256 -4249325 -2057834 -1941607 -1469818 885244 3050022 3706466 4293249 4628815
13814 4628815 2100625 -2434525 -3929245 -1159889 807732 -595834 -1163172 1249109
13806 1249109 1076324 -5444265 -11782035 -9951280 -2783845 817002 -1053927 -3364227
13798 -3364227 -4172924 -5782548 -7659986 -6873037 -4912367 -5940971 -8383403 -6203856
13790 -6203856 936988 6489857 7042303 6140367 6527831 5864219 2723244 363253 1426923
13781 1426923 4163375 6432224 8380561 9073883 6078675 904901 -848535 2213124
13773 2213124 4455441 2065361 -1015895 -258929 1832294 576693 -2868025 -4110387
13765 -4110387 -2799832 -1691165 -1151000 -94446 -133786 -3217034 -6795716 -6800610 -4177838
13756 -4177838 -3049643 -3367466 -1258252 3377891 5567462 2825667 -1063903 -1770866
13748 -1770866 224883 2138667 3232585 4200975 4820126 4631298 4260959 4248776 4047724
13739 4047724 3592101 4175837 6142319 7239918 5323245 1807087 285435 1782717
13731 1782717 3297422 1827599 -1535925 -3093184 -1759301 -823236 -3378568 -7484343
13723 -7484343 -8029659 -2962209 4612479 10547080 13346924 13305615 10867395 7301945 4610510
13714 4610510 3108796 1213635 -987550 -727999 2797878 5712928 4416597 891335
13706 891335 -421300 817322 1176236 -904262 -3603257 -5186357 -5500973 -4407772 -1857855
13697 -1857855 755789 1918724 1951903 1460382 -274344 -2460858 -1177526 4864572 9528094
13688 9528094 6324165 -1190891 -3035093 3417839 10621261 12728172 12506495 13781405
13680 13781405 14429230 11343912 6529543 3406694 1672222 284257 1054056 4458549
13672 4458549 6055414 2454051 -2483650 -2873525 433802 1770759 -690403 -3486681
13664 -3486681 -3746985 -1836345 796540 2439304 1275287 -1587632 -1466662 3474508
13656 3474508 8011938 7049769 3900068 4929313 8467527 7038834 -126982 -5285239
13648 -5285239 -4022703 -987694 -1298076 -3396538 -4033738 -4159474 -5386299 -5362956 -1343458
13639 -1343458 4853834 9233213 10302078 8626082 4943738 1469009 1416008 3950687
13631 3950687 3285657 -3303235 -10009504 -9682905 -3726604 340277 -646539 -2948415 -3148872
13622 -3148872 -2400373 -2528968 -2399040 -184199 3442935 6150399 6487684 4672006 1978944
13613 1978944 -201087 -1457413 -2312234 -2539128 -825504 2531040 4240771 1755395
13605 1755395 -2679001 -4458285 -2559484 -213975 109804 -725738 -1433596 -2715718 -5444742
13596 -5444742 -8699767 -11051895 -12106846 -11601452 -8786403 -4273980 -994593 -1369796
13588 -1369796 -4257400 -6273531 -5523527 -2547277 1616860 6121052 9194666 8875008
13580 8875008 5848828 3492050 3513674 3404578 512371 -2940607 -2432056 1693283 3889643
13571 3889643 1423749 -1583887 -887629 998661 -1015035 -6259384 -9496674 -9099484
13563 -9099484 -8241023 -8012658 -5561735 -686130 1633401 -1438175 -5391744 -4507790 214329
13554 214329 3348781 2735450 813844 -29955 334893 1272900 2058270 1886453 1378398
13545 1378398 2580730 5439207 6539993 3895495 316726 -1145875 -2109132 -4969599
13537 -4969599 -7025413 -4180922 1187811 2518726 -946895 -2866443 337949 4360992
13529 4360992 4289692 1885552 1971549 5049859 7362841 6430852 3323473 268099 -1614544
13520 -1614544 -2301502 -1955317 -433218 2087175 4008417 3388080 1222811 1467256 5439212
13511 5439212 8633139 6774442 2784221 2570981 5309773 4377872 -1733423 -6275277
13503 -6275277 -4182139 874984 2627076 419618 -2322601 -3664876 -3492612 -1765991
13495 -1765991 109793 -606410 -3397212 -3545090 815121 4443783 1951793 -4254759
13487 -4254759 -7542235 -5928649 -2796317 -904539 -300733 -563782 -837823 935088 4917047
13478 4917047 7234567 4929235 1144353 1042245 4403242 6944217 7205373 6928432 6007784
13469 6007784 2780922 -1260663 -2680229 -1937338 -2713962 -5463673 -7097336 -7199549 -8639106
13460 -8639106 -11232075 -10907650 -6825647 -3519522 -3735771 -4611921 -3604293 -2873200 -4396521
13451 -4396521 -5538481 -3563522 -805488 -1193976 -4353161 -6734747 -6369140 -3627625
13443 -3627625 261475 2774998 924363 -4566324 -8501797 -7496259 -4397605 -3584623
13435 -3584623 -4759619 -4860873 -3497331 -2531251 -2153626 -1196063 -22562 188967 -149234
13426 -149234 -27325 387523 1300673 4089597 7801985 8172895 4044606 1324515 5247588
13417 5247588 11490894 11429685 4643103 -875190 -725644 1036153 418319 -253973 2041491
13408 2041491 4759818 3650567 -444905 -2709840 -559853 3997116 6984996 5960576
13400 5960576 2384159 1025114 4619347 8941478 6890230 -1615507 -8289492 -7127947
13392 -7127947 -1860851 511915 -704497 -1487245 -919736 -1516515 -3084470 -2132052 2089270
13383 2089270 5664577 5376644 2405147 -493219 -2259894 -2667712 -1307876 612859
13375 612859 29873 -3994579 -7769949 -6997496 -2331634 1513337 1829822 644594 1003552
13366 1003552 2836803 3961953 3732315 3621065 4472534 5147952 4501260 3150165 2184756
13357 2184756 1261252 -561025 -2743002 -3592338 -2462061 -304982 1711869 2775915
13349 2775915 2038816 -453696 -2516541 -1669079 1385026 3282797 2639077 1785514 2750302
13340 2750302 4009598 3224027 1168288 376920 1114408 1287003 -210105 -2370556 -4064018
13331 -4064018 -5152750 -5738158 -6061346 -7055006 -9306812 -11488174 -11390526 -8601399 -4826851
13322 -4826851 -1700912 298429 946211 -46334 -2228152 -4517368 -6103910 -6213061 -3652342
13313 -3652342 1549794 6375696 6954684 2933229 -2024044 -4431348 -3928988 -1801242
13305 -1801242 1188546 4410519 6622241 7097975 6589725 6184410 5913749 5025363 2858895
13296 2858895 -662158 -4317314 -5608242 -3379048 -480338 -1303400 -5837774 -8852926
13288 -8852926 -6605231 -1842515 278038 -754552 -966120 1818120 5066704 5208896
13280 5208896 1834195 -2464675 -4913338 -4676111 -3192586 -2717713 -3957623 -5409586
13272 -5409586 -5536641 -4667947 -3838104 -3088222 -2524989 -3681719 -7412148 -11342999 -12320994
13263 -12320994 -11073656 -11260361 -13615262 -14512377 -11572452 -7319251 -5024505 -3711334
13255 -3711334 -338731 4842238 8446756 8682028 6855263 4490317 2054905 839527
13247 839527 2817036 7174175 9653657 7636292 4145825 4139042 7722025 10120483 8672807
13238 8672807 6726740 8734364 13690211 16345972 14098265 9462207 5407625 1735206
13230 1735206 -2015679 -3190983 700831 6711145 8747150 5507254 2162052 2657192
13222 2657192 4090835 1605808 -3973162 -7301000 -5986436 -2948494 -1507331 -1901761
13214 -1901761 -3420980 -6437663 -10425907 -12516505 -10392392 -5271039 -220287 3240182
13206 3240182 5176163 5326525 3546027 1516961 1607888 3897092 6195327 7204555 7849337
13197 7849337 9046325 9885756 8902166 5959863 2149924 -1133229 -2453458 -1003991
13189 -1003991 2017452 3843813 3110346 1475999 1141571 1869936 2145392 2286339 3864648
13180 3864648 6105460 5771970 1897700 -1773633 -1351225 1593333 1712553 -3033408 -8536109
13171 -8536109 -9471954 -5040629 1335872 6269448 8583600 8362722 6149861 3303050
13163 3303050 1523332 1361006 1973251 2531814 2931163 2961721 2028990 347189 -544636
13154 -544636 697536 3692387 6804311 8500028 7889233 4996717 1346462 -646801
13146 -646801 53005 2052129 3517895 4178356 4287527 3123844 603468 -743557 1702359
13137 1702359 6331481 8463883 6281309 2667098 258810 -1985833 -5216156 -6720929
13129 -6720929 -2993588 4588604 10390124 10545242 6100030 716382 -2394984 -1738207
13121 -1738207 1618751 4264437 3596074 857565 -726892 -372229 44626 -256833 27929
13112 27929 1260313 1855707 1072097 23581 -926977 -2878540 -5434723 -6177891 -4627406
13103 -4627406 -3488799 -3940769 -3127879 692506 3743192 1568534 -3859859 -6320928
13095 -6320928 -3522131 1130820 4287435 5786197 5965718 4292923 1861104 1527693
13087 1527693 3754288 5051274 2374943 -2846775 -6445076 -5795199 -1696441 2412984
13079 2412984 2791723 -1221084 -6011778 -7738034 -7012024 -6872613 -7070239 -4733313 -747900
13070 -747900 -66725 -3969680 -7363797 -6668544 -5178789 -6515156 -7748478 -4732916 -298607
13061 -298607 -93301 -2587180 -1020132 4985627 7568712 2248012 -5309290 -7450109
13053 -7450109 -4315078 -1581820 -2208767 -4485354 -5926444 -5470099 -3120170 -88034
13045 -88034 1705333 1932067 2163922 2743177 1926522 -168675 -114617 3282584 5140413
13036 5140413 691187 -6636887 -8578390 -3111493 3000144 3746812 1142689 548322
13028 548322 2604264 3541793 1552595 -1003301 -1604008 -844837 -822930 -1958468 -2617998
13019 -2617998 -1364770 1201923 2937799 2319236 6942 -1889757 -2015808 -870403
13011 -870403 267341 835817 1005529 792369 7266 -993377 -1358346 -858132 -227486
13002 -227486 234344 1722690 5276228 9085375 9151292 3821636 -3316078 -6656960 -4474893
12993 -4474893 -295145 1474544 -138005 -2782620 -3643411 -1635184 2009022 4711078
12985 4711078 4979315 4051955 4037595 4672386 3895693 1703453 582262 1045695 -52972
12976 -52972 -4308465 -7622750 -4943596 2338265 7644559 7393546 4166469 1605471 96770
12967 96770 -1329710 -2369439 -2739478 -3454473 -4672861 -4430094 -1741444 932250 868106
12958 868106 -716903 -509033 1660968 2506107 330473 -2537308 -3417105 -3002935 -3524476
12949 -3524476 -4585043 -3230884 1745100 7428942 9707907 7648639 3889325 1242245
12941 1242245 333520 547073 1422273 2095317 957087 -2243066 -4798833 -3744561 23992
12932 23992 2573709 2210900 1566315 3324021 6067177 6424717 4137730 2667016 4744208
12923 4744208 8895382 10855188 7774130 928940 -5283867 -7074686 -4279598 263885
12915 263885 3874173 5728931 5851231 4201589 1388629 -1275937 -3339614 -5411129
12907 -5411129 -6991325 -6157756 -3051753 -1417650 -3710844 -6265443 -3446439 3529546
12899 3529546 6587401 1489423 -5530343 -5555036 1071489 5426352 2318771 -3070941
12891 -3070941 -2965243 2429306 6006948 3696572 -1085783 -3199693 -1993709 84797
12883 84797 1959692 4012483 5468459 4981530 3255642 2185771 1578473 -357834 -3034766
12874 -3034766 -3129111 660472 5116888 6308475 3911856 445544 -1723586 -1148912 2658808
12865 2658808 7846246 10564887 8825128 4676519 915739 -2302990 -5289618 -5775433
12857 -5775433 -1980648 2552097 1748003 -5009063 -11615825 -13046793 -10829731 -8970884
12849 -8970884 -7778080 -4932628 -888003 620920 -2049655 -5208625 -3720346 2686874
12841 2686874 8658634 9067957 4397373 -616969 -2611031 -2139286 -1192676 -560233 -25640
12832 -25640 946353 3161411 6118954 6495540 1719686 -4286341 -3709928 4457525 11330245
12823 11330245 9656658 3602120 1538988 3476250 3002674 -1275644 -4816973 -6348631
12815 -6348631 -8868754 -11174247 -7897985 -107325 3487219 -309948 -3619362 -216806
12807 -216806 4463722 2779927 -2848388 -5140669 -3812274 -3556406 -4261301 -2169462 1802385
12798 1802385 3558213 3949276 6920056 10530911 8555981 1287081 -3686990 -2821089
12790 -2821089 -917615 -2078679 -3766949 -2867505 -1145760 -1043980 -1341713 -524724 -66224
12781 -66224 -1307790 -3029344 -4451005 -6385585 -7411511 -4031074 2692845 6140109
12773 6140109 3423833 433406 3069563 8193124 8734363 4080821 -500563 -2230604
12765 -2230604 -2775543 -3326990 -3130847 -2406776 -2275404 -1996609 131840 3501000 5804376
12756 5804376 6184618 5181153 2908175 37076 -1100359 554761 2406459 1683354
12748 1683354 -722439 -2850004 -5283668 -8352413 -8797386 -4204389 1750566 3840517
12740 3840517 2714859 2040930 982722 -3175541 -7072865 -4875835 718968 894136
12732 894136 -4680590 -6104407 420395 5039180 -587365 -9625932 -10223768 -2775558
12724 -2775558 2477555 954382 -2725806 -4580486 -5460822 -5673705 -3555060 -420537
12716 -420537 -187981 -2741764 -3506067 -895039 1365336 866773 110660 1370087 2669278
12707 2669278 1311775 -2370874 -6691557 -10344037 -11087242 -7149607 -1835115 -1759209 -7519147
12698 -7519147 -10991649 -5990165 2783682 6481517 4053398 1283360 477723 -1560753
12690 -1560753 -5672692 -7793703 -6014226 -3913289 -3867125 -2450975 3239766 8903197
12682 8903197 8055421 1470721 -3768155 -3730647 -995118 1364399 3633827 5784454 5108844
12673 5108844 687757 -3661447 -4563220 -4023216 -5135592 -6002794 -3414490 -289073 -2322806
12664 -2322806 -7472673 -6671054 2665185 11232528 10283914 3199227 -1037097 -575121 162032
12655 162032 57678 1587109 3350123 993253 -4169804 -5445287 -1056199 3180258
12647 3180258 3429717 2808557 3902469 3574138 -460576 -4296147 -4260059 -3170370 -4556716
12638 -4556716 -5616716 -2343435 2431600 3136968 613749 30590 1814842 2018076 458421
12629 458421 915375 3270898 2782092 -1821684 -6211942 -7934667 -9650744 -12750164 -13749210
12620 -13749210 -10244018 -5620320 -4351474 -6119496 -7466181 -6347714 -2889226 1528629
12612 1528629 4301403 3644915 1564496 1299013 1471473 -2171118 -8170371 -8873935 -1452846
12603 -1452846 6731183 7972999 3862192 107011 -2754948 -6812642 -9267154 -5553676
12595 -5553676 1823754 5211173 2462558 -794267 -54176 2686923 3533106 1695724
12587 1695724 -1512773 -4691341 -6213658 -5454250 -4607221 -5778763 -6360856 -1823678 6283397
12578 6283397 10175883 5705110 -1887747 -4778427 -1771516 2182815 3131474 1726305
12570 1726305 1008508 2897208 6319770 7877951 5387682 966117 -1337526 -1189323
12562 -1189323 -2369727 -6522515 -9795206 -8098442 -3213868 -499604 -1696849 -3148430
12554 -3148430 -1300216 2442235 3576451 372756 -3461981 -2852020 2240610 6265552
12546 6265552 4986118 934723 -463047 1410253 2312562 364772 -1061361 1224721
12538 1224721 5841393 9715751 11835871 11896896 8779943 3621265 1319555 4694469
12530 4694469 9031190 7212413 -261379 -5216017 -2733313 2171495 1323254 -5990250
12522 -5990250 -12425134 -11594540 -4722148 2004894 4400516 3234317 1488070 631989
12514 631989 -51410 -1696099 -4354575 -6961161 -8222532 -7622269 -5712555 -3267998 -470430
12505 -470430 2356317 3731029 2406649 -186861 -1027518 393341 1544974 1456370 2554851
12496 2554851 5602614 6395392 1779501 -3582587 -2024552 6305456 13022960 12306889
12488 12306889 6678917 824479 -4487176 -9328031 -10683249 -6505688 -813073 209168
12480 209168 -3780836 -7081826 -5517172 -972022 2020132 1681490 -126691 -1077058 -1026520
12471 -1026520 -1232256 -1684170 -813449 1414287 2040082 -1059038 -5264769 -6089504 -3110146
12462 -3110146 287662 2472928 4911739 8001565 9944099 10450107 11231576 11869124 9779927
12453 9779927 5559621 3342660 4000516 3362263 -169792 -1954524 1097265 4552239
12445 4552239 3357212 86183 449117 4156543 6413950 5887164 5046969 4532151 3295668
12436 3295668 3074236 6616449 11897511 13680200 10867780 7347891 5530584 3904862
12428 3904862 1311444 -962818 -2045759 -2520012 -2038008 650165 4855714 7986088
12420 7986088 8357178 5785990 856875 -3690853 -3437298 1791828 5192571 1324732
12412 1324732 -5439936 -7017740 -3681485 -2300293 -4092185 -3434755 611151 1483847
12404 1483847 -3171757 -6077026 -1574155 5137826 5953011 1322230 -2342551 -2416565 -1270853
12395 -1270853 -767455 -848006 -1498812 -1949684 -96119 3822479 5792085 3869213 2197421
12386 2197421 4823359 8535407 7153218 1084116 -2852250 -706527 4035024 5445188
12378 5445188 1414908 -5193857 -9169989 -7113483 -1100606 2675795 895680 -2761935
12370 -2761935 -2804686 678288 3034358 2061756 286494 564404 2665170 4539948 4604112
12361 4604112 2491833 -730347 -3115371 -3794993 -3798626 -3963003 -3417856 -1528066 364132
12352 364132 959742 1063161 1600070 1398041 -669465 -3101443 -4053747 -4550960 -6350927
12343 -6350927 -8045062 -6791693 -3073115 -151758 851678 1838802 3671365 4700252
12335 4700252 3977783 2868466 2502325 2266955 1848035 2162111 2777159 828653 -5067275
12326 -5067275 -11103462 -11281608 -4495141 3370293 5665460 2212573 -1397462 -1267345
12318 -1267345 586436 324164 -2261895 -4905466 -7224958 -10196904 -12551861 -12055687
12310 -12055687 -9971485 -9499604 -9598192 -5823293 1472295 5816403 4158137 1729756
12302 1729756 3326431 5498038 3134422 -1034114 -753925 3044126 3767735 259759
12294 259759 -1407340 2092470 6501962 7064769 4691847 2463097 710562 -1290030
12286 -1290030 -2268474 -944065 1055041 1074158 -883430 -2351309 -1658822 282211 1182854
12277 1182854 -108998 -2141397 -2218083 496692 4248227 7519426 10618136 13151309
12269 13151309 12456020 7229305 836007 -2122565 -1231579 676252 2296043 4128007
12261 4128007 5254284 3968983 1277375 -17152 307800 -156141 -2200071 -4026052
12253 -4026052 -4416185 -3564394 -922293 4213044 9731228 11697813 8894417 3845804
12245 3845804 -548124 -2896133 -2621577 -403871 1438579 1835558 2764265 5064613 5104450
12236 5104450 313513 -4662955 -3648321 1181202 2489402 -255582 -507409 3438224
12228 3438224 5506943 2847722 542685 1770782 2207859 -752450 -1676402 3333458
12220 3333458 7971918 4525078 -4051860 -8799736 -7357459 -4147773 -1510184 1154529
12212 1154529 1749957 -2624428 -8863294 -10419105 -6846893 -4401558 -6840907 -11454578
12204 -11454578 -14519616 -15082162 -12866120 -7969842 -3582012 -3892500 -8071485 -10816093
12196 -10816093 -9846517 -8302374 -8583403 -8609828 -6222415 -3162921 -2086392 -2535221 -2148328
12187 -2148328 166950 3690398 6652656 6892867 3953746 866917 1292295 4594975
12179 4594975 6609406 5543132 3808826 3448698 3464203 2926428 3036026 4135606 3947669
12170 3947669 1229498 -1431339 -1031675 1640147 3604719 3818299 3352924 2824035 2056438
12161 2056438 1500145 1708610 1625667 -698621 -5266949 -9123555 -8908210 -4380216 987689
12152 987689 3560183 3613003 4463865 7072177 7981693 4789191 1168803 2411192 7144396
12143 7144396 8485086 3924271 -975179 -756848 2525666 3322163 631059 -1912124
12135 -1912124 -1973396 -545159 1189985 3389186 5578605 5820306 2849163 -2233718 -6902898
12126 -6902898 -9087722 -8095850 -4595897 -281311 2457334 1170035 -4780443 -12032612
12118 -12032612 -14606075 -9839109 -2063726 2310908 2502694 2647230 4129577 3750593
12110 3750593 567855 -934614 2488100 7428241 8700897 5993376 2024401 -2155277
12102 -2155277 -5730589 -5830215 -2132616 -472340 -5285595 -10871506 -7856767 2603770
12094 2603770 9487996 7589785 3907764 5445019 8894734 7831348 3565673 1797175
12086 1797175 2610820 1300460 -2575099 -3891721 2204 5362025 7364746 5465856
12078 5465856 2180497 -547792 -2380369 -3741886 -4822110 -4685813 -1944653 2565208
12070 2565208 5167845 3489117 -5638 -1136077 354514 1168180 -259707 -2017653
12062 -2017653 -2054171 -188583 3142243 6958589 8474375 5359921 65813 -1643282
12054 -1643282 2085096 6608881 7226023 5176955 4755201 6815321 8191527 6468375
12046 6468375 2730140 -179240 -479302 1274960 2815345 2467130 1127429 870106 1516306
12037 1516306 639927 -2306007 -4333654 -3047910 -337727 249809 -1678498 -3519659
12029 -3519659 -3690884 -3182112 -3423258 -4425973 -5010363 -3763859 -188313 4152950 6345880
12020 6345880 5067945 2210354 695879 1393062 2842171 3058950 1082623 -1956232
12012 -1956232 -2888657 476816 5675445 7214940 3057965 -2893726 -6126684 -6525654
12004 -6525654 -6197642 -5445577 -3784097 -2236592 -1258167 1284000 6434903 10618522 9789770
11995 9789770 5307657 1493820 -861495 -3768422 -6319947 -5321288 -1229283 2100897
11987 2100897 3818745 6674672 10573970 11493060 8601140 6726671 8864018 11226663
11979 11226663 9295546 4576803 1298366 -329787 -3144073 -7291999 -9598843 -8063488
11971 -8063488 -4117367 -642938 548127 -239339 -1039356 -372948 1042277 2108226 3933613
11962 3933613 7491655 9401688 4930616 -3957749 -9006646 -6517200 -2513914 -3441372
11954 -3441372 -6692808 -5571143 102476 4488586 4834166 3973611 4121272 3566862 507630
11945 507630 -3710050 -6380250 -6042879 -2881923 1403378 4020488 3126698 -548797 -4983270
11936 -4983270 -8635515 -10089772 -8209965 -4439278 -2516089 -3594296 -4154121 -1384007
11928 -1384007 2258773 3282324 3087568 5346800 9664709 12453082 12459887 10965023 8250238
11919 8250238 4663708 3264830 5783918 7532072 2789197 -5566492 -8829766 -4913392
11911 -4913392 -615330 -455671 -1095191 698950 2350388 1747058 2142509 5612997 7713668
11902 7713668 4634520 530358 1079397 3965827 3132537 -552496 -896441 2794367 4609584
11893 4609584 2062803 -358824 621815 2147112 1320149 303873 1484256 2375132 72437
11884 72437 -2638581 -893980 4233117 6431288 2792623 -2486043 -3978449 -1389195
11876 -1389195 1388099 1317724 -1239332 -3678413 -3615596 -1080528 1085770 98703 -3015906
11867 -3015906 -4102948 -1233940 2436953 2868997 569259 -641676 732880 2528774
11859 2528774 3061563 3263484 3845167 3561403 2056870 1564596 3294679 4598963 2948429
11850 2948429 825805 2554975 7001227 7985252 2781707 -3921848 -6437104 -4902603
11842 -4902603 -2931349 -1346077 1819209 6465184 9799937 10705735 10987397 11274992 9263327
11833 9263327 4132736 -383267 -567838 1830228 2646031 2328190 4851018 9593636 10272873
11824 10272873 4416563 -1562334 -1114768 2979054 3562414 284689 -1147016 646467
11816 646467 830086 -2641812 -5692884 -5822812 -6022226 -7882223 -7705781 -3943541 -2088280
11807 -2088280 -6272467 -11316465 -9988367 -4095771 -988372 -2013620 -2262533 -23536
11799 -23536 1554117 1801607 3752289 7301323 8285762 5773994 3656886 3235009 739612
11790 739612 -5266329 -10141361 -10071705 -7466040 -6081711 -5587660 -4543604 -4210349 -5302972
11781 -5302972 -4922594 -1150927 2514992 1789274 -1888863 -3795260 -2791891 -1485248
11773 -1485248 -1129962 -667606 15018 -224292 -1170412 -1605745 -1958456 -3507572 -5115715
11764 -5115715 -3920876 123480 3015178 1266418 -3729389 -7042503 -5454085 -630395
11756 -630395 3188797 4298190 5007936 7255444 8769319 6352878 1690973 -200802
11748 -200802 1575038 2313957 -1039148 -5439812 -6787721 -5584305 -4659702 -4420698 -3449298
11739 -3449298 -1290253 2053063 6739103 10684520 9859209 4223086 -35700 1782673
11731 1782673 6084267 6543047 3543289 2437203 4454213 5752063 4899081 4945117 7355770
11722 7355770 9552027 9871082 10012307 10895171 10665573 8806201 7989371 9463580 10408035
11713 10408035 8596140 6290700 6276452 6683627 3413674 -3646453 -10004682 -11659586
11705 -11659586 -8584092 -3601672 317603 1899980 2189714 3280889 5689687 7502998
11697 7502998 6755837 3817081 631022 -1578360 -2967528 -4102715 -5137275 -5567304
11689 -5567304 -4503876 -1874318 539296 424666 -2278589 -5112245 -6125952 -5831490
11681 -5831490 -5422673 -4629872 -2731245 -440177 1089357 2471110 5168505 8322360
11673 8322360 8785383 5495677 1987543 2299083 5164743 5263230 935314 -2621833 -532019
11664 -532019 3961689 3463489 -2488390 -5846833 -1274313 6318913 9091653 6675182
11656 6675182 4020742 2231181 -1453976 -5686846 -4855852 1382441 5284368 1361645
11648 1361645 -5708773 -7862566 -4237011 -167443 1177067 660718 -1326676 -5300399
11640 -5300399 -8902704 -8173546 -3530921 82212 315816 400125 3151285 6073770 5365454
11631 5365454 1704153 -1290178 -2142785 -1662309 303236 4402348 8718484 9916291
11623 9916291 7803807 5656104 5307234 4724207 1579924 -3130626 -6413698 -6390646 -2970415
11614 -2970415 2634214 7648735 8864829 5911051 2178521 918514 1672168 2049973
11606 2049973 1385263 525585 -444380 -1539598 -1014647 2679009 7422496 9080598 6853489
11597 6853489 4005139 2813821 2017166 368283 -559843 762835 2714384 2827607 1446170
11588 1446170 549380 279206 -669515 -1995911 -1890629 -76558 1731312 2734080 4120169
11579 4120169 6339023 7240042 4540116 -745689 -4904372 -5529318 -3855603 -2755755
11571 -2755755 -3180206 -3453531 -2027797 95505 534705 -1266536 -3081503 -2445791 557837
11562 557837 3520387 4258191 2621939 -42585 -2595131 -4784207 -6354137 -6399877 -4576592
11553 -4576592 -2460554 -2059276 -2757153 -1723474 1694285 4143894 2703321 -768825
11545 -768825 -2406186 -2042424 -2665480 -4629569 -4407352 -254322 4199249 4229103 -22906
11536 -22906 -4053548 -4632229 -3193590 -3506724 -6731221 -9477187 -7672690 -2308123 805408
11527 805408 -1665585 -6048232 -7140886 -5682809 -5956220 -7579165 -5545169 1230932
11519 1230932 7287345 8373814 6604529 5289476 3590887 -22994 -3130397 -2544825
11511 -2544825 609001 2938076 3556815 3191353 996351 -3553249 -7443406 -7116530 -3622621
11502 -3622621 -958552 -309760 196919 950791 395393 -1020689 -681917 1620087 2597957
11493 2597957 318978 -2753634 -3288400 -1606113 -774033 -2173607 -3668926 -2351366
11485 -2351366 1760904 5615492 6845739 6379959 6106070 5318380 2250934 -1463347 -1732972
11476 -1732972 1746280 4014715 1471735 -3327648 -5633727 -4266724 -1350806 635421
11468 635421 -454738 -5154732 -9614114 -8357123 -2588246 -718020 -6603218 -12766696
11460 -12766696 -11150263 -5391851 -4527110 -8391952 -8859932 -3945812 -445706 -1677270
11452 -1677270 -2407699 980025 4004383 2480038 176617 2128478 5608268 4406111
11444 4406111 -1029817 -4204244 -2184365 1027828 1186628 -519511 -204912 2899424
11436 2899424 5643755 5409658 3528685 3186341 4707104 5079889 2813734 764510 2026805
11427 2026805 5062032 5977434 4386138 3492026 4736918 5818851 4463990 1427295
11419 1427295 -837627 -563748 2229056 5280083 5470686 2651149 839550 3109934
11411 3109934 6794106 6883517 2776063 -1832356 -4297490 -4365784 -1771177 2779511 5349190
11402 5349190 2688998 -2162415 -3475306 -1501802 -1602878 -4732929 -5635809 -2019240
11394 -2019240 1160125 -546378 -4697619 -6719919 -6292650 -5452385 -4379637 -2783464
11386 -2783464 -2376783 -4485584 -7253866 -7725264 -5066664 -538809 3558169 4484168 1590328
11377 1590328 -1582611 -1293643 612982 -433684 -3491934 -2997455 1503556 3874275
11369 3874275 1821711 1121838 5582320 10159646 9420063 6311004 6006743 6461237 2568550
11360 2568550 -3969835 -6509929 -3298722 1050036 2766849 2222007 1193892 1636792
11352 1636792 5773679 12856514 17478955 15770895 11505080 11005719 13561744 12519279
11344 12519279 5269904 -3361522 -7996023 -8192199 -6367382 -4358306 -3198728 -3321337
11336 -3321337 -3986912 -4277685 -4482493 -4930563 -4673839 -3374340 -2827925 -4071111 -4743391
11327 -4743391 -2177068 2627227 6909455 9811480 10922957 7936996 291582 -6857942
11319 -6857942 -7415544 -2173139 2749310 4358890 4829764 5766546 5832818 4552289 3500485
11310 3500485 2652049 18453 -3695258 -4321032 -211522 4466244 4986622 2257748 1142773
11301 1142773 3778656 6967905 6546048 3015964 1237331 3765558 6267080 2662088
11293 2662088 -5674922 -10451439 -7549949 -2470630 -1490970 -2493630 95248 5204500
11285 5204500 6799191 3733622 959182 1116657 1260372 -1144021 -4349497 -5877600
11277 -5877600 -5612243 -4079122 -1340343 1397308 2358812 1952132 1825061 1240329 -1939012
11268 -1939012 -6633292 -8919452 -7396728 -4339784 -1259217 2491364 6154079 7103265
11260 7103265 5218253 3717130 4168937 4293728 2157136 -896382 -2987194 -4184340
11252 -4184340 -4800710 -4135319 -2239440 -320980 1467583 3918504 5973871 5245680 1970898
11243 1970898 -869937 -2099044 -3595383 -6222615 -8004891 -7336601 -4781093 -1106313
11235 -1106313 2977288 4926407 2542756 -1388312 -1407131 2681685 5261623 3630597
11227 3630597 1638934 2458277 3628053 2533774 1147953 1278977 481127 -2514286 -3413452
11218 -3413452 807313 5138453 3345411 -1840088 -2748494 1108560 2837439 -375909
11210 -375909 -3477559 -2622210 -925405 -2031793 -3497326 -826417 5206775 9262424
11202 9262424 7907174 2559287 -2999588 -5829984 -5110159 -1990186 1495101 3696343
11194 3696343 3674095 1327521 -1547369 -1530173 2579934 6714520 5520000 -285476 -4100887
11185 -4100887 -2263258 1135133 884953 -1502767 -1054558 1807277 1487582 -3507641 -7303426
11176 -7303426 -5179025 -760625 -642455 -4785014 -7127290 -4630019 -902913 -391299
11168 -391299 -2977171 -5577661 -5884067 -3135376 1912619 6162061 5951631 1549890 -2285278
11159 -2285278 -1918280 1144565 3375185 3757005 3141848 1686186 -434128 -1845401 -2018264
11150 -2018264 -2400986 -3194110 -1732127 2939763 6877315 6536806 4518134 5397021 8289358
11141 8289358 9031657 7863479 8571331 10789338 9994316 5717454 3099427 4646663 6615422
11132 6615422 5860886 4369650 3971869 2189832 -2519506 -6031097 -3923626 1486983
11124 1486983 4040526 1706529 -2114074 -3763351 -2649082 -582038 -148320 -2441539
11116 -2441539 -4867439 -3311758 2051021 6002012 5157238 2152693 522838 -593908
11108 -593908 -2937398 -4176605 -1639278 1661528 588429 -3701589 -4721266 -192944
11100 -192944 4682658 4695499 884578 -2516359 -3731045 -3599372 -2596683 -408343 2434583
11091 2434583 4375679 4245861 2191533 -613613 -2980591 -4591868 -5703354 -6005752
11083 -6005752 -4715140 -2071108 608854 2931523 5748051 8582196 8969127 6028758
11075 6028758 2473518 813963 -185467 -2283374 -3157318 738558 7577615 10947790
11067 10947790 7805289 1900957 -1734407 -2388845 -2310343 -2632347 -2728928 -2046832 -1016741
11058 -1016741 -842225 -2562070 -5130370 -5114629 -742010 4240571 4187433 -660036 -3920289
11049 -3920289 -1719665 2674272 4982534 6124781 8552022 10277831 7841053 3006649
11041 3006649 928458 2454890 3566871 2376726 1346955 1791273 1477641 -519520
11033 -519520 -1441862 205982 1670518 785124 -240578 849536 2112523 1356646 663330
11024 663330 2341755 3654021 1051833 -2898442 -2981247 6548 741984 -1324001 -1459227
11015 -1459227 1093915 986773 -3911319 -8136480 -7118444 -3949473 -3393899 -4405222
11007 -4405222 -3583555 -1855422 -2280489 -4061622 -3824828 -1028405 2065677 4085475 4676393
10998 4676393 3020220 -265944 -1955013 -455514 1074849 -600339 -3565586 -3986672
10990 -3986672 -1868237 544425 3239007 6591959 7843628 4819572 917105 790021
10982 790021 3089503 3320628 1819754 2204171 3464502 1121288 -4183753 -6901446 -5804692
10973 -5804692 -5342994 -6622195 -5027951 575319 3945281 865285 -3949666 -4191727
10965 -4191727 -1148446 -446897 -3338530 -6184654 -6176693 -3329182 1459630 6725426 10012459
10956 10012459 9961341 8043088 6498968 5683961 4617300 2696521 -6854 -2541636
10948 -2541636 -2795674 454453 4926859 6686841 4874613 2111372 342613 -712055
10940 -712055 -1175383 -638314 -244812 -1503616 -2965674 -1888423 976288 2535739 2885061
10931 2885061 4476492 5894385 2783865 -3911778 -7221596 -3985101 642219 1372629
10923 1372629 -331839 -970812 -1062603 -2275577 -3115755 -1916039 -534797 -1060687 -1883588
10914 -1883588 -551817 2196157 4115835 4459006 3189392 382224 -1924247 -1095642
10906 -1095642 1421573 1346566 -1135818 -981559 2879602 4968777 2584844 608768 2663783
10897 2663783 4682381 2997595 1875944 5650344 9297568 5552265 -2707960 -6214634
10889 -6214634 -3021960 282635 27722 -275060 2328921 5484502 6310286 5541005 4917557
10880 4917557 4196791 2387376 -323321 -2581684 -2576959 538404 4849002 7012023 6468825
10871 6468825 5803289 6020992 5340913 4071513 5562958 9690343 11007882 7188321 3631433
10862 3631433 4954449 7614910 6751968 4767006 6064242 8088581 5596236 255134
10854 255134 -2182854 -1581181 -2098978 -3189622 -321227 6071662 10133263 9165389 6083935
10845 6083935 3456332 1192137 -111962 692974 2118841 1993025 1498958 2500392 3157426
10836 3157426 1760019 1871393 6773378 11788580 10299518 5097953 4671884 9576843
10828 9576843 12158949 9488966 6525112 5585102 2921061 -1912120 -3123915 1162585
10820 1162585 4562912 2667814 -33714 1739472 5814348 7598944 7653156 8906174
10812 8906174 10788920 11135493 10496605 10218469 9020824 5262942 490603 -2251794 -2075429
10803 -2075429 -446841 642132 -7037 -1356617 -311424 3959721 7012410 4470625
10795 4470625 -732859 -1672670 2505153 5696399 4245710 1067873 -626830 -1556588
10787 -1556588 -2557283 -2216731 -427821 612838 645025 1849576 3990835 4194682 2551227
10778 2551227 2351555 3731370 3151319 399680 -481894 1206752 1444920 -207600 1337655
10769 1337655 7186014 10867858 8633725 5840004 7611774 9991451 6885537 224153
10761 224153 -3655930 -3419519 -2026185 -403171 1719116 1812771 -2105995 -6302837 -5347237
10752 -5347237 330195 5807066 8449824 8385459 4753314 -2543391 -8875001 -8793220 -3581873
10743 -3581873 413394 884644 1756619 5756771 9875928 10005689 6257391 1555224 -2308537
10734 -2308537 -5094245 -6489898 -6235769 -5123180 -4248800 -3390071 -1303032 2005451 4249585
10725 4249585 3244629 61170 -1773349 -689430 1054086 917891 -439616 -850124
10717 -850124 107556 1544645 3049178 3866182 2562056 86007 429297 4887625 8672596
10708 8672596 7500142 4466161 5083390 8470930 9930668 9659095 11097020 12294951
10700 12294951 7916139 -198598 -3778372 -849763 1459193 -642348 -1621991 2812599
10692 2812599 7798936 7559589 4361741 3176719 3493279 2798701 3037650 6862274 11224150
10683 11224150 11114507 7149971 4081247 3994952 5569593 7667521 9259942 8085595
10675 8085595 3614252 -703656 -1877283 -1770677 -3387490 -5293943 -3984328 30225
10667 30225 2717665 2195843 546480 584627 3245814 7348185 10147340 9292373 5576708
10658 5576708 2267638 947666 303637 -281599 846386 4090355 6554543 5507935
10650 5507935 1711955 -1946504 -3011544 -302866 4898386 8311405 6722292 2761872
10642 2761872 1888341 4740603 6984066 6632762 6074170 6307398 5157707 2644008 2300553
10633 2300553 5185609 7836627 7925499 6813600 5264540 2288497 -658276 -607531 726835
10624 726835 -1227456 -4666227 -2335677 5993843 11086491 8157342 4119360 5579021
10616 5579021 8365352 6035724 1267452 580611 3296179 3922622 1616832 -179389
10608 -179389 -677660 -1764713 -3173343 -3013323 -1409692 355636 2187080 3684298 3246736
10599 3246736 1250666 690465 2547490 4526128 5844410 8054630 9762952 7263005
10591 7263005 2569064 3098631 9937227 14332269 10397634 3659875 1621175 3005001
10583 3005001 2435409 -388703 -2257361 -2116231 -249358 3278643 5783885 3486391
10575 3486391 -1127616 -661179 5430242 8881968 5980903 3260655 5265426 7085286
10567 7085286 5134743 4736501 9483267 13192026 10805855 7688041 9223434 10568398
10559 10568398 6302239 1355775 2175643 5184120 4335969 2514749 5028529 8922707
10551 8922707 9092236 8301754 11037847 13918775 12147380 9248151 10804255 14519245
10543 14519245 15331867 14159989 13555853 11748374 8558657 9148926 14532892 17496964
10535 17496964 15001776 13791282 16404841 14728581 6265854 2092247 7657049 11138331
10527 11138331 4037097 -2276024 4165437 15117675 17274684 14097362 15151096 17265711
10519 17265711 14135587 11432390 14673532 15753184 8959153 5067149 11524438 16031733
10511 16031733 9308271 4673478 13306150 21493864 16835935 13557133 24130282 31543151
10503 31543151 21845056 16342552 33742729 49806713 39026996 25775502 41710685
10496 41710685 63782575 56768499 45705264 70866452 102016688 92464339 93039385 186413884
10488 186413884 304000042 255996471 -163 -253669761 -296972555 -177881590
10482 -177881590 -89979342 -98101167 -111248903 -76563756 -48245568 -62713125 -75507954
10475 -75507954 -53566396 -31485016 -38334397 -46533281 -31648883 -18526956 -29859295
10468 -29859295 -42596765 -32577723 -17592215 -20973508 -30533060 -26732123 -18949819 -22748660
10460 -22748660 -29145075 -25013963 -19532791 -24392423 -29939439 -24891393 -19098570 -24125699
10452 -24125699 -30439035 -25532237 -16965438 -16618462 -18488210 -12288361 -4154477 -4376322
10444 -4376322 -7933500 -5598617 -2132520 -5978904 -12051551 -11315890 -7400386 -8402192
10436 -8402192 -11726442 -11341284 -10853924 -15698076 -20942110 -19686814 -15504931 -14889420 -15501049
10427 -15501049 -12783795 -9914471 -10830305 -11747826 -9201293 -7599170 -9673305 -9318144
10419 -9318144 -3415800 -170196 -5276817 -10576172 -7923287 -3786077 -7276382 -13268496
10411 -13268496 -11398988 -4166875 -1935163 -5607246 -7596537 -5752422 -4146023 -3314011
10403 -3314011 -548640 2793726 3329302 1984314 891205 -1677839 -6331002 -8210624
10395 -8210624 -5004224 -2944857 -6944832 -11565473 -10335835 -6870848 -7161850 -7954985
10387 -7954985 -3709302 1099564 -1500384 -8735912 -11099882 -7369942 -4569819 -5396125
10379 -5396125 -6136993 -5372987 -5149119 -4846786 -2461347 -407148 -2202531 -5467808 -5774554
10370 -5774554 -4788301 -6856229 -10477670 -11248365 -10296367 -11417474 -12738247 -9958245 -5284366
10361 -5284366 -4250777 -5949224 -5336714 -3026529 -3559626 -5978673 -5825924 -4888426 -8605805
10352 -8605805 -14517261 -14153979 -7184481 -3027766 -6171816 -9748354 -7112723 -1081027
10344 -1081027 2658399 4062513 5891507 7803138 7710346 5285047 1042776 -4748364
10336 -4748364 -10114819 -11691032 -8884888 -4949577 -2790368 -2309207 -2177553 -1360763 917757
10327 917757 3755664 4066928 923255 -1375327 844801 3749566 1134174 -4950002
10319 -4950002 -6333074 -1708994 868003 -3202302 -7842251 -6303005 -1469983 -72278
10311 -72278 -1725180 -1018730 2193595 2164472 -3145404 -8442886 -9066849 -7504291 -8627071
10302 -8627071 -11871234 -12528401 -9423562 -6686786 -7356876 -9467322 -10466496 -11644562 -14583346
10293 -14583346 -16137910 -11853670 -3096123 4186647 7348745 8692624 9474934 8145646
10285 8145646 5387779 4587009 5280396 2651114 -3250194 -4524115 3180111 12009728
10277 12009728 11324430 1968426 -5801005 -6445039 -4420017 -5870217 -10879029 -14853236
10269 -14853236 -13914699 -8368051 -2856950 -2189379 -5404155 -6364830 -2323735 1652614
10261 1652614 52439 -5253644 -9182380 -11767564 -16280593 -21363650 -21644792 -15785861
10253 -15785861 -8545948 -4833282 -5839477 -10159559 -14355801 -13585326 -6570167 814104
10245 814104 1658076 -3083577 -6603477 -6023662 -4508104 -4102502 -2745895 593439 3319304
10236 3319304 3391814 1756036 -584301 -3808487 -6730011 -7212668 -5988831 -5850466 -6355779
10227 -6355779 -4065564 886576 3624774 1893528 -424703 46619 676556 -2214685
10219 -2214685 -6579536 -7390699 -4085421 -902898 -580019 -1524488 -1544297 -1304544 -2645497
10210 -2645497 -5023884 -5438946 -2161465 2436751 3916440 607183 -4850658 -9045782
10202 -9045782 -11066289 -11408874 -10002826 -7376643 -5843577 -6818133 -8233249 -7297985 -4691706
10193 -4691706 -3265894 -3695816 -4428776 -4943097 -5767195 -6072969 -4811741 -3708101 -5326315
10184 -5326315 -8319158 -8540364 -5141544 -1576681 100236 1798630 4886042 6994875
10176 6994875 5528138 1551950 -1816827 -2741567 -1044643 2259108 4410566 2589121
10168 2589121 -2032392 -4475888 -2383737 129097 -2152306 -8057273 -11246680 -8463366
10160 -8463366 -3487555 -2004766 -4522383 -5957986 -1864180 6115780 11696849 10631841
10152 10631841 4962999 112917 -1113304 -206899 565719 1047613 1978073 2760600 1924102
10143 1924102 -781081 -3826464 -5386611 -4833009 -2812255 -380479 1530151 1937047
10135 1937047 -42523 -4054873 -7880839 -8991847 -6804483 -2700682 1711273 5114846
10127 5114846 5914551 3322276 -817148 -3347261 -3303050 -2141813 -524893 2287371 5321126
10118 5321126 5548086 2217180 -1383612 -2280441 -1230667 -37416 1539713 3841305
10110 3841305 5017993 3371407 -112333 -3614691 -6364184 -6907066 -3095767 3486395
10102 3486395 6881542 4105565 -390468 -1434957 -354048 -672295 -796191 2352588
10094 2352588 5421768 2260735 -5500709 -9250704 -5343114 670886 2952033 1993231
10086 1993231 455158 -1457682 -3554942 -3575514 -719708 2417786 3883745 4918344
10078 4918344 6535175 7214981 6094640 4847137 4163792 1941973 -2472490 -5569139
10070 -5569139 -4114154 361398 4211729 6340276 7521893 7413267 5349474 2677214
10062 2677214 1584099 2465417 4314814 6536744 8552852 8806403 6108377 1333907
10054 1333907 -3543654 -7368956 -9790507 -10369317 -8865202 -5834333 -2326635 484292
10046 484292 1527804 903313 484417 1795175 3455460 2728233 -466382 -3355369 -4204890
10037 -4204890 -3939979 -3717962 -3719843 -4838804 -8378379 -12875722 -14288776 -11186006 -7249762
10028 -7249762 -6576499 -8463449 -8888202 -5681137 -478217 3279960 3020007 -904753 -4635634
10019 -4635634 -3828009 1378669 5757661 4688005 -773139 -5738024 -7109933 -5807790
10011 -5807790 -4219652 -3173069 -1741586 676611 2906269 3430979 3045804 4128727
10003 4128727 6447374 6407995 2767682 133089 2676221 6681550 5058725 -1587681
9995 -1587681 -5052287 -1641580 2652218 1903784 -1205570 -1184587 1104007 934512 -1984504
9986 -1984504 -3850444 -3701941 -4260478 -6356955 -7597800 -6810309 -5493372 -4428619 -2840769
9977 -2840769 -1531148 -2862409 -6426328 -8406216 -7005609 -5285381 -6402870 -8817517
9969 -8817517 -8958446 -6514623 -3903386 -1853946 880236 3671902 3610035 129893 -2946668
9960 -2946668 -2144705 882322 1825185 -229869 -2065203 -1394828 164559 -54482 -2118601
9951 -2118601 -3872377 -3587368 -1351911 1076810 1363723 -1147426 -4015048 -4138124 -1728013
9942 -1728013 180795 183786 -324390 -683336 -1962555 -3332502 -1762682 2307215 3317810
9933 3317810 -1845704 -8424595 -10141598 -7604120 -5552527 -4900068 -3418943 -2083839
9925 -2083839 -3976741 -7557684 -7504366 -2615241 2861697 6201011 8682709 10269869 7864411
9916 7864411 945266 -6091728 -9443692 -9559973 -7781006 -3956222 713997 3065212
9908 3065212 2490510 1976264 2632399 1573283 -2452683 -5821689 -5340497 -2818144 -1362068
9899 -1362068 -798334 243618 1237658 1781074 3261335 5466334 5118973 1298332 -1096783
9890 -1096783 2493412 9129788 11570384 7171931 117940 -4162024 -3896595 -1035895
9882 -1035895 1428823 2488257 3891001 6801901 8920784 8415869 9255499 16027527 22800069
9873 22800069 15718013 -8596877 -34313613 -42893526 -33651248 -20985197 -15058554 -13452415
9865 -13452415 -10434020 -6009663 -3731988 -4749121 -6591004 -5849411 -1467316 3645979
9857 3645979 5473678 4169403 3600975 4407176 2170061 -4678550 -10593796 -11190560 -10290217
9848 -10290217 -12373113 -13234819 -6756802 2585323 4102888 -3124129 -8573373 -5730144
9840 -5730144 -120271 690642 -2939014 -6523559 -8561229 -9458322 -8342182 -5199580 -2682654
9831 -2682654 -2507356 -2998478 -2492393 -1965353 -2278953 -2181144 -1002189 -27654 545828 2502863
9821 2502863 5675383 6723355 3789157 -1010552 -5299382 -8819637 -10560229 -8134816
9813 -8134816 -2518295 1084217 133602 -1739151 -1312500 -1094374 -3674780 -5328080 -1310223
9804 -1310223 5383813 7129439 2378081 -2855356 -4139125 -3536339 -4279593 -5537013 -4788021
9795 -4788021 -2011914 890393 2689449 2875826 765885 -3375489 -6955677 -6571334 -1546486
9786 -1546486 4439795 6112103 1877363 -3938715 -5625192 -2997107 -1617267 -5148833
9778 -5148833 -10068333 -10383682 -5727268 -1484616 -1505551 -3968929 -4989615 -3598918 -1739718
9769 -1739718 -899783 -405266 1047806 2961672 2890793 -566332 -5083373 -6680163 -4789080
9760 -4789080 -2906094 -3087494 -2757750 406524 3171731 596886 -6052860 -9984405 -7753937
9751 -7753937 -3216572 -1658596 -3962790 -8032050 -11962801 -13432676 -9626070 -1181106
9743 -1181106 6299379 8076837 5770958 3957161 3403245 1616275 -1423902 -2837162
9735 -2837162 -2059597 -2023949 -4175119 -6049299 -5213562 -2487353 224147 2429871 3777666
9726 3777666 3028301 304360 -1861399 -1654111 -189945 1033407 2522841 4535229 4919015
9717 4919015 2152290 -1225219 -1406936 1435114 3578910 2748816 30051 -2685069 -4579182
9708 -4579182 -5396623 -5191047 -4555427 -3752539 -2367484 -977173 -1435513 -3794971 -5225052
9699 -5225052 -4314327 -3598582 -4509511 -3176000 3619166 11008132 11153082 4466114 -1415536
9690 -1415536 -3414334 -5645235 -9241268 -8670003 -2047612 3185497 936813 -3731010
9682 -3731010 -2565440 3004411 4808339 764674 -3171611 -2898493 -852462 -301120 -740351
9673 -740351 -283426 1418524 3559958 4601586 2501753 -2635702 -7006844 -7249872 -4844869
9664 -4844869 -3142187 -2101551 -307795 50362 -3950351 -9393290 -10308929 -6815406 -4808009
9655 -4808009 -6109272 -6203299 -3364871 -2322605 -5494080 -7887996 -5585002 -2803591 -4486505
9646 -4486505 -7463149 -6242564 -3173081 -4353053 -8061261 -6537899 1021972 6332157
9638 6332157 4487965 100918 -2195294 -5232305 -11923908 -17198731 -14710363 -7321076
9630 -7321076 -2998065 -2643688 -220961 5601660 8458344 4674361 -1060426 -3782530
9622 -3782530 -5224823 -8017040 -8958672 -4489546 1455770 2416698 -263417 275677 4707895
9613 4707895 5954170 276073 -7354472 -11355381 -12479757 -13144757 -11553304 -5443044
9605 -5443044 2069790 5512950 4051038 1507962 773663 1381560 1517709 -77192 -3085558
9596 -3085558 -4847925 -2576915 2131319 3862892 603844 -2913197 -2019642 1185838
9588 1185838 1937940 571449 1168557 4271590 6159451 4807117 1974489 -565114 -2804147
9579 -2804147 -4287120 -3684240 -1119042 1611463 3074605 2485885 -777467 -5359880 -7368381
9570 -7368381 -4962945 -1756060 -1817474 -3275727 -1750617 1515916 1085586 -3411158 -5929724
9561 -5929724 -3285934 60644 -1045758 -5382509 -7943645 -6035764 -509019 5879448
9553 5879448 9343793 7400890 2182767 -1422947 -2203208 -3665151 -7195484 -8569652
9545 -8569652 -4302173 2170408 4576529 1873914 -1416088 -1573999 875532 3376383
9537 3376383 4190095 3025341 679583 -1672935 -3482757 -4820793 -5431300 -5002547 -4351563
9528 -4351563 -4539580 -4616675 -2411554 1929137 5479604 6311035 5343778 3615497 488262
9519 488262 -3817200 -6363042 -4487769 534880 4471307 4092901 -328977 -5145621 -5682798
9510 -5682798 -431673 6510116 9111918 6018178 1418174 -876640 -1317705 -1778564 -2129578
9501 -2129578 -1604708 -1046334 -1463745 -1956964 -1042235 1002698 2479460 2162855 298908
9492 298908 -1327250 -565258 2265114 3500537 637592 -3243994 -3198094 202804 2083407
9483 2083407 1841574 4256258 10169313 12652950 6641273 -2930110 -7788397 -7022686 -5543270
9474 -5543270 -5275775 -4447210 -3741302 -6118574 -10309595 -10798024 -6024753 -1530316 -2211137
9465 -2211137 -5196812 -3958240 2413028 7752252 6981674 3004699 3192433 9545427 15283219
9456 15283219 13130463 4837466 -1125308 -545653 2317518 2173729 -368102 -1583971
9448 -1583971 -299636 2379310 5823116 9015974 9560968 6875276 4085015 3641001 3611391
9439 3611391 1658823 -300301 293349 1150359 -1394651 -5216812 -4572996 1136130 6427489
9430 6427489 7701630 6676340 5226044 2508577 -935495 -1526857 1900741 5103328
9422 5103328 4179155 1100129 149651 1499214 1990384 469430 -1462901 -3115311 -5413857
9413 -5413857 -7876169 -8171575 -5660846 -2817076 -1674724 -836075 2031599 6030575 7914261
9404 7914261 6922074 5996511 7132579 7957233 5186934 -51089 -3222664 -2235862 461714
9395 461714 1629906 373919 -2639271 -6073935 -7431201 -4982251 -1356414 -1604480 -5775778
9386 -5775778 -7285626 -1866511 5287181 5763493 -855615 -6963138 -7236940 -3977727 -1611238
9377 -1611238 -440248 1950514 5877974 8704317 8003133 4207062 94621 -2216354
9369 -2216354 -3604469 -6289195 -9781106 -10779268 -8380000 -6585022 -8809573 -12195207
9361 -12195207 -11267570 -5894128 -1214755 -42074 84693 1661740 3541712 4157962 4487924
9352 4487924 5333237 4772937 1282670 -2801452 -4002201 -2551844 -1664785 -2761337 -4213971
9343 -4213971 -4641322 -4680007 -4870155 -4232210 -2430727 -1624015 -3978643 -7898497 -8974333
9334 -8974333 -5246695 193684 2902723 2002493 -30505 -1324749 -2214625 -3185856 -3463914
9325 -3463914 -2373964 -827067 -809428 -3766586 -8923824 -12505318 -10282921 -2966578 2657119
9316 2657119 1266518 -3592571 -3985477 1169763 4889711 2944331 -355496 -9425 1834116
9307 1834116 449268 -3519554 -6011088 -6314003 -6417647 -5788297 -2393690 2088525 3287831
9298 3287831 317623 -3168191 -4006262 -2196701 848608 3239629 2524011 -1657572 -5352803
9289 -5352803 -4254819 604656 4341837 4463235 2175694 -1197989 -4833400 -6347654
9281 -6347654 -3839823 125487 863168 -2150242 -5321624 -6732839 -7409734 -7414231 -5928603
9272 -5928603 -5182283 -8536602 -13846436 -14505581 -8682243 -2073079 416132 288054 478604
9263 478604 454909 -312961 889841 5433731 9339758 8165567 3039663 -1796356 -4536747
9254 -4536747 -5289452 -3093908 2139619 6831207 7216268 4415605 2475143 2664802 3160024
9245 3160024 3034644 2877960 2412596 1227610 1246734 4560874 8801480 8645248 2975437
9236 2975437 -2842483 -3656213 -934875 -45150 -2632473 -4773918 -3076516 59323 -422849
9227 -422849 -4751707 -7090616 -3048252 4007216 6753045 2840583 -2887880 -4842680
9219 -4842680 -2558253 243561 48713 -3668612 -8218128 -9797134 -7293662 -3757505
9211 -3757505 -2412209 -2241157 -300612 2655725 2973540 501631 -435589 2211779 4783613
9202 4783613 3459795 -340008 -2827305 -3326829 -3960461 -5615431 -6764949 -5525806 -1667596
9193 -1667596 2543717 3498646 133520 -3683754 -3468138 -364516 749806 -839129 -745408
9184 -745408 2807489 6079727 6609107 7059180 9167752 9545675 5719112 1258786 38640
9175 38640 1352 -2014169 -3638483 -1475896 1358518 -686161 -6196873 -8527648 -5766497
9166 -5766497 -2299615 -1022455 -543131 -253948 -1901903 -5220468 -7440298 -7991068 -8666902
9157 -8666902 -8721391 -5414371 -270414 1271840 -1737552 -3640017 -1142993 1272666 -1172449
9148 -1172449 -5430461 -4939821 872797 6234550 6745414 3467949 -80555 -1897180 -2535959
9139 -2535959 -4110244 -7840896 -11458553 -10507899 -3972693 2954859 4113163 -531417
9131 -531417 -5398826 -6297871 -4232562 -2050207 -181251 2487114 5174357 5367160 2687448
9122 2687448 331538 1019184 2848069 1584012 -3246463 -7285871 -6981533 -3576128 -206368
9113 -206368 2150779 3711615 3539409 1193494 -1233301 -1952624 -2652313 -5305440 -7510754
9104 -7510754 -5461025 -576269 1906046 982229 1101820 4128019 5608508 1999694 -2967512
9095 -2967512 -3356104 381062 2285831 -863543 -6101027 -8954568 -8403194 -6376532 -4504492
9086 -4504492 -2845801 -1160294 -77615 -257725 -857723 -337084 697244 -626538 -5109260
9077 -5109260 -8978744 -8440550 -5201195 -3917895 -5184929 -5439490 -3607022 -2701985 -3750438
9068 -3750438 -3434696 -227712 2085285 611604 -1225701 921458 4839355 5069521 1735632
9059 1735632 294273 2866132 5239128 3483235 -1029563 -5032016 -8059891 -11154308
9051 -11154308 -13377399 -12633324 -9103882 -5512083 -3901553 -3642207 -2942567 -1255821 505296
9042 505296 1516904 1744532 1159559 -394991 -1954928 -1589323 815989 2467647 1495120
9033 1495120 312306 1956528 4381253 3014511 -1272267 -2586345 136843 183556 -6228945
9024 -6228945 -12305376 -9826157 -1576736 2772099 679722 -1484248 -97633 724505
9016 724505 -2283089 -5413634 -4323706 -1049228 -264999 -2173483 -3229680 -1587237 1401391
9007 1401391 3147368 958770 -6199212 -14524009 -16787545 -10204338 -711254 3787577
8999 3787577 2347397 -192525 -1070153 -1856247 -3854294 -5761566 -6313090 -5844833 -4663872
8990 -4663872 -2567442 -318686 855556 1390321 2605931 3851067 3129866 784519 -337751
8981 -337751 892318 2209939 1622728 355473 604191 2109948 2618749 860875 -2065247
8972 -2065247 -3927844 -3740124 -3303979 -5709612 -11215676 -15699004 -15135022 -10663756 -6725655
8963 -6725655 -5067146 -3809596 -1919054 -620996 -64799 1232112 2650816 1511983
8955 1511983 -1593088 -2094549 1482046 4323835 2654865 -123246 842535 3830075 3983003
8946 3983003 2069960 3130931 7303575 8740202 4552168 -1055504 -3558543 -4146291
8938 -4146291 -6271593 -9776567 -11397442 -9036941 -3565788 1941709 3755933 502784
8930 502784 -4390616 -5660356 -2548819 417502 -247106 -3284326 -6655360 -11038056 -16382888
8921 -16382888 -18682782 -14708053 -7939848 -5057599 -7238034 -9422293 -8268792 -6148056
8913 -6148056 -5827380 -5627401 -3038628 -32209 -418767 -3255867 -3756889 -1277104 -1256135
8904 -1256135 -6305241 -9928008 -4799483 5017549 7545822 -565297 -8493506 -5988636
8896 -5988636 2982496 7524290 5637666 4488279 7465391 10217676 9841663 9208850 9772292
8887 9772292 7877836 2031081 -2771870 -2501692 -301040 -439880 -1230043 505996 2413717
8878 2413717 472988 -3339070 -3862143 -1145446 389511 -181500 360241 2691737 3832120
8869 3832120 3023255 2993413 4463362 4625350 2411021 584029 1028412 2067422 1947714
8860 1947714 1172020 38882 -2296893 -4916244 -5183047 -3265449 -2633655 -4164184 -3891369
8851 -3891369 725111 6111209 7470381 5293301 3453440 3255787 3065267 2118489 1089547
8842 1089547 -108816 -1928511 -3346001 -3177342 -2455457 -2830291 -3408261 -2068352 611411
8833 611411 1812858 829150 -57170 510799 1082903 431797 -217135 344826 705615 -1120079
8823 -1120079 -4233646 -5682742 -4400016 -2392249 -1838732 -2620207 -3287946 -3175498 -2608666
8814 -2608666 -1833171 -798097 249024 671646 -168769 -2636840 -6196911 -8703812 -7775933
8805 -7775933 -4195378 -2450825 -5524085 -10045857 -9722516 -3515667 2943622 4685194
8797 4685194 2542059 -221725 -2284021 -2789545 374351 6754153 10800016 7927356
8789 7927356 1235911 -2506796 -1950771 -972775 -667151 1878332 6126308 6108491 -1131419
8780 -1131419 -10109164 -13500816 -10633852 -6123547 -3181790 -1918517 -2062623 -3658812
8772 -3658812 -5951276 -8024099 -9587320 -9574761 -5993334 603582 5565454 5022255 1023333
8763 1023333 -1067315 537286 2540877 1565857 -1977728 -5380963 -7100358 -7914417 -9166030
8754 -9166030 -10186670 -8207426 -2199521 3848786 4443239 -60922 -3095847 -580993
8746 -580993 3635486 3895549 816534 -1018239 -986407 -2753219 -7320466 -10743243 -9579309
8737 -9579309 -4917680 -163277 2166650 1063045 -2310010 -4031958 -839792 5025578
8729 5025578 7636456 5027603 1612154 1614819 3794263 4908571 4845683 5001887 4316807
8720 4316807 960559 -3479269 -5390860 -4166058 -2413749 -1449237 -79822 1817134
8712 1817134 2034958 -451458 -3625217 -5548346 -6743966 -7776237 -7139349 -4105843 -1498139
8703 -1498139 -2359472 -5192267 -6065328 -4771302 -4836697 -7092588 -7661903 -4245806 -540300
8694 -540300 -1220676 -5222053 -7630858 -6507713 -4015253 -1789133 683866 3027279 3272908
8685 3272908 1306593 -77375 1013599 3048633 3598000 2344782 504673 -874230
8677 -874230 -1151700 -516505 -775963 -3519348 -6946795 -7276781 -4216778 -1879743 -2745804
8668 -2745804 -4046704 -2421795 1025225 3261944 4066663 4712860 4231828 971475 -3578746
8659 -3578746 -6356119 -7106609 -7673987 -8039372 -6882804 -5110623 -4574515 -3857901 -62876
8650 -62876 5024001 5575189 -74874 -6368632 -7851121 -5812972 -5044222 -7030887 -9306394
8641 -9306394 -9471779 -7144441 -3265012 383658 2036180 1908629 2154680 3656321 4385403
8632 4385403 2363333 -1211994 -3297501 -2324425 927271 4486858 6228403 5130059
8624 5130059 2415756 137802 -1697426 -4566373 -7764662 -8346348 -5767892 -3271305
8616 -3271305 -2901977 -2574313 -471727 1157211 -140336 -2493574 -2826897 -1754629 -1224358
8607 -1224358 89419 4184628 8663435 9587653 7715822 6176305 3553723 -3634943
8599 -3634943 -12075753 -13475805 -6886731 -1233974 -2293938 -4710810 -1758251 3923782
8591 3923782 5834634 4235776 3543772 2978933 -1678386 -8745491 -11492249 -8591511 -6240900
8582 -6240900 -8471277 -11970974 -12749042 -11937115 -11728284 -10445157 -5707783 566851 4006630
8573 4006630 2969716 -477381 -3267104 -3546442 -1988481 -1828179 -5288554 -9397266 -8661657
8564 -8661657 -2938308 1406979 171080 -3133205 -3415641 -1487286 -1060150 -1675668 -42585
8555 -42585 3410926 4787296 3009848 1046028 754192 829342 367144 556274 1985544
8546 1985544 3584601 4950276 6634402 7653363 6107825 3028403 2055359 4021553
8538 4021553 5241240 2894078 -973037 -2809326 -2146038 -639603 891218 1936794
8530 1936794 1024307 -2102147 -4549642 -3420226 83144 2346264 2325770 2072744 2757989
8521 2757989 3224828 2857129 3024163 4485996 5580314 4549437 1984562 -806403 -4348150
8512 -4348150 -9351761 -13241218 -11706186 -4783560 1559928 2272806 -467744 -944553 1510653
8503 1510653 1881806 -2403400 -7236184 -7640775 -4147936 -701047 747574 407852 -1926387
8494 -1926387 -5760807 -7857744 -5213421 640671 5408889 7162181 6878809 5468928
8486 5468928 3729254 3605906 5398104 5193486 -191955 -6894711 -7973574 -3117818 1321783
8477 1321783 1934063 1718247 3271118 4911012 5232292 5465740 5389443 2940115 -159732
8468 -159732 827293 4610849 3153957 -5823873 -13165791 -10864396 -3483398 -172002 -1560608
8459 -1560608 -2726049 -3785753 -7851806 -11886437 -9914183 -4189554 -3432304 -9506685
8451 -9506685 -14641896 -13274318 -8660968 -5583553 -3707199 -1184402 1043573 1740128
8443 1740128 1723637 1349470 -449280 -2981820 -3594686 -1928902 -508442 -302061 70797
8434 70797 199696 -2130806 -5904820 -6923480 -4155010 -1080390 352643 1623386 2282287
8425 2282287 -878365 -6873853 -9160295 -4832033 436814 614285 -2706127 -4801463
8417 -4801463 -5332158 -6394556 -7198398 -5931596 -3868222 -2909845 -1771094 1096183 3553547
8408 3553547 2950653 535965 -1307010 -3256305 -6321578 -8168650 -6950249 -5794564
8400 -5794564 -8231614 -11758269 -11543611 -8417766 -7327670 -9293301 -10637214 -9217962
8392 -9217962 -5922822 -900784 5928534 11123804 10431456 5532619 2600227 3605666
8384 3605666 4364170 1969251 -1192042 -2202433 -1448717 10827 2445690 4921255 4769044
8375 4769044 1602166 -1539464 -2733749 -3544956 -5233981 -5944929 -3718937 290669 3394991
8366 3394991 4128447 2400946 -934027 -3870455 -4628991 -3575131 -1997544 79903 2197901
8357 2197901 1389815 -3750410 -8325526 -6265616 168407 2554856 -1389265 -4858853
8349 -4858853 -3205788 -535474 -1409549 -3127965 -1541706 1414906 2028494 1786772 3730021
8340 3730021 5872487 4900322 3117391 4660049 7228608 5079622 -887541 -3559838
8332 -3559838 -493740 2470134 99071 -5335768 -8349297 -7255371 -4556020 -3104680
8324 -3104680 -3686093 -4889921 -4899014 -4381121 -6185300 -10253405 -11490808 -6494582 35482
8315 35482 874063 -3246264 -4933875 -1694156 592542 -2565368 -7190263 -6849486 -1381619
8306 -1381619 3993416 5553870 4023297 2172865 1495182 704385 -2434794 -6756824 -7156473
8297 -7156473 -1524016 4140165 2848433 -2648740 -3162353 2944535 6984715 3156200
8289 3156200 -3390724 -5561230 -4268586 -4158736 -5278943 -4949677 -3455766 -2121969 492539
8280 492539 5008663 7489543 4879243 777364 118064 1487651 828617 -559317 1321960
8271 1321960 5130714 6202387 4839423 5135309 6747938 5559335 2035471 1054559 3062820
8262 3062820 3159928 -6365 -2100390 -1447646 -1908982 -5065405 -6939710 -5601544 -4957186
8253 -4957186 -7209547 -8302674 -5378247 -2527969 -3921552 -6718305 -6471124 -4705263
8245 -4705263 -4896441 -4917715 -313666 7322024 11591249 9659405 4266592 -1189916 -4740454
8236 -4740454 -4537818 -585102 3044275 2259032 -1531064 -4027381 -4845318 -7006908 -10670832
8227 -10670832 -12609450 -11889030 -11134616 -11545177 -10998965 -7956727 -3547983 783196 4219798
8218 4219798 5047302 2101732 -2025996 -3459651 -3150628 -5810482 -11730620 -14952553 -11967606
8209 -11967606 -7212706 -6195620 -7337225 -5522675 -1003314 888471 -1711692 -4108464
8201 -4108464 -1738545 3727468 6958113 5376198 974439 -2960915 -4854349 -4874589 -3797068
8192 -3797068 -2551706 -2036395 -2538386 -3492358 -4162845 -4274921 -3763095 -2660827 -1826353
8183 -1826353 -2652149 -4725008 -4986954 -1564814 2363260 1852725 -2530593 -4737505 -1951104
8174 -1951104 1071073 -517539 -3705023 -2012437 4414815 8615666 6251869 142224
8166 142224 -5145784 -8374169 -9753952 -8419483 -4618129 -1394402 -958417 -1161736 1511488
8157 1511488 6419299 8958778 6286301 729531 -3222160 -4030383 -4011267 -5410911 -7022334
8148 -7022334 -5906402 -1813968 2133565 3554790 3388384 3232740 2536652 654208 -416219
8139 -416219 1425256 4258373 4136024 1034885 -572656 2299720 7423717 10524247 9906719
8130 9906719 7007494 4217953 3065097 3199536 2715294 549588 -1744715 -2152744 -1462290
8121 -1462290 -2127196 -4263088 -5414624 -4352404 -2390484 -577494 1631422 4092437
8113 4092437 4978573 3363888 858481 -546985 -816840 -1158409 -2153993 -3204921 -3078022
8104 -3078022 -1179644 915193 276043 -3575884 -7145968 -7350134 -5642514 -4937744 -4513279
8095 -4513279 -2056642 935235 999534 -876162 -474497 1956932 1542932 -2455352 -4187155
8086 -4187155 -178339 5063547 5891190 2946257 -13642 -2095942 -3869166 -4045179 -2131417
8077 -2131417 -1089787 -2917731 -4583722 -2798473 98225 -116382 -2394944 -2290479 610443
8068 610443 2372754 1211285 -342086 257033 2821541 5892068 7860691 7139204 4043565
8059 4043565 1630193 1886350 2474952 424137 -2590545 -2550006 480847 2375868 892832
8050 892832 -2179929 -4387690 -4534336 -1837166 3041542 6531543 5559921 2133364 736111
8041 736111 1658305 1249152 -1427217 -3194659 -2704772 -2672798 -4445826 -5037495 -2235064
8032 -2235064 1233643 1872367 823706 1542618 3852357 3959991 172357 -4163822 -4332043
8023 -4332043 317772 5579390 7131672 5363599 4199054 5164050 5041907 930011 -4833256
8014 -4833256 -7610191 -6566717 -4528230 -3131993 -1993505 -1812494 -3893288 -6632598
8006 -6632598 -6938974 -5578390 -6470946 -9709416 -10333536 -6172381 -2003131 -2472628 -4880275
7997 -4880275 -3327807 2610456 7879421 9184098 7969255 6493404 4684499 1686746
7989 1686746 -1942890 -4613784 -5150879 -3641769 -1631000 -1089244 -2301377 -3424146 -3125639
7980 -3125639 -2751930 -4471391 -7966014 -10534864 -10137598 -6972226 -2454617 1780114 4025588
7971 4025588 3459986 1506605 937404 2860832 5451688 6326784 5365362 4287117 4063245
7962 4063245 3985150 3200017 1903076 662293 -308129 -690983 -154235 297401 -1369106
7953 -1369106 -5037929 -7163995 -5039428 -1090884 197386 -1111885 -786651 2455447
7945 2455447 4608592 2535831 -1678775 -4628894 -5970269 -6412461 -5235415 -2973770
7937 -2973770 -2861668 -5915610 -8143569 -6741962 -5259429 -7487750 -9965366 -7169495
7929 -7169495 -1426181 47601 -3235169 -4441357 -742705 2760508 2217892 686024
7921 686024 1502742 2344322 -148233 -4565723 -7265926 -7083748 -4752446 -1212864 1256713
7912 1256713 89692 -3294367 -4352999 -2420948 -2071492 -5344451 -8164112 -7571043 -6624968
7903 -6624968 -7858488 -7670997 -2838615 2469138 2745690 162304 401234 2614464 1368540
7894 1368540 -3091898 -4618277 -1252018 1899531 1218785 -475578 246514 2011837 1781241
7885 1781241 -614717 -3556921 -6056691 -7028607 -5044946 -880406 2023423 1421265 -1278400
7876 -1278400 -3581921 -4755520 -4827884 -3064566 623675 4245462 5556726 4556783 2899558
7867 2899558 1566494 393267 -473266 5483 2283941 4750208 4949258 2878622 1708135
7858 1708135 3389105 4711131 1105665 -5665509 -8111840 -3130264 2977503 3096996
7850 3096996 -971963 -2206807 1073465 4161362 4097606 2691967 1249298 -1861595 -6830311
7841 -6830311 -10458484 -10749011 -9641744 -9110377 -7931727 -4601813 -611557 1562021 1630325
7832 1630325 701903 -852676 -3032697 -5210005 -6791675 -7582735 -6947141 -4415577 -1470330
7823 -1470330 -396870 -871771 -291162 1949726 3481965 3041775 2186019 1766094 315897
7814 315897 -2346840 -3721540 -3138776 -3755887 -6918553 -8353510 -4199290 2225805 4555420
7805 4555420 2199594 43110 727958 2441674 3784207 5517775 7100455 6416901 3943144
7796 3943144 2715231 3036127 1763610 -1543640 -2535531 1198296 5530882 5418362 1748268
7787 1748268 -1254039 -2714184 -4897805 -8061083 -9855095 -9178947 -6969168 -3683800
7779 -3683800 568412 3872192 4010395 1977603 654420 220060 -1473793 -4119677 -4864853
7770 -4864853 -3593251 -3724199 -6280899 -7672480 -5590549 -2721279 -1638222 -283383
7762 -283383 3512044 6801652 5774429 2437877 1581840 2868974 1777678 -2262706 -4614895
7753 -4614895 -2880142 -152343 652115 913816 2577438 4240242 3579291 960618 -1525585
7744 -1525585 -2602526 -2093026 -823080 -1005186 -4149704 -8003473 -8571751 -5718408 -3171990
7735 -3171990 -2345000 -698500 2245777 2478869 -1781893 -5592064 -3793713 1321108 3249576
7726 3249576 -297430 -6259960 -11247617 -13582328 -12254330 -8043791 -4436060 -3874165
7718 -3874165 -4511900 -3844762 -3313302 -5322828 -7920665 -7324490 -4371195 -3449791 -5684657
7709 -5684657 -7888529 -7921288 -6630134 -4776044 -2418924 -1089339 -2210373 -3653170 -2255174
7700 -2255174 723992 1390647 -198059 -704153 -367502 -2830818 -7573206 -9315638 -6665318
7691 -6665318 -4674625 -6230007 -7387633 -4659041 -755505 1008571 2181839 4309534
7683 4309534 4187841 -360778 -4844299 -4488958 -2050840 -2517212 -3918971 -1345671 2776727
7674 2776727 1602265 -3900427 -5316734 -700796 1359176 -4664707 -11906109 -11203227
7666 -11203227 -4193791 722232 1174642 1627466 3343820 1986276 -3440965 -6376328
7658 -6376328 -1303187 7830340 12220161 8946162 2995435 -311166 -783600 -1034281 -2392716
7649 -2392716 -4561487 -6646526 -6834582 -3282442 2708167 6421022 5103229 2032389
7641 2032389 2341662 5932640 7886861 5445817 917984 -2681130 -5090569 -6630352
7633 -6630352 -6134236 -3387403 -999201 -1118245 -1948075 -151965 4239367 7634663 7171416
7624 7171416 3469508 -580901 -2441885 -1613178 310554 1424436 1579889 1903921 2370293
7615 2370293 1577378 -633941 -2385804 -2506351 -2058705 -2034127 -1702910 -702553 -453037
7606 -453037 -1528263 -1793935 404676 3020047 2951930 506946 -1503038 -1953205 -1909120
7597 -1909120 -1817896 -994918 587555 2443157 4852821 7600292 8394318 5502833 1231973
7588 1231973 -607488 -452696 -2483055 -7831951 -12085897 -11215050 -6970560 -4093630 -4195513
7579 -4195513 -4906769 -4158681 -3006851 -3884086 -7197615 -10401230 -10596033 -7768003 -4677760
7570 -4677760 -3484391 -3805731 -4527714 -5414929 -5575817 -2860234 2520194 5881124 3246159
7561 3246159 -2635740 -5478343 -3893852 -2168779 -2876606 -3937073 -3929563 -4812798 -7074713
7552 -7074713 -7427639 -4813564 -3913086 -7897834 -11561789 -7745794 1475700 6506066 2998184
7543 2998184 -2973014 -3730663 1078911 6524216 9076213 8238094 4643897 61988 -2506212
7534 -2506212 -2036291 -1757543 -5119787 -10111086 -11043523 -6362386 -1155829 -237641 -1851891
7525 -1851891 -1302221 1311506 1448949 -1873246 -3300883 1181141 7446080 8218609 3140669
7516 3140669 -780158 1100426 5225048 5408871 914475 -3669244 -4705379 -3067350
7508 -3067350 -2166766 -4229885 -8149154 -10126309 -7299360 -1307413 3278399 4759067
7500 4759067 6174428 9779798 12373561 9284374 1436200 -5140765 -6447309 -4083535
7492 -4083535 -1785303 -1314232 -2059354 -2150306 347018 5025012 7963325 5704169 493100
7483 493100 -1641154 1334886 4907094 4342032 207746 -4091242 -6995896 -8645997 -8854346
7474 -8854346 -7930438 -7336694 -7090217 -4842582 -114566 3267515 2345809 75077 938594
7465 938594 3554506 2780870 -1805490 -5176610 -4913217 -4350318 -5977218 -6882491 -3914187
7456 -3914187 439741 1085580 -2883591 -7609061 -9461093 -8225515 -6218890 -5976114 -8000780
7447 -8000780 -9783516 -8266924 -3903614 -411239 99280 -767628 -1285846 -2044848 -3146890
7438 -3146890 -2589921 -204586 187457 -3735869 -7971514 -7332897 -3413365 -2347880 -5448163
7429 -5448163 -7269213 -3598149 3079836 7447599 7206631 3600456 -985554 -4197490
7421 -4197490 -4545515 -2767164 -1377691 -2003703 -3721945 -4050937 -1221236 3532061 5510626
7412 5510626 860302 -7171702 -9830380 -3975871 2209816 -18033 -6799802 -6900432
7404 -6900432 1309550 7282187 4192148 -1736889 -2046527 1682604 2621002 -55078 -1858465
7395 -1858465 -1286112 -353329 1157851 5345385 10637269 12298492 8959724 4391799 2327390
7386 2327390 2844260 4019421 4312922 3346426 2507482 4026112 7479508 8982262 6441490
7377 6441490 3296448 3465654 4923745 2992474 -1691248 -4029475 -2708413 -1861705 -3934854
7368 -3934854 -6386032 -7033109 -7632769 -9650061 -10648797 -8069913 -3794524 -1918110 -3586559
7359 -3586559 -6166562 -6298473 -2504674 3619964 7653364 5582485 -1732569 -8584847
7351 -8584847 -10017837 -6401206 -1927944 52420 -432634 -877037 858233 3930245 5086676
7342 5086676 2761159 -576813 -1862008 -1627076 -2029227 -2276342 10799 3633432 4650475
7333 4650475 2693791 1793515 3828669 5781176 5326567 4621502 5754152 6379198 3465653
7324 3465653 -1396918 -4043389 -3335182 -1710744 -1455981 -2895397 -5143340 -6603258 -5767737
7315 -5767737 -3079146 -899543 -703475 -1849691 -3557289 -5585446 -6376295 -3928567 174514
7306 174514 1306404 -1762569 -4801555 -4707999 -3773822 -4259818 -3510063 788592 4627540
7297 4627540 2969623 -1793157 -3064881 15914 2359887 1674615 605315 69941 -2441411
7288 -2441411 -6309693 -6263765 -570257 4835159 4459138 1063699 626552 2728539 1625572
7279 1625572 -4109234 -8523936 -6315369 -103988 3105028 938047 -2109399 -1563394
7271 -1563394 1175286 2148303 1605753 3183012 6738627 7197488 2398082 -2788499 -3600595
7262 -3600595 -2229907 -2783846 -3351702 467617 6661811 8913068 6786960 6008096 7882589
7253 7882589 6530899 -656615 -7243862 -6807206 -1883793 1026911 612753 -251129 -678295
7244 -678295 -1467859 -1545707 -10110 489566 -2581282 -6524376 -6877794 -4286624 -2888528
7235 -2888528 -3390579 -3217245 -2515682 -4023440 -6909789 -6685495 -2381838 1473148 1638969
7226 1638969 79062 -747949 -1707759 -3508521 -3768777 -936752 2225968 2504935 879743
7217 879743 52377 -116107 -1058753 -1439874 1298238 6282315 9754817 9923724 8225439
7208 8225439 6120309 3634016 990016 -1152613 -3195880 -5730706 -7204426 -5373788
7200 -5373788 -1377586 786364 -245139 -1309063 190965 2249441 1661555 -801482
7192 -801482 -1548527 663558 3523670 4767304 4521532 3801158 2636159 500218 -2364090
7183 -2364090 -4601882 -4548110 -1826283 1373011 1584149 -2183542 -6729121 -8072309 -5951507
7174 -5951507 -3415529 -2669889 -3345695 -4415478 -5263306 -4639814 -1347466 2855877 3446401
7165 3446401 -1791477 -9220295 -12682537 -9697442 -3175955 2148273 3827485 3083842
7157 3083842 3185832 5733756 8047671 5858457 -485036 -4912797 -2994283 1808626
7149 1808626 2801090 -373565 -1530182 2268767 5786924 3253933 -2991172 -5991025
7141 -5991025 -4395323 -3932478 -8141137 -12559543 -11126584 -5153904 -1527651 -2958870
7133 -2958870 -4761403 -2534026 1250733 1585093 -1056726 -1649034 1381555 3989881 3129713
7124 3129713 898870 -96215 -1328080 -4720542 -7656646 -6393355 -2858710 -2805887 -6999355
7115 -6999355 -9149778 -4474805 3437302 7117552 4348136 -105833 -1052721 1314284
7107 1314284 2515480 -637039 -6336490 -9656884 -7895414 -3370569 -388375 -299621 -897072
7098 -897072 -225858 867465 432918 -1684511 -3452279 -2706949 654290 4377807 6027305
7089 6027305 5431027 3968823 1589161 -2978622 -8060354 -8562892 -2849339 2663808 459821
7080 459821 -7850113 -13364629 -11665055 -7214942 -5052047 -3897583 -440984 4191829
7072 4191829 6287625 5013520 2416644 -59674 -1974043 -2499312 -1526768 -880164 -2000800
7063 -2000800 -3628108 -3835613 -2966155 -2520545 -2571869 -2277944 -1549195 -345568 2155096
7054 2155096 5802193 8354781 7833719 4606657 115652 -4211605 -5826973 -2370983
7046 -2370983 3753769 5834934 1012391 -5362479 -7040733 -5115357 -4688667 -6609625
7038 -6609625 -7818178 -7478840 -7079920 -6046548 -2895478 482816 1336499 1609921 4847425
7029 4847425 8582859 6949506 874034 -2069180 621376 2622013 -362875 -3524594
7021 -3524594 -1407533 2742901 1918594 -4539510 -11362232 -14946088 -15415398 -13382444 -9638391
7012 -9638391 -6779596 -6836986 -8009276 -7087336 -4092450 -1406754 377032 2286747 3681082
7003 3681082 2816853 457224 -400493 1304669 3475153 4199896 4005186 4105552 4233517
6994 4233517 3211121 829220 -1588642 -2485806 -1873221 -1440744 -2288391 -3228117 -2707583
6985 -2707583 -1694101 -2407321 -4538026 -5568723 -4981266 -4849725 -5529758 -4363205 -200562
6976 -200562 4160382 5965641 5833104 5240289 4104911 3091079 4579580 8296842 9536449
6967 9536449 5447587 -36671 -1639498 -296147 -778101 -4171186 -7594898 -9495966
6959 -9495966 -10016393 -7563149 -846002 6013870 6328830 -172807 -6245632 -6566352 -3842884
6950 -3842884 -3418172 -5628378 -6557353 -4249019 -1261811 -1249100 -4274510 -6091158 -2898908
6941 -2898908 3097200 5152010 423334 -5906329 -7677859 -5827020 -5155901 -5814465 -3976413
6932 -3976413 312502 2749904 2570102 3930416 7842126 9352215 5893958 2454819
6924 2454819 3959144 7266020 6052894 402609 -4027909 -4615499 -4234360 -5552631 -7491815
6915 -7491815 -8050227 -7194495 -5816129 -4130036 -2145648 -241666 1421741 3049224 4447517
6906 4447517 4977473 4471165 3552764 2962617 2984811 3399798 3556225 2632720 299089 -2731166
6896 -2731166 -4906017 -4870582 -2775215 -521153 86817 -467144 -287324 570063 -424273
6887 -424273 -4212692 -7622432 -7054942 -3257975 -92268 343319 -867537 -1671218 -357180
6878 -357180 3836656 8743305 9610686 4735353 -879401 -1321519 2289452 3977794 1525050
6869 1525050 -2248719 -5683689 -9650367 -12829905 -12036548 -8095177 -5226989 -3656198
6861 -3656198 358499 5677605 5373068 -2099468 -8585108 -7800724 -4041200 -3614929 -4578106
6852 -4578106 -2474985 -430935 -4341051 -11451708 -13117062 -7739829 -2555655 -2543190 -5076478
6843 -5076478 -6345548 -6275121 -5509045 -3229279 103931 2214414 2536751 2567678 2298885
6834 2298885 404300 -1760276 -896367 2780612 5248704 4842908 4486923 6495233 8972675
6825 8972675 8763354 4809738 -2090331 -9469040 -12912657 -9811453 -4101496 -2884328
6817 -2884328 -7207202 -10610934 -8208265 -2580760 1257323 2106341 1203332 -1060362 -3808994
6808 -3808994 -4609787 -2956597 -1840726 -3032900 -4008892 -2559230 -991490 -2016666 -3634406
6799 -3634406 -2619298 -746146 -2612335 -8457627 -13831699 -16032587 -16564940 -16837011 -15253542
6790 -15253542 -9981610 -2411840 3217027 2955930 -3341328 -10466577 -11488537 -5060684
6782 -5060684 2597394 5502655 5372928 7498909 11413338 11403778 5894409 100069 -1946711
6773 -1946711 -2031154 -1991635 584019 6507127 10009153 5825136 -1863069 -4254700 -228257
6764 -228257 3021283 1578340 -83082 2379846 5883002 4962871 -381327 -6000527 -9453016
6755 -9453016 -10644987 -9507220 -7142145 -6849076 -9713251 -11343007 -7681705 -2139713
6747 -2139713 -1470463 -5709568 -8318534 -6296551 -3781494 -4362247 -5966177 -5761014 -4624478
6738 -4624478 -3725280 -1597802 1979501 3700714 1993759 377103 1774868 3738817
6730 3738817 3522763 3334146 5254982 5431372 153137 -5748721 -4580662 2052364 5280589
6721 5280589 2741515 1355948 4870040 7675891 5075010 1808277 4073783 8642953
6713 8642953 7529554 843833 -2642494 1947647 8788190 9564324 4258633 14911
6705 14911 1094729 4051521 3540739 -438062 -3695706 -4286056 -4035413 -4007456 -2670547
6696 -2670547 251633 2186763 2102998 2551370 4535094 4558026 719687 -2486461 -797303
6687 -797303 2150368 393892 -4104727 -4758300 -2227686 -3833185 -10644523 -14552465 -10945504
6678 -10945504 -5736254 -5435304 -7704601 -7336394 -5456885 -6209976 -8568787 -8178220 -4977500
6669 -4977500 -3030146 -3818289 -4462952 -2247604 2416015 6957461 8245254 4464598 -2483674
6660 -2483674 -7870628 -9039074 -7652645 -6170994 -5078563 -4723447 -5852118 -6418438 -2554888
6651 -2554888 4376950 6726740 765057 -6635952 -6738466 -552362 3985862 3297315 488216
6642 488216 -1245993 -1208784 1280115 5805105 8332105 5696696 1644541 2202799 5864833
6633 5864833 5466129 39900 -2925396 810751 5407965 3617148 -3226567 -8268093
6625 -8268093 -8207487 -5061729 -1826189 -439766 -1984317 -5184599 -6120859 -2709898 1597145
6616 1597145 1648406 -2587226 -6004609 -5008200 -1359903 1139721 1315763 588179 14959
6607 14959 -590676 -1164306 -1150851 -1172395 -2869485 -5726893 -5985292 -1285215 4733990 5848767
6597 5848767 1234584 -3500496 -3970236 -1940311 -1068832 -1576747 -1769873 -1545436 -1254394
6588 -1254394 96075 2265942 2253153 -1007049 -3292581 -843481 3169550 3217866 485482
6579 485482 1181580 6406862 10100561 8032685 3195633 453030 540760 1437308 1718338
6570 1718338 549994 -2191570 -4116853 -2106343 2484409 4053513 147840 -4963899
6562 -4963899 -6434378 -5034668 -4297318 -4623093 -3898388 -1901052 -333406 575042 2298255
6553 2298255 5151192 7648441 8628430 8187628 6672472 4308230 1797111 151233 -86311
6544 -86311 992570 2663020 3301029 1255687 -2979545 -6327740 -6124861 -3214209 -992216
6535 -992216 -1385826 -2611760 -1378375 2910980 6835524 6541028 2339734 -1611176 -2432562
6526 -2432562 -1431543 -900316 -302639 1973428 4666909 4658032 1574587 -1594561 -2846100
6517 -2846100 -3517027 -5371104 -7323246 -6504166 -1973236 3404029 5103802 1601968 -3298760
6508 -3298760 -4449611 -1815194 -302310 -2359027 -4537567 -3700356 -2448828 -4337591
6500 -4337591 -7322280 -7199284 -4727745 -3418223 -2593304 536941 3617075 1894473 -2345416
6491 -2345416 -1933393 2607907 2238227 -5582349 -10601615 -4546660 5740806 7873887
6483 7873887 1043328 -5114879 -5423776 -3946769 -4592081 -5151268 -2588580 1511316 3617900
6474 3617900 3262122 3164564 5575348 9245989 9769087 4011031 -5162885 -10881942 -10440875
6465 -10440875 -8496409 -9670994 -11514692 -9104744 -3900781 -2273657 -5965731 -9677621
6457 -9677621 -8969050 -5612449 -3228900 -1792707 528012 2804937 2242747 -1044278 -3123531
6448 -3123531 -993938 3371082 5265468 3165021 579835 1118889 3483079 3608639 730411
6439 730411 -1814841 -1748356 -373061 732929 1849929 2395866 -183516 -6149509 -11116800
6430 -11116800 -11043080 -7323655 -4149585 -3167573 -3748771 -5947352 -9269379 -10478442 -7094111
6421 -7094111 -2092960 -770058 -3259299 -4455961 -1756791 1234115 122784 -4315207
6413 -4315207 -7517627 -6685448 -3426167 -1704705 -3851296 -8109623 -10268206 -8239671
6405 -8239671 -4165137 -1127144 674006 2631885 4067948 2738554 -1100382 -3654041
6397 -3654041 -1502968 4543059 9931702 10376964 5825290 733402 -439202 1985155
6389 1985155 4133196 4225374 3961422 3888490 1711988 -2598443 -4413299 -968840 3316389
6380 3316389 2779009 -1091062 -2701693 -1837432 -3710641 -9757974 -14510477 -12987391 -6397489
6371 -6397489 1009118 6478631 8471698 5900042 88518 -5237812 -7832233 -8581222
6363 -8581222 -8217992 -5311079 683080 6803541 9136863 6651338 1395864 -3485323
6355 -3485323 -5103079 -2298664 2785455 6063340 5592352 3173614 1348073 453878 -485978
6346 -485978 -1559156 -1911931 -1092270 322680 1012396 -118381 -2501311 -3853038 -2673355
6337 -2673355 -283046 914389 550926 211146 1008433 2867019 5293848 7043829 6137475
6328 6137475 2400490 -1082337 -1337922 874995 3089669 4795751 5897063 3856949
6320 3856949 -2827883 -9687043 -10340958 -5280620 -1130942 -977697 -1380883 -6966 263458
6311 263458 -2604939 -5625319 -6281435 -7002119 -9926453 -11793740 -9035153 -4341436 -2750627
6302 -2750627 -3770154 -2984835 -6129 809345 -2533346 -6680668 -7798973 -5689421 -2223843
6293 -2223843 1090807 2907287 2097263 -579314 -2650001 -2858756 -2489407 -2869243 -2992179
6284 -2992179 -1074870 2189456 3619955 1348084 -2477322 -4131918 -3049605 -2131919
6276 -2131919 -2945932 -3291489 -1290470 917003 741536 -31195 1537390 3284582 801848
6267 801848 -3903733 -3551163 3013434 7551123 4109083 -2293858 -3619841 -145157 2254763
6258 2254763 1998775 1910204 2023503 -162714 -2996539 -1516116 4156662 7631078 5283259
6249 5283259 1045597 -254267 344965 -1009315 -4624402 -7322507 -6822145 -3443253 998427
6240 998427 3901765 2960666 -1383067 -5488516 -6075082 -3472879 -421722 978825 -57857
6231 -57857 -3642252 -8372897 -10788255 -8127741 -1964151 2625293 2262980 -1287655 -3467677
6222 -3467677 -1935914 1516574 3482016 2213888 -1559762 -5676738 -7619743 -5818536
6214 -5818536 -1414977 1935044 1770179 -45370 117172 2299722 2993465 981015 -291262
6205 -291262 1877949 4697439 3741194 -291300 -2303788 255856 4449869 6107483 4363526
6196 4363526 1266844 -1087583 -2087646 -2413558 -2866505 -2925647 -1056321 2593206 4948722
6187 4948722 3392767 -327054 -1896172 49616 2586361 2914892 1701895 1135995 1643828
6178 1643828 1924991 1160040 -30880 -514391 -41194 222539 -1058489 -3283204 -4169708
6169 -4169708 -3150574 -2963495 -5683678 -8479468 -6697915 -1048363 2103750 -1045024
6161 -1045024 -6515008 -7865188 -4284391 -411678 473774 -287562 -234304 560045 710047
6152 710047 420568 989851 1892537 580683 -3801041 -8034431 -8202810 -4993991 -3090417
6143 -3090417 -4604265 -5915976 -3170315 1349474 1709632 -3682013 -10033336 -12275588
6135 -12275588 -10173315 -6822634 -4939906 -5456447 -7042981 -6120913 -330112 6808935
6127 6808935 8150119 1982363 -4578732 -4392541 605517 3311760 2008281 1415226 3846433
6118 3846433 5392323 2600137 -2067947 -4411996 -4377739 -4247373 -3730307 -993346 2796892
6109 2796892 4056127 1792006 -1296806 -2915075 -3259454 -2615682 -308783 2545661 2415839
6100 2415839 -2090035 -7310774 -8958947 -7826487 -7948023 -10131251 -11024994 -8700873 -5328244
6091 -5328244 -2954666 -112181 4785313 9253299 9495826 6228714 4052068 4825895 5122551
6082 5122551 1695602 -3271415 -4824889 -1715181 2378371 3740640 2369000 366794
6074 366794 -1344226 -3287722 -5447161 -6628320 -5830522 -3309741 -110927 2826306 4932558
6065 4932558 5926082 5792396 4642779 2506278 -493022 -3745075 -6329776 -7784888 -8481210
6056 -8481210 -9070978 -9704329 -9943574 -9453723 -8674242 -8471212 -8769004 -7949938 -4654347
6047 -4654347 -139012 2698284 3182895 3831904 6155640 7704027 5821438 2443479 1454883
6038 1454883 2335140 982013 -3109143 -5580665 -4430264 -3246732 -4576775 -5103851 -1500876
6029 -1500876 3185889 4057141 2020468 1447092 2650771 2610783 1522104 2366119 4637566
6020 4637566 4642071 1994461 -117027 -1247697 -3992722 -7455682 -7260263 -3560652 -2050618
6011 -2050618 -4571957 -5762692 -2486439 468017 -1080701 -2971502 352198 6368229
6003 6368229 8696411 6822248 4733736 2947476 -973660 -5900076 -8037005 -7311358
5995 -7311358 -6621539 -5674104 -1931627 2819157 3513859 -12736 -2050608 541092 4351609
5986 4351609 5303218 3484268 508398 -3159321 -6255831 -6401174 -3958230 -2645274 -4353491
5977 -4353491 -6584834 -6578687 -4581209 -1561205 2526693 6270359 6462247 2938653 493156
5968 493156 2867743 7325667 8293470 4526838 -353545 -3193183 -4293218 -5466463 -7268417
5959 -7268417 -8440234 -7317739 -3944785 -737042 -49938 -1214401 -1479167 184541 2046339
5950 2046339 2396271 1330927 -357752 -1941039 -2220880 -444320 1986556 2734683 1378528
5941 1378528 -968033 -4002142 -7262058 -7907097 -3703155 2053016 3382113 -45401
5933 -45401 -2310368 -25416 3467482 4444147 4026752 4398194 4737049 4088096 3698597
5924 3698597 3228486 -567191 -7543484 -11484881 -8456101 -3254410 -2140642 -3524804
5916 -3524804 -2275507 583599 160426 -2751725 -2555646 1540385 4649490 5151325 6847675
5907 6847675 10849196 12514789 8940507 3380134 -448492 -2854180 -4234718 -2391725
5899 -2391725 2465701 5087446 2052754 -2688927 -3670770 -1794797 -1376870 -2192036 -373559
5890 -373559 3895622 5462930 1796983 -3024816 -3663755 161254 4510587 6361150 6011773
5881 6011773 5207688 4469879 2799019 -190725 -2648319 -2259907 293442 1501065 -247257
5872 -247257 -1790984 1004094 7542313 12717682 12613367 8252207 3698760 1949700 2850716
5863 2850716 3840928 2529328 -688855 -2813714 -1883761 241098 233726 -2053223 -3381039
5854 -3381039 -1843944 314450 -265554 -3676089 -6809453 -7011445 -4385803 -900999 1576174
5845 1576174 2347184 1880930 1106228 585322 495012 1231064 3089099 5010166 4957361 2707434
5835 2707434 1142507 2865309 6092541 6319137 2325539 -1998016 -2807701 -721717 1670416
5826 1670416 3999611 6609656 6876440 1792302 -5775692 -8383046 -3511794 2419955
5818 2419955 2676158 -735991 -1144293 2015217 2462911 -2724733 -8030425 -7228181 -1893660
5809 -1893660 1650717 1223036 206059 1117743 2255397 1501087 -251732 -1440935 -3018658
5800 -3018658 -6672391 -11179030 -13239382 -11805356 -9366998 -8501948 -8953694 -8958999 -7977440
5791 -7977440 -6814816 -5920832 -4942082 -3671008 -2387056 -1409706 -1083531 -1824708 -3295921
5782 -3295921 -4093874 -3546741 -3334647 -5483402 -8731229 -9065387 -4717606 1251410 4551155
5773 4551155 4147829 1724354 -1472855 -4893907 -7031772 -6438419 -4261117 -3234272 -3980812
5764 -3980812 -4709437 -4755113 -5498853 -6883077 -6172927 -2188332 1907984 2783092 1824114
5755 1824114 2582906 4779152 4771077 1683425 -962849 -526842 1495291 2971791 4520793
$$ [...]
##END NTUPLES=NMR SPECTRUM
##END=
