##TITLE=31Pdec_SR69_k2
 CDCl3, 124 sc
 9.07.2021
##JCAMPDX= 6.0         $$ Bruker NMR JCAMP-DX V2.0
##DATA TYPE= NMR SPECTRUM
##DATA CLASS= NTUPLES
##ORIGIN= UXNMR, Bruker Analytische Messtechnik GmbH
##OWNER= root
$$ XWIN-NMR		Version 3.5
$$ Fri Jul  9 13:05:02 2021 Russian Standard Time (UT+4h)  she@DPX200
##.OBSERVE FREQUENCY= 81.013821
##.OBSERVE NUCLEUS= ^31P
##.ACQUISITION MODE= SIMULTANEOUS
##.ACQUISITION SCHEME= undefined
##.AVERAGES= 124
##.DIGITISER RES= 16
##SPECTROMETER/DATA SYSTEM= spect
##.PULSE SEQUENCE= zgpg30
##.SOLVENT NAME= DMSO
##.SHIFT REFERENCE= (INTERNAL, DMSO, 0, 248.564)
##AUDIT TRAIL= $$ (NUMBER, WHEN, WHO, WHERE, WHAT)
$$ ##TITLE= Audit trail, XWIN-NMR		Version 3.5
$$ ##JCAMPDX= 5.01
$$ ##ORIGIN= Bruker BioSpin GmbH
$$ ##OWNER= she
$$ F:/spectra/data/she/nmr/P31/1/pdata/1/auditp.txt
$$ ##AUDIT TRAIL=  $$ (NUMBER, WHEN, WHO, WHERE, WHAT)
(   1,<2021-07-09 12:57:22.25 +0400>,<she>,<DPX200>,
      <continue with go, POWCHK disabled, PULCHK disabled
       configuration hash MD5:
       00 E9 B6 7A A2 85 ED C7 34 08 36 98 17 FE 4E 26
       data hash MD5: 32K
       03 F8 86 E9 3E D9 9D 8C 04 72 C1 C5 28 8D 89 EA>)
(   2,<2021-07-09 13:03:54.60 +0400>,<she>,<DPX200>,
      <Start of raw data processing
       efp BC_mod = 2 LB = 1 FT_mod = 6 PKNL = 1 PHC0 = -7884.039 PHC1 = 1092.475 SI = 64K 
       data hash MD5: 64K
       7E 5B 17 54 7F CA 0F 1F 48 2A 11 F8 B2 F7 17 62>)
(   3,<2021-07-09 13:04:15.73 +0400>,<she>,<DPX200>,
      <pk PHC0 = 78.92586 PHC1 = 14 
       data hash MD5: 64K
       A1 1F 8A 96 F4 80 8E 56 B5 D6 96 00 A1 E1 B2 76>)
(   4,<2021-07-09 13:04:20.00 +0400>,<she>,<DPX200>,
      <abs ABSG = 5 
       data hash MD5: 64K
       D0 78 5D 91 08 96 3D AF 57 89 6C B5 61 2F 32 A9>)
$$ ##END=
$$ 
$$ hash MD5
$$ 50 6C A8 5A A3 FD FC 32 16 EA DF D3 97 E6 94 FC
##$RELAX= 
##$RELAX= 
##$RELAX= 
##$RELAX= 
##$RELAX= 
##$RELAX= 
##$RELAX= 
##$RELAX= 
$$ Bruker specific parameters
$$ --------------------------
##$DU= <F:/spectra>
##$EXPNO= 1
##$NAME= <P31>
##$PROCNO= 1
##$TYPE= <nmr>
##$USER= <she>
##$AMP= (0..31)
100 100 100 100 100 100 100 100 100 100 100 100 100 100 100 100 100 100 
100 100 100 100 100 100 100 100 100 100 100 100 100 100 
##$AQSEQ= 0
##$AQ_mod= 1
##$AUNM= <au_zg>
##$AUTOPOS= <>
##$BF1= 81.014009
##$BF2= 200.13
##$BF3= 200.13
##$BF4= 200.13
##$BF5= 200.13
##$BF6= 200.13
##$BF7= 200.13
##$BF8= 200.13
##$BYTORDA= 1
##$CFDGTYP= 0
##$CFRGTYP= 5
##$CHEMSTR= <none>
##$CNST= (0..31)
1 1 145 1 1 1 1 1 1 1 1 1 1 1 1 1 1 1 1 1 1 1 1 1 1 1 1 1 1 1 1 1 
##$CPDPRG= <waltz16>
##$CPDPRG1= <>
##$CPDPRG2= <waltz16>
##$CPDPRG3= <>
##$CPDPRG4= <mlev>
##$CPDPRG5= <mlev>
##$CPDPRG6= <mlev>
##$CPDPRG7= <mlev>
##$CPDPRG8= <mlev>
##$CPDPRGB= <>
##$CPDPRGT= <>
##$D= (0..31)
0 1 0 0 0 0 0 0 0 0 0 0.03 2e-05 3e-06 0 0 0 0 0 0 0 0 0 0 0 0 0 0 0 0 
0 0 
##$DATE= 1625820875
##$DBL= (0..7)
120 120 120 11 120 120 24 19 
##$DBP= (0..7)
150 150 150 150 150 150 150 150 
##$DBP07= 0
##$DBPNAM0= <>
##$DBPNAM1= <>
##$DBPNAM2= <>
$$ [...]
##$SUBNAM3= <"">
##$SUBNAM4= <"">
##$SUBNAM5= <"">
##$SUBNAM6= <"">
##$SUBNAM7= <"">
##$SUBNAM8= <"">
##$SUBNAM9= <"">
##$SW= 501.771253377433
##$SWIBOX= (0..15)
0 1 3 0 0 0 0 0 0 0 0 0 0 0 0 0 
##$SW_h= 40650.406504065
##$TD= 32768
##$TD0= 1
##$TE= 0
##$TE2= 300
##$TE3= 300
##$TEG= 300
##$TL= (0..7)
0 120 53 12 22 120 120 120 
##$TP= (0..7)
150 150 150 150 150 150 150 150 
##$TP07= 0
##$TPNAME0= <>
##$TPNAME1= <>
##$TPNAME2= <>
##$TPNAME3= <>
##$TPNAME4= <>
##$TPNAME5= <>
##$TPNAME6= <>
##$TPNAME7= <>
##$TPOAL= (0..7)
0.5 0.5 0.5 0.5 0.5 0.5 0.5 0.5 
##$TPOFFS= (0..7)
0 0 0 0 0 0 0 0 
##$TUNHIN= 0
##$TUNHOUT= 0
##$TUNXOUT= 0
##$USERA1= <user>
##$USERA2= <user>
##$USERA3= <user>
##$USERA4= <user>
##$USERA5= <user>
##$V9= 5
##$VALIST= <valist>
##$VCLIST= <CCCCCCCCCCCCCCC>
##$VD= 0
##$VDLIST= <DDDDDDDDDDDDDDD>
##$VPLIST= <PPPPPPPPPPPPPPP>
##$VTLIST= <TTTTTTTTTTTTTTT>
##$WBST= 1024
##$WBSW= 4
##$XGAIN= (0..3)
0 0 0 0 
##$XL= 0
##$YL= 0
##$YMAX_a= 3388
##$YMIN_a= -7049
##$ZGOPTNS= <>
##$ZL1= 120
##$ZL2= 120
##$ZL3= 120
##$ZL4= 120
##$ABSF1= 248.5645
##$ABSF2= -253.2056
##$ABSG= 5
##$ABSL= 3
##$ALPHA= 0
##$AQORDER= 0
##$ASSFAC= 0
##$ASSFACI= 0
##$ASSFACX= 0
##$ASSWID= 0
##$AUNMP= <proc_1d>
##$AZFE= 0.1
##$AZFW= 0.5
##$BCFW= 0
##$BC_mod= 2
##$BYTORDP= 0
##$COROFFS= 0
##$CY= -3
##$DATMOD= 1
##$DC= 0
##$DFILT= <>
##$DTYPP= 0
##$F1P= 0
##$F2P= 0
##$FCOR= 1
##$FTSIZE= 65536
##$FT_mod= 6
##$GAMMA= 0
##$GB= 0
##$INTBC= 1
##$INTSCL= 5.30512e-09
##$ISEN= 30
##$LB= 1
##$LEV0= 0
##$LPBIN= 0
##$MAXI= 10000
##$MC2= 0
##$MEAN= 0
##$ME_mod= 0
##$MI= 50
##$NCOEF= 0
##$NC_proc= -7
##$NLEV= 6
##$NOISF1= 182.463
##$NOISF2= 159.3651
##$NSP= 0
##$NTH_PI= 0
##$NZP= 0
##$OFFSET= 248.5645
##$PC= 4
##$PHC0= -7805.113
##$PHC1= 1106.475
##$PH_mod= 1
##$PKNL= yes
##$PPARMOD= 0
##$PSCAL= 0
##$PSIGN= 0
##$REVERSE= no
##$SF= 81.014009
##$SI= 65536
##$SIGF1= 159.3651
##$SIGF2= -187.1042
##$SINO= 113.3802
##$SIOLD= 16384
##$SREGLST= <1H.CDCl3>
##$SSB= 0
##$STSI= 65536
##$STSR= 0
##$SW_p= 40650.406504065
##$SYMM= 0
##$S_DEV= 0
##$TDeff= 32768
##$TDoff= 0
##$TI= <>
##$TILT= no
##$TM1= 0
##$TM2= 0
##$TOPLEV= 0
##$USERP1= <user>
##$USERP2= <user>
##$USERP3= <user>
##$USERP4= <user>
##$USERP5= <user>
##$WDW= 1
##$XDIM= 65536
##$YMAX_p= 468990083
##$YMIN_p= -114642885
$$ End of Bruker specific parameters
$$ ---------------------------------
##NTUPLES= NMR SPECTRUM
##VAR_NAME=  FREQUENCY,     SPECTRUM/REAL,   SPECTRUM/IMAG
##SYMBOL=    X,             R,               I
##VAR_TYPE=  INDEPENDENT,   DEPENDENT,       DEPENDENT
##VAR_FORM=  AFFN,          ASDF,            ASDF
##VAR_DIM=   65536,         65536,           65536
##UNITS=     HZ,            ARBITRARY UNITS, ARBITRARY UNITS
##FACTOR=    0.620285442955139, 1,           1
##FIRST=     20137.2065510759, 0,            0
##LAST=      -20513.1999529892, 0,           0
##MIN=       -20513.1999529892, -114642885,  0
##MAX=       20137.2065510759, 468990083,    0
$$ Real data points
##PAGE= N=1
##DATA TABLE= (X++(R..R)), XYDATA
$$ [...]
13027A0931806K513738J80535m65252j115240m716080q340681o375055m10938
$$ 10931806 13445544 13626079 13160827 12045587 7329507 -1011174 -7386229 -7797167
13019g797167K041056n26819j356674K888757O624617M989054J104251o94545
$$ -7797167 -5756111 -6282930 -7639604 -4750847 1873770 6862824 7967075 7272530
13011G272530j578360l138031k540023J338519L235934n09601m884494l959716
$$ 7272530 5694170 2556139 16116 1354635 4590569 4080968 -803526 -4763242
13003d763242n20556m92373k515044j430152J675523J943162N25248K406215N930401
$$ -4763242 -5283798 -5776171 -8291215 -9721367 -8045844 -6102682 -5577434 -3171219 2759182
12994B759182M344753k101655n265328j935487J493729M4664k472017j223880
$$ 2759182 7103935 5002280 -263048 -2198535 -704806 -660142 -3132159 -4356039
12986d356039J707430K267547J565629K452262L195356L55732m579015o645254
$$ -4356039 -2648609 -381062 1184567 3636829 6832185 7187917 2608902 -4036352
12978d036352m179991j8030L051914M338462L500914M20274k969526l658662j214227
$$ -4036352 -8216343 -8234373 -5182459 -843997 2656917 3077191 107665 -3550997 -4765224
12969d765224J408366J452273n68496k105925j865063p83427l2876P24998K342894
$$ -4765224 -3356858 -1904585 -2473081 -4579006 -6444069 -7227496 -7260372 -6535374 -4192480
12960d192480M116979M046834J379554k147721l998456l047329j89625K172577
$$ -4192480 -75501 3971333 5350887 3203166 -795290 -3842619 -4032244 -1859667
12952a859667J632589j501510l385373r55660L218304L686898q8038k802562j247907
$$ -1859667 -227078 -1728588 -5113961 -6069621 -2851317 835581 747543 -2055019 -3302926
12943c302926J376696J173811r94288k594354l478683l492496o63542M136903
$$ -3302926 -1926230 -752419 -1746707 -4341061 -7819744 -11312240 -11975782 -7838879
12935g838879N434790R77487l274251j634804K441084K660151N08109J327439
$$ -7838879 -2404089 -1426602 -4700853 -6335657 -3894573 -1234422 -726313 601126
12927F01126L444969Q97221m860829o111780j639751J426615m03588k464616j304253
$$ 601126 4046095 4943316 82487 -6029293 -7669044 -6242429 -6646017 -9110633 -10414886
12918a0414886L03641L51613J255790L415789L035475j74539p71514L097925N572544
$$ -10414886 -10111245 -9759632 -8503842 -5088053 -2052578 -2227117 -2998631 99294 5671838
12909E671838K621916j325550j106860J317418J711699K19526j732249n059792
$$ 5671838 8293754 6968204 5861344 7178762 8890461 9109987 7377738 2317946
12901B317946q351869n939083L103440R831679O495370j975749n086113j631319
$$ 2317946 -6033923 -11973006 -8869566 962113 7457483 5481734 395621 -1235698
12893a235698O09083k138469n065292l348444J138505L221546P63266l480812
$$ -1235698 -626615 -2765084 -7830376 -11178820 -10040315 -6818769 -6055503 -9536315
12885i536315m589308m08456N371684O804550K921679j517319k946336k443600
$$ -9536315 -14125623 -14534079 -9162395 -2357845 563834 -953485 -3899821 -6343421
12877f343421j430124P18275K996695K451299j56471l47939K069965J927653j558636
$$ -6343421 -7773545 -7055270 -4058575 -1607276 -1763747 -2111686 -41721 1885932 327296
12868C27296k138639K199575M244790k11245m186482j250062L134994J334268
$$ 327296 -1811343 388232 4633022 4421777 235295 -1014767 2120227 3454495
12860C454495l050820k072668K653821M081209K362267J931533R77465l928619
$$ 3454495 403675 -1668993 984828 5066037 7428304 9359837 10337302 6408683
12852F408683p158756j471505P098595O224416k517745n528155O85382M885417
$$ 6408683 -750073 -2221578 4877017 11101433 8583688 3055533 3740915 8626332
12844H626332R29749l278695j455737Q61256j410198l169089R1066K624592j332397
$$ 8626332 9556081 6277386 4821649 5682905 4272707 1103618 1194684 3819276 2486879
12835B486879o442430m739076J518414M368010K364232J35914k53930j91220K00412
$$ 2486879 -3955551 -8694627 -7176213 -2808203 -443971 -308057 -561987 -753207 -552795
12826e52795J498102K230823J387881O97150O61351j533970o163296p914597l627702
$$ -552795 945307 3176130 4564011 5261161 5922512 4388542 -1774754 -9689351 -13317053
12817a3317053J687006K214959L30281J798925N578217N591284P58100l662053
$$ -13317053 -11630047 -9415088 -9084807 -7285882 -1707665 3883619 4641719 979666
12809I79666m285133l167598k697891j940095N25785L499924M468557K436726
$$ 979666 -3305467 -6473065 -9170956 -11111051 -10585266 -7085342 -2616785 -180059
12801a80059j151790l583668l322845j815303j884307l843844m564372j120791
$$ -180059 -1331849 -4915517 -8238362 -10053665 -11937972 -15781816 -20346188 -21466979
12793b1466979N566643J0912436J0032187K351027n972624o956976o14588L805673
$$ -21466979 -15900336 -4987900 5044287 7395314 1422690 -5534286 -6148874 -2343201
12785b343201M56522l919113l25045P347900P605109l55370n514731k800165M89264
$$ -2343201 -1886679 -5805792 -6130837 1217063 8822172 8466802 2952071 151906 641170
12776F41170r46436k160041N06011J665611j796641k777670L304422P815173K118375
$$ 641170 -305266 -2465307 -1959296 -293685 -2090326 -4867996 -1563574 6251599 8369974
12767H369974o863656o904439O6079K330066j976507l827678k83312J716842l95549
$$ 8369974 1506318 -5398121 -5332042 -3001976 -4978483 -8806161 -9089473 -7372631 -7768180
12758g768180j28273M967846P238826J507942n664620n825219p26889K127893
$$ -7768180 -7896453 -2928607 4310219 5818161 153541 -5671678 -6398567 -4270674
12750d270674J047064M93562K580566M259603K579735j251749l583707k288197
$$ -4270674 -3223610 -2730048 -149482 4110121 6689856 5438107 1854400 -433797
12742d33797J095145K684329L60849l542957m922401k892825k26960R01996J178528
$$ -433797 661348 3345677 3706526 163569 -4758832 -7651657 -7878617 -6976621 -5798093
12733e798093J805947K284560J580482l9862j406164j860741j585124r39560j2765
$$ -5798093 -3992146 -1707586 -127104 -166966 -1573130 -3433871 -5018995 -5958555 -5971320
12724e971320J002886J272026K02488p06885J148607M967247N594740N89165m322245
$$ -5971320 -4968434 -3696408 -3493920 -4200805 -3052198 1915049 7509789 8098954 3776709
12715C776709k412073L160058L205160k826129n282798N3519M741168J693830
$$ 3776709 1364636 4524694 7729854 4903725 -379073 -325554 4415614 6109444
12707F109444l023060j004240L672037J552237n240003n738018J612193N892063
$$ 6109444 3086384 2082144 5754181 7306418 2066415 -3671603 -2059410 3832653
12699C832653Q77578n716435m827422P17294K118687j629734l198357J412712
$$ 3832653 4710231 -1006204 -5833626 -5116332 -2997645 -4627379 -7825736 -6413024
12691f413024O827803N725849r85589n023055j895682K636517Q25405n076913
$$ -6413024 414779 6140628 5155039 131984 -1763698 872819 1698224 -3378689
12683c378689n579770J529520P428757N562604M54299j575136k299621n064514
$$ -3378689 -8958459 -7428939 -182 5562422 6016721 4441585 2141964 -2922550
12675b922550n852694l09066N953992M649253j453547k983845O40428J826854
$$ -2922550 -8775244 -9084310 -3130318 1518935 65388 -2918457 -2278029 -451175
12667d51175p64047p62929K617793K359441k896197n005121j6722M967958L679019
$$ -451175 -1215222 -1978151 639642 2999083 102886 -4902235 -4918957 49001 3728020
12658C728020j81457j300872j369435k922588k602582K063589N706372K687733
$$ 3728020 3546563 2245691 876256 -2046332 -4648914 -2585325 3121047 5808780
12650E808780l271125m465183n51933K394342J566884j15664K24028K109961L237204
$$ 5808780 2537655 -1927528 -2479461 -85119 1481765 1366101 1590129 3700090 6937294
12641F937294J324310l703794p542417n034712K142146O121097L794174J151329
$$ 6937294 8261604 4557810 -2984607 -8019319 -5877173 243924 4038098 5189427
12633E189427K779995L923940o93271o456458n777837r28907k66285m018315m084178
$$ 5189427 7969422 11893362 11200091 4743633 -1034204 -1963111 -2229396 -6247711 -10331889
12624a0331889J918314O307358L504122j902538l251585j185977k0854O1310J488573
$$ -10331889 -8413575 -2106217 1397905 -504633 -3756218 -4942195 -4963049 -4901739 -3413166
12615c413166L202348J952629j435554k303060Q13420L541515J739453k756349
$$ -3413166 -210818 1741811 306257 -1996803 -1183383 2358132 4097585 1341236
12607A341236m907970l252043q75247p1911M94988K021277K255358q39803m163135
$$ 1341236 -3566734 -6818777 -7694024 -7765935 -7270947 -5249670 -2994312 -3834115 -7997250
12598g997250k623325L039087O174921L251617j333945j978937M05768J219950
$$ -7997250 -10620575 -7581488 -1406567 1845050 511105 -1467832 -1062064 157886
12590A57886p6811j8200K016865K213639j310612m826790m127221m05947J978696
$$ 157886 81075 62875 2079740 4293379 2982767 -1844023 -5971244 -6377191 -4398495
12581d398495J731288J152228J241226J91783k449262l808541j999491O15537
$$ -4398495 -2667207 -1514979 -273753 -81970 -2531232 -6339773 -8339264 -7723727
12573g723727J383642J813198M051833N349331J745476l836240m178146Q27964
$$ -7723727 -6340085 -4526887 -475054 4874277 6619753 2783513 -1394633 -566669
12565e66669L043801r60712l880209K86624N794205M318367j594589l535816j257689
$$ -566669 2477132 1516420 -2363789 -2077165 3717040 8035407 6440818 2905002 1647313
12556A647313j171767l399785j812945L276471M179947m96693k611785J319819
$$ 1647313 475546 -2924239 -4737184 -1460713 2719234 2222541 -389244 930575
12548I30575L633648j040584n928817l479404J901696J763866k242572k361295
$$ 930575 4564223 3523639 -2405178 -5884582 -3982886 -2219020 -4461592 -6822887
12540f822887J505540K713934L84790L19028L364859L103959k457467n932765
$$ -6822887 -5317347 -2603413 -2218623 -1899595 1465264 4569223 2111756 -3821009
12532c821009j767772M647702M910001j31677k569785M35295L352802J442392
$$ -3821009 -5588781 -941079 3968922 3837245 1267460 1702755 5055557 6497949
12524F497949k489902l172384q41857J9720j711574k252986L03432K159010l77836
$$ 6497949 4008047 835663 -6194 13526 -1698048 -3951034 -3647602 -1488592 -1866428
12515a866428m521306m632069n02227K605580J854550J62620P65998K562714K689038
$$ -1866428 -6387734 -11019803 -11522030 -8916450 -7061900 -6899280 -6133282 -3570568 -881530
12506h81530O86522j758719k991512j988020J074113L863183L744993J391932
$$ -881530 -195008 -1953727 -4945239 -6933259 -5859146 -1995963 1749030 3140962
12498C140962J89541J418325K709825K013011J43109j626175l520754n474716
$$ 3140962 3330503 4748828 7458653 9471664 9614773 7988598 4467844 -1006872
12490a006872o037938m459067j779417Q33947K736189K952076J498934J004756
$$ -1006872 -7044810 -11503877 -13283294 -12449347 -9713158 -6761082 -5262148 -4257392
12482d257392L383502N723489M176755J025480J591259M345923K138007n094278
$$ -4257392 -873890 4849599 9026354 10051834 11643093 15989016 18127023 13032745
12474A3032745p834575j423935N570152L879533k798020m683677r36841J303629
$$ 13032745 5198170 3774235 9344387 13223920 10425900 5742223 4805382 6109011
12466F109011n05318k043948j259462j092376k450311j811646K309790O058474
$$ 6109011 5603693 3559745 2300283 1207907 -1242404 -3054050 -744260 5314214
12458E314214N518178J547196k064384k561379N4317K943050K536356j086020
$$ 5314214 10832392 12379588 10315204 7753825 7808142 10751192 13287548 12201528
12450A2201528l394201j534573J150960L42602k260315k149619Q246k43600k781775
$$ 12201528 8807327 7272754 8423714 8766316 6506001 4356382 4364628 4121028 1339253
12441A339253k633212J300981L653902Q35130l393647l484939N49108M190790
$$ 1339253 -1293959 7022 3660924 4496054 1102407 -2382532 -1833424 2357366
12433B357366M181091R46720k767268m013534j953693R66822J610284Q5268q84887
$$ 2357366 6538457 7485177 4717909 704375 -1249318 -282496 1327788 1413056 528169
12424E28169l89718l45574j690039k567515j470356L23455R12256M78231M24265
$$ 528169 138451 -207123 -1897162 -4464677 -5935033 -5611578 -4699322 -4221091 -3796826
12415c796826J146197J829937J636622M63323q71372j236495p35034j027342k824190
$$ -3796826 -2650629 -820692 815930 1279253 407881 -828614 -1563648 -2590990 -5415180
12406e415180l865621j439812L320780N870476L538137j151426l197324m85538
$$ -5415180 -9280801 -10720613 -7399833 -1529357 2008780 857354 -2339970 -2825508
12398b825508L885343M560003k86486o165240o681944j042707M873228N760268
$$ -2825508 1059835 5619838 5333352 -831888 -7513832 -8556539 -3683311 2076957
12390B076957K663748o1149p42622o46815n08352j34611j52858j094773j690827
$$ 2076957 4740705 4679556 3936934 3290119 2781767 2647156 2494298 1399525 -291302
12381b91302o82475Q63630J562546K315325L875057L761024l90647n757983p129136
$$ -291302 -973777 -110147 1452399 3767724 7642781 11403805 11013158 5255175 -1873961
12372a873961m167749j322016o87312L5570J803923J796926j080100k896663l50835
$$ -1873961 -6041710 -7363726 -8051038 -8015468 -6211545 -4414619 -5494719 -8391382 -8742217
12363h742217L563746L559721q9260j836145J165446M985306M217730q92160m873906
$$ -8742217 -5178471 -1618750 -1708010 -3544155 -2378709 2606597 6824327 5932167 1058261
12354A058261l984398m50672J070493n45060k408613k101924o9312K334058M343216
$$ 1058261 -2926137 -3376809 -2306316 -2851376 -5259989 -7361913 -7431225 -5097167 -753951
12345g53951M710604K064899k247206m299350k400416M72461R06436n65242j421141
$$ -753951 3956653 6021552 3774346 -525004 -2925420 -2452959 -1546523 -2111765 -3532906
12336c532906j174229q03175p7796J612236L007803K299679k5571j756946j629916
$$ -3532906 -4707135 -5510310 -5588106 -3975870 -968067 1331612 1306041 -450905 -2080821
12327b080821P9198K380432L587559K160522r49498k586976j448251K18087K60760
$$ -2080821 -2001623 378809 3966368 6126890 5177392 2590416 1142165 1360252 1621012
12318A621012o41019j348945k234872k949752j700175J047589J902988Q1933o37812
$$ 1621012 979993 -368952 -2603824 -5553576 -7253751 -6206162 -4303174 -4221241 -4859053
12309d859053J496414K466326o63241m048554l267763n62440l0085j5476K852442
$$ -4859053 -3362639 -896313 -1559554 -5608108 -8875871 -9438311 -9468396 -9483872 -6631430
12300f631430N869918M224010q2749j215287P57534J178385n5721O46220J911134
$$ -6631430 -761512 3462498 3379749 2164462 2921996 4100381 4044660 4690880 6602014
12291F602014r31721n822154n576874m40659J316259k299737k825828L933623
$$ 6602014 5670293 -151861 -5728735 -6169394 -4853135 -7152872 -9978700 -6045077
12283f045077R165192M254669n206261p361330j030006M103136J922119l404034
$$ -6045077 3120115 7374784 2168523 -5192807 -6222813 -2119677 -197558 -3601592
12275c601592n058499j776290K858642N263787M398560J651039n17995n94311
$$ -3601592 -8660091 -10436381 -7577739 -2313952 2084608 3735647 3217652 2623341
12267B623341P16443J213580o86060l957513n074554j741922L011137L348048
$$ 2623341 3339784 4553364 3867304 -90209 -5164763 -6906685 -3895548 -547500
12259e47500j213644m030476q46309L354480K161383j764727j266070L107808
$$ -547500 -1761144 -5791620 -6637929 -3283449 -1122066 -2886793 -4152863 -1045055
12251a045055M176298M34243j898636P719J350155j069355l469098k283072K44018
$$ -1045055 3131243 3565486 1666850 1674569 3024724 1955369 -1513729 -3796801 -3552783
12242c552783J146513J282881J607858P18551j038041q31707Q48236R242k918045
$$ -3552783 -2406270 -1123389 484469 1203020 164979 -666728 181508 190750 -2727295
12233b727295k331963K342462L862056j026254n186696k337778K914472L246783
$$ -2727295 -5059258 -2716796 1145260 119006 -5067690 -7405468 -4490996 -1244213
12225a244213J58212m04458J492886J711376K44652j68556j95420j586404k006836
$$ -1244213 -1086001 -1490459 2427 1713803 1958455 1789899 1594479 8075 -1998761
12216a998761Q88763L431917J009787l729935m665785j485214J571905L303179
$$ -1998761 -1109998 2321919 3331706 -398229 -5064014 -6549228 -4977323 -1674144
12208a674144M751550L845275j220562n621686l332023K632027L850718o04356
$$ -1674144 3077406 6922681 5702119 80433 -3251590 -619563 3231155 2626799
12200B626799l574999j812340L71755K59526P51857L191780M108500J889998j77255
$$ 2626799 -948200 -2760540 -2388785 -2129259 -1377402 1814378 5922878 7812876 7635621
12191G635621k15499o11363j927803o33792L650377M997296k19461o682638o998125
$$ 7635621 7420122 6808759 4880956 4247164 7897541 12894837 12675376 5992738 -1005387
12182a005387j503824L287095L240056m24856m498498o400985m794621n98107
$$ -1005387 -2509211 777884 4017940 3593084 -905414 -7306399 -12101020 -12699127
12174a2699127L184164M289032L174397J724904J403939K634671M027660K760689
$$ -12699127 -9514963 -5225931 -2051534 -326630 1077309 3711980 7739640 10500329
12166A0500329j622906m891771l378610k04564q93792l749807j929403M277288
$$ 10500329 8877423 3985652 607042 402478 -491314 -4241121 -6170524 -1893236
12158a893236O077080L59968l835362P03383O971050M291292m540742p463049
$$ -1893236 4183844 4543812 708450 1411833 8382883 12674175 8133433 670384
12150F70384j764309K838295J38324m236460l545982J42336J713149J485063J982644
$$ 670384 -1093925 1744370 1882694 -2353766 -5899748 -5757412 -4044263 -2559200 -576556
12141e76556J652791j634707m423632j681774M839222Q195798N361366l19842
$$ -576556 1076235 -558472 -4982104 -6663878 -1824656 6371142 11732508 11412666
12133A1412666m872000o668029m428162J757575P022383N468555j236381m948464
$$ 11412666 6540666 -127363 -4555525 -2797950 4224433 9692988 8456607 3508143
12125C508143k691453o25938l021342m480837O56337P205504O028801j422570
$$ 3508143 816690 190752 -2830590 -7311427 -6655090 550414 6579215 5156645
12117E156645m974894j265938K105748n43905m781053m335547l88074K136987
$$ 5156645 181751 -1084187 1021561 477656 -4303397 -8638944 -9027018 -6890031
12109f890031K182682J721787J410964J274439K124271K761142j76801n915801
$$ -6890031 -4707349 -2985562 -1574598 -300159 1824112 4585254 4408453 -1507348
12101a507348p812903k528686L831509M327318J212681N42238J322572j111796
$$ -1507348 -9320251 -11848937 -8017428 -3690110 -2477429 -1935191 -612619 -1724415
12093a724415m141550j030955N640105N294413l573546q925441k994693N507268
$$ -1724415 -5865965 -6896920 -1256815 4037598 464052 -8461389 -11456082 -5948814
12085e948814M839321k167906l963014J388054M898943K084394j260170l37027
$$ -5948814 -1109493 -3277399 -7240413 -5852359 -953416 1130978 -129192 -466219
12077d66219J129200j203233m213465k808540J369372K771675O90791o54554M64292
$$ -466219 662981 -540252 -4753717 -7562257 -6192885 -3421210 -2730419 -3384973 -2920681
12068b920681J318472L23854m07783M64939P00646j478683l724310k976223m36776
$$ -2920681 -1602209 -1278355 -1686138 -1221199 -520553 -1999236 -5723546 -8699769 -9136545
12059i136545K19457j433996k103543j21933J979025J557273P7029R99342M545860
$$ -9136545 -8917088 -10351084 -12454627 -12576560 -10597535 -9040262 -8963233 -7963891 -3418031
12050c418031O971148N362478J326075j366445j740352k144219l651930l559209
$$ -3418031 3553117 8915595 10241670 8875225 7134873 4990654 1338724 -2220485
12042b220485L22456M648066L663171k428672o294701k718973M350861P165981
$$ -2220485 -1898029 2750037 6413208 3984536 -2310165 -5029138 -678277 6487704
12034F487704M025626k61996k199437l069890m440525m783894k451145J055817
$$ 6487704 10513330 10251334 8051897 4982007 541482 -4242412 -6693557 -5637740
12026e637740L012763K959204K476702K472233K066098L4302l065936m525883
$$ -5637740 -2624977 334227 2810929 5283162 7349260 7383562 4317626 -208257
12018b08257k333899J363698J921744j328550l255865l90573L031557J139896
$$ -208257 -2542156 -1178458 743286 -585264 -3841129 -4231702 -1200145 -60249
12010f0249l987843n006424n14264L302620K678764Q89685J104629J488527L91098
$$ -60249 -4048092 -9054516 -9568780 -6266160 -3587396 -2697711 -1593082 -104555 286543
12001B86543N2804J377089R35492k417806l618652O42957N154651L510577j996294
$$ 286543 339347 1716436 2651928 234122 -3384530 -2741573 2413078 5923655 3927361
11992C927361m399454k615700j035928j022143k0360K073033K453106R24817j929
$$ 3927361 -472093 -3087793 -4123721 -5145864 -5166224 -3093191 -640085 284732 282803
11983B82803j9137n48569m85916J622335K621315r20666m603432j057542O941814
$$ 282803 263666 -284903 -770819 851516 3472831 2552165 -2051267 -3108809 3833005
11974C833005Q116761j28717o393794k271509M837693L679291l702358o584387
$$ 3833005 11949766 11821049 5427255 3155746 7993439 11672730 7970372 1385985
11966A385985k516539J031803J01485j168023j44287l14167l258331m040989O79023
$$ 1385985 -1130554 -98751 2734 -1165289 -1309576 -1623743 -4882074 -8923063 -8244040
11957h244040N946733N401904P47245j371799N37303J554504j518000n762489
$$ -8244040 -2297307 3104597 3851842 2480043 3017346 4571850 3053850 -2708639
11949b708639o643752l396230J134502L723846L131690Q63143k73218M31029N43420
$$ -2708639 -9352391 -12748621 -11614119 -7890273 -4758583 -3895440 -4168658 -3737629 -3194209
11940c194209j415624k656909j41620L694828L909451J059439N13189L163148
$$ -3194209 -4609833 -7266742 -7408362 -3713534 195917 1255356 1768545 4931693
11932D931693L416400j094098m574121k304859J421658Q13491j380200O54590
$$ 4931693 8348093 7253995 2679874 375015 1796673 2610164 1229964 1884554
11924A884554M281602K112787m407321n711371M04069M342712l54394o767278
$$ 1884554 6166156 8278943 3871622 -1839749 -1435680 2907032 2552638 -4214640
11916d214640n447036J541778N008392K605282M41446K447650N258962M309805
$$ -4214640 -9661676 -8119898 -3111506 -506224 -64778 2382872 7641834 11951639
11908A1951639n0594m013180m842695k705997L23535K139895J920061q4919l125376
$$ 11951639 11901045 7887865 3045170 339173 662708 2802603 4722664 4637745 1512369
11899A512369n149876l008769L394120Q203133N511891j805054m775529j064767
$$ 1512369 -3637507 -6646276 -3252156 4950977 10462868 8657814 3882285 2817518
11891B817518J542912k426568p064012m300259L135174N723996J375381k491523
$$ 2817518 4360430 1933862 -5130150 -9430409 -6295235 -571239 804142 -1687381
11883a687381q60501K340756J658830j664931k469372M94323L187766K029597
$$ -1687381 -2547882 -207126 1451704 -213227 -2682599 -2188276 999490 3029087
11875C029087j577098l392819j987960l73715j248022k756654j564816J508991
$$ 3029087 1451989 -1940830 -3928790 -4302505 -5550527 -8307181 -9871997 -8363006
11867h363006K892105K387785K873643L923908J848872k607452l411956R72668
$$ -8363006 -5470901 -3083116 -209473 3714435 5563307 2955855 -456101 516567
11859E16567L798536N28882l414742j461526L278510L447929o11068k591947j186493
$$ 516567 4315103 4843985 1429243 -32283 3246227 6694156 6083088 3491141 2304648
11850B304648q26458k588053k574155K29959J833143L69921q46120P43272L063985
$$ 2304648 1478190 -1109863 -3684018 -3454059 -1620916 -1250995 -2097115 -1353843 1710142
11841A710142L394998K044818K96452j777843l763637l936189j383848K478096
$$ 1710142 5105140 7149958 7446410 5668567 1904930 -2031259 -3415107 -937011
11833i37011N017258M096159k65102m596950m389780J78900L492838K028524o20803
$$ -937011 4080247 8176406 7911304 3314354 -1075426 -896526 2596312 4624836 4004033
11824D004033J37805K282060P62378l921582o426251m361458j45858L630744N622680
$$ 4004033 4141838 6423898 7186276 3264694 -3161557 -7523015 -7668873 -4038129 1584551
11815A584551L892430j876899p101708o419727p60719M026862M713353K733688
$$ 1584551 5476981 3600082 -3501626 -9921353 -10682072 -6655210 -1941857 791831
11807G91831K62184j317221p12208J226717J026182j765933k208117J777243L956833
$$ 791831 1054015 -263206 -975414 251303 1277485 -488448 -2696565 -919322 3037511
11798C037511l02259m307746L2506P364860O081274k604476o472766k420698K2077
$$ 3037511 2735252 -1572494 -1539988 5824872 11906146 9301670 2828904 408206 430283
11789D30283k906460k725292M196729P715924N60669q203958o624750K389893
$$ 430283 -2476177 -5201469 -1004740 6711184 7271853 -932105 -7556855 -5166962
11781e166962P332835N236755K118707J095623n3688k099851l249917l137777
$$ -5166962 2165873 7402628 9521335 10616958 10563270 8463419 5213502 2075725
11773B075725k068176J122481N409210N609920l06780n989449m983249l92909
$$ 2075725 7549 1130030 6539240 12149160 11842380 5852931 869682 476773
11765D76773M24437k683552l879812j462243P96468J097181J362937K114594J880802
$$ 476773 901210 -1782342 -5662154 -7124397 -6327929 -5230748 -3867811 -1753217 127585
11756A27585J386321K581197L874192K014719j486782j678215J647944K883140
$$ 127585 1513906 4095103 7969295 9984014 8497232 6819017 8466961 11350101
11748A1350101p88327m810434l725255J531037N498783M983015J530207j638754
$$ 11350101 10561774 5751340 2026085 3557122 9055905 14038920 15569127 13930373
11740A3930373l098112l536239l655037k865597p62954J147676J220456O27601
$$ 13930373 10832261 7296022 3640985 775388 12434 1160110 2380566 3008167
11732C008167J677751L316871K178169j236711k214431L91356J304388k603181
$$ 3008167 4685918 8002789 10180958 8944247 6729816 7121172 8425560 5822379
11724E822379n927842k489112M232176N304286n68164n267034l154372J682579
$$ 5822379 -105463 -2594575 1637601 6941887 6373723 1106689 -2047683 -365104
11716c65104K557681m36654k098218l62686J503640N99662j423080j471092J5955
$$ -365104 2192577 1755923 -342295 -704981 798659 1398321 -24759 -1495851 -1479896
11707a479896P7801j478450j422543J184786K435769l60730l451544j981147J928043
$$ -1479896 -1402095 -2880545 -4303088 -3118302 -682533 -1043263 -4494807 -6475954 -4547911
11698d547911K178704j487428l251381r70212P59083r49470k388084j422L627864
$$ -4547911 -2369207 -3856635 -7108016 -8078228 -7319145 -8268615 -10656699 -10658121 -7030257
11689g030257M430866L000161K209064K336178K091541J425755M91295j160196
$$ -7030257 -2599391 400770 2609834 4946012 7037553 8463308 8954603 7794407
11681G794407k338506r06537J623453R38198k688804l597951r0905J916650j315100
$$ 7794407 5455901 4549364 6172817 7111015 4422211 824260 733355 2650005 1334905
11672A334905m553599k198749K341338K625304m47675j534350j79511J78070n34926
$$ 1334905 -3218694 -5417443 -3076105 -450801 -898476 -2432826 -2612337 -2434267 -2969193
11663b969193l5878N50536j018355k358998p7275L061203J983545j529265j412092
$$ -2969193 -3005071 -2454535 -3472890 -5831888 -5909163 -2847960 -864415 -2393680 -3805772
11654c805772K153271L048931q4025j683517J172035M511154M413905J689915
$$ -3805772 -1652501 1396430 1312405 -371112 800923 5312077 9725982 11415897
11646A1415897j829660n464247o920301l737860J137497J779058j260091j066541
$$ 11415897 9586237 4121990 -2798311 -6536171 -5398674 -3619616 -4879707 -5946248
11638e946248L977863O620738K499677k465624j906680R92098M03739j390115
$$ -5946248 -1968385 4652353 7152030 4686406 2779726 3771824 4175563 2785448
11630B785448J001600M608771J930927n244247o608641N09272N948236K070653
$$ 2785448 3787048 8395819 10326746 5082499 -1526142 -1016870 4931366 7002019
11622G002019m643249m364612P93741J636304k285893k759181K035125M057980
$$ 7002019 2358770 -2005842 -1212101 424203 -1861690 -4620871 -2585746 1472234
11614A472234m01030l976764j126018K139816n53965l697927M88229O883491M860913
$$ 1472234 1071204 -2905560 -4031578 -1891762 -2445727 -6143654 -5655425 1228066 6088979
11605F088979l092962m534389K175379N368850K59979l670351m17471K286610
$$ 6088979 2996017 -1538372 637007 6005857 6265836 2595485 2178014 4464624
11597D464624j639923m698523J68353N552405K235232l942130k095244M382848
$$ 4464624 2824701 -1873822 -1705469 3846936 6082168 2140038 44794 4427642
11589D427642M017137k214721k850001L531485N952940K49765m448854j940130
$$ 4427642 8444779 6230058 3380057 6911542 12864482 13114247 8665393 6725263
11581F725263J628915k45297m076065m014528j026466J217080K361290K423423
$$ 6725263 8354178 8108881 4032816 18288 -1008178 208902 2570192 4993615
11573D993615m68203m931423n307204j17455M438959L532186L37896m13983M79017
$$ 4993615 4525412 -406011 -5713215 -5830670 -1391711 2140475 2478371 2064388 2543405
11564B543405N22222O90457J894996J507291j584105l257297n67394K705889K200983
$$ 2543405 3065627 3756084 5651080 7158371 5574266 2316969 1749575 4455464 6656447
11555F656447K27384R68918K344383n55485o312417q251889l919613K160723N061083
$$ 6656447 6883831 7852749 10197132 9641647 3329230 -4922659 -8842272 -6681549 -1620466
11546a620466M124678J154250j854802k861150j118663J215351J406828k6494
$$ -1620466 2504212 3658462 1803660 -1057490 -2176153 -960802 446026 419532
11538D19532k72750J298788K208807N47733k450914l797999j601980L070020O420791
$$ 419532 146782 1445570 3654377 4202110 1751196 -2046803 -3648783 -578763 5842028
11529E842028N193424O11830k673590k605568k097103l575360m444914j566700
$$ 5842028 11035452 11647282 8973692 6368124 4271021 695661 -3749253 -5315953
11521e315953K410263K209750j650564l012058Q06010N144522N093032J944680
$$ -5315953 -2905690 -695940 -2346504 -5358562 -4552552 591970 5685002 7629682
11513G629682k95333j090039k221711l132319j878800O06303J635424J534746
$$ 7629682 7334349 6244310 4022599 890280 -988520 -382217 1253207 2787953
11505B787953K720356M092167J686341l831783o041611k057327K506651K198861
$$ 2787953 5508309 9600476 11286817 7455034 1413423 -643904 1862747 4061608
11497D061608J18376J513905L632241L80526n579713n402741J283937M627642
$$ 4061608 4179984 5693889 9326130 9706656 4126943 -1275798 8139 4635781
11489D635781k4923m860695k481976K873213L538752M17516r19257l15825j001636
$$ 4635781 4610858 -249837 -2731813 141400 3680152 4097668 3178411 2862586 1860950
11480A860950j831092J34134K418207O06419l246566l470410k73093J222086J9168
$$ 1860950 29858 163992 2582199 3188618 -57948 -3528358 -3801451 -2579365 -2560197
11471b560197k27538J330347K203658K498004L779326L138980l091430j0218899
$$ -2560197 -2787735 -1457388 746270 3244274 7023600 10162580 7071150 -3147749
11463c147749r224965p55193M572785J908019j549314M77089L712432K194569
$$ -3147749 -12372714 -13127907 -8555122 -6647103 -8196417 -7719328 -4006896 -1812327
11455a812327j549054k032969r8481M23777L51318K395785M583757L354352N01325
$$ -1812327 -3361381 -5394350 -5492831 -5069054 -4717736 -2321951 2261806 5616158 6117483
11446F117483L83043K045614N88039m372683p574512n727261j192151K722213
$$ 6117483 6500526 8546140 9134179 4761496 -2813016 -8540277 -9732428 -7010215
11438g010215N571790P310995N970175P41287m654979m954395J62414M882245
$$ -7010215 -1438425 5872570 11842745 12584032 7929053 2974658 3137072 8019317
11430H019317L891639j209888m319805k983316p78459q04455r31367J578188M374511
$$ 8019317 11910956 10701068 6381263 3397947 2619488 1815033 883666 2461854 6836365
11421F836365L434558l07974k813767l674405n339380o617955l418007L449941
$$ 6836365 10270923 9962949 7149182 3474777 -1864603 -8482558 -11900565 -8450624
11413h450624P403315M870077j80195k508319j847632p58431l79241o30590j366985
$$ -8450624 -1047309 3822768 3642573 1134254 -713378 -1471809 -1851050 -2481640 -3848625
11404c848625j552344j09362J642457J559350O31040J292297K188819K419l494932
$$ -3848625 -5400969 -5510331 -3867874 -2308524 -1677484 -385187 1803632 1806051 -1688881
11395a688881k752849K114059M303807J022354k078408o34551J458220l35657
$$ -1688881 -4441730 -2327671 1976136 2998490 920082 285531 1743751 1408094
11387A408094l136912k257469M68309N66601r58387j39744K306716K499496O07269
$$ 1408094 -1728818 -3986287 -3517978 -2951377 -3909764 -4049508 -1742792 756704 1363973
11378A363973K85285J981349K470569N98063j496401k704828m012442n081273
$$ 1363973 1649258 3630607 6101176 6699239 5202838 2498010 -1514432 -6595705
11370f595705l764319K43502M138052N060981K748013o99023k425249j056516
$$ -6595705 -10360024 -10116522 -5978470 -917489 1830524 1131501 -1293748 -2350264
11362b350264J610697K497335J480820J360813K755314K574149m98830k895757
$$ -2350264 -739567 1757768 3238588 4599401 7354715 9928864 9430034 6534277
11354F534277j641676N35821n68452m059941n713934m260955j880072N68J545762
$$ 6534277 4892601 5428422 4859970 800029 -4913905 -9174860 -11054932 -11054364 -9508602
11345i508602K317967J727342Q40112R63892J541510J740168K304783L381453
$$ -9508602 -7190635 -5463293 -4623181 -3659289 -2117779 -377611 1927172 5308625
11337E308625K853813k12376k970782k952401k136516l011369l410461j75884
$$ 5308625 8162438 7950062 4979280 2026879 -109637 -3121006 -6531467 -6707351
11329f707351M278966M728699J245365j226945r55535j115768k891798k911261
$$ -6707351 -2428385 2300314 3545679 2318734 1363199 247431 -2644367 -5555628
11321e555628M82371L624218L097299P92006J18483M79096o36525k279132j149938
$$ -5555628 -5073257 -1449039 1648260 2440266 2558749 3037845 2401320 122188 -1027750
11312a027750K457429L992474J097115k507048k038987J397808K326250r88589
$$ -1027750 1429679 5422153 6519268 4012220 1973233 3371041 5697291 4708702
11304D708702l903619k518296L08466l04680l137995k657726J850168M668121
$$ 4708702 805083 -1713213 -1404747 -1709427 -4847422 -7505148 -5654980 -986859
11296i86859K340451j365645j804863j57410m5703r83215J65253K999042L425979
$$ -986859 1353592 -12053 -1816916 -1974326 -2020029 -3003244 -2837991 161051 3587030
11287C587030l61875n051494o057110k437601K523412M894835M097977L038648
$$ 3587030 3225155 -1826339 -7883449 -10321050 -7797638 -2902803 1195174 4233822
11279D233822L648288L696623M84481l614423l657588k11250M17530m133757p719573
$$ 4233822 7882110 11578733 12063214 8448791 4791203 4579953 4997483 863726 -6855847
11270f855847m412696K624328N745897L288363K64878J44349R84512r3029k397488
$$ -6855847 -11268543 -8644215 -2898318 390045 654923 799272 1783784 1690755 -706733
11261g06733k789454M06064N069629O544102K368107l868548n654930j512396
$$ -706733 -3496187 -3090123 1979506 8523608 10891715 7023167 1368237 -144159
11253a44159K981324K721205n61985k092538j256356j243747l056295l761693
$$ -144159 2837165 5558370 4996385 2903847 1647491 403744 -2652551 -6414244
11245f414244r11093L751238N777849K660013l025056n650417k790832J648363
$$ -6414244 -7325337 -3574099 2203750 4863763 1838707 -3811710 -6602542 -4954179
11237d954179K567637K63201j493103k017571l152702l450711K96489N681617
$$ -4954179 -2386542 -2123341 -3616444 -5634015 -8786717 -12237428 -11940939 -6259322
11229f259322O400130K530637R64282L430602L233210k223210n421549j423913
$$ -6259322 140808 2671445 3635727 7066329 10299539 8076329 2654780 1230867
11221A230867K771560j78099n320841m259482M17187R08803j126473J577881O768379
$$ 1230867 4002427 3824328 -1496513 -5755995 -5338808 -4430005 -5556478 -3978597 2789782
11212B789782N069316l077639o347882n05452M897544K028389l719339l668395
$$ 2789782 7859098 4781459 -1566423 -2071875 2825669 4854058 1134719 -2533676
11204b533676J176626M012752L145339K053091J983224O50501k737491n379766
$$ -2533676 -1357050 2655702 5801041 7854132 9837356 10487857 7750366 2370600
11196B370600m150567N60484M404463L060024k373651n766566l743577k13494
$$ 2370600 -1779967 -1219483 3184980 6245004 3871353 -1895213 -5638790 -5852284
11188e852284K86669k0539K861234N842895K989740l191895m143358Q63188L223400
$$ -5852284 -5565615 -5586154 -2724920 3117975 6107715 2915820 -1227538 -364350 2859050
11179B859050l71450k034696L668496R370356N675850m233919r174187n462078
$$ 2859050 2487600 452904 4121400 13491756 19167606 14933687 5759500 297422
11171B97422O4051J073857j027378j369182J553963M571605L449163k152196o904834
$$ 297422 361473 1435330 407952 -961230 592733 5164338 8613501 6461305 -443529
11162d43529n162172J263235M398353R47172k812058m49933M896378N701927J735047
$$ -443529 -5605701 -4342466 55887 1003059 -1808999 -2258932 2637446 8339373 10074420
11153A0074420k30458K477483M358280L89798o372179q826839m662535J593082
$$ 10074420 9843962 12321445 16679725 17069523 10697344 1870505 -2792030 -1198948
11145a198948M202942J982496j408883k023290L4457J385715K60825j300605j125533
$$ -1198948 3003994 4986490 3577607 1554317 1588774 2974489 3235314 1934709 809176
11136H09176m30316j186951j867827M07498M108605M019980j297866o686321p007764
$$ 809176 378860 -808091 -2675918 -2268420 1840185 5860165 4562299 -2124022 -9131786
11127i131786l244819N57186L188977N397860N737798K358710k078564k670707
$$ -9131786 -12376605 -11819419 -8630442 -3232582 2505216 4863926 2785362 114655
11119A14655K31862J176896j524330k880114J45895K963387R08493k618592j725456
$$ 114655 346517 1523413 -917 -2881031 -2735136 228251 1136744 -1481848 -3207304
11110c207304K029377K453892p52408j976742M94904K286393J160668K34018J469200
$$ -3207304 -1177927 1275965 523557 -1453185 -958281 1328112 2488780 2722798 4191998
11101D191998K537981K020884J623459J492436m82659l134448k566450J14197
$$ 4191998 6729979 8750863 10374322 11866758 11384099 8249651 5683201 5797398
11093E797398o15892m140360k831222M384778P451948M71097p732680o527199
$$ 5797398 5181506 1041146 -1790076 2594702 10046650 10517747 2785067 -3742132
11085c742132J124004N435572M790514L648450J744271l099003o186385k171720
$$ -3742132 -2618128 2817444 7607958 11256408 13000679 9901676 3715291 1543571
11077A543571L391532J234776n464148n521053R31148K268092m219198o905318
$$ 1543571 4935103 6169879 705731 -4815322 -3884174 -1616082 -5835280 -12740598
11069a2740598O07770Q440622O270768j280793l812322o99995J636692J240865
$$ -12740598 -12132828 -3692206 2578562 1297769 -2514553 -3214548 -1577856 -336991
11061c36991M73240o43063k697362k404929K481647O925822M689263j672632m110992
$$ -336991 136249 -506814 -3204176 -5609105 -3127458 3798364 8487627 6814995 2704003
11052B704003r40360J679039p8523k673919j789103J239518K097979m21006l404359
$$ 2704003 1763643 3442682 3364159 690240 -1098863 140655 2238634 1817628 -1586731
11043a586731l702965j349679Q68055Q95818j62529o0106Q84150M18755j273751
$$ -1586731 -5289696 -6639375 -5771320 -4875502 -5038031 -5098137 -4213987 -3795232 -5068983
11034e068983r62124K597481N889305N070653J122840j760741j613229l56135
$$ -5068983 -6031107 -3433626 2455679 7526332 8649172 6888431 5275202 4919067
11026D919067o66721k809716m423436k805016K093230O749592P086362K643042
$$ 4919067 4252346 1442630 -2980806 -5785822 -3692592 3057000 10143362 12786404
11018A2786404l056438o120717n324479k156288O89171J299196L10861k3424N49478
$$ 12786404 9729966 3609249 -1715230 -3871518 -3182347 -1883151 -1572290 -1595714 -1046236
11009a046236l93723l260605m031648p7704M274299L052863k064905l716473J19896
$$ -1046236 -1439959 -4700564 -8732212 -8809916 -4535617 -1482754 -3547659 -7264132 -7144236
11000g144236L374087J527227j909659j449684K372160M569072K501362j753070
$$ -7144236 -3770149 -2242922 -4152581 -5602265 -3230105 1338967 3840329 2087259
10992B087259m164224k357820J908292L517997l24124n344386m686909J687769
$$ 2087259 -2076965 -4434785 -2526493 991504 667380 -4677006 -9363915 -7676146
10984g676146O494374M983299N10534j723953j682111j961446k266442o74279
$$ -7676146 -1181772 3801527 4312061 2588108 905997 -1055449 -3321891 -3996170
10976c996170J880988K413419K75431k124410k479289o14191J914276K952728
$$ -3996170 -2115182 298237 573668 -1550742 -4030031 -4644222 -2729946 222782
10968B22782J471204r02829j345196M20167J481966k59360l193551m206803k293100
$$ 222782 1693986 791157 -554039 -133872 1348094 1088734 -2104817 -6311620 -8604720
10959h604720J018962L455723L389768Q65510j888270k181507J07410K147309
$$ -8604720 -7585758 -4130035 -740267 125243 -1763027 -3944534 -3837124 -1689815
10951a689815J332996j864290m459405l861562l42562L106375L850052K364433
$$ -1689815 -356819 -2221109 -6680514 -10542076 -10884638 -7778263 -3928211 -1563778
10943a563778P60235n82272k101028j615529L166603Q121359N412362m285179
$$ -1563778 -803543 -1385815 -3486843 -5102372 -1935769 6185590 11597952 7312773
10935G312773r514344l455519N299341N103860j672727l876607M57922L043970
$$ 7312773 -2201571 -5657090 -357749 4746111 3073384 -803223 -345301 2698669
10927B698669N14130j491925j56399K41932j573529m28943M600055O015002k13803
$$ 2698669 3212799 1720874 1564475 1806407 232878 -196065 4403990 10418992 10205189
10918A0205189p087754o824297j544277K078165K496972J818387L20921j700202
$$ 10205189 3117435 -3706862 -5251139 -3172974 -676002 1142385 1463306 -236896
10910b36896j415118J857786L848797J878794n76324l98826m23205l194984m799435
$$ -236896 -1652014 205772 4054569 5933363 5357039 4958213 4535008 1340024 -3459411
10901c459411j462159K674592J764806j756675j314349K617998L813329J239951
$$ -3459411 -4921570 -2246978 -482172 -2238847 -3553196 -935198 2878131 4118082
10893D118082K62059K703901L601021j81422m500738m109050J73574L413925K778381
$$ 4118082 4380141 7084042 10685063 10503641 6002903 1893853 2067427 5481352 8259733
10884H259733n64435l685363m172955j609213J823638L122374J642445l02612
$$ 8259733 7695298 4009935 -163020 -1772233 51405 3173779 4816224 4513612
10876D513612m12058J042879K210195K243133J757995J041058n90692k789901
$$ 4513612 4101554 5144433 7354628 9597761 11355756 12396814 11806122 9016221
10868I016221l140890l79241K308559O83147l786806n018892j484142J053900
$$ 9016221 5875331 5496090 7804649 8487796 4700990 -317902 -1802044 -748144
10860g48144j034171k976545k763L604054J449231l281120k434914L192243M928830
$$ -748144 -1782315 -4758860 -4761623 -1157569 291662 -2989458 -5424372 -2232129 2696701
10851B696701Q69525j371031J618713L223010j163322n752817l918407J419385
$$ 2696701 3566226 2195195 3813908 7036918 5873596 120779 -3797628 -2378243
10843b378243L492300J978733J025599J288901L40228j655669k110900m07509
$$ -2378243 1114057 3092790 4118389 5407290 5747518 4091849 1980949 1573440
10835A573440J649003K441394J280368j504532l597015k391380J066602K790477
$$ 1573440 3222443 5663837 6944205 5439673 1842658 -548722 517880 3308357
10827C308357J355555p44464j647042j822716j013811J421370K749687n54498
$$ 3308357 4663912 3919448 2272406 449690 -564121 857249 3606936 3052438
10819C052438n655845n552114K2321L233490L19220k433151J018937O951416P790021
$$ 3052438 -2603407 -8155521 -8133200 -4899710 -4580490 -7013641 -5994704 956712 8746733
10810H746733K556981l284898m781118j149037L927430M138763k723973r418255
$$ 8746733 11303714 8018816 3237698 2088661 6016091 10154854 7430881 -1987374
10802a987374o951635K073212O123429J844487j606357J741906N711639M013406
$$ -1987374 -8939009 -6865797 -742368 1102119 -504238 1237668 6949307 10962713
10794A0962713N32757M18518N84588k612561m873591k056296J012118q76325l168297
$$ 10962713 11495470 11913988 12498576 9886015 5012424 2956128 3968246 3091921 -76376
10785g6376O4248M240686J677352m427899m760992J032602N001684M082386K206262
$$ -76376 -12128 4228558 5905910 1478011 -3282981 -2250379 2751305 6833691 9039953
10776I039953R26501k047228n588154n413499j561074J881554L764511N486779
$$ 9039953 9966454 7919226 2331072 -3082427 -4643501 -2761947 1002564 6489343
10768F489343N143466n505o060988n620034J218870O197982M168876j186930l989561
$$ 6489343 11632809 11627304 5566316 -53718 1165152 7363134 11532010 10345080 6355519
10759F355519l163236j369951q09662j332925q81222J808614M234168K636203
$$ 6355519 3192283 1822332 1012670 -320255 -1201477 607137 4841305 7477508
10751G477508j563523k615301L03452J008613k998765n096935m71295M761232
$$ 7477508 5913985 3298684 3602136 4610749 1611984 -3484951 -3956246 804986
10743H04986L060505k031440j920597L005725M901653J356015k242679k087151
$$ 804986 3865491 1834051 -86546 2919179 7820832 9176847 6934168 4847017
10735D847017j32263N73642r45820l947820n359127j666337M880139O626237J233899
$$ 4847017 4714754 5288396 4342576 394756 -4964371 -6630708 -1750569 4875668 6109567
10726F109567m073564l772769j754799j655469R68302P941850J0038326J249719
$$ 6109567 2036003 -1736766 -3491565 -5147034 -4178732 3763118 13801444 15051163
10718A5051163p638357m190687M761749M039622m146013m566901L904079O356115
$$ 15051163 7412806 3222119 7983868 12023490 7877477 3310576 7214655 13570770
10710A3570770j803396p162058k051601L106933n55107n203659j505890M922926
$$ 13570770 11767374 4605316 2553715 5660648 5105541 -98118 -1604008 3318918
10702C318918M447766m840N3262L059208J436002l949719n358722j550547J039812
$$ 3318918 7766684 7761844 7815106 10874314 12310316 8360597 3001875 1451328 2491140
10693B491140l61178j526260K47862J982758J087577m16075j20884O83037j75404
$$ 2491140 2129962 603702 851564 2834322 3921899 3505824 3384940 4067977 3892573
10684C892573j843607k200088j674657k196298l005883j128608L034359M434566
$$ 3892573 2048966 -151122 -1825779 -4022077 -7027960 -8156568 -5122209 -687643
10676f87643O69128k858578l9963O001333O686600Q91465l652345k706824q26726
$$ -687643 -18515 -2877093 -2917056 3084277 9770877 10662342 7009997 4303173 3476447
10667C476447j691908j835114J514231M444841L742141K694940L603177K251341
$$ 3476447 1784539 -50575 1463656 5908497 9650638 12345578 15948755 18200096
10659A8200096l309531o444674k587576J480206j537047o528518m717524R65959
$$ 18200096 14890565 8445891 5858315 7338521 5801474 -727044 -5444568 -4478609
10651d478609J422860k431914j996891L280823N428476K232280j84569O77431
$$ -4478609 -3055749 -5487663 -7484554 -4203731 1224745 3457025 3272456 3949887
10643C949887M43879k256145k947593k58892J224936p86720k703448j580832J004921
$$ 3949887 4393766 2137621 -809972 -1068864 156072 -630648 -3334096 -4914928 -3910007
10634c910007K734831K967906J355006j334009k204823l88685M97745j423809
$$ -3910007 -1175176 1792730 3147736 1813727 -391096 -779781 -282036 -1705845
10626a705845j938563J777481M700981K083858j615001k69852L002352J856778
$$ -1705845 -3644408 -1866927 2834054 4917912 3302911 3033059 6035411 7892189
10618G892189j635777j591478K84399j278746m090341k680833O05981J95914j109839
$$ 7892189 6256412 4664934 4949333 3670587 -419754 -3100587 -2494606 -2298692 -3408531
10609c408531K732508P981443O070925j202144m261879j297669J197979J126749
$$ -3408531 -676023 7305420 13376345 12174201 7912322 6614653 7812632 8939381
10601H939381J606096J554186j961132m598853q24809L897675N73193o833712
$$ 8939381 10545477 12099663 10138531 5539678 4714869 8612544 9185737 2352025
10593B352025o977313l51020K656495O93635J887495O429810N751644m77749l030621
$$ 2352025 -4625288 -4976308 -2319813 -1626178 261317 6691127 12442771 11965022 8934401
10584H934401P0326J259537j005835k91902L020373J211111m790696n144540R60369
$$ 8934401 9004727 10264264 9258429 8966527 11986900 13198011 8407315 3262775 4223144
10575D223144L242218j232863l672401o09993P42825k194138k381169K385826
$$ 4223144 7465362 6232499 2560098 1950105 2692930 498792 -1882377 503449
10567E03449M809004J888395m97801P5890o33631k364502j47318L451144R26935
$$ 503449 5312453 7200848 6703047 6778937 6145306 3780804 3633486 7084630 8011565
10558H011565m593150k719782M540560M362291m033757o994836l4310N156043
$$ 8011565 3418415 698633 5239193 9601484 5567727 -1427109 -1461419 3694624
10550C694624J713094k652825j964115p07865j351637L57345L508180J672278
$$ 3694624 5407718 2754893 790778 82913 -1268724 -911379 2596801 4269079
10542D269079k724125n22306N892576M675080l560967n480349J351283M873920
$$ 4269079 1544954 1022648 6915224 11590304 8029337 2548988 3900271 8774191
10534H774191P91372k240790j668519m013189p282761k576515N771694M901568
$$ 8774191 9565563 7324773 5656254 1643065 -5639696 -8216211 -2444517 2457051
10526B457051j749719N09828Q638803N988815n267914o808552P09432r63368j0105830
$$ 2457051 707332 1217160 9855963 15844778 10576864 3768312 4477744 3514376 -6591454
10517f591454n993946R447698J0864753l920456q355474L805116P722294l949114
$$ -6591454 -12585400 -3137702 7727051 3806595 -4548879 -743763 6978531 3029417
10509C029417p446038M317674P607079l752695m948241Q766789R590252o732901
$$ 3029417 -4416621 -98947 7508132 3755437 -1192804 7573985 17164237 10431336
10501A0431336q446477R300065J0886242q600430q470567J4915011J1320000k2581566
$$ 10431336 1984859 11284924 22171166 13570736 5100169 20015180 31335180 8753614
10493H753614j9831384K8981260L4176643k7948276k8561724J10102070K30625890
$$ 8753614 -11077770 17903490 52080133 24131857 -4429867 105672203 336298093
10486C36298093J32691990j11981252k31410214j27809130J5166201K9242384
$$ 336298093 468990083 357008831 125598617 -2210513 12955688 42198072
10480D2198072k5744933k3857419J8774326J7538821j6287801j5135178J3059212
$$ 42198072 16453139 -7404280 11370046 28908867 12621066 -2514112 10545100
10473A0545100J0980186j5808190j6193251P852874J1319159o821466q342060
$$ 10545100 21525286 5717096 -10476155 -2623281 8695878 1874412 -6467648
10466f467648P767863P703399q473342q226183R336818J2465607k805806p634740
$$ -6467648 1300215 9003614 530272 -7695911 1640907 14106514 11300708 3665968
10458C665968M327693Q226801l157372q601140l56548M821095O72998r9538M159075
$$ 3665968 7993661 16220462 13063090 4461950 4105402 8926497 9599495 9499957 13659032
10449A3659032M11726r592425q854338K813440O903822q07550m602437R78151
$$ 13659032 14070758 4478333 -4376005 -1562565 5341257 4533707 -68730 909421
10441I09421L331062k133046m386511L77894K178054k251029l928319N0438K432134
$$ 909421 4240483 2107437 -2279074 -1901180 276874 -1974155 -5902474 -5852036 -3419902
10432c419902J984628M768683Q458991M295048m910054p268305k263002l57055
$$ -3419902 -1435274 3333409 11792400 16087448 11177394 3909089 1646087 1289032
10424A289032k813319q63410N126218M891856k248305n442033j516085R68294
$$ 1289032 -1524287 -2387697 2738521 7630377 5382072 -59961 -1576046 -607752
10416f07752j390340k117321J049201K419866M97653K07582K043512J602970m05981
$$ -607752 -1998092 -4115413 -3066212 -646346 -148693 58889 2102401 3705371 3299390
10407C299390J09322Q01933k620924n260410j16793P281638O187557r17339k879988
$$ 3299390 3408712 4210645 1589721 -3670689 -3787482 3494156 9681713 8764374 5884386
10398E884386M39654j76206m514218l460135K772281M474521M67496p06151K038132
$$ 5884386 6324040 6147834 1633616 -1826519 945762 5420283 5887779 5181628 7219760
10389G219760Q67169m339917m734071M68495K114846j614391k259084J987592
$$ 7219760 8086929 3747012 -987059 -518564 1596282 -18109 -2277193 -289601
10381b89601K507143l048954n774994j487083K778371K544329K288838L806576
$$ -289601 2217542 -831412 -6606406 -8093489 -5315118 -2770789 -481951 3324625
10373C324625J944094l279971l621946K991818P427237M058363j165720k467832
$$ 3324625 5268719 1988748 -1633198 1358620 8785857 12844220 11678500 9210668
10365I210668k541080l801538k569863K163459M410325J360574j502445n37615
$$ 9210668 6669588 2868050 298187 2461646 6871971 8232545 6730100 6192485
10357F192485J45794k193346l333526q20248Q10732j067004j788252J481837L598609
$$ 6192485 6338279 4144933 811407 -8841 801891 -265113 -2053365 -571528 3027081
10348C027081M49776l387430k196481K027860M003483K921173Q09320j753877
$$ 3027081 3476857 89427 -2107054 -79194 3924289 6845462 7654782 5900905
10340E900905l959029l581528j047363N7481p87643K23219L684771M441829P5544
$$ 5900905 1941876 -1639652 -2687015 -2629534 -3417177 -3193958 490813 4932642 5008186
10331E008186m079273k727388J488543K334997j336594n053721m448108Q29779
$$ 5008186 928913 -1798475 -309932 2025065 688471 -4365250 -8813358 -7983579
10323g983579O808202P979346K982699k727098l184656K29078J624574k62833
$$ -7983579 -1175377 6803969 9786668 7059570 3874914 4103992 5728566 5465733
10315E465733j622769j178586j417401k346485j106917J590296J733666k83205
$$ 5465733 3842964 2664378 1246977 -1099508 -2206425 -616129 1117537 834332
10307H34332M57882M175831M631161n69984n118029l527397O38412J054653j564824
$$ 834332 1292214 5468045 10099206 9529222 4411193 883796 1522208 2576861 1012037
10298A012037j573083K305819N144489L049810j584152l433606j169571J112933
$$ 1012037 -561046 1744773 6889262 9939072 8354920 4921314 3751743 4864676
10290D864676l7418k213939r74514K689830L689268J274988l21662m51630l084971
$$ 4864676 4827258 2613319 1638805 4328635 8017903 9292891 8971229 8519599 5434628
10281E434628o832298l817813O156461J0795424L133059n708403k857989N820528
$$ 5434628 -1397670 -5215483 940978 11736402 14869461 9161058 6303069 12123597
10273A2123597N524084l547098p942687l458799O09695m57242o11452K548838
$$ 12123597 17647681 14100583 6157896 2699097 3308792 2851550 2240098 4788936
10265D788936K248221l650280o478014r41734N349326L680875k944312n723584
$$ 4788936 7037157 3386877 -3091137 -4032871 1316455 4997330 2053018 -3670566
10257c670566k363808K525384M463405K023108l120565o165250l375633K235863
$$ -3670566 -6034374 -3508990 954415 2977523 -143042 -6308292 -9683925 -7448062
10249g448062M253961K219891J397197L005859K522854r76072k232097P28282
$$ -7448062 -3194101 -974210 422987 3428846 5951700 4975628 2743531 3471813
10241C471813K573731k57488l727452l503684j589447j338639j487446M51642
$$ 3471813 6045544 5788056 2060604 -1443080 -3032527 -4371166 -5858612 -5406970
10233e406970L305518M471599L447370P67412k794945m519640j745288L103600
$$ -5406970 -2101452 2370147 5817517 6584929 3789984 -729656 -2474944 628656
10225F28656M357805J193416j322273n15304K40486j967787m844274n027941k553393
$$ 628656 4986461 6179877 4857604 4342300 4582786 2614999 -2229275 -7257216 -9810609
10216i810609P21090L290847L584147J183513j197518p29029J188396J663013
$$ -9810609 -9089519 -5798672 -2214525 -1031012 -2228530 -2957559 -1769163 -106150
10208a06150J550302K780411K957212q03923n090212m759254j818724j345116
$$ -106150 1444152 4224563 7181775 6377852 1287640 -3471614 -5290338 -6635454
10200f635454j415896K718853O980582L255800n197285o697003j79845L094139
$$ -6635454 -8051350 -5332497 1648085 4903885 -293400 -6990403 -7170248 -4076109
10192d076109p16833j895729M259541Q058317K529347l989741k323090K442529
$$ -4076109 -4792942 -6688671 -2429130 5629187 8158534 4168793 1845703 4288232
10184D288232J375291k935445l118630o88789j061278j901600J540086N208725
$$ 4288232 5663523 2728078 -390552 -1079341 -2140619 -4042219 -2502133 2706592
10176B706592K501376k733543j689055L990757M521256j741326o135199m025682
$$ 2706592 5207968 2474425 785370 4776127 9297383 7556057 1420858 -2604824
10168b604824m18390K56754R3891Q01730l85749m072402n163104n46137N056033
$$ -2604824 -3023214 -2766460 -2672569 -1870839 -2256588 -6328990 -11492094 -12038231 -6982198
10159f982198N635310K394674Q34160J818499Q84553l630534o667084l309549
$$ -6982198 -1346888 1047786 1881946 3700445 4584998 954464 -5712620 -9022169
10151i022169L284730N162891M97282l675958j823223J811676J17532n264920
$$ -9022169 -5737439 -574548 -77266 -3753224 -5576447 -3764771 -3647239 -8912159
10143h912159o114687k38960N409389N144630J434612p35341o17520n3755K49295
$$ -8912159 -15026846 -15265806 -9856417 -4711787 -3277175 -4012516 -4630036 -4683791 -4434496
10134d434496J12480o84955n75219K321923N708002M646812j034167n663319n524100
$$ -4434496 -4322016 -5006971 -5582190 -3260267 2447735 7094547 6060380 397061 -5127039
10125e127039k833909n54198J365685K792949K027903j83707m80343J342620J737987
$$ -5127039 -7960948 -8515146 -7149461 -4356512 -2328609 -2512316 -2992659 -1650039 87948
10116H7948J07878J092J948676J945106p43552j594257O89132J575768j77073
$$ 87948 195826 196918 2145594 4090700 3347148 1752891 2442023 4017791 3840718
10107C840718N52723M858575N539595p24936n968134l376470J284653r8733l848632
$$ 3840718 4393441 9252016 14791611 14066675 8098541 4722071 6006724 5907991 2059359
10098B059359j591581M085686L327130m310441q745825m795048J656803M065130
$$ 2059359 467778 4553464 7880594 3570153 -5175672 -9970720 -8313917 -4248787
10090d248787K858163O90113k200191n021773m772385o37390L809678M864577
$$ -4248787 -1390624 -700511 -2900702 -7922475 -12694860 -13332250 -9522572 -4657995
10082d657995K509773o31444j713434N10803L721967L223218j899236n860728
$$ -4657995 -2148222 -2779666 -4493100 -3982297 -260330 2962888 1063652 -4797076
10074d797076l327834K706058N002233K156279r37025j362782p27534J48022K419675
$$ -4797076 -8124910 -5418852 -416619 1739660 802635 -560147 -1287681 -1139659 1280016
10065A280016M237000J215716n687780q626897k889536N937505Q983307N089706
$$ 1280016 5517016 6732732 1044952 -7581945 -10471481 -4533976 4449331 9539037
10057I539037M28181p23581Q118j63187j009473j152282p96318o33716l12493
$$ 9539037 9967218 9243637 9251755 9088568 8079095 6926813 6130495 5496779 5184286
10048E184286j7786j355095l973223l666314J839486O866524L816961m552143
$$ 5184286 5166500 3811405 -161818 -3828132 -1988646 4877878 8694839 4142696
10040D142696o603273J404156Q188172L415340o496188p967692n36227M143489
$$ 4142696 -2460577 -1056421 7131751 10547091 4050903 -3916789 -4453016 -309527
10032c09527J465208q08781K182025M294543K50746m925438m774602j323712O51921
$$ -309527 1155681 346900 2528925 6823468 7074214 2148776 -2625826 -3949538 -3297617
10023c297617K050743M807507N116549m51432o583204n411866J596043N662580
$$ -3297617 -1246874 3560633 8677182 8225750 1642546 -3769320 -2173277 3489303
10015C489303L095589j288880k489118q70956Q32806J111983l70827k930783m645747
$$ 3489303 6584892 5296012 2806894 1935938 2768744 3880727 3509900 579117 -4066630
10006d066630m175595k097777R86693N357383R279395Q622666K543299l697689
$$ -4066630 -8242225 -10340002 -9353309 -3995926 5283469 13906135 16449434 12751745
9998A2751745n253264l827585l331481l054199l77625K873731L065617J605388
$$ 12751745 7498481 3670896 339415 -2714784 -3092409 -218678 2846939 4452327
9990D452327K420766L858935N93657o121065q005311k038983L971939K527186
$$ 4452327 6873093 10732028 11325685 5204620 -2800691 -4839674 -867735 1659451
9982A659451k676956l032537J714977L861309K16763l485461k357336L87168J59594
$$ 1659451 -1017505 -4050042 -2335065 1526244 1743007 -1742454 -4099790 -3712622 -3553028
9973c553028n91819K767185P122904M680590m264221r725760n503779K763715
$$ -3553028 -4144847 -1377662 5745242 10425832 6161611 -3564149 -9067928 -6304213
9965f304213O540619N001228K197738l71007k553321j901504K261569M998914
$$ -6304213 236406 5237634 7435372 7064365 4511044 2609540 4871109 9870023
9957I870023K300020k170762l115836k229120l594728m745797r87374M694801
$$ 9870023 12170043 9999281 6883445 4654325 1059597 -3686200 -4673574 21227
9949B1227N474967K066126O38214J382480n19860l894959k727646J858966K220051
$$ 21227 5496194 7562320 8200534 9583014 9063154 5168195 2440549 4299515 6519566
9940F519566k308162l989653n14138J420330q57304j159962L112401N030846L51917
$$ 6519566 4211404 221751 -292387 1127943 270639 -889323 2223078 7253924 7605841
9931G605841m447981k935232J100852J031983k161637l285842j089682K288378
$$ 7605841 3157860 222628 1323480 2355463 193826 -3092016 -4181698 -1893320
9923a893320N090655N337449J595104k943889k892260Q71448J796966j655363
$$ -1893320 3197335 8534784 10129888 7185999 4293739 5165187 6962153 5306790
9915E306790l588864r89774J634398O46496j383103j459212l06165J110638K582561
$$ 5306790 1717926 728152 2362550 3009046 1625943 166731 -139434 971204 3553765
9906C553765J924283j646420k948167J783013O018370K209479m092220k857255
$$ 3553765 5478048 3831628 883461 2666474 8684844 10894323 6802103 3944848
9898C944848K076061j07471n854809k678638O375767O221278k645262m478368
$$ 3944848 6020909 5913438 58629 -2620009 3755758 9977036 7331774 2853406
9890B853406K434084L301682l535249l362120M198753L150125m317315K163392
$$ 2853406 5287490 8589172 5053923 1691803 5890556 9040681 4723366 6886758
9882F886758J7750416J2215402j1744006j0628713K2283200K6800598l1074212
$$ 6886758 24637174 36852576 25108570 14479857 36763057 63563655 32489443
9875C2489443q6559399o0572929J9329596N6753760K5491653q458842j032482
$$ 32489443 -54069956 -114642885 -95313289 -38559529 -13067876 -21526718 -22559200
9868b2559200J4584034M027031j0171741o29815J2653935L079458j2721840p065690
$$ -22559200 -7975166 -3948135 -14119876 -14749691 -2095756 983702 -11738138 -18803828
9860a8803828R365330R733120k173152m437453K571323K720123k999040j565117
$$ -18803828 -9438498 294622 -1878530 -6315983 -3744660 -1024537 -4023577 -5588694
9852e588694M349857J980833n808851n457188K481045N491615J250716j617517
$$ -5588694 -1238837 741996 -5066855 -10524043 -8042998 -2551383 -1300667 -2918184
9844b918184l87051R08463K439541N564523M937220k518616p997228l816452K276153
$$ -2918184 -3305235 -2396772 42769 5607292 10544512 8025896 28668 -3787784 -1511631
9835a511631r096n332343k991070L320125K951639j829615j012747L823217L005919
$$ -1511631 -1520727 -6853070 -9844140 -6524015 -3572376 -5401991 -6414738 -2591521 414398
9826D14398k523339l224308J117468J987832j216753j062438K473158J852757
$$ 414398 -2108941 -5333249 -4215781 -2227949 -3444702 -4507140 -2033982 -181225
9818a81225k842188l346829J448155L584704Q20161j16712K793034K856940k255082
$$ -181225 -3023413 -6370242 -4922087 -1337383 -517222 -633934 2159100 5016040 2760958
9809B760958n323194k072500J429894o78020m499627l334475J904343N004027
$$ 2760958 -2562236 -4634736 -3204842 -3882862 -8382489 -11716964 -9812621 -4808594
9801d808594L486025N88122n3493J524495K670778J913761Q01411R91596P60103
$$ -4808594 -1322569 -734447 -787940 736555 3407333 5321094 6122505 7114101 7874204
9792G874204k180048n079229k910425K669416M030302o78187m186587j930986
$$ 7874204 5694156 614927 -2295498 373918 4404220 3726033 -460554 -2391540
9784b391540J136385M89560L5097L387793N545478J803603k381370j21392M435032
$$ -2391540 -1255155 -765595 -730498 2657295 8202773 10006376 7625006 7503614 11938646
9775A1938646K766320l619988o098800k914798R2592M59591Q67288J360803p90109
$$ 11938646 14704966 11084978 4986178 2071380 2163972 2623563 3490851 4851654 4061545
9766D061545l933748l120450J605551M926613L925073K50818l894965o303029
$$ 4061545 127797 -2992653 -1387102 3539511 7464584 7715402 3820437 -2482592
9758b482592l739875L450230Q417722N856135J0769j877687m69081j120661l411440
$$ -2482592 -6222467 -2772237 5645485 11501620 11512389 9634702 9165621 8044960 4633520
9749D633520k625170P37473J756273r6939j144220j066602k295818l331027p90699
$$ 4633520 2008350 2745823 4502096 4405157 3260937 2194335 -101483 -3432510 -4223209
9740d223209L076488K981907l47185j577419q9837J25229j219810q01789P20563
$$ -4223209 -1146721 1835186 1488001 -89418 -179255 -54026 -1273836 -2075625 -1355062
9731a355062l83021k921371k154293J121780J476835j097916r22116K780735L878267
$$ -1355062 -1738083 -4659454 -6813747 -5691967 -4215132 -5313048 -6235164 -3454429 423838
9722D23838k44225m317629l658865j09289K670260L738340L049963P33997p66658
$$ 423838 179613 -4138016 -7796881 -7906170 -5235910 -1497570 1552393 2286390 1519732
9713A519732Q15105K829843J136640k432475k650417n1080J40998k276342k288331
$$ 1519732 2334837 5164680 6301320 3868845 1218428 1167348 1308346 -967996 -3256327
9704c256327O56930J712989K39094R72407L895671K731888l383331o356877j708315
$$ -3256327 -2599397 -886408 -647314 325093 4220764 6952652 3569321 -2787556 -4495871
9695d495871M053799L833076j07450k157639k089692j798713m576L254686K882437
$$ -4495871 -442072 3391004 3283554 1125915 -963777 -2762490 -2767066 487620 3370057
9686C370057l292564p922505l536670N142335O764179m70639o469447l559717
$$ 3370057 77493 -7845012 -11381682 -6239347 524832 54193 -6415254 -9974971
9678i974971L964202O939582K929507k569551l895268j056103J793145J712843
$$ -9974971 -6010769 928813 3858320 1288769 -2606499 -3662602 -1869457 -156614
9670a56614k00107j011398L03409K212867K851640J583619r26342k815947k230389
$$ -156614 -356721 -1368119 -1064710 1148157 3999797 5583416 4657074 1841127 -389262
9661c89262j23290l35727m316763p379514m015020L802533Q035519M840988p85640
$$ -389262 -512552 -848279 -5165042 -12544556 -16559576 -12757043 -4721524 119464 -666176
9652f66176k220837M85120K136680J19173k452102j433242K409842M013812R61723
$$ -666176 -2887013 -2401893 -265213 -146040 -2598142 -4031384 -1621542 2392270 3353993
9643C353993k480010j171905K693744K421319k179414l658965P34887L524294
$$ 3353993 873983 -297922 2395822 4817141 2637727 -1021238 -286351 3237943
9635C237943p68336n522561k498997L853793L337770k738715l622411K688108
$$ 3237943 2469607 -3052954 -5551951 -1698158 1639612 -1099103 -4721514 -2033406
9627b033406O247669K053778k318873n66958K056213p39968m633937k260954L901442
$$ -2033406 4214263 6268041 3949168 3382210 5438423 4698455 64518 -2196436 1705006
9618A705006N383232Q74474l010033k558120r06466j019142j223719M77094K267578
$$ 1705006 7088238 7962712 4952679 2394559 1488093 468951 -754768 -277674 1989904
9609A989904J306154j792754l631227k361156L49975J851276J803962J813500
$$ 1989904 3296058 1503304 -2127923 -4489079 -4139104 -2287828 -483866 1329634
9601A329634K325629J934362K78165p64850j49292M89310r2882n00903J24549
$$ 1329634 3655263 5589625 5867790 5102940 4953648 5442958 5350076 4849173 4973722
9592D973722j91111k190052k449714J138636M250327J963802l005003m168661
$$ 4973722 4782611 2592559 142845 1281481 5531808 7495610 4490607 321946
9584C21946j233355P30648M87369J200573K440950K11442m149447l818961K206576
$$ 321946 -911409 -180761 306608 1507181 3948131 4159573 10126 -3808835 -1602259
9575a602259N820323J767026m170154l870214J797370N578865L843172p63036
$$ -1602259 4218064 5985090 1814936 -2055278 -257908 5320957 9164129 8401093
9567H401093m043060l958612j478899O9562j573526m077595l324256K74969K476826
$$ 8401093 4358033 399421 -1079478 -1009916 -2583442 -6661037 -9985293 -9710324 -7233498
9558g233498K185218K324814L327040K162366q20159j074984J872739K616189
$$ -7233498 -5048280 -2723466 603574 2765940 1945781 870797 2743536 5359725
9550E359725n42182j770166K158037N402453K477964k653382l621559j812472
$$ 5359725 4817543 3047377 5205414 10607867 13085831 10432449 6810890 4998418
9542D998418k025327l110856j274754J148452q66398n049897m124261K489334
$$ 4998418 2973091 -137765 -1412519 -264067 -1130465 -6180362 -10304623 -7815289
9534g815289P284026N558192P35573k256503k696064j589587R99306L875129M129034
$$ -7815289 -531263 5026929 5762502 3505999 809935 -779652 219654 4094783 8223817
9525H223817R63066k577494l174967o81228K373142K968862j33325m332827m754717
$$ 8223817 9186883 6609389 3434422 2753194 5126336 8095198 7961873 3629046 -1125671
9516a125671m30832L043923O04213m574219n220382m38401L605377L185261J206627
$$ -1125671 -1556503 1487420 2091633 -2482586 -7702968 -8141369 -4535992 -1350731 -144104
9507a44104Q75168R42714m71129k107159k292715j595303m90723J780868L933927
$$ -144104 731064 1673778 1202649 -904510 -3197225 -4792528 -5283251 -3502383 431544
9498D31544K664177j324637k262754J822822M357019P047n508776l346663L756122
$$ 431544 3095721 1771084 -491670 1331152 5688171 5695218 186442 -3160221 595901
9489E95901M559655l039512q103477l608924K894793K112919k122461l04123O181613
$$ 595901 5155556 2116044 -5987433 -9596357 -6701564 -4588645 -6711106 -7015229 -833616
9480h33616P300362J073876l473358j157725K165515O97944k335403k131417r95065
$$ -833616 6466746 7540622 4067264 2909539 5075054 5772998 3437595 1306178 311113
9471C11113k902979n144465k627256L255131O839961O562005M860478K150426
$$ 311113 -2591866 -7736331 -10363587 -7108456 -268495 6293510 11153988 13304414
9463A3304414k558082o573724n749575j505224M13549j439077k381976N23598
$$ 13304414 10746332 4172608 -1576967 -3082191 -2668642 -4107719 -6489695 -5966097
9455e966097L777626K750978j723834m442296k072380L061241N405466K631511
$$ -5966097 -2188471 562507 -1161327 -5603623 -7676003 -4614762 790704 3422215
9447C422215j108196o62070K275530J601092k703521l604956Q64847K854870k381846
$$ 3422215 2314019 1651949 3927479 5528571 2825050 -779906 84941 2939811 557965
9438E57965p088379k967245M548344M674255j314140l212342O89564K263376j188648
$$ 557965 -6530414 -9497659 -4949315 -275060 -1589200 -4801542 -4111978 -1848602 -3037250
9429c037250l146309n15191J852090J436047J736236L193140J384407k799162
$$ -3037250 -6183559 -6698750 -4846660 -3410613 -1674377 1518763 2903170 104008
9421A04008k297072L181314M646411j181112n700154k902839J190576M05290j229274
$$ 104008 -2193064 988250 5634661 4453549 -1246605 -4149444 -2958868 -2553578 -3782852
9412c782852P84071J633444l140561p220870l410083L518955M769382J883727
$$ -3782852 -2998781 -1365337 -4505898 -11726768 -15136851 -11617896 -6848514 -4964787
9404d964787J911918L735639J206504l933580m370859k76110J458734j15294P16146
$$ -4964787 -3052869 682770 1889274 -2044306 -6415165 -6691275 -5232541 -5347835 -4631689
9395d631689M454586M720193q1558l375547j309122J629958J121356m17566L49144
$$ -4631689 -177103 4543090 4461532 1085985 -223137 1406821 2528177 2110611 2459755
9386B459755J509073o1285k924093l480130j343294R57412J906342K209889K897189
$$ 2459755 3968828 3907543 983450 -2496680 -3839974 -2882562 -976220 1233669 4130858
9377D130858L600815K758868k33378l102448k682477M14050J640273j349950n147870
$$ 4130858 7731673 10490541 10257163 7154715 4472238 4886288 6526561 5176611 28741
9368B8741n362098k210255J135781L042822L618938L115159K544628K967253K308955
$$ 28741 -5333357 -7543612 -6407831 -3365009 253929 3369088 5913716 8880969 11189924
9359A1189924k797046r621350r561752r6323R125344Q084054l54370n564059l616772
$$ 11189924 8392878 -1228472 -10790224 -10886547 -1761203 6322851 5968481 404422 -3212350
9350c212350N72450K586392K417063N94140k603765m611091k904139P48490K772275
$$ -3212350 -2639900 -53508 2363555 2957695 353930 -4257161 -7161300 -6412810 -3640535
9341c640535K788341K026416j53287l270013l089610K011667N914985K882827
$$ -3640535 -852194 1174222 1020935 -2249078 -5338688 -3327021 2587964 5470791
9333E470791k896748l578513P148R22540j772338k809487q67801L70444K69120
$$ 5470791 2574043 -1004470 -997322 -74782 -1847120 -4656607 -5524408 -5153964 -4884844
9324d884844J369344K495057P42456r04335K374920O794296M307608l155433n443347
$$ -4884844 -3515500 -1020443 -277987 -1182322 1192598 7986894 12294502 9139069 3695722
9315C695722o63627K390399j248j163757K153021L481977o79059l933262j964771
$$ 3695722 3032095 5422494 5421246 4257489 6410510 9892487 9213428 5280166 3315395
9306C315395j73799k451977l331477P80651L242900p35698l706982J638561Q585050
$$ 3315395 3141596 689619 -2641858 -1861207 1381693 645995 -3060987 -1422426 7162624
9297G162624O879064j65670k021097J048979J25677n311268o470125j107866K652184
$$ 7162624 14041688 13876018 11854921 12903900 13029577 7718309 1248184 140318 2792502
9288B792502K99860k488635n55109K867086L073967J145839L1682o80115k055209
$$ 2792502 3092362 603727 48618 2915704 5989671 7135510 7167192 6487077 4431868
9279D431868k551556j071793L61745n0522r14062m49143M44019J63444p10824
$$ 4431868 1880312 808519 1170264 1119742 205680 -243463 200556 364000 -346824
9270c46824m45307J355391L421473L891890J546996k614127n275844l990129j53719
$$ -346824 -792131 563260 3984733 7876623 9423619 6809492 1533648 -2456481 -2610200
9261b610200K717227K918360J261420p04874j266439P83669L676277L152606j612098
$$ -2610200 107027 3025387 4286807 3581933 2315494 3099163 6775440 9928046 8315948
9252H315948n258786l336171O85027O61798k405240k344512J647052L757162J181170
$$ 8315948 3057162 -279009 406018 1067816 -1337424 -3681936 -2034884 1722278 2903448
9243B903448k177249k982645k557876j753618J298432N522989N896306J628853
$$ 2903448 726199 -2256446 -4814322 -6567940 -5269508 253481 6149787 7778640
9235G778640j494247r18630j753062n922484n559500L965186J2069286O198681
$$ 7778640 6284393 5365763 3612701 -2309783 -7869283 -3904097 8165189 14363870
9227A4363870p596010j1355740j332081P356836M548737j390045k79329L224310
$$ 14363870 6767860 -4587880 -5919961 1436875 5985612 4595567 4316238 7540548
9219G540548L01678n088021l217091L619523M274839k605417o443234j993125
$$ 7540548 7842226 2754205 -462886 3156637 7431476 4826059 -1617175 -3610300
9211c610300L283420K254883j689731k253458O1353J289566R44060M10203q19711
$$ -3610300 -326880 1928003 238272 -2015186 -1953833 -664267 279793 689996 -129715
9202a29715k619430k046662J958305N274016L953383l71648l790502n226433m964013
$$ -129715 -2749145 -4795807 -2837502 2436514 6389897 6018249 2227747 -2998686 -7962699
9193g962699k120905K515363M888236K910438k46756j676999l102402n483223
$$ -7962699 -10083604 -7568241 -2680005 230433 -16323 -1693322 -4795724 -10278947
9185a0278947m515899K407252R212421Q338205J787129k293406j533623k18733
$$ -10278947 -14794846 -12387594 -3175173 5163032 6950161 4656755 3123132 2904399
9177B904399k00973P57624K162282N51383l226029m007845q84580J143261l11277
$$ 2904399 2703426 3461050 5623332 6174715 2948686 -1059159 -1943739 -800478 -1111755
9168a111755j453126N27135K723527J712551j371307l445052l218614p64615K759683
$$ -1111755 -2564881 -2037746 685781 2398332 1027025 -2418027 -5636641 -6401256 -3641573
9159c641573M134618J140489k914424k551671J671297L831658J970330L55508
$$ -3641573 493045 1633534 -1280890 -3832561 -2161264 1670394 3640724 3996232
9151C996232J197453J047937k006593m156543k361374O46655J492645J251811
$$ 3996232 5193685 6241622 4235029 78486 -2282888 -1636233 -143588 1108223
9143A108223J884669K269902J209358L4722p62609k930023n685105m657801J084866
$$ 1108223 2992892 5262794 6472152 6506874 5744265 2814242 -2870863 -7528664 -6443798
9134f443798N974078N458738J793422r98534k649730l500635j592711K593729
$$ -6443798 -469720 4989018 6782440 5783906 3134176 -366459 -1959170 634559
9126F34559M051715Q45251j655661N79542L100206P22200l232481k967226n69939
$$ 634559 4686274 5531525 3875864 4455406 7555612 8277812 5045331 2078105 1508166
9117A508166j638361m145981j319636N818595Q300139K415687m898787n866122
$$ 1508166 -130195 -4276176 -5595812 222783 8522922 10938609 6039822 173700
9109A73700r43216M024349N039328K347226j186096k705035k077203j664910k174676
$$ 173700 -769516 3254833 8294161 10641387 9455291 6750256 4673053 3008143 833467
9100H33467j126906K325510M514085K682129l36766j105787j297115l276552m214793
$$ 833467 -293439 2032071 6546156 9228285 8891519 7785732 6488617 3212065 -1002728
9091a002728j096095K250239P16163k714248j614536K471072K737365m01633n3399
$$ -1002728 -2098823 151416 867579 -1846669 -3461205 -990133 1747232 1345599 1292200
9082A292200M019049M135583j527033m888518j507164K081618o152l230311j371486
$$ 1292200 5311249 9446832 7919799 3031281 1524117 3605735 3599583 369272 -1002214
9073a002214K567663K099988j710469k960219q22715Q05478R83525J927042K981821
$$ -1002214 1565449 3665437 1954968 -1005251 -1827966 -1022488 -38963 1888079 4869900
9064D869900J020833l290945n164491k354773J879181L307309J382441j224328
$$ 4869900 5890733 2599788 -2564703 -4919476 -3040295 267014 1649455 425127
9056D25127j822783j38993J548336J149975k81115r8500J419235J173011j417284
$$ 425127 -1397656 -1536649 11687 1161662 880547 782047 2201282 3374293 1957009
9047A957009k997808j768823k28313j59925N57948K865512L027053j125176m791276
$$ 1957009 -1040799 -2809622 -3037935 -3197860 -2639912 225600 3252653 2127477 -2663799
9038b663799k873386J574831K387910Q42364K860365P045599N286366l137194
$$ -2663799 -5537185 -3962354 -1574444 -732080 2128285 9173884 14460250 11323056
9030A1323056p873563k643469M381371K646938m606905n683271J140480N130562
$$ 11323056 3449493 806024 5187395 7834333 3227428 -2455843 -1315363 3815199
9022C815199R3320n999196l315326N068413P977996K051758m902244n823408k536105
$$ 3815199 3908519 -2090677 -5406003 -337590 7640406 9692164 4789920 -1033488 -3569593
9013c569593k32011K43411R70452J812434J101582m25193l04340J675045L192938
$$ -3569593 -3801604 -3558193 -2587741 -775307 326275 -98918 -403258 1271787 4464725
9004D464725K817487J278569l79044j677673j952630q75017K03768o86276l365456
$$ 4464725 7282212 8560781 8181737 6504064 4551434 3676417 3880185 3193909 -171547
8995a71547n060654l105433K210286P058425O654517L03122o095680n659869N34449
$$ -171547 -5232201 -8337634 -6127348 931077 7585594 7888716 1793036 -3866833 -3332384
8986c332384M209751J471764j587467J109712N450071L649114l007644o293607
$$ -3332384 877367 2349131 761664 1871376 7321447 10970561 7962917 1669310
8978A669310l961681j618564j985656j509515R67158J340428j054288o85653L999188
$$ 1669310 -2292371 -3910935 -5896591 -7406106 -6438948 -5098520 -6152808 -6838461 -2839273
8969b839273O000802J004302m390024k685826K568194K916096j557749l482037
$$ -2839273 3161529 4165831 -224193 -2910019 -341825 2574271 1016522 -2465515
8961b465515k42464L339765L297002N37068k952975n901981n980841j599054M369882
$$ -2465515 -2707979 631786 3928788 4465856 1512881 -4389100 -10369941 -11968995 -7599113
8952g599113O842365M289683p22799m955706n372442L917P673163R080624J384606
$$ -7599113 -756748 3532935 2810136 -2145570 -7518012 -7514095 159068 9239692 10624298
8943A0624298o169099m004209L373766L941010l375700p657793l264059L054545
$$ 10624298 4455199 450990 3824756 7765766 4390066 -3267727 -6531786 -3477241
8935c477241M474526L089467K773565K274367J50718j155165o92623j391062l319414
$$ -3477241 997285 4086752 6860317 9134684 9285402 8130237 7437614 6046552 2727138
8926B727138k254769J247600L00997n792022p269133P34976Q278378N429263j784033
$$ 2727138 472369 1719969 2020966 -3771056 -11040189 -10305213 -2026835 3402428 1618395
8917A618395j647238M246846N434980R86559p67281J567571R77693l331595l926719
$$ 1618395 -28843 4218003 9652983 10639542 9872261 11439832 12417525 9085930 5159211
8908E159211L54958J389343l169538m719272J001422N446924J335609n220643
$$ 5159211 5514169 6903512 3733974 -985298 16124 5463048 6798657 1578014
8900A578014n194343o65112Q69701o46763k54148J858627K034699J261751K631131
$$ 1578014 -3616329 -4281441 -3411740 -4058503 -4312651 -2454024 -419325 842426 3473557
8891C473557L655436P3187m800326l704234K402801M875368P68238k836114j93545
$$ 3473557 7128993 7202180 2401854 -1302380 1100421 5975789 6744027 3907913 3714368
8882C714368M682870M632752p28790n525133n154098n82959L301800K485945j829978
$$ 3714368 8397238 13029990 12301200 6776067 1621969 1039010 4340810 6826755 4996777
8873D996777m138944j550150J977035J304426k164373k908116J24413K633948
$$ 4996777 857833 -692317 1284718 2589144 424771 -2483345 -2358932 275016
8865B75016K012614j16163k190038m068319m095884o36800L099496K026884k236431
$$ 275016 2287630 2171467 -18571 -4086890 -8182774 -8819574 -5720078 -3693194 -5929625
8856e929625k687539J580017L037654j788020n499072j250563N762371N822713
$$ -5929625 -8617164 -7037147 -3999493 -5787513 -11286585 -12537148 -6774777 -952064
8848i52064q41221n318337l385992M35930J721271J528032J659963R17669j173316
$$ -952064 -1793285 -7111622 -10497614 -10061684 -8340413 -6812381 -5152418 -4234749 -5408065
8839e408065j586374J774092N748836N554880J408946j708553q56277J257254
$$ -5408065 -6994439 -5220347 528489 6083369 7492315 5783762 4927485 6184739
8831F184739Q73139j024122p46422J230212K61323m112118n243759P59710P010877
$$ 6184739 7057878 6033756 5287334 6517546 6778869 2666751 -2577008 -1817298 5193579
8822E193579M733150k902410m882867N57465L449702j275201n691652k781956
$$ 5193579 9926729 7024319 2141452 2698917 6148619 4873418 -818234 -3600190
8814c600190J760501K6069l966822j218104O376523Q497377K548780l500164m362480
$$ -3600190 -1839689 -1813620 -5780442 -6998546 -622023 7875354 10424134 6923970 2561490
8805B561490l562624m608765m813190j358028K975776L950780J559809j155816
$$ 2561490 -1001134 -5609899 -10423089 -11781117 -8805341 -4854561 -3294752 -4450568
8797d450568j922135l45199K164465L084478J777396R35655K163466K264156j684957
$$ -4450568 -6372703 -6717902 -4553437 -1468959 308437 1244092 3407558 5671714 3986757
8788C986757n894756m369282J710010N502252M341498J368985j575622n038870
$$ 3986757 -1907999 -6277281 -4567271 934981 5276479 6645464 5069842 30972
8780C0972o465291k236387M156247M787879m17630l100581j08562K079795k54535
$$ 30972 -6434319 -8670706 -4514459 273420 -144210 -3244791 -3353353 -1273558 -1528093
8771a528093j664780J405876L279677l88604l820647r44885L928384L941529J131549
$$ -1528093 -3192873 -1786997 1492680 1104076 -2716571 -3661456 266928 4208457 5340006
8762E340006Q43097J149884k128266n359853k786402K040554J497441k783233
$$ 5340006 6183103 7332987 5204721 -155132 -2941534 -900980 596461 -2186772
8754b186772k997678J010572K535330P69975P76579J743588j874024p231392m841417
$$ -2186772 -5184450 -4173878 -1638548 -868573 -91994 1651594 -222430 -7453822 -12295239
8745a2295239M322374P570046Q74353l519909K872412J0256658O307636m313019
$$ -12295239 -7972865 -402819 471534 -3048375 -175963 10080695 16388331 12075312
8737A2075312q446044m760451k511593m556485m604255k846M198849M510523K949166
$$ 12075312 3629268 -1131183 -3642776 -8199261 -12803516 -12806362 -8607513 -4096990 -1147824
8728a147824Q82105k699402n662978l491425K603021N577464K839447j11103R78740
$$ -1147824 -265719 -2965121 -8628099 -12119524 -9516503 -3939039 -1099592 -1210695 -231955
8719b31955K674431N65322l167431l635158p88006J572295J754739J084277O09113
$$ -231955 2442476 3007798 -159633 -3794791 -4582797 -3010502 -1255763 -171486 437627
8710D37627L65494P34143J796936K337245J501440K13567p08987k141302m546206
$$ 437627 803121 1537264 3334200 5671445 7172885 7386452 6677465 4536163 -10043
8701a0043o118236n076840k210285O88063L087248M615346L981674J320330p03450
$$ -10043 -6128279 -11205119 -13415404 -12727341 -9640093 -5024747 -1043073 277257 -426193
8692d26193p47597j205628l595387m442226k90698N463510O324684K130516j198211
$$ -426193 -1173790 -2379418 -5974805 -10417031 -10707729 -5244219 1080465 3210981 2012770
8683B012770j012187n95387j760961j752861J48678k04068m143880n918324j370313
$$ 2012770 1000583 405196 -1355765 -3108626 -2959948 -3164016 -7307896 -13226220 -14596533
8674a4596533M427339M583549J155330J066790M169758L838651j214043m202293
$$ -14596533 -10169194 -5585645 -4430315 -3363525 806233 4644884 3430841 -771452
8666g71452r37639M032498M854058K058050o33901k394732m194833n018366l135612
$$ -771452 -1709091 2323407 7177465 9235515 8601614 6206882 2012049 -3006317 -6141929
8657f141929O60660L812195M589913K562085j307290l889556k143197K390024
$$ -6141929 -5481269 -1669074 2920839 5482924 4175634 286078 -1857119 532905
8649E32905M433090J880325j571962k416175j879113j978141j379423J190922
$$ 532905 4965995 6846320 5274358 2858183 979070 -999071 -2378494 -1187572
8641a187572L261732K554673J258697J922435K322872m99078l990716l632286
$$ -1187572 2074160 4628833 5887530 7809965 10132837 9633759 5643043 2010757
8633B010757m88703R17277N38464J882225M168353K850796j687540l564588j235027
$$ 2010757 1522054 2439331 2977795 4860020 9028373 11879169 10191629 6627041 5392014
8624E392014m63686m332708p250807l750616K393737L867915Q51022j66655L072818
$$ 5392014 4928328 595620 -6655187 -10405803 -8012066 -4144151 -3293129 -3459784 -386966
8615c86966N477144K596898l017250n470881k999621M34856N35606j940558k497765
$$ -386966 5090178 7687076 4669826 -801055 -3800676 -3365820 -2830214 -4770772 -7268537
8606g268537M97217K963346R32259l075124l513961l55467J194199m26169p99183
$$ -7268537 -6771320 -3807974 -2875715 -5950839 -9464800 -9820267 -8626068 -9052237 -9851420
8597i851420K139750L997261J772761m04308J346126L106594n8996m158043j691826
$$ -9851420 -7711670 -3714409 -1941648 -2345956 -999830 2106764 2047768 -2110275 -3802101
8588c802101N231944O634284j50785o133887m148062J350647K396036j000988
$$ -3802101 1429843 8064127 7913342 1779455 -2368607 -1017960 1378076 377088
8580C77088l152976k079181n41480r9223L41035R92603P47103l6104R1285P84837
$$ 377088 -2775888 -4855069 -5396549 -5495772 -5154737 -4162134 -3415031 -3451135 -3359850 -2575013
8570b575013N86112O5428J023096K772611K630232L42158j353583j194665r78619
$$ -2575013 -1988901 -1923473 -900377 1872234 4502466 4844624 3491041 2296376 1317757
8561A317757j548959q05025K090418L703822Q00658m210670n935727l191926n5740
$$ 1317757 -231202 -1036227 1054191 4758013 5558671 1348001 -4587726 -7779652 -7835392
8552g835392J58424j382515j955021r03376Q99679K693593L384085J640156j708160
$$ -7835392 -7676968 -9059483 -11014504 -11917880 -11018201 -8324608 -4940523 -3300367 -5008527
8543e008527l198549p91572K987666M129743K192489j7777p52103n99314o0402
$$ -5008527 -8207076 -8998648 -6010982 -1881239 311250 293473 -458630 -1057944 -1118346
8534a118346J200384K584550K733686J838837J318578R38771r88557m039227n377460
$$ -1118346 82038 2666588 5400274 7239111 8557689 9496460 8507903 4468676 -908784
8525i08784l991376k058157p73813J551868N014034N565740P11066n136219n597680
$$ -908784 -4900160 -6958317 -7732130 -6180262 -1166228 4399512 5110578 -25641 -5623321
8516e623321j012665K527454K000769L77381N64599J427035J311049J231424K241102
$$ -5623321 -6635986 -4108532 -2107763 -1730382 -1165783 261252 1572301 2803725 5044827
8507E044827K917288J910895M40872J566j41789j045682j890751j804819j584720
$$ 5044827 7962115 9873010 10313882 10315448 10173659 9127977 7237226 5432407 3847687
8498C847687j378622O50633M405917N460125Q02373n144500n431410n17111K463653
$$ 3847687 2469065 3119698 7525615 12985740 13788113 8643613 3212203 2695092 5158745
8489E158745O01862r70906J649126M236554J315961m614192o595693l482081n54764
$$ 5158745 5760607 4789701 6438827 10675381 11991342 7377150 781457 -2700624 -3255388
8480c255388n81813l77641K529171N153384L798882j63312k580505k297680j449085
$$ -3255388 -3837201 -4214842 -1685671 3467713 7266595 7103283 4522778 2225098 776013
8471G76013j312884r59423K89215J549829J839052J212969J77740q76307j514505
$$ 776013 -536871 -1496294 -1207079 342750 2181802 3394771 3572511 2696204 1181699
8462A181699j442776r23469m15007m7701P34p50575k033322k134975L56986M103875
$$ 1181699 -261077 -1184546 -1599553 -1647254 -1646520 -2397095 -4430417 -6565392 -6208406 -2104531
8452b104531N513019K279123l877982q255145p145792j306507M453161N771725
$$ -2104531 3408488 5687611 1809629 -6445516 -13591308 -14897815 -10444654 -4672929
8444d672929K898473l61645j466695j213617j021841o79580J19367M64255K42921
$$ -4672929 -1774456 -2136101 -3602796 -4816413 -5838254 -6517834 -6398467 -5934212 -5691291
8435e691291J199671L704718M652247J556780l008910m533343k880571j680823
$$ -5691291 -4491620 -786902 3865345 5422125 2413215 -2120128 -5000699 -6681522
8427f681522k143308j703289R55039L628520M330383L734023K661669M41939k638770
$$ -6681522 -8824830 -10528119 -9573080 -5944560 -1614177 2119846 4781515 5223454 2584684
8418B584684m122572k491199N52931K325712K033938P21348Q4695J357787L279099
$$ 2584684 -1537888 -4029087 -3476156 -1150444 883494 1604842 1689537 3047324 6326423
8409F326423K050071l366241p177108l231130M849547O875185P72812l779020
$$ 6326423 8376494 5010253 -2166855 -5397985 -548438 6326747 7099559 3320539
8401C320539q1019N236089L125516l363203m512753K36661K121773k207091n689140
$$ 3320539 3239520 8475609 11601125 8237922 3725169 3961830 6083603 3876512 -1812628
8392a812628k606007K869501L794823L09775k221626j474975k38722j407470l871001
$$ -1812628 -4418635 -1549134 2245689 2555464 333838 -1141137 -1379859 -2787329 -6658330
8383f658330l818158M60653N520424O046918J900765r63813J069266L435142M10008
$$ -6658330 -10476488 -10015835 -4495411 1551507 3452272 2488459 3557725 6992867 7402875
8374G402875n041353m926757J354094N422188J834308m826947p085752l497031
$$ 7402875 2361522 -2565235 -1211141 4211047 6045355 1218408 -5867344 -9364375
8366i364375K208214O320872O624379K580972k933663n068521k630751L16098
$$ -9364375 -7156161 -835289 5789090 8370062 5436399 367878 -2262873 -1946775
8358a946775J78419j812986k529636j044472J728054M275080M178911K81513l753781
$$ -1946775 -1768356 -3581342 -6110978 -7155450 -5427396 -1152316 3026595 3308108 -445673
8349d45673k531927K952702N464228J965439j899111j138626Q10480j247488n019264
$$ -445673 -2977600 -24898 5439330 7404769 5505658 4367032 5177512 3930024 -1089240
8340a089240m576688J2154L415012L266257J716828L03242j148701j622551j70797
$$ -1089240 -5665928 -5653774 -2238762 1027495 2744323 3047565 1898864 276313 105516
8331A05516P91064j563170m983314m547650m2172L895575M678661L988889L171614
$$ 105516 896580 -666590 -5649904 -10197554 -10239726 -6344151 -1665490 2323399 5495013
8322E495013J372229j091566k027212j197915j166772l201257n279542m850498
$$ 5495013 6867242 5775676 3748464 2550549 1383777 -1817480 -7097022 -11947520
8314a1947520j206074M530846R073931P821949o7226q251964r258440l616124
$$ -11947520 -13153594 -8622748 451183 8273132 8205906 -46058 -9304498 -12920622
8306a2920622J558109K660904K802592M459124N079377K326601j507270l449981
$$ -12920622 -11362513 -8701609 -5899017 -1439893 3639484 5966085 4458815 1008834
8298A008834m111631m842281m233094r96132K435246K859684J084296M41407J692295
$$ 1008834 -3102797 -7945078 -12178172 -13174304 -10739058 -7879374 -6795078 -6353671 -4661376
8289d661376K480437J461316K96077R48552K638127K707843L84993j541757k63975
$$ -4661376 -2180939 -719623 -423546 525006 3163133 5870976 6255969 4714212 4450237
8280D450237K361104J605657k775582m912254j389593K608205P22074m228086
$$ 4450237 6811341 8416998 5641416 729162 -660431 1947774 2669848 -1558238
8272a558238m125040J694606N301516K324091k397655l446676k012109j089672
$$ -1558238 -5683278 -3988672 1312844 3636935 1239280 -2207396 -4219505 -5309177
8264e309177Q2211K364592K815473n56989m177113l836398r34629O65116Q60384
$$ -5309177 -5226966 -2862374 -46901 -603890 -4781003 -8617401 -9552030 -8886914 -8026530
8255h026530J751917K604802J259015j269915k068033q66300M83962J624121L175884
$$ -8026530 -6274613 -3669811 -2410796 -3680711 -5748744 -6615044 -6131082 -4506961 -1331077
8246a331077M071823K898145O36009r52357k043162l019665k318465O19837K696059
$$ -1331077 2740746 5638891 6274900 5322543 3279381 259716 -2058749 -1438912 1257147
8237A257147J378708p56354r9630J642287L37919k995629l363908r1875J871176
$$ 1257147 2635855 1879501 1779871 3422158 3760077 764448 -2599460 -2691335 -820159
8228h20159k44859k970760j969462K296756N820896N325539O14284m937672o368687
$$ -820159 -1065018 -4035778 -6005240 -3708484 2112412 7437951 8052235 3114563 -3254124
8219c254124k310582K413578K517972m70041q45993K178199L435731M14990k796825
$$ -3254124 -5564706 -3151128 -633156 -1103197 -1949190 229009 3664740 4079730 1282905
8210A282905k323201j89736J16682k30810J976575N456096N001358j341543q615328
$$ 1282905 -1040296 -1230032 -1113350 -1344160 632415 6088511 11089869 9748326 1132998
8201A132998r755179l310963M545565O428804J964143k144901r85611K454488
$$ 1132998 -8622181 -11933144 -7387579 -958775 1005368 -1139533 -2125144 329344
8193C29344K552236m95750j984951p26234r0446j143254p04035K204451L460033
$$ 329344 2881580 2385830 400879 -325355 -415801 -1559055 -2263090 -58639 3401394
8184C401394K18721m188465n002888k298250O57074K363927L195098K957478J573053
$$ 3401394 3620115 -568350 -5571238 -7869488 -7212414 -4848487 -1653389 1304089 2877142
8175B877142M35059M14093K36805q92709j290025M661M85323k012293m814489
$$ 2877142 3312201 3726294 3963099 3070390 1780365 1785026 2270349 258056 -4556433
8166d556433l649302Q17211L675792K579960Q7572r23814n74902P0949J136429
$$ -4556433 -8205735 -7388524 -3712732 -1132772 -1045200 -1969014 -2543916 -2472967 -1336538
8157a336538K484913K572830N72915j880306k722426k228605k200131k964650
$$ -1336538 1148375 3721205 4294120 2413814 -308612 -2537217 -4737348 -7701998
8149g701998k807807n95386K290072L464377K426077Q92558K87734Q7617p31117
$$ -7701998 -10509805 -11105191 -8815119 -5350742 -2924665 -2032107 -1744373 -1656756 -2387873
8140b387873j711591j602362l74779P85943J160717R28362L02592m50561n67349
$$ -2387873 -4099464 -5701826 -6076605 -5290662 -4129945 -3201583 -2898991 -3349552 -3916901
8131c916901K45764R79407R66266J342380K757639K964366m2505l440332k545688
$$ -3916901 -3671137 -2691730 -1725464 -383084 2374555 5338921 5296416 1856084 -689604
8122f89604J580090K675349j129893l828595q61188L332200K231866k282522l013117
$$ -689604 890486 3565835 2435942 -1392653 -2253841 1078359 3310225 1027703 -1985414
8113a985414R86519L225729M68391k443505r61132J980084J473576r59229j30745
$$ -1985414 -998895 2226834 2695225 251720 -709412 1270672 2744248 1785019 1654274
8104A654274L631691M129086j220254o697695n821466j98928K856294N1839m367183
$$ 1654274 5285965 9415051 8194797 1497102 -4324364 -4523292 -1666998 -1615159 -5982342
8095e982342m917284j311764K654688M069356K863103N22755j141693q77808Q08456
$$ -5982342 -10899626 -12211390 -9556702 -5487346 -2624243 -2101488 -3243181 -4120989 -3312533
8086c312533K098743K420403L015377L838082K322813k380668o205992m660009
$$ -3312533 -1213790 1206613 4221990 8060072 10382885 8002217 1796225 -2863784
8078b863784P99843M452101L571109M69570j997201l041453k305321K81190K603337
$$ -2863784 -2063941 2388160 5959269 6428839 4431638 1390185 -915136 -633946 1969391
8069A969391K007489p30656k427245k298383j946222j155533J400969L568309
$$ 1969391 3976880 3246224 818979 -1479404 -3425626 -4581159 -3180190 388119
8061C88119J726348k135651j986615K194226L173297j986130o526768m364665
$$ 388119 2114467 -21184 -2007799 186427 3359724 1373594 -5153174 -9517839
8053i517839J056589L495981L100409K817618J584225j872801l545548j14769
$$ -9517839 -8461250 -4965269 -1864860 952758 2536983 664182 -2881366 -2996135
8045b996135L848874K598625p00713P29516M985251M094492k533499o884050m625691
$$ -2996135 852739 3451364 2750651 3480167 8465418 12559910 10026411 3142361 -1483330
8036a483330J05578K778313L174498J397266k715341n322059j902042M088505
$$ -1483330 -1377752 1400561 4575059 5972325 3256984 -2065075 -3967117 121388
8028A21388M352486j181728l718841j05184K331266o26868k343882K319472O644127
$$ 121388 4473874 3292146 -426695 -531879 1799387 1172519 -1171363 1148109 7792236
8019G792236K882230m145903m467648J097451L014481j415414m744399j670917
$$ 7792236 10674466 6528563 2060915 3158366 6172847 4757433 13034 -1657883
8011a657883L921801N860251L183060j189249m472346m940741k432026P01977
$$ -1657883 2263918 8124169 11307229 10117980 5645634 704893 -1727133 -1025156
8003a025156J715882R69646Q77443J608963Q86058j682157l124624j171527K238467
$$ -1025156 690726 1660372 2537815 4146778 5032836 3350679 226055 -945472 1292995
7994A292995L116354N22986j793427J33070M601530N183793p13465p017888o620111
$$ 1292995 4409349 4932335 3138908 3271978 7873508 13057301 12343836 5325948 -1294163
7985a294163j423758J138141P6782J213621N137840M629508k223631o174012p81007
$$ -1294163 -2717921 -1579780 -1502998 -289377 4848463 9477971 7254340 1080328 299321
7976B99321O305365M861078j975285l729819K81623J458391k689066n327075k801493
$$ 299321 6604686 11465764 9490479 5760660 6042283 7500674 4811608 -515467 -3316960
7967c316960K39240J69553l79441O13130N13357j806342k634443K07230L352363
$$ -3316960 -3077720 -2908167 -3287608 -2674478 -2161121 -3967463 -6601906 -6394676 -3042313
7958c042313L448410J740103L83445j045113k751927k842969o88479J584284K554546
$$ -3042313 406097 2146200 2529645 1484532 -1267395 -4110364 -4798843 -3214559 -660013
7949f60013K720836J680421j278223l519445j637358J897858J237921k865822
$$ -660013 2060823 3741244 2463021 -1056424 -2693782 -795924 441997 -2423825
7941b423825l197493J964545N391325K735569o81852K29033J806094o31288l774647
$$ -2423825 -5621318 -3656773 1734552 4470121 3788269 4017302 5823396 5192108 1417461
7932A417461k557989N09396K18031j868325r69580J614850J024521k017763k613744
$$ 1417461 -1140528 -631132 -413101 -2281426 -3251006 -1636156 -611635 -2629398 -5243142
7923e243142m40390N26228k10543M99894K511283K235279n91069k171628q10572
$$ -5243142 -5683532 -5157304 -5367847 -4867953 -2356670 -121391 -712460 -2884088 -3694660
7914c694660J501725L231537L993686K287534j934324l947242J60328N852626
$$ -3694660 -2192935 1038602 5032288 7319822 5385498 1438256 1598584 7451210
7906G451210N119383j626977o119960m630949j798225j152925j61796K737427
$$ 7451210 12570593 10943616 4823656 192707 -1605518 -2758443 -2920239 -182812
7898a82812L842686Q14791k483655j800266J506376L510872K695574m00222m268400
$$ -182812 3659874 4474665 1991010 190744 1697120 5207992 7903566 7503344 3234944
7889C234944n579913k115463K185503R42586m469043n483549N02489N523653L610434
$$ 3234944 -2344969 -4460432 -2274929 -1332343 -5801386 -11284935 -10782446 -5258793 -1648359
7880a648359l08294J4872J569835r10581l961305j101530M831967N365421J74906
$$ -1648359 -1956653 -1941781 -371946 -1282527 -5243832 -6345362 -1513395 3852026 4026932
$$ [...]
##END NTUPLES=NMR SPECTRUM
##END=
