##TITLE=31Pdec_SR69_k(TFA)
 CDCl3, 24 sc
 7.07.2021
##JCAMPDX= 6.0         $$ Bruker NMR JCAMP-DX V2.0
##DATA TYPE= NMR SPECTRUM
##DATA CLASS= NTUPLES
##ORIGIN= UXNMR, Bruker Analytische Messtechnik GmbH
##OWNER= root
$$ XWIN-NMR		Version 3.5
$$ Thu Jul  8 12:04:37 2021 Russian Standard Time (UT+4h)  she@DPX200
##.OBSERVE FREQUENCY= 81.013821
##.OBSERVE NUCLEUS= ^31P
##.ACQUISITION MODE= SIMULTANEOUS
##.ACQUISITION SCHEME= undefined
##.AVERAGES= 24
##.DIGITISER RES= 16
##SPECTROMETER/DATA SYSTEM= spect
##.PULSE SEQUENCE= zgpg30
##.SOLVENT NAME= DMSO
##.SHIFT REFERENCE= (INTERNAL, DMSO, 0, 248.564)
##AUDIT TRAIL= $$ (NUMBER, WHEN, WHO, WHERE, WHAT)
$$ ##TITLE= Audit trail, XWIN-NMR		Version 3.5
$$ ##JCAMPDX= 5.01
$$ ##ORIGIN= Bruker BioSpin GmbH
$$ ##OWNER= she
$$ F:/spectra/data/she/nmr/P31/1/pdata/1/auditp.txt
$$ ##AUDIT TRAIL=  $$ (NUMBER, WHEN, WHO, WHERE, WHAT)
(   1,<2021-07-08 12:01:44.28 +0400>,<she>,<DPX200>,
      <created by zg, POWCHK disabled, PULCHK disabled
       configuration hash MD5:
       00 E9 B6 7A A2 85 ED C7 34 08 36 98 17 FE 4E 26
       data hash MD5: 32K
       B8 74 6A CC 51 22 71 D0 46 95 C4 3C C2 21 C5 96>)
(   2,<2021-07-08 12:01:50.40 +0400>,<she>,<DPX200>,
      <Start of raw data processing
       efp BC_mod = 2 LB = 1 FT_mod = 6 PKNL = 1 PHC0 = -7954.565 PHC1 = 653.2863 SI = 64K 
       data hash MD5: 64K
       83 A8 8E FA 88 0B ED C5 45 1C BC B0 86 E7 C5 9C>)
(   3,<2021-07-08 12:02:18.75 +0400>,<she>,<DPX200>,
      <pk PHC0 = -93.48843 PHC1 = 233.8 
       data hash MD5: 64K
       18 5E 3A 0C E0 B7 73 7D 9B 9D 7C 9E 1F 44 71 12>)
(   4,<2021-07-08 12:03:49.26 +0400>,<she>,<DPX200>,
      <pk PHC0 = -655.3239 PHC1 = 1690.589 
       data hash MD5: 64K
       27 B0 CB 44 8D CE BD 87 E4 EF D0 3A BB 97 F4 11>)
$$ ##END=
$$ 
$$ hash MD5
$$ 31 EB 4A E1 E4 8D 04 08 5C 2F 8E 4C 6D 56 10 DE
##$RELAX= 
##$RELAX= 
##$RELAX= 
##$RELAX= 
##$RELAX= 
##$RELAX= 
##$RELAX= 
##$RELAX= 
$$ Bruker specific parameters
$$ --------------------------
##$DU= <F:/spectra>
##$EXPNO= 1
##$NAME= <P31>
##$PROCNO= 1
##$TYPE= <nmr>
##$USER= <she>
##$AMP= (0..31)
100 100 100 100 100 100 100 100 100 100 100 100 100 100 100 100 100 100 
100 100 100 100 100 100 100 100 100 100 100 100 100 100 
##$AQSEQ= 0
##$AQ_mod= 1
##$AUNM= <au_zg>
##$AUTOPOS= <>
##$BF1= 81.014009
##$BF2= 200.13
##$BF3= 200.13
##$BF4= 200.13
##$BF5= 200.13
##$BF6= 200.13
##$BF7= 200.13
##$BF8= 200.13
##$BYTORDA= 1
##$CFDGTYP= 0
##$CFRGTYP= 5
##$CHEMSTR= <none>
##$CNST= (0..31)
1 1 145 1 1 1 1 1 1 1 1 1 1 1 1 1 1 1 1 1 1 1 1 1 1 1 1 1 1 1 1 1 
##$CPDPRG= <waltz16>
##$CPDPRG1= <>
##$CPDPRG2= <waltz16>
##$CPDPRG3= <>
##$CPDPRG4= <mlev>
##$CPDPRG5= <mlev>
##$CPDPRG6= <mlev>
##$CPDPRG7= <mlev>
##$CPDPRG8= <mlev>
##$CPDPRGB= <>
##$CPDPRGT= <>
##$D= (0..31)
0 1 0 0 0 0 0 0 0 0 0 0.03 2e-05 3e-06 0 0 0 0 0 0 0 0 0 0 0 0 0 0 0 0 
0 0 
##$DATE= 1625731303
##$DBL= (0..7)
120 120 120 11 120 120 24 19 
##$DBP= (0..7)
150 150 150 150 150 150 150 150 
##$DBP07= 0
##$DBPNAM0= <>
$$ [...]
##$SUBNAM2= <"">
##$SUBNAM3= <"">
##$SUBNAM4= <"">
##$SUBNAM5= <"">
##$SUBNAM6= <"">
##$SUBNAM7= <"">
##$SUBNAM8= <"">
##$SUBNAM9= <"">
##$SW= 501.771253377433
##$SWIBOX= (0..15)
0 1 3 0 0 0 0 0 0 0 0 0 0 0 0 0 
##$SW_h= 40650.406504065
##$TD= 32768
##$TD0= 1
##$TE= 0
##$TE2= 300
##$TE3= 300
##$TEG= 300
##$TL= (0..7)
0 120 53 12 22 120 120 120 
##$TP= (0..7)
150 150 150 150 150 150 150 150 
##$TP07= 0
##$TPNAME0= <>
##$TPNAME1= <>
##$TPNAME2= <>
##$TPNAME3= <>
##$TPNAME4= <>
##$TPNAME5= <>
##$TPNAME6= <>
##$TPNAME7= <>
##$TPOAL= (0..7)
0.5 0.5 0.5 0.5 0.5 0.5 0.5 0.5 
##$TPOFFS= (0..7)
0 0 0 0 0 0 0 0 
##$TUNHIN= 0
##$TUNHOUT= 0
##$TUNXOUT= 0
##$USERA1= <user>
##$USERA2= <user>
##$USERA3= <user>
##$USERA4= <user>
##$USERA5= <user>
##$V9= 5
##$VALIST= <valist>
##$VCLIST= <CCCCCCCCCCCCCCC>
##$VD= 0
##$VDLIST= <DDDDDDDDDDDDDDD>
##$VPLIST= <PPPPPPPPPPPPPPP>
##$VTLIST= <TTTTTTTTTTTTTTT>
##$WBST= 1024
##$WBSW= 4
##$XGAIN= (0..3)
0 0 0 0 
##$XL= 0
##$YL= 0
##$YMAX_a= 1673
##$YMIN_a= -1592
##$ZGOPTNS= <>
##$ZL1= 120
##$ZL2= 120
##$ZL3= 120
##$ZL4= 120
##$ABSF1= 0
##$ABSF2= 0
##$ABSG= 0
##$ABSL= 0
##$ALPHA= 0
##$AQORDER= 0
##$ASSFAC= 0
##$ASSFACI= 0
##$ASSFACX= 0
##$ASSWID= 0
##$AUNMP= <proc_1d>
##$AZFE= 0.1
##$AZFW= 0.5
##$BCFW= 0
##$BC_mod= 2
##$BYTORDP= 0
##$COROFFS= 0
##$CY= -3
##$DATMOD= 1
##$DC= 0
##$DFILT= <>
##$DTYPP= 0
##$F1P= 0
##$F2P= 0
##$FCOR= 1
##$FTSIZE= 65536
##$FT_mod= 6
##$GAMMA= 0
##$GB= 0
##$INTBC= 1
##$INTSCL= 5.30512e-09
##$ISEN= 30
##$LB= 1
##$LEV0= 0
##$LPBIN= 0
##$MAXI= 10000
##$MC2= 0
##$MEAN= 0
##$ME_mod= 0
##$MI= 50
##$NCOEF= 0
##$NC_proc= -8
##$NLEV= 6
##$NOISF1= 182.463
##$NOISF2= 159.3651
##$NSP= 0
##$NTH_PI= 0
##$NZP= 0
##$OFFSET= 248.5645
##$PC= 4
##$PHC0= -8703.377
##$PHC1= 2577.675
##$PH_mod= 1
##$PKNL= yes
##$PPARMOD= 0
##$PSCAL= 0
##$PSIGN= 0
##$REVERSE= no
##$SF= 81.014009
##$SI= 65536
##$SIGF1= 159.3651
##$SIGF2= -187.1042
##$SINO= 113.3802
##$SIOLD= 16384
##$SREGLST= <1H.CDCl3>
##$SSB= 0
##$STSI= 65536
##$STSR= 0
##$SW_p= 40650.406504065
##$SYMM= 0
##$S_DEV= 0
##$TDeff= 32768
##$TDoff= 0
##$TI= <>
##$TILT= no
##$TM1= 0
##$TM2= 0
##$TOPLEV= 0
##$USERP1= <user>
##$USERP2= <user>
##$USERP3= <user>
##$USERP4= <user>
##$USERP5= <user>
##$WDW= 1
##$XDIM= 65536
##$YMAX_p= 434486563
##$YMIN_p= -132133119
$$ End of Bruker specific parameters
$$ ---------------------------------
##NTUPLES= NMR SPECTRUM
##VAR_NAME=  FREQUENCY,     SPECTRUM/REAL,   SPECTRUM/IMAG
##SYMBOL=    X,             R,               I
##VAR_TYPE=  INDEPENDENT,   DEPENDENT,       DEPENDENT
##VAR_FORM=  AFFN,          ASDF,            ASDF
##VAR_DIM=   65536,         65536,           65536
##UNITS=     HZ,            ARBITRARY UNITS, ARBITRARY UNITS
##FACTOR=    0.620285442955139, 1,           1
##FIRST=     20137.2065510759, 0,            0
##LAST=      -20513.1999529892, 0,           0
##MIN=       -20513.1999529892, -132133119,  0
##MAX=       20137.2065510759, 434486563,    0
$$ Real data points
##PAGE= N=1
##DATA TABLE= (X++(R..R)), XYDATA
$$ [...]
15150 -1290175 -3188621 -3119481 137920 1476663 -1939965 -6189575 -6719858 -4337469 -2540215
15141 -2540215 -2419485 -2675684 -1940914 824723 5678018 10103746 10923325 8736971 7133451
15132 7133451 6883957 5345730 2591263 2556129 5891176 7528567 4637873 1181150 493530
15123 493530 -550076 -4555131 -6757366 -2254856 4625398 6178151 3142164 2347316
15115 2347316 4933829 5749807 3595777 3304857 6935635 10604721 11328093 10247886 8047154
15106 8047154 3864301 -156385 -124368 2383682 1458503 -2897429 -3181486 3795995 10764898
15097 10764898 10216566 4703445 1746927 3312552 5746088 6514104 5740639 3553195
15089 3553195 520009 -1002458 439785 2999650 4485114 5449916 6808271 7166275
15081 7166275 5509953 3861881 4092492 4612307 3450747 2063020 2492064 3058075 909250
15072 909250 -2710144 -3800705 -1492533 1001626 1205967 225872 440218 2399262 4594849
15063 4594849 5458654 5269990 5640389 6518917 5304881 1265773 -1102725 2426462 8061332
15054 8061332 7767922 1111266 -3658708 -2223166 -281364 -3231690 -7332284 -6987653
15046 -6987653 -4260505 -3905376 -4318522 -1566757 1765242 574753 -2782401 -1647693
15038 -1647693 3353676 5004110 1410553 -1635184 -797594 828598 1158295 2140210 3279133
15029 3279133 432963 -5753663 -8006508 -3149900 2310835 2069192 -914015 -736421
15021 -736421 1649609 1457183 -1095016 -1615682 1011733 3773045 4707779 4105818 1825854
15012 1825854 -2012115 -4636251 -3270414 290115 1503185 -856796 -3738543 -4448074
15004 -4448074 -3043101 -460239 2586319 4810474 5178244 4642502 4868455 5513687 5011343
14995 5011343 3613724 3149868 3929055 4387042 3965275 4086976 5900161 8828207 11491081
14986 11491081 12452045 10334875 5295818 400447 -737593 1686135 3494621 1481472
14978 1481472 -2891750 -5472919 -3946544 236859 3491662 3114260 -519286 -4250746
14970 -4250746 -5111635 -3151814 -832831 154272 482538 1526609 3218515 4266173 4030714
14961 4030714 3404359 3538085 4001538 2994689 -60098 -2873214 -2559738 684835 3837674
14952 3837674 5050159 5250527 5087514 2955268 -1894738 -6383326 -6716032 -3551944 -1187886
14943 -1187886 -1863657 -3658714 -4275010 -4099080 -4400337 -4677314 -3426069 -401149 3125325
14934 3125325 5634396 6188737 4921865 3374519 3280191 4201714 3589700 440683 -2320633
14925 -2320633 -1250816 2213986 2516672 -2674339 -8188153 -7074105 335799 6383949
14917 6383949 5715050 1574485 225130 1943231 1706337 -2154702 -4843872 -1951100
14909 -1951100 4492527 9339814 10981552 11644765 12690764 12872970 11043147 8172878
14901 8172878 6253071 6315148 7500188 7665787 5857343 4492020 7072990 12754080 15881844
14892 15881844 13028386 7718981 5114320 4730106 2835040 -9647 349233 3770952
14884 3770952 4887179 1616919 -1074738 1122463 5210001 5868693 3344410 1703168
14876 1703168 1784350 1015844 -891535 -1217090 418286 501237 -2874160 -6240691 -4857493
14867 -4857493 1200762 7138705 8752813 6031497 1940558 -813094 -1549745 -1313740
14859 -1313740 -1769100 -4137903 -8137201 -11400921 -10834158 -5762631 572347 3943509
14851 3943509 3457558 1652462 651611 335635 473795 1876610 4110539 4595738 2073179
14842 2073179 -964175 -1584578 -460110 -55958 -368119 430336 2223262 3392848 4542406
14833 4542406 7894433 12544653 14155123 10786469 5811048 3165927 2423538 767290
14825 767290 -2317563 -4770172 -4978625 -3007717 125793 2761053 3332202 2233274 1562022
14816 1562022 1715052 332683 -3396977 -5812385 -3317084 1941047 4675046 3587112
14808 3587112 1724650 369995 -2402152 -6351911 -7475487 -4132117 -375653 13295
14800 13295 -927639 357864 2342000 1090128 -2408305 -3129840 96298 2833731 1935418
14791 1935418 -604728 -2212800 -3575174 -5413699 -5483640 -2372239 635586 -451358
14783 -451358 -4205465 -5619431 -3181032 -342242 -194909 -2248840 -4736763 -6684113
14775 -6684113 -6914468 -4213005 218022 3241567 4136026 5681991 9090909 10845062
14767 10845062 7658033 2392266 1032269 4478213 7437797 6112480 3179544 3077273
14759 3077273 5193806 4967560 687714 -4063178 -5297906 -3500217 -2083327 -2367259
14751 -2367259 -2191729 429154 4076800 5596831 4324380 3125736 4770395 8304507
14743 8304507 10119609 8302787 4636748 1884062 358071 -1500206 -3826070 -4667755
14735 -4667755 -3176162 -1552106 -2208320 -4235942 -4848691 -3705051 -3128849 -3819089 -3298959
14726 -3298959 28392 3939301 5652006 5797219 6307147 6151242 2943769 -1903046 -3834963
14717 -3834963 -1638597 589396 -411334 -2344283 -1309876 2109553 3899192 2365563
14709 2365563 -283758 -1723318 -2178994 -2991746 -4515681 -6124818 -7139377 -7215087 -6382948
14700 -6382948 -4821264 -2350858 1368254 5760719 9215221 10557878 9761507 6812278
14692 6812278 1478447 -4743138 -8286583 -7165295 -3895234 -2713407 -4579829 -6864872
14684 -6864872 -7263881 -5849810 -3712126 -1806937 -990682 -1134930 -410325 2504764 5872434
14675 5872434 6875274 5774769 5374982 6551329 7516361 7694488 8550320 9598789 7697452
14666 7697452 2437826 -1605224 -1164421 404688 -1922783 -6935047 -8824458 -5471848
14658 -5471848 -268905 4084519 8514743 13111208 14569988 11073967 6406356 5529155
14650 5529155 7825016 8327586 4968748 1047952 -48800 510213 -511297 -3081701
14642 -3081701 -3551889 269888 5452286 6632235 2119985 -3921365 -6276378 -4915154
14634 -4915154 -4525848 -7364685 -9097635 -4409014 4608392 9721992 7003472 1991976
14626 1991976 1811255 5464545 6215240 1702071 -3557041 -5625649 -5718214 -5769334 -4421190
14617 -4421190 -493135 3382225 4250723 3124243 2202065 572958 -3095209 -5954167
14609 -5954167 -4140071 739839 3430146 2738595 2209583 3221724 3076696 855755 -504147
14600 -504147 106211 -458844 -3645985 -5708004 -3595517 -176846 234284 -1903546 -3446382
14591 -3446382 -3746357 -3778593 -2911856 -695437 661545 -118222 237427 4763196 9903017
14582 9903017 9436625 3797519 -15458 2081029 6744775 8735773 6657094 2424156
14574 2424156 -1259929 -2263736 -1132038 -1772539 -6388648 -10291903 -6774250 2467378
14566 2467378 7468198 2532256 -6534149 -10686848 -8606465 -5481004 -4340013 -3470271
14558 -3470271 -1137323 1391549 2062609 980513 315662 1677795 3656435 2906969 -1012481
14549 -1012481 -3486871 -614919 4221276 4411392 488340 140639 6097065 10852763
14541 10852763 7793982 1602452 1251253 6857736 10912496 10300635 9203106 10165425
14533 10165425 9861741 5778548 1005424 -750984 -396987 -371378 66699 2651039 5528442
14524 5528442 4942704 949934 -1807763 345623 5762043 9511996 8678246 4675089
14516 4675089 773908 -1411690 -2305047 -2209979 -610345 2069298 3771530 2997208 591956
14507 591956 -1493924 -1995041 -261458 3602244 7291845 7304885 3396713 -118599 101606
14498 101606 1930064 1840640 911482 2340231 4840907 4158863 816918 386188 4861132
14489 4861132 9354225 9628658 7821322 7537574 7815343 6043098 3293024 2163290 1861659
14480 1861659 126905 -1729026 -539870 2814050 3919910 1228846 -2289853 -4170798
14472 -4170798 -4902416 -4574411 -1551470 3445074 5796188 2672670 -2271188 -3164127 733193
14463 733193 5088598 6693640 6041928 4109247 618803 -3185751 -3546283 1217632 7081187
14454 7081187 8418727 4956489 1549492 1133643 1401770 -296361 -2188947 -1102718
14446 -1102718 1991695 3210828 1766544 886865 2289349 3403764 1722514 -1067138
14438 -1067138 -1680156 87488 1839327 2351888 2207462 1434060 -758535 -3841810 -5841162
14429 -5841162 -5842692 -4986558 -4486132 -3956534 -2198664 1152335 4836304 6338739 3949775
14420 3949775 -340950 -1323723 3646913 10133007 11111134 6115342 2166594 4234100
14412 4234100 8574383 8468380 3561622 -682529 -1316234 -1019155 -2648295 -4916123 -5173763
14403 -5173763 -3415754 -1309439 663217 2770977 4124126 3589151 2028938 1554830
14395 1554830 2653905 3759814 3706486 2970457 2152557 812337 -1338135 -3257821 -3771366
14386 -3771366 -3299853 -3139350 -3259034 -2299423 -176862 868838 -792467 -3286943 -3445824
14377 -3445824 -1587468 -1297120 -3710295 -5242908 -3180084 -395287 -798142 -2581486
14369 -2581486 -1210257 2147153 1631458 -3349403 -6210986 -3648261 -775589 -1461264
14361 -1461264 -840608 5472848 11007491 7074334 -2029937 -3863186 3065572 7114455
14353 7114455 2375949 -2466444 596432 5866526 4442000 -1017752 -2233597 56826
14345 56826 -1350886 -6116225 -6269158 74086 5103468 3247772 -1711635 -4119753 -3950493
14336 -3950493 -3640310 -3250725 -2203782 -1374962 -665883 1567517 4554477 4816031 2019072
14327 2019072 741704 3769851 7736064 8284377 5766867 2882867 358407 -1858974
14319 -1858974 -2532084 -1498490 -898048 -985651 1653115 8028569 12548943 9593715 1585020
14310 1585020 -4347473 -5688084 -5605091 -6291791 -6493329 -5263850 -3529565 -1659397 819979
14301 819979 3022233 3454003 2702743 2322277 1802731 69217 -984207 1356308 5361811
14292 5361811 6170319 2577999 -1676194 -3753978 -4464385 -4508087 -2722729 328524 1453612
14283 1453612 -208876 -1163030 1033742 3911733 4498537 4267746 6109758 8810600 8486062
14274 8486062 4329796 -487973 -3161392 -3749140 -3616083 -3678932 -4204639 -4733236 -4338376
14265 -4338376 -3019502 -2112004 -2216324 -1852786 312301 2955492 3571944 1725717 -808634
14256 -808634 -2487743 -3069872 -3002061 -3246152 -4777395 -6588913 -5471972 -224848 4962805
14247 4962805 4700575 7338 -1979161 2606492 8518339 7870829 559946 -5434620
14239 -5434620 -4139554 1334737 3401528 -466624 -5340229 -5405389 -408326 5236525
14231 5236525 7829347 7182376 5067683 3061239 2231857 3337202 6230698 9440290
14223 9440290 10849572 8935230 3911443 -1720123 -4455697 -2954604 248400 1415382
14215 1415382 -253973 -2523966 -3646409 -3797307 -3058735 -810073 1905635 2217872 -502098
14206 -502098 -2762046 -1567767 959982 535430 -2933143 -5249821 -3910144 -877412
14198 -877412 1245489 2791825 5067942 6858291 5337163 240245 -4623015 -5023495
14190 -5023495 -1241430 1730780 -72570 -4318630 -4969701 -380572 4202346 3982026
14182 3982026 1240973 1106817 3322893 3629790 2409678 5295344 13378775 19128577
14174 19128577 16323523 9344580 6911926 9513630 9699255 4165341 -1332509 -1101948
14166 -1101948 2020993 1223339 -4499786 -9433227 -8964896 -4730279 -1643756 -2294487 -5228254
14157 -5228254 -7356968 -6915746 -4358616 -1118164 1951055 4635547 6365652 6217538
14149 6217538 4233244 1935713 994877 1797319 3458978 4524865 3551894 125623 -4156053
14140 -4156053 -6697017 -6533402 -5078555 -3863634 -2976645 -2560707 -3978244 -7542520 -10380826
14131 -10380826 -9123848 -4433933 -471170 364986 -86349 836157 2892349 4011426
14123 4011426 3588332 2975939 3222933 3744892 3409811 2254452 1772361 3350071 6333086
14114 6333086 8224965 7536706 5867618 5878203 7505317 7907011 5409145 1727138 -489128
14105 -489128 -734161 -177735 578257 1890795 3943290 6343681 8342704 8694789 6148820
14096 6148820 1233090 -2946261 -2984325 1424628 6765046 8582189 5380196 18623
14088 18623 -3157279 -3081718 -2957036 -5432814 -8353004 -7814951 -4279840 -1835014 -1542860
14079 -1542860 -225416 2877732 3425672 -861698 -4908621 -2897273 2961858 5564992
14071 5564992 2828679 -1008513 -2831719 -3579525 -3797643 -2167024 283536 -105891 -3456130
14062 -3456130 -4555105 -224217 5282390 5800490 1619361 -1324324 652091 5032301
14054 5032301 6864483 4332831 155798 -1783876 -815194 177760 -743818 -1543292 113158
14045 113158 2029517 384019 -3313944 -3297331 1607684 5457065 3739340 -341721 -1351974
14036 -1351974 719797 2211560 1946908 1421104 1179290 1056918 2182520 4890317 6259735
14027 6259735 3575784 -1083108 -3423621 -2835997 -1888470 -1089208 1504641 5710715 8407774
14018 8407774 7941558 6211281 5746516 7095539 9281634 10716508 9840693 6803827 3941916
14009 3941916 2870201 2450070 1550405 1505329 2946137 2980109 -278359 -2962492 -635005
14000 -635005 3804370 3940630 609795 1299466 7948518 12990679 10339526 3669082 -64241
13991 -64241 218018 1329052 1909461 2219702 1349164 -985390 -2577753 -2217786 -2005034
13982 -2005034 -2812750 -1226624 4593348 9604164 7986050 2114386 -415491 2625547
13974 2625547 6207712 6236693 4136897 2802184 2807025 3711925 5248745 6154594 4993027
13965 4993027 2727204 1473681 587567 -2504540 -7206820 -9274981 -6449392 -1205612
13957 -1205612 3184726 6036976 7500852 6871725 4499016 2487373 1602003 107717
13949 107717 -2469381 -3273066 -328563 3534942 3921998 519361 -3207982 -4754172 -4238065
13940 -4238065 -2183310 1295347 4892494 6286268 4926748 3132886 3383186 5274209
13932 5274209 6000289 3664799 -433538 -3144113 -3018948 -1819189 -1906543 -3071655 -3482261
13923 -3482261 -3149923 -3979071 -5980736 -6170263 -2741124 1960037 4715514 5717117 6823305
13914 6823305 7069422 3676589 -2462966 -6074142 -3898652 794770 2328609 -273143
13906 -273143 -2701772 -1382047 2268189 4246161 3054357 1055031 1213214 3777718
13898 3777718 6586156 7726530 6893870 4565697 1406376 -1073786 -977251 1355277 2388537
13889 2388537 -661635 -5372923 -6428729 -2917691 -90678 -1853262 -4705437 -3179804
13881 -3179804 596045 -1381149 -10751506 -18183473 -15009881 -5357212 -904583 -5404136
13873 -5404136 -10995167 -10504695 -6785608 -6482402 -9727807 -11354058 -9507445 -7242592
13865 -7242592 -6278013 -4612951 -1172211 1927450 3632398 6414963 11564957 15064912
13857 15064912 12010372 3832451 -2599914 -3190514 -958757 -1247549 -4847169 -7717739
13849 -7717739 -6710750 -3567022 -2312241 -3571329 -3448190 881570 6092557 6003231 -41984
13840 -41984 -5293483 -3788801 2221381 5795051 4336843 1435505 432689 466296 -95772
13831 -95772 -228501 1211786 2190980 -112407 -4906189 -8594230 -9239405 -7539410 -3970570
13822 -3970570 1632182 7033475 7581889 1585633 -6158461 -8778061 -4705317 1222602
13814 1222602 3608661 1562593 -1963813 -3794896 -2634663 914748 4959101 7333601
13806 7333601 7120813 5347460 3815579 3351330 3550834 3962279 4691424 5522694 5241662
13797 5241662 2981026 247624 160139 3576288 7003823 6225741 1767604 -1375657 73324
13788 73324 3937243 6025576 4997808 2091774 -1584177 -4661634 -4329921 557501 5837172
13779 5837172 5593146 -170068 -5149294 -4952801 -1903281 -89165 421973 1587150 2815322
13770 2815322 2167970 405947 292307 2562152 5296381 6702950 6319185 4289564 1549214
13761 1549214 -222942 -724268 -1671477 -3314661 -2530311 2471435 7668448 7736955 3746899
13752 3746899 1479209 2448801 1973251 -2776722 -7888226 -8255633 -4209402 414 1474220
13743 1474220 80515 -2927783 -5457335 -5639368 -4077018 -3288013 -3982975 -4403266 -4205259
13734 -4205259 -5467070 -8056361 -7870310 -2739443 3140598 4362008 1474527 -802180
13726 -802180 -611334 -112196 -715044 -1196291 -445932 1030519 2343103 2648954 996310
13717 996310 -2000744 -3454994 -1760589 487943 115643 -1657783 -1654535 -776218 -2700920
13708 -2700920 -6750674 -7426660 -2491671 3226873 4619491 3117799 3556209 6730004
13700 6730004 8509349 5501022 -895381 -6048058 -6542865 -3239000 -174103 33701
13692 33701 -932220 -142420 1784275 1773586 -326431 -1281081 -55848 214109 -2326209
13683 -2326209 -4741204 -4150097 -2675076 -3628407 -5251836 -3022003 2794168 6709290
13675 6709290 5554474 2168375 217294 -784773 -2764087 -4390954 -2764070 1400032
13667 1400032 3942963 2919791 941632 761394 1493688 1453699 2075199 5177081 7830853
13658 7830853 5121366 -1482903 -4168358 162056 4283795 946206 -5733694 -6174200
13650 -6174200 -11293 3716113 1187291 -498248 4485107 10894574 10710442 5315781
13642 5315781 2174754 2890082 2174856 -2516642 -7412161 -9037102 -8574912 -8138147 -7284420
13633 -7284420 -5060023 -2026025 1256974 4760789 6936409 5411259 1159791 -1255165
13625 -1255165 472653 3164503 2949348 659658 -207522 1224522 3065371 4441324
13617 4441324 6152783 7944849 8110984 6198109 3745602 1751274 -469706 -3007128
13609 -3007128 -3954495 -1871253 1682144 3908589 4342741 4705372 5490861 5044821 2706360
13600 2706360 618685 772141 1892223 1423171 -502083 -1629804 -1562093 -2247751 -4317528
13591 -4317528 -5907351 -5926753 -5537529 -5142784 -3135809 239128 1053902 -2872627 -7201500
13582 -7201500 -6063878 -581493 2242474 -857827 -5460819 -6302607 -3929197 -2154010
13574 -2154010 -2080979 -1945394 -1236428 -1560809 -3449486 -4925953 -4213495 -2377173 -1949945
13565 -1949945 -3411737 -4460139 -3320316 -1522491 -1768217 -3662518 -4091835 -2283689
13557 -2283689 -1461832 -3669294 -5891035 -4514898 -1415393 -1278942 -3830957 -3626339 1671597
13548 1671597 7254268 7489837 3085068 -517525 138719 3579690 5936948 4835215
13540 4835215 1463726 -598190 594717 2951836 3647988 3731572 6152033 9807416 10236968
13531 10236968 6965188 4854083 5958641 5579426 406474 -4453894 -2414826 4074529
13523 4074529 6644407 2944645 -1313708 -1885652 -670934 289915 2790957 7339393
13515 7339393 9473421 5631083 -641569 -2701152 857911 5582504 7558450 6901354
13507 6901354 5457837 4270681 3558525 2831098 777833 -3000488 -6119381 -5464564 -1590708
13498 -1590708 1049611 -705622 -5001636 -7642598 -6928240 -4111587 -360631 4057853
13490 4057853 7640096 7570652 3277421 -1717121 -3291402 -1001895 2696863 6148258
13482 6148258 9033294 10159234 7915068 3221730 -855736 -3068848 -4675462 -5491235
13474 -5491235 -3007981 2641912 6717160 6141453 4447856 6238553 9485944 8794108
13466 8794108 4724507 3485656 7115046 10365791 9231998 6712609 6897661 8333105
13458 8333105 7506598 5070324 3803070 3111228 553692 -2876908 -3940454 -2705076
13450 -2705076 -2179683 -2818039 -2224923 -605744 -1533648 -5903584 -9550823 -8940671 -5443896
13441 -5443896 -1764936 2020427 5841392 6655631 2426823 -3032676 -3729083 710515
13433 710515 4739452 4084845 -245121 -4861358 -7114486 -5136860 1039687 7128057
13425 7128057 7253769 1164221 -4426648 -4116075 -327551 1536035 1434790 3603155 8621657
13416 8621657 11705884 9367156 3585245 -1764121 -4992731 -5679470 -3320987 634317
13408 634317 2257992 -363586 -4014317 -4588768 -2764141 -2185277 -3268582 -2822615 203594
13399 203594 2707337 2515342 2034606 4469082 8761345 11065283 9917367 7221938 4758440
13390 4758440 2506966 639511 547074 2670014 5017146 5313963 3717947 2204538 1956531
13381 1956531 2508448 2877186 2262767 59262 -3360568 -6019928 -6091459 -4406777 -3479542
13372 -3479542 -3655633 -2445257 1122511 3878457 2719624 -284658 -436471 2505380
13364 2505380 3731575 767329 -2366749 -785123 4297114 7443011 6147778 2658911
13356 2658911 -521784 -3203439 -5240761 -5299972 -3459146 -2364008 -3769993 -5856932
13348 -5856932 -6057029 -4856812 -4281827 -3974291 -2073954 398568 -134412 -3934467 -5819793
13339 -5819793 -1442892 6542296 11490437 10467805 5883066 700516 -3841633 -5799967
13331 -5799967 -2691844 3802855 7287443 4138552 -1192722 -2024572 1599817 4150692
13323 4150692 3415897 2800328 4475596 5457516 2715673 -1827912 -4430043 -4867482 -5439377
13314 -5439377 -6513472 -6435658 -5123739 -4769240 -6793043 -10106109 -12573293 -12701128 -9849256
13305 -9849256 -4291695 2390792 7782849 10056711 9037694 6188111 3580651 2314931
13297 2314931 1815919 1175313 823547 1819262 3837776 5359878 5699289 5264136 4212548
13288 4212548 2935326 3315119 6496621 9521306 7915580 2266390 -1866491 -1841623 -1181142
13279 -1181142 -2816331 -4097281 -2124756 602877 704944 243816 2928618 6911102
13271 6911102 7393787 4393828 1900804 1054274 527541 2039682 7908759 13649584 11427877
13262 11427877 2147629 -4136156 -2334606 1299213 632145 -806683 2255696 6491103
13254 6491103 5540037 1182604 310003 3276609 3885482 410961 -1644153 755874 2959100
13245 2959100 247953 -4832072 -6846622 -5500001 -4899560 -6679476 -8024584 -6363137
13237 -6363137 -2766376 192827 1702294 2333369 1774749 -939543 -4996380 -7647479
13229 -7647479 -7482166 -6241874 -5811262 -4895433 -1208522 3813492 5673520 2637682 -1918470
13220 -1918470 -3961801 -3127335 -1459935 -335354 -325298 -2043132 -5035673 -7040173 -6021211
13211 -6021211 -2292615 2038117 4591841 3581607 -701426 -4740753 -4636678 -1044479
13203 -1044479 1203573 -675739 -4364710 -6537729 -6512147 -4358075 531422 6413713
13195 6413713 8688631 5800353 2206455 1936262 2853321 1543737 10434 1798704
13187 1798704 4521539 3029835 -1620450 -3432700 -1220973 34887 -1751133 -2440842
13179 -2440842 570519 3720532 3507379 1889480 1826573 2075746 546711 -910154 454228
13170 454228 3083422 3304433 1051627 -546376 -263198 169189 -264849 -266863 1367258
13161 1367258 3882385 5572931 5559217 4588441 4522925 6179908 7307837 4453411 -2093470
13152 -2093470 -7147305 -6235024 -957545 3133112 2878633 -146905 -2629302 -2722495 -685016
13143 -685016 1866854 3277596 3337202 3077182 2716518 1216475 -1303431 -2728378 -2196734
13134 -2196734 -2115321 -4424653 -6615621 -4749734 596545 5025500 6471681 6625283 6017776
13125 6017776 2511391 -3317945 -5822451 -1237859 5846527 7578553 3154569 -612468
13117 -612468 945496 4677920 5268072 2544512 207125 -34571 574375 1393970 3063236
13108 3063236 4466701 2494416 -3618235 -9902770 -11531315 -8038161 -3092456 273138
13100 273138 2443732 5027061 7440300 7207297 3727413 309218 851615 4695259 6809873
13091 6809873 4116148 -259536 -1089866 1871468 3768306 1468720 -2443338 -3572072
13083 -3572072 -1352427 970135 900065 -449347 -151511 2551055 4714036 3049410 -1219784
13074 -1219784 -2920628 410047 4888745 5853410 4548154 5179742 7258489 6451530 2549290
13065 2549290 298631 1277953 1306661 -1720586 -3645569 -1331661 1467135 148176 -3514829
13056 -3514829 -5216047 -5155250 -5936382 -6948290 -6345928 -5541412 -6112208 -5262536 -487211
13047 -487211 4057737 2801017 -1638831 -1580509 3871906 7604980 5298178 430155 -2296374
13038 -2296374 -2050770 558043 4708949 6898161 3265851 -4081827 -8556235 -7975246
13030 -7975246 -6343474 -6092014 -5141107 -2972188 -2464963 -3464545 -1731705 2709719 3432738
13021 3432738 -2252080 -7913898 -7465075 -3626394 -1741316 -1267635 499667 1685543
13013 1685543 -349746 -2806988 -2016062 -587069 -2800832 -5745238 -2803934 5344082
13005 5344082 10647590 8746041 3835259 1677162 2948226 4719589 4497110 1617986
12997 1617986 -2489604 -4838420 -3739107 -844977 1326618 2525938 3404082 3100058
12989 3100058 938300 -1479501 -2797041 -4397915 -7375038 -9482731 -8540007 -6256568
12981 -6256568 -4829178 -2542187 2677800 7989582 9243102 7794188 8045894 9704798
12973 9704798 8490670 3818404 -210336 -1455584 -1809912 -2401146 -2071252 -1084273 -1216303
12964 -1216303 -1644606 142441 2805628 1965392 -2402067 -4874199 -2605630 771856
12956 771856 1506516 1067424 2214567 3920167 3603408 1422714 -696494 -2015078 -2517986
12947 -2517986 -1664423 140760 733159 -1006792 -2995872 -2422092 672295 3611211 4079637
12938 4079637 2067815 -554839 -2036964 -2500918 -3085088 -3337618 -1672846 749435 78728
12929 78728 -3967631 -5945124 -2725506 491026 -2026917 -6492402 -5071029 972696
12921 972696 2743141 -1991770 -5528051 -2904446 1352983 2332264 2007996 3109918 3537814
12912 3537814 1996751 2073054 4997677 5039805 -1373001 -7997265 -7531603 -2815145 -1372849
12903 -1372849 -3281233 -3366904 -2238507 -5140583 -10712215 -10804947 -3211230 3720822 2318016
12894 2318016 -4858447 -10054394 -10023770 -7147734 -4354872 -2457888 -983440 490435
12886 490435 1224762 -474026 -4446758 -7022349 -4995950 -531312 1517801 806236 1618427
12877 1618427 5288239 7398836 4584990 -175904 -2145267 -1390122 -1178506 -2147582 -2122255
12868 -2122255 -813308 -796797 -3296377 -5918984 -5889895 -3767999 -2486852 -3558584 -5579265
12859 -5579265 -6354423 -5383042 -3793802 -2591495 -1882606 -1601312 -1841606 -2012739 -626753
12850 -626753 3030902 7221275 8630938 5382234 -827123 -5695096 -5835470 -1827704
12842 -1827704 2368305 3382307 1388369 -1269815 -3144856 -3908674 -2757684 638666
12834 638666 3741252 2814124 -2054606 -6386793 -7179989 -6582229 -7613019 -8868781 -6800605
12825 -6800605 -1859924 1274403 -295112 -4286683 -6556702 -5730529 -3539770 -2004160
12817 -2004160 -1595144 -1773450 -2246270 -3060546 -3626930 -2748445 -575159 418983 -1624823
12808 -1624823 -4336543 -3093768 2624290 7511578 6741220 1765909 -2412717 -3901502
12800 -3901502 -4841629 -6549678 -7110044 -4605912 -428675 2102841 1375109 -1488734 -4712003
12791 -4712003 -7598374 -9734710 -9640888 -5937249 138 4331994 4679898 2335219 -284391
12782 -284391 -2147332 -2042269 2304091 10032377 14757538 11409371 4021363 1100695
12774 1100695 3984813 6260500 4922793 4424637 7337370 8693891 4095184 -2987570
12766 -2987570 -7317086 -9691586 -12715811 -13887798 -9941135 -4158837 -1806828 -1175816
12758 -1175816 2850459 8251480 7619372 315401 -5663143 -5555657 -3861472 -5627914
12750 -5627914 -8452832 -7372238 -2843409 648100 893913 -989796 -3771522 -6943041
12742 -6943041 -9284201 -9198406 -6640727 -3774634 -3551711 -7099274 -11876871 -13654858 -11642528
12733 -11642528 -9911978 -11731520 -14753648 -14845473 -12191094 -9291800 -5201145 2376280
12725 2376280 10230241 11558079 5601083 -630836 -1840984 -66607 1066293 1825532
12717 1825532 2911156 1738861 -3388845 -8836990 -9552108 -5311982 3661 3360893
12709 3360893 4263093 3573745 2900417 3253993 2887724 -865456 -6304550 -7613620 -2637546
12700 -2637546 3361164 4649640 2163826 322597 242698 399654 1188872 3885847 6620703
12691 6620703 5951453 1698684 -3388674 -7598761 -10279517 -9572098 -4793546 -256297
12683 -256297 -1579953 -7700466 -11183680 -7757762 -1509470 1134403 -930316 -4066231
12675 -4066231 -5286670 -4424726 -2761887 -2013117 -3589696 -6710564 -7992998 -4963002
12667 -4963002 402152 3581868 2925318 1140195 852543 876752 -1309446 -4861454 -6161857
12658 -6161857 -4094387 -1786034 -1787269 -2087217 639255 5555897 8543370 7884927 5951629
12649 5951629 5136584 5123469 4876739 4476774 3624576 747319 -4450852 -9019204 -9302945
12640 -9302945 -5086261 -131979 1402499 -983603 -3469611 -2052428 2087315 3150335
12632 3150335 -1629071 -7244560 -7277208 -3070255 -1502089 -4242378 -5354562 -960388
12624 -960388 4727834 6118961 3936141 2178959 1422110 -263821 -2546382 -3554130
12616 -3554130 -3484808 -3454169 -2356068 1290172 5747959 7984851 7881741 6949040 4344243
12607 4344243 -1600609 -8711339 -12284064 -11246162 -9173198 -8630122 -7945091 -4595294
12599 -4595294 945658 5879031 7819265 6401003 3691411 2870464 4807388 6435130
12591 6435130 4568820 724630 -489612 2309509 5327673 4587865 627858 -2825268
12583 -2825268 -3358927 -1917212 -877877 -813912 266593 3748561 7160997 6382749 1449038
12574 1449038 -2742900 -2864370 -1212514 -1241799 -2344991 -2294714 -1878079 -2871143 -3625840
12565 -3625840 -1522385 1429756 482015 -4555061 -8519405 -7827627 -4186898 -874746
12557 -874746 895147 1157694 230419 -523068 106605 640908 -1557718 -5841791 -8284453
12548 -8284453 -6553884 -2139730 2256430 4705979 3826321 20292 -3213984 -2770781
12540 -2770781 -493391 -450388 -2287677 -2152421 -14720 -86706 -2875907 -3223156 1011948
12531 1011948 4171946 753322 -6442886 -10575665 -9739190 -7267782 -5675420 -4608457
12523 -4608457 -3293807 -1529739 673718 2128165 948155 -1918157 -2213818 1885189
12515 1885189 6140763 5555828 1094972 -2229984 -2074390 -110776 1774912 3091746
12507 3091746 3419702 2502284 1159587 71812 -1233869 -2522154 -2004160 556419 2309689
12498 2309689 1452134 314067 1411557 3330684 4137110 5727912 9990499 13280728
12490 13280728 10604402 3864542 -194531 195545 300409 -2377291 -4220597 -2300622
12482 -2300622 564821 587302 -1411544 -2374663 -1724154 -684376 549003 2066766 2518715
12473 2518715 732021 -2021699 -3196056 -1652600 1626242 4326067 4048292 584484
12465 584484 -2892089 -3165810 -1531562 -2023553 -4884455 -5752035 -2595064 831699 930815
12456 930815 -329398 531449 2370147 1796931 -434035 -261554 3137756 6085818 6006575
12447 6006575 4522837 4004829 4085698 3028287 449988 -2639703 -5090408 -5950290 -4788275
12438 -4788275 -2558578 -1223002 -1742130 -2981451 -3003223 -957524 2432573 5615817 7175725
12429 7175725 6527679 4097615 1057966 -929901 -289991 2892827 5805661 5073229 790431
12420 790431 -3099374 -3458840 -1354994 496873 1634644 2870860 3177987 935894 -2329810
12411 -2329810 -3034893 -755580 952724 10829 -993162 1113703 5299400 7956270
12403 7956270 7693439 6145021 4951937 4146377 3205584 1989583 685670 -147238 48959
12394 48959 558279 -411800 -2874199 -3709917 -438388 4428034 5605454 1738061 -2905374
12385 -2905374 -4228394 -3074792 -2597566 -3248517 -2914904 -721669 1953031 3767361 4347341
12376 4347341 3119547 -324970 -4351362 -6181814 -5608060 -5614732 -7917603 -9973633 -8591130
12367 -8591130 -4930200 -2987490 -3655415 -3555677 -590184 2281611 960104 -3771462 -6763147
12358 -6763147 -4761866 111242 3761394 5144319 6288105 8106767 8438012 5316355
12350 5316355 839376 -420656 2888096 6844738 7221705 4822652 3586826 4399387
12342 4399387 4047007 760767 -2544321 -2445679 121576 1760625 1564449 1107809 568863
12333 568863 -1583058 -4898935 -6299376 -4241633 -939842 980482 1826833 3118303
12325 3118303 4394269 3999305 2138612 1074032 2381440 5237681 7231651 6195215
12317 6195215 2015143 -2522297 -3759082 -1235077 1343969 638169 -2002365 -2653319
12309 -2653319 -208898 2811437 4247154 4182519 2795770 -480989 -4630771 -6810182
12301 -6810182 -6151344 -5296452 -6051159 -5995851 -2513527 1652146 991081 -4869942 -9925596
12292 -9925596 -9510021 -5711463 -3175787 -2719544 -2250942 -1806429 -3420682 -6300155 -6312907
12283 -6312907 -1829193 2939741 2906218 -1149122 -3287466 545068 8154703 13951513
12275 13951513 14725396 12024473 9534627 8825014 8090080 5287122 1604593 110627
12267 110627 1120235 1543731 -97736 -1001727 1103777 3260234 1340868 -3034872 -4648167
12258 -4648167 -3111392 -3387956 -6934196 -8394419 -4047386 1830032 3373245 1612036
12250 1612036 1375510 3004421 3056543 1262644 555648 884986 -939930 -4971267 -7392250
12241 -7392250 -6962723 -6750915 -8026450 -7840398 -4855133 -2369301 -2519955 -2185471 1599064
12232 1599064 6107550 6933302 4383511 1799516 322721 -416331 960537 5205015
12224 5205015 8570579 6474278 329114 -3975386 -4091484 -3176921 -3885573 -5146108 -5766898
12215 -5766898 -6807673 -8716753 -9741415 -8986637 -7938175 -7180778 -4686450 317599
12207 317599 4330345 3206744 -2630861 -8877570 -12110066 -11825540 -8771113 -3762836
12199 -3762836 1590334 4714160 3725777 -655752 -5021830 -5772263 -2563010 1144713
12191 1144713 2129193 1461325 2652677 6008481 7568135 4700524 229769 -1102769
12183 -1102769 1324172 3991572 4574274 4638385 6353992 8557377 8029502 4381235 1617779
12174 1617779 3333131 7345967 7730732 2734619 -2231671 -1596905 2973356 5704476
12166 5704476 5414910 6104347 8924872 9269526 4281863 -1476355 -1964160 1653049 2754265
12157 2754265 -1618926 -7531260 -9819407 -7562163 -3550873 -962131 -1012824 -1972962 -522880
12148 -522880 4090009 7921226 6903526 2892500 1632982 4552877 6732509 4505834
12140 4505834 868421 277351 1567340 524086 -2489620 -2772269 901590 3843056
12132 3843056 2523683 -281658 -459759 679665 -1155196 -5722236 -7916014 -5251180
12124 -5251180 -1542076 -1461221 -4533728 -6880277 -6758411 -5588755 -4599710 -3341602 -1631430
12115 -1631430 -759274 -1961840 -4787011 -7480648 -8517689 -7901197 -7445197 -9094558 -12064114
12106 -12064114 -12611617 -8308920 -1913168 1210729 -338176 -2188768 219715 6095615
12098 6095615 10691298 11016937 8539945 6530191 6093203 5441595 2891461 -38561 335809
12089 335809 4978057 9433040 8063280 977530 -5410572 -5575262 -787759 3520126
12081 3520126 4717405 5087588 7397581 10640927 11294658 7874204 2931482 232711
12073 232711 600481 1307544 -468811 -4519823 -8356219 -10096881 -9634914 -7732588 -5429474
12064 -5429474 -4055773 -4258044 -4816540 -3747742 -932612 1415062 1216800 -1353932 -4221814
12055 -4221814 -5011875 -2688597 1060760 2445206 -648125 -5610544 -7874313 -6716799
12047 -6716799 -5741134 -7038461 -7996049 -5756815 -2161143 -1318573 -3742977 -6022610 -5906363
12038 -5906363 -4831572 -4916682 -5798112 -5714196 -4425852 -3682954 -5042051 -8013657 -10498155
12029 -10498155 -10735784 -8632576 -5382700 -2410668 -936092 -1645570 -3680641 -4496180
12021 -4496180 -2277620 1494190 3408804 2263809 249747 -370926 69333 157766 -264179
12012 -264179 -807377 -2216515 -5367254 -8981909 -10039244 -6900056 -1400638 2433955
12004 2433955 1900693 -1682044 -3866633 -1461275 3926514 7529295 6465232 2160168
11996 2160168 -1831664 -2803227 28503 5145031 8898377 8118239 3428513 -1542401
11988 -1542401 -4478450 -5801355 -5710867 -3123267 1024926 2685898 -439419 -5160059
11980 -5160059 -6668347 -4593552 -2565113 -2966640 -4764464 -5824175 -5016164 -2407918
11972 -2407918 718438 2368548 1829334 656397 536321 1040318 585149 -1494632 -4812199
11963 -4812199 -8393477 -10380326 -9298310 -6707929 -6015836 -7245650 -6333343 -1874775
11955 -1874775 1399021 -332828 -3200551 -1203732 4214026 6570682 4984458 5288997
11947 5288997 9917769 13572516 11517653 6587577 4337566 5252523 5648063 3767170
11939 3767170 1451443 1028085 2954634 5597132 5972947 2235596 -3322797 -5597188
11931 -5597188 -2528430 2035987 2914393 -452035 -4158478 -4664460 -1914442 1464255
11923 1464255 2780605 1601241 130870 826566 3726269 6997051 9338056 10027443
11915 10027443 7616722 1817822 -3418995 -2706564 3530756 8189221 6069736 314121
11907 314121 -2465055 -951783 491173 -1048515 -3131044 -1643605 3851334 9453328
11899 9453328 11020716 8556531 6129484 6790598 8365546 6213659 -194503 -6215186
11891 -6215186 -7986452 -6405341 -4038218 -1371750 1643699 3198200 1894070 -314589
11883 -314589 -442094 1324855 2373839 1813247 1330108 2169062 3276271 2555835 -961009
11874 -961009 -5619166 -7412730 -3601579 2896896 5165218 351308 -6189137 -7375058
11866 -7375058 -2913365 1748893 3032045 1893964 94877 -1818470 -2795801 -1571775
11858 -1571775 601976 872538 -788931 -1269417 665256 2315335 1506311 91185 879502
11849 879502 3353010 4792428 4247389 3297841 3653860 5466977 7382364 7395841 4607715
11840 4607715 752064 -1363882 -1526724 -2294054 -4502382 -5081819 -1568247 3240015 4295596
11831 4295596 1057779 -2041531 -1842734 67680 956526 988977 1756686 2838639 2264718
11822 2264718 -417342 -3515085 -5259369 -4972481 -2706591 436491 1800503 -925320
11814 -925320 -6703989 -11588223 -12713484 -10410004 -6059960 -196850 5931658 9296224
11806 9296224 8188796 5065095 3547197 3467731 1921970 -1313679 -3218352 -2896623 -3405284
11797 -3405284 -6258374 -7826401 -4570262 708052 1999950 -1606463 -4912522 -4043804
11789 -4043804 -1042811 234551 -440144 -706654 -149259 -931640 -4081903 -7222668 -6901189
11780 -6901189 -2543900 2586778 4490598 2283914 -1276960 -2909506 -1697351 1199190
11772 1199190 4370457 6647533 6880112 4963165 2673492 1795841 1643310 274032 -1920960
11763 -1920960 -2170915 457659 3019020 2250548 -1427661 -4922704 -6155927 -5254623 -3240006
11754 -3240006 -1206259 -59898 322011 974364 1940189 1948814 1331316 3058759 8245765
11745 8245765 12616385 11323198 6200204 3653372 5514573 7224186 6132910 5783418
11737 5783418 8951527 11796851 9689902 4874149 2861486 4072281 4812542 4241835
11729 4241835 3901159 1942426 -4616827 -12087591 -12801499 -7242476 -5168366 -11148971
11721 -11148971 -17080383 -14619270 -7733734 -5151902 -5905096 -1924518 7673492 14701652
11713 14701652 14282711 10338466 7238848 4088690 330896 -298911 3738580 6779048
11705 6779048 3170655 -3777411 -5717045 -624065 4896688 4602177 -441057 -5022955
11697 -5022955 -6518153 -6118277 -5078324 -2744370 1038823 3689995 2306279 -2116092
11689 -2116092 -5263431 -4781185 -2558999 -915391 355770 1230958 -576752 -5254286
11681 -5254286 -7703308 -3865212 1903653 1910400 -3338857 -5589079 -1489795 2446266 140599
11672 140599 -5499803 -8551793 -8920663 -9709275 -10041428 -7090620 -3104892 -3754026 -9385004
11663 -9385004 -13395468 -10743435 -4120220 287961 477889 -257445 1287459 3972348
11655 3972348 4118889 672164 -3062625 -3663378 -2122460 -2081761 -4388420 -6257096 -5841829
11646 -5841829 -4521269 -3898920 -3524029 -2777264 -2303422 -2280569 -1777428 -918597 -1023302
11637 -1023302 -1676513 -807048 1251906 1415882 -951136 -2424224 -1101120 266485 -803032
11628 -803032 -2567591 -2857009 -2571117 -2195791 492301 5177057 6324384 1031527 -4875469
11619 -4875469 -4812581 -1585205 -2372512 -6818511 -8567439 -6847786 -7153763 -10104121 -9082966
11610 -9082966 -1673814 4817845 3625620 -2109019 -5179076 -4601980 -4671463 -6937256 -8539465
11601 -8539465 -7364292 -4603250 -2155390 -304528 1434396 2477875 852085 -4802983
11593 -4802983 -12371290 -16648374 -14560399 -9123932 -5748084 -5513136 -5344650 -4094104
11585 -4094104 -4035323 -5745843 -5999912 -2723877 1350996 2166789 -965176 -5680775 -9103985
11576 -9103985 -8764967 -3791556 2995841 6530715 4871275 1335428 144422 2066101
11568 2066101 5276261 7782407 7642455 3724269 -1801328 -4363544 -2570346 -523108
11560 -523108 -2266522 -6190532 -7662007 -5444811 -2538643 -1615285 -2347741 -3017985 -2745804
11551 -2745804 -2046641 -2264002 -4170745 -6629079 -7557649 -6626647 -5531514 -5115478 -4265643
11542 -4265643 -2566198 -1561815 -1708639 -631920 2895154 5305008 2288184 -4159895
11534 -4159895 -6667818 -1528382 6175558 8556822 4267036 -713532 -1100209 1776353
11526 1776353 3221143 1861370 222484 -305105 -1303604 -3465216 -4639863 -3791691 -3583226
11517 -3583226 -5938425 -7791161 -5170877 440956 4139811 4576085 4210466 3504181 297853
11508 297853 -4576100 -6402200 -3090084 1569311 3058628 1270413 -889224 -892289 2405522
11499 2405522 7871568 11483453 10099402 6132464 4316380 3982605 426549 -5333366
11491 -5333366 -5663234 1704236 8153855 5925885 -723091 -2541138 1326764 4264503
11483 4264503 3349108 2022208 2873687 4524483 5668257 6776667 7534016 6825505 5127503
11474 5127503 3541851 1701280 -52880 935666 4526193 4383797 -3746622 -12911295
11466 -12911295 -12221550 -2351074 4969176 3489310 -730851 -1197362 -13656 -326073
11458 -326073 1309844 7684494 12783665 9588936 1941549 -147192 5025208 9474911
11450 9474911 8137312 4766796 4013155 4862631 4790267 4681873 5961503 6918865 5516860
11441 5516860 2923418 1079527 -705979 -3572522 -5671556 -4278127 20508 4216595
11433 4216595 6804719 8033004 7506223 4754758 1419893 -342644 -1100247 -2584203
11425 -2584203 -3659743 -1909794 995905 419855 -3795316 -6143736 -3855183 -1251444
11417 -1251444 -2206771 -3338051 -81405 4396848 3315391 -2570738 -5352088 -1721628
11409 -1721628 2683764 2587157 378276 679373 2678788 2489513 -8569 -1389898 -274234
11400 -274234 1327305 1831963 2044891 3022758 4193288 4194829 2539171 274691 -639827
11391 -639827 824769 3216816 3808327 1738590 -1116237 -2710467 -2903604 -2618089 -2536639
11382 -2536639 -3160384 -4444257 -4766227 -2190390 2370384 5250559 4458701 2101796 1024866
11373 1024866 939352 -251559 -2731051 -4527956 -4426222 -3390682 -3045156 -3642315 -3811614
11364 -3811614 -2470536 -1086139 -2815288 -8035915 -12118770 -10292405 -4034492 540084
11356 540084 482190 -1384734 -2044450 -2426029 -4401875 -7153772 -8662882 -8232057 -5909228
11347 -5909228 -2057826 1127734 795313 -2201155 -3380005 -996045 1210108 72700
11339 72700 -1887428 -806299 2174101 2857391 180296 -3262896 -5283538 -5340745 -3171563
11330 -3171563 607385 3661678 4431899 4200969 4325511 3352589 -171374 -3940714 -4502173
11321 -4502173 -2425060 -1379156 -2718809 -4193194 -3859930 -2637603 -2877182 -6080458
11313 -6080458 -11574537 -16151933 -16143937 -11327684 -5593817 -2567034 -2231388 -2970064 -4461146
11304 -4461146 -6619445 -7840286 -6512258 -2928498 1435901 4761784 4757171 788234 -3486254
11295 -3486254 -3630152 -1130551 -1540827 -5053662 -5416441 -383425 4139293 4072406 3524095
11286 3524095 5955560 6925682 2772480 -838267 2196473 7294275 6812241 3457926
11278 3457926 5099883 10185450 10211457 4532402 781050 1316727 872896 -2176065 -3670125
11269 -3670125 -3602825 -6684237 -11308709 -9630066 -1488837 3218417 18534 -3419493
11261 -3419493 -956063 2489880 1347398 -709344 1222637 3935795 2758238 344515
11253 344515 992005 2518278 1475972 605971 3341283 6276716 5029367 2638580 3882113
11244 3882113 5669823 1942889 -5210983 -8360462 -6480772 -5095581 -5803123 -4298085
11236 -4298085 798285 4808445 4228878 1188208 -820283 -1051952 -332597 399029 -212624
11227 -212624 -2580997 -4669255 -4570525 -3464844 -3048890 -1966087 1415440 4724438 4638401
11218 4638401 2576774 2537627 4623680 5799653 5982402 7839203 10928389 11643884 9351188
11209 9351188 7356911 7085918 6340936 4431527 4131844 6793705 9686526 10010692 7949508
11200 7949508 4320009 -870174 -5686855 -6127680 -1518598 3111609 3118421 271161 -451853
11191 -451853 1824352 3376283 1962314 -136973 184000 2719373 4906858 5332368 4576740
11182 4576740 3293280 1395584 -526194 -741366 1506155 4591584 6519081 7196331
11174 7196331 7151605 5512227 1859542 -1162294 -723635 1175238 -132809 -4345013 -5571322
11165 -5571322 -1192822 3447224 2507456 -2076926 -3915376 -1053072 2763778 4040103
11157 4040103 2692169 148876 -2147017 -2660649 -884651 1796184 4141123 6701406
11149 6701406 9563356 10434189 7687004 3564620 1302904 529064 -1298484 -4183395
11141 -4183395 -5803522 -5593264 -5135016 -4782603 -3103294 156192 3129307 4081894 2790395
11132 2790395 27674 -2669421 -3554823 -2763241 -2773386 -5026345 -7566712 -8046066 -7204881
11123 -7204881 -6822619 -6140271 -3543376 -362453 442199 -1435318 -3684678 -4877883 -5196870
11114 -5196870 -4761321 -4027171 -4619131 -6912544 -8237372 -6500094 -3827800 -3183356 -3390957
11105 -3390957 -1746422 304135 -832848 -4412455 -6330113 -5999920 -6382839 -6985220 -3329763
11096 -3329763 4695848 9949439 7008568 -216717 -3649981 -1025816 2843224 3083294
11088 3083294 -138340 -3160488 -3498916 -2517979 -3445513 -6564762 -7878499 -4435882 547645
11079 547645 1209739 -2891105 -5979197 -3713983 1860507 5856621 5866600 2749102 -962249
11070 -962249 -2313628 -203837 2651208 2470731 -399095 -1974774 -747678 406566
11062 406566 -374178 -660672 1754608 4525246 4157962 1338563 -541396 -604006 -744276
11053 -744276 -1304736 24924 4137447 7786574 6807780 1442088 -3163056 -2494240 2059811
11044 2059811 4821637 2582097 -2162255 -5403447 -6629320 -7553883 -7849622 -5484867
11036 -5484867 -838516 2667046 2647991 385638 -1147554 -386333 1906366 3612452 3203527
11027 3203527 1476112 654213 1237359 1449828 693974 865555 2469829 2706685 332728
11018 332728 -1044997 1303938 3489386 452230 -5371808 -7306975 -4800312 -3269977
11010 -3269977 -3945964 -1832987 4598289 9342640 7847908 3700639 2160297 2244971 1080
11001 1080 -4257283 -6890790 -6749053 -5891434 -5888906 -6399669 -6286462 -4304551 -318020 2953661
10991 2953661 1907456 -2792443 -5850551 -3801810 980723 4341051 5264146 4874795
10983 4874795 3736757 2335763 1351131 -353287 -4667859 -9465303 -9211930 -3069954
10975 -3069954 2107107 689956 -3927003 -5072595 -2713148 -1981134 -4262723 -5981196
10967 -5981196 -5505838 -5437367 -7336799 -8903830 -7823264 -5053554 -2965723 -2656467 -4008794
10958 -4008794 -6300124 -7920934 -7217468 -4476637 -2019339 -1771371 -3230304 -3858211 -1333831
10949 -1333831 3996341 8823956 10065556 8304049 6483717 5372446 2894376 -1589640
10941 -1589640 -5443970 -6529287 -5929284 -5270257 -4154667 -2192135 -806925 -841336 -971621
10932 -971621 -619888 -1565396 -4302834 -5936658 -4593494 -2881074 -3716319 -5692665 -6118230
10923 -6118230 -5598806 -5607440 -4616073 -1355823 995645 -618390 -2818667 -246296 5421773
10914 5421773 7788880 6216187 6390321 9765524 10279708 4292260 -3087540 -5648290
10906 -5648290 -4577352 -4697680 -6480112 -6841278 -5037958 -2935297 -1229318 247146
10898 247146 -195714 -4226272 -9469679 -11280100 -8571534 -4582236 -1828642 213591
10890 213591 1892627 1596524 -1033334 -3098750 -2227263 -408781 -1256937 -4615252 -6895567
10881 -6895567 -6398645 -5144431 -4912035 -4596630 -2989391 -1423286 -1387609 -1751665 -1156393
10872 -1156393 -1305034 -4394692 -8512658 -9653417 -7899253 -7174252 -8467314 -8139027 -4565446
10863 -4565446 -1672542 -2969957 -6192623 -7535361 -7656844 -9022864 -10093899 -7450641
10855 -7450641 -2290884 481730 -650018 -2503017 -3154694 -4239043 -6134669 -5730017
10847 -5730017 -1588334 2353335 1524471 -3073318 -6347264 -5238930 -686103 5120848
10839 5120848 10182298 11838614 8083949 1057233 -3345017 -1623920 2752341 3282867
10831 3282867 -1468980 -6301981 -6406461 -3157741 -1054195 -1305139 -1607723 -974363 -995378
10822 -995378 -2346440 -3658049 -4482854 -5938057 -7493282 -6849794 -4498552 -4342568 -7303675
10813 -7303675 -8340754 -3562274 2978162 4163347 -657890 -5691776 -6869449 -5291402
10805 -5291402 -3218074 -1352990 -287254 -439101 -48781 3016806 7039303 7835537 4996331
10796 4996331 2882476 4388070 7445619 9008025 8789482 7380713 4250789 -190611
10788 -190611 -3610518 -4950420 -5701177 -6138598 -3941994 701950 2547211 -1843468 -7574043
10779 -7574043 -6973023 -222738 4912748 3739069 -245657 -1819621 -709096 456274
10771 456274 981881 1927843 3634498 6147866 10074426 14372986 15207176 10133955 2204522
10762 2204522 -3345066 -5730719 -8474198 -12815210 -15211211 -12623221 -6994776 -2508545
10754 -2508545 -874627 -1398493 -3427194 -6085844 -7233261 -5607763 -3160973 -2623751
10746 -2623751 -3486385 -3230017 -2067051 -3063370 -6964480 -10059815 -8729113 -3867407 821186
10737 821186 3127793 3219875 1697118 -1135971 -4509692 -7194692 -8188272 -6799724 -2941605
10728 -2941605 1566040 2943318 -1269027 -8551335 -12675099 -9931083 -3539414 -423088
10720 -423088 -3312238 -7551731 -7099426 -2523073 -356282 -4256256 -9923220 -10808600 -6443864
10711 -6443864 -1944035 -554544 -529658 417179 1433289 1197844 1486945 4950457 10126290
10702 10126290 11721184 6900748 -674982 -5100326 -5521548 -6229667 -9099450 -9932484
10694 -9932484 -5299044 525056 883612 -2820611 -2860258 2520586 6229917 3973907 798586
10685 798586 1521673 2230554 -2012018 -7374425 -7353897 -3820437 -3080589 -4605862 -3250604
10676 -3250604 -167832 -1308634 -6145223 -8169591 -6567493 -7007040 -10009762 -9425047
10668 -9425047 -4699662 -3617502 -8823060 -12085525 -7541620 -1279210 -1040335 -4348927
10660 -4348927 -4241439 -485185 2206322 2311801 1382153 -226010 -2104379 -2070011 2969
10651 2969 860256 -219008 308352 2628507 1163173 -5597969 -10389712 -8317364 -5282409
10642 -5282409 -8047893 -12935952 -12847814 -9318668 -8245191 -8753010 -6218954 -2438578 -2648655
10633 -2648655 -5045242 -3123867 3018503 6793174 5562027 2693909 184377 -2765984
10625 -2765984 -4725913 -3497578 -1894972 -4354452 -8430793 -7444550 -1253289 3375154
10617 3375154 3168936 1527210 940448 -230699 -2366183 -2857322 -1108242 660782 2345260
10608 2345260 5768121 9073202 7667518 1951924 -1851498 -273594 3134890 3723182
10600 3723182 1394340 -1237785 -2582932 -2633430 -2559292 -4163063 -7515842 -9906199 -9420087
10591 -9420087 -7780267 -6977312 -5734473 -2771908 -680368 -2421434 -6518457 -9597899
10583 -9597899 -10941779 -11039054 -9256420 -6567139 -6192532 -7788499 -6420897 -1356859 1058966
10574 1058966 -1594814 -2324574 2702512 5260217 -1601613 -10074890 -9384929 -3504456
10566 -3504456 -3478375 -8192273 -7863572 -2651895 -2127801 -7968922 -12125637 -11651518 -11225933
10557 -11225933 -11088508 -6446549 569033 1889896 -2582358 -4876520 -3375807 -4334302
10549 -4334302 -8330232 -8707188 -4919387 -4048500 -7100840 -6874624 -1720726 1264990 -915360
10540 -915360 -3424758 -4664530 -8674765 -14390220 -14763586 -8909392 -3769249 -2379595
10532 -2379595 -1679518 -1893614 -5946291 -10203404 -8604374 -4688142 -6163173 -10202580
10524 -10202580 -9032738 -6333724 -10784644 -17326765 -14574372 -7173514 -8781017 -15950860
10516 -15950860 -13455956 -3479018 -2736750 -11228115 -12591360 -6318220 -8875232 -20363005
10508 -20363005 -22533885 -13875051 -12559068 -19861437 -17510178 -7078180 -11313766 -28636324
10500 -28636324 -31173874 -18054261 -20469839 -40586304 -42847677 -24657675 -29289567 -61044474
10492 -61044474 -65430538 -36795853 -53862750 -132052686 -132133119 62127623 332200586
10485 332200586 434486563 308386801 135283375 76834920 95370423 83499264 41032479
10478 41032479 31398697 51810698 50975933 28351841 24723865 40126453 38124566 16637213
10470 16637213 8370256 19138058 22860357 13375623 11014604 19564080 21182869 13826216
10462 13826216 14036595 22121962 20801667 9604273 7114610 16844601 21519499 14250977
10454 14250977 7627528 8648163 9825226 8223935 10370737 15592071 15283687 10308670
10446 10308670 9918439 13630942 13198978 10836425 15425868 22619362 19890752 10023145
10438 10023145 7785935 13848900 14397544 7102441 4309381 8307323 7046345 -1144494
10430 -1144494 -1962276 8819348 15791685 9534915 1637057 3443715 8109662 6096087
10422 6096087 2660478 6375880 12892586 13590836 10627817 10882223 12704686 10322007
10414 10322007 5502229 4297761 6432199 7000176 5565465 5769232 8017931 9005545
10406 9005545 7438997 5688406 6343542 9599877 13147027 13903773 11512825 9519776
10398 9519776 10511835 11856796 10230250 7974328 9295056 12174605 10874547 5237192
10390 5237192 337049 -2201957 -4889751 -6952439 -4591022 864868 3379508 2101597
10382 2101597 2846200 7794236 11423317 9501063 5418820 4417879 6884078 9980955
10374 9980955 11429305 9942182 6004088 2915766 3019308 3496126 820960 -2086815
10366 -2086815 295148 6129101 7782642 3551572 -4211 1342293 4044448 3977229
10358 3977229 2372347 2102833 3547840 6119268 9146820 10295311 7939907 5294378
10350 5294378 6872853 11094742 12257635 9334145 6232549 3897459 -243362 -4861361
10342 -4861361 -4981761 -917456 930968 -1888472 -4370054 -2630473 972889 3366232
10334 3366232 4672090 4664846 2074453 -586761 1701735 8208479 12064916 10150941 6646353
10325 6646353 4825255 2671105 -681252 -1578741 1333594 3340444 598968 -4486886
10317 -4486886 -8042068 -9784613 -10563218 -9813373 -7977404 -6948346 -6478214 -4660157 -2413279
10308 -2413279 -2118085 -2163008 490874 3053912 524060 -3900974 -2110443 4535393 5631681
10299 5631681 -950167 -4503892 971286 6936472 5067451 500279 1380565 4964130
10291 4964130 4436946 1793193 3009788 6075971 4550398 -699623 -3014369 -666883
10283 -666883 2252993 3535773 4177073 4048341 2516023 1204114 1069436 32560 -1874707
10274 -1874707 -79758 6180864 9198907 3897505 -2467753 -848268 4697357 3454721
10266 3454721 -4321796 -8131382 -4093303 793495 1760371 2277995 4614988 4663440 119205
10257 119205 -4549426 -5595227 -5559623 -7309935 -8735668 -7593615 -6123898 -6423797 -5981714
10248 -5981714 -2399284 1424278 1546533 -678386 -1141556 516089 1537899 1502852 2388221
10239 2388221 3819355 2940206 -305066 -1822773 997310 5476014 7786036 8325408
10231 8325408 9763647 11430892 9893378 5102485 1562667 1857083 3063978 2171486
10223 2171486 1156160 2839921 5057059 3981592 934537 272623 2017999 2615862
10215 2615862 2086122 3691973 6500731 5576427 862316 -1466353 1065568 3075145
10207 3075145 537555 -2567210 -1274981 2593411 4636870 4713228 4443248 2563210 -1731461
10198 -1731461 -4825048 -3715760 -1644328 -3077644 -5915455 -4385382 2243519 8927832
10190 8927832 11339498 8956928 3591158 -1238640 -1599344 2286171 4879154 2254519
10182 2254519 -2337598 -3266600 125880 4487819 7238174 6590972 1041439 -6461078
10174 -6461078 -8263062 -1686657 5116416 3397102 -3940576 -7496360 -5231220 -2770410
10166 -2770410 -2283861 -399939 3243369 4413864 2371470 1519858 3187706 3158644 -52144
10157 -52144 -1211180 3712949 10807406 13287427 9949287 5449355 4408671 7335267
10149 7335267 10772437 10479703 5845278 1000020 -27304 1972236 3791612 4942192
10141 4942192 6883008 8873221 8842368 7314937 6345445 5561868 3310682 466371 -1152450
10132 -1152450 -2627902 -5530460 -7381123 -4882594 -230081 1538759 174768 -893899
10124 -893899 -1732969 -4613283 -6482201 -1455192 8150073 12090241 6439224 -354979
10116 -354979 188646 5062280 5895757 1418480 -2109328 -166483 5213743 8825722 7538439
10107 7538439 2838068 -730282 -694911 302946 -1116212 -3267637 -2258000 716771 847068
10098 847068 -1819268 -2152926 1011782 2895791 1805691 2516332 7126465 9874155 6133163
10089 6133163 313773 -1153174 440396 -102178 -2282391 -1200817 3686726 7676115
10081 7676115 7964594 6272028 4508901 2465058 117962 -1492558 -2217828 -2866341 -3088112
10072 -3088112 -1527017 1703258 4555324 5338188 4351337 3229118 3217207 3833736 3329475
10063 3329475 1218279 -450999 -28627 695857 -713102 -2506535 -915167 2943329
10055 2943329 3355401 -1460920 -6084023 -5647117 -2506790 -1902479 -4461296 -6628708 -6082198
10046 -6082198 -3381515 37250 2797021 3872766 3853588 4472883 5800445 6050340 5014358
10037 5014358 4723701 5537502 5033338 2555462 1381130 4004737 8193329 9990195 8119974
10028 8119974 3813738 -795413 -2725847 -171611 3872035 3823838 -859379 -4438899
10020 -4438899 -3232480 -435798 43321 -485883 585634 1949318 1413103 307673 579700
10011 579700 942069 30658 7285 2907222 6620237 8295614 8211988 6717941 1952206
10002 1952206 -4860538 -6937623 -829961 6589896 6902091 2214160 874467 4037753
9994 4037753 5133258 1651925 -1213184 318279 3283333 3951940 3422327 4674016 7903455
9985 7903455 10786030 10931082 7443331 2170536 -1010665 -360318 1329206 637083 -2074431
9976 -2074431 -4431625 -5427547 -4306787 148453 5510607 5272884 -2445173 -10070029 -10416957
9967 -10416957 -6990186 -7273096 -9970873 -7930852 -975911 4081934 5169430 6829080
9959 6829080 10151198 10409153 6215081 2385113 1745418 1840187 1394291 2300339 3596239
9950 3596239 1434611 -3075464 -4024782 -746274 591930 -2136780 -3253231 292381
9942 292381 3413424 2159169 386686 2211119 5161414 5941516 6041402 6489335 3981479
9933 3981479 -2143307 -5715821 -2602959 2232784 2581148 97233 -667003 -628306 -2583939
9924 -2583939 -4097417 -1266128 3939555 6697716 6769290 7215206 8622777 9722979 10716106
9915 10716106 11453505 9763463 5713797 3491612 5126178 7106100 7033906 7733922 10391862
9906 10391862 10517898 6195419 3058686 4700032 5841652 2491601 695683 6035882
9898 6035882 12332215 11508326 7521442 8487478 11260303 7175960 -1578937 -5127282 -2187188
9889 -2187188 153268 213290 2031112 4455639 3297074 1819560 5610059 10420318 9719157
9880 9719157 9575345 18458900 27563184 23568111 16879635 28199308 45298754 27770117
9872 27770117 -31880003 -84399339 -83864769 -45912192 -18830098 -17429817 -18530329 -9415975
9864 -9415975 -3950122 -10596719 -16461686 -11271350 -3704427 -4226366 -9172785 -10770833
9856 -10770833 -9246768 -7425541 -4692037 -2332897 -4594688 -9693248 -9831035 -4133449
9848 -4133449 -1154061 -4560672 -7291023 -4746387 -2680078 -5648397 -7893470 -3413305
9840 -3413305 3327301 4646248 834616 -3173424 -6303277 -9456681 -10374174 -7317896
9832 -7317896 -3801463 -3639938 -4968378 -4286124 -2442944 -1658511 -721987 1788656 3412192
9823 3412192 1836302 -721885 -1701125 -2650827 -4870258 -5173920 -1433733 2029945 724102
9814 724102 -2163362 -777722 3642158 4939059 1786820 -1618843 -3246076 -4881183
9806 -4881183 -6623713 -6047029 -3193219 -1056011 -633781 -161888 560125 -272052 -2231263
9797 -2231263 -2518252 -775319 154259 -751991 -827939 1721398 4701368 5068250 2762892
9788 2762892 -101249 -2063095 -2998333 -3165292 -2665186 -1562523 -290357 238427 -262287
9779 -262287 -282946 1986508 5779505 8350942 8609560 7503936 4830478 -166504 -4224679
9770 -4224679 -1721482 6270113 10306255 4649306 -3959697 -5515190 -498508 2715028
9762 2715028 1127005 -438550 911976 2166033 1049888 -386359 -463968 -269317 152813
9753 152813 2467217 5482661 5579330 3450483 4530822 10133609 13940193 10902224 4439656
9744 4439656 356188 -1869465 -6161050 -11295169 -11644683 -5956926 4688 802037 -2415484
9735 -2415484 -4776499 -4285204 -3092678 -3097159 -3007994 -990354 1561078 1604266 -419228
9726 -419228 -385291 3191986 5935490 3465109 -2235754 -5935898 -6528670 -7026459 -8618652
9717 -8618652 -9522103 -9321401 -9724038 -10634979 -9728262 -6550729 -3279581 -1011972 929330
9708 929330 1853529 61743 -3238852 -4615642 -3526432 -2586511 -2542087 -1683072 -408687
9699 -408687 -886938 -1673217 1057585 5768315 6080985 1245059 -1436568 1795067 4835910
9690 4835910 2194642 -1607216 -185512 3348068 1756399 -3821819 -5843967 -2546217
9682 -2546217 691745 1254725 2009709 3758100 3174758 75048 -627605 2824431 5083924
9673 5083924 1817555 -3217744 -3662056 372372 3383984 2736549 1314893 2121694 3945895
9664 3945895 3774584 1330442 -917530 -1701200 -2573903 -4576138 -5450907 -2886099 745375
9655 745375 883212 -1935783 -2077544 2336722 5781753 3953244 1111111 3379305 8271091
9646 8271091 7686543 -43175 -7880086 -10110148 -8467286 -6821645 -5362001 -2849068
9638 -2849068 -509034 -292464 -1515918 -1891427 -643325 1070107 1900661 1586448 1304258
9629 1304258 2728892 5470422 6033909 1534547 -5689865 -9572389 -6790338 97495
9621 97495 5940301 7487489 4907001 1139806 -258160 1385582 2879889 1590185 -414616
9612 -414616 421485 3053970 3100204 -138625 -2466313 -1325136 806564 1022447 84402
9603 84402 -44879 585406 1309722 2599870 4273798 4399103 2047013 -918409 -2487597
9594 -2487597 -2834394 -2499738 -684372 2677022 5269706 5081928 3331295 2850175 4575098
9585 4575098 6947437 7880765 6589268 4379234 3482648 3697631 1371839 -5299975 -11250612
9576 -11250612 -9691472 -2222173 2209352 -54842 -2483114 388431 3601860 -52211
9568 -52211 -7657731 -10140587 -6159671 -3403126 -5789170 -7489048 -2585568 5517490 8798121
9559 8798121 5201531 124151 -1274830 353488 815132 -2059956 -6186991 -8031596
9551 -8031596 -6765078 -4851515 -4561268 -5235232 -4821852 -2838587 -451193 1357935 2116802
9542 2116802 1185953 -1465471 -4139288 -4515516 -1800428 2874547 7402861 9491560 8049239
9533 8049239 4869661 3267467 3849067 3738995 1479983 -122418 1435632 3819272 3460476
9524 3460476 1315740 755747 1586020 1083051 -229045 674720 3132759 3183338 827270
9515 827270 951053 5078757 7820944 4669393 -1316210 -4208953 -2742939 657243 4925596
9506 4925596 9915479 13201205 12010997 7593687 4044725 3222125 3686192 4067827 4646873
9497 4646873 5713248 6584159 6355103 4512390 1514468 -471198 912219 4852091 7650406
9488 7650406 7611506 6852139 6651027 4851133 810921 -1304094 1206978 3745984 804593
9479 804593 -4705412 -5641336 -2386826 -2136766 -6386686 -8037443 -3375937 1491413 592687
9470 592687 -2792388 -2857158 -1284540 -3472327 -8576131 -10748783 -8606819 -6710516 -7892293
9461 -7892293 -9855222 -9960160 -8688256 -7322277 -5786604 -3883620 -2277969 -1742506 -2830742
9452 -2830742 -5379322 -6904502 -3970031 2175929 4499401 -974802 -8140000 -8339858
9444 -8339858 -2717271 -149995 -3987897 -8696611 -10006041 -9871836 -9279359 -4936286 2563574
9435 2563574 5378602 -537780 -7526845 -6496208 102637 3374956 1872858 1462112
9427 1462112 3659737 3629957 -92946 -2690844 -1643678 -564204 -1817140 -2243142 184550
9418 184550 1639743 -989001 -3852188 -1872345 2907419 4458363 1943812 -179741
9410 -179741 -307080 -1803253 -5914228 -7974989 -3833553 3251564 5943318 1876782 -3902506
9401 -3902506 -5520635 -2379359 2268771 6117624 8704394 9115063 6359949 2308942
9393 2308942 880795 2787240 3954828 1419210 -1886234 -1478584 1685683 2954352
9385 2954352 1793397 2733122 7528377 11124049 8168096 339556 -5992264 -7478283
9377 -7478283 -6034210 -4352986 -2310221 1485042 6268000 8578026 5553548 -1286672
9369 -1286672 -6618378 -6825038 -3912767 -1966304 -921166 2563981 8178285 10580201
9361 10580201 6867594 1314136 -494754 1015471 1746433 934082 1088519 2212200 1092775
9352 1092775 -3163595 -6901576 -6466226 -2302648 2340887 4591447 3449067 454699
9344 454699 -759517 2091144 6671745 8564028 7049581 5346373 4910434 3395817 -440929
9335 -440929 -3814634 -4313715 -3774546 -4664967 -5508177 -3607161 -172239 1275379 214174
9326 214174 -1162662 -2538193 -5484442 -9171969 -10429902 -8616305 -6418777 -4963352
9318 -4963352 -2182619 2497134 5783669 5053136 2044387 -209187 -1177868 -1387964 -363569
9309 -363569 1339384 1177867 -1233846 -2158039 493474 2656007 13685 -4390587 -4146683
9300 -4146683 658241 3837760 2832323 1625839 3310898 5883650 6969214 7038985 5922522
9291 5922522 1644047 -4657649 -7866286 -6012928 -3408854 -3469853 -3521486 -688563 2255007
9282 2255007 2092721 1610873 4608864 7986283 5744945 -1134744 -5625825 -4557038 -1310572
9273 -1310572 912002 2273130 2465895 -212760 -4568001 -6272188 -3488129 1188127
9265 1188127 5126861 7892256 8664895 6227525 2551909 1582154 2910472 1435491 -4552333
9256 -4552333 -9536281 -7997276 -1807093 2811483 3021212 1130175 642940 3117895 7606356
9247 7606356 11409369 12336056 10799933 8322806 4526520 -1550028 -7595783 -9538358
9239 -9538358 -7367061 -5150832 -4368366 -2094038 2395481 4432157 651728 -5437237
9231 -5437237 -8449800 -8247042 -8006769 -8017026 -5950386 -1921354 779138 -91227 -3103013
9222 -3103013 -4528274 -1407633 5456244 11032699 10718981 5818442 1492220 -696237
9214 -696237 -3602651 -7132296 -6223993 738550 7337453 7640514 4562551 4342165 6628027
9205 6628027 6164055 1654686 -3187022 -5902692 -7086868 -6960720 -5121281 -3026462 -2540041
9196 -2540041 -2945562 -3048421 -4398232 -8247810 -11434318 -10204123 -6396889 -4671445 -5097185
9187 -5097185 -3933850 -559162 2059210 2985737 3690114 3385051 -75428 -4763690 -6125177
9178 -6125177 -4226157 -3759995 -6182075 -7574188 -5336535 -1510475 1644515 3976914
9170 3976914 4356396 1085506 -3083886 -2261345 4030922 9117885 8434795 5194391 4074213
9161 4074213 4595646 4260134 3460134 3201933 1740532 -2481529 -7315572 -9594876 -8953454
9152 -8953454 -6661178 -3513735 -912578 -719591 -1905137 -863299 2797527 4645389
9144 4645389 1973726 -2103686 -3728177 -3228065 -2126024 124942 2842643 2302957 -2276254
9135 -2276254 -5241269 -2115408 3034068 3406736 -521880 -2810968 -1491144 110342
9127 110342 145761 189809 676293 -153364 -2357623 -3781841 -3721420 -3320796 -2445561 117957
9117 117957 3484695 5212182 4851069 3893762 2964698 2278705 3550169 7460280 10430363
9108 10430363 8480623 3555309 1232853 2588749 3435068 1671683 -41121 216487
9100 216487 746592 388512 678275 1939588 1750701 -448983 -1431134 635193 2944037
9091 2944037 2700169 1362592 1219519 1037097 -1408692 -5003419 -6871410 -6329931 -4396710
9082 -4396710 -1442405 1720824 2581097 161161 -2243980 -1098737 2085496 3247878
9074 3247878 2298787 2756158 5260657 6181718 3629688 600100 241640 1511398 1938189
9065 1938189 1717906 2047382 1732307 -800269 -3341948 -1862310 3265393 6914126 6288788
9056 6288788 4738293 6097756 8275710 6266839 57825 -4745784 -4385156 -1265943
9048 -1265943 367048 -175989 -943226 -1147315 -1528562 -2251767 -2525681 -1527932 1442770
9039 1442770 6231677 10142885 9488715 4944036 2556133 5963784 10065231 7310695
9031 7310695 -1030599 -5844215 -2867492 1855755 1698499 -1253909 -1310940 828046 -339993
9022 -339993 -5291803 -8056591 -5613704 -2867104 -5137841 -9756813 -9529274 -2839196 4139149
9013 4139149 5603113 2861605 1246150 2767594 4421066 2867885 -1711629 -6618694
9005 -6618694 -9456452 -9183614 -5964484 -1302477 2421662 3672612 2785256 861030 -1517967
8996 -1517967 -3744977 -4407884 -2535295 617436 2293627 989641 -2130562 -4578783
8988 -4578783 -4865733 -3607156 -2606230 -2734301 -3018891 -2542043 -2559121 -4765663 -7525903
8979 -7525903 -6709853 -1484539 3642596 4711278 3468402 3627471 4599652 3289579 506233
8970 506233 322231 3076975 4210771 1274310 -2635893 -4395636 -5290366 -6936268 -6683641
8961 -6683641 -1354154 6595961 10852532 8534498 2646464 -2220420 -3983129 -3309645
8953 -3309645 -2316087 -3028934 -5254607 -6188676 -3801046 -60985 1133404 -1199968 -4407133
8944 -4407133 -6034698 -6097257 -5319398 -3494091 -739884 1174963 366987 -2553741 -4407657
8935 -4407657 -2527099 2020318 4864803 2924648 -1624289 -3394390 -19513 5398503
8927 5398503 8586783 8567700 6629067 3506237 31916 -1570539 -289406 1067224 -776714
8918 -776714 -4387079 -5270423 -2378621 613694 709191 -1263988 -3446309 -5347071 -6443404
8909 -6443404 -5744993 -4071340 -3637918 -4133111 -2675147 760440 1861945 -1499337 -5182859
8900 -5182859 -4832252 -2574472 -3034427 -5218584 -3950361 1518636 5900431 5507953 2815479
8891 2815479 1972656 3539284 5440703 6211854 5531532 3803946 2625342 3625038 5722127
8882 5722127 5692098 2636922 -321547 -217514 1961987 3283281 2862705 2017660 1698281
8873 1698281 1516990 743540 -689476 -1613335 -70867 4171652 7707224 6545864 1527461
8864 1527461 -2165692 -1807053 -227781 -671975 -2234040 -3002691 -4162005 -7092800 -9032308
8855 -9032308 -6140489 503878 6148628 8582004 8997428 7644390 3497576 -1589226
8847 -1589226 -3259829 -543213 2555206 2868410 1878892 1881077 1783688 -476379 -3645439
8838 -3645439 -4382011 -2075379 -194041 -2414655 -7966433 -11210921 -7015055 2570200
8830 2570200 8881642 6295992 -468660 -2351953 2175013 6289410 5509868 2976622
8822 2976622 2436085 2250771 7314 -2171047 -1641282 -536544 -1946836 -3980926 -3051518
8813 -3051518 -665407 -1197119 -4453748 -6350231 -6210052 -7277236 -9721989 -9304127 -4578061
8804 -4578061 82573 1113142 675098 1872365 3050779 705104 -4529102 -8508674
8796 -8508674 -8739393 -5970116 -1981189 1416146 2277038 296485 -1830141 -1312881 856839
8787 856839 1364444 -334951 -1120353 996024 3626475 3044666 -1005703 -5181764 -6629050
8778 -6629050 -5761098 -4857455 -4925851 -4699871 -2656767 600867 2630299 1872679 -568639
8769 -568639 -2312073 -2260215 -1048877 447052 1699322 1720045 -560507 -4256512 -6319391
8760 -6319391 -4819216 -1526135 346960 189911 -184225 -176274 -1144167 -3166330 -3923113
8751 -3923113 -2131398 286296 1097790 675051 304029 3537 217907 2893563 7593353
8742 7593353 9198513 4089637 -3115849 -4453828 333321 3548064 980689 -2668505
8734 -2668505 -2133975 537469 526175 -1781473 -2288100 -63868 1905236 1619622 70192
8725 70192 -982341 -695343 516107 688677 -1860699 -4937167 -3621690 2621572 7325838
8716 7325838 4994131 -1291511 -4437040 -2955003 -1062906 -910756 -279746 2138914 4138960
8707 4138960 3558408 920423 -2011081 -3512358 -1989328 2231382 5693721 5495766 3463752
8698 3463752 3339639 4852477 4641471 2345936 1156296 2273794 3376829 3114804 2760843
8689 2760843 2601887 985549 -1799874 -2638853 -123525 3261831 4674196 3676791 855980
8680 855980 -3033547 -5950975 -5969525 -4268199 -3386652 -2714551 2025 2955581 1725477
8671 1725477 -2800121 -4219490 -441938 2562409 243553 -3187699 -1677562 3150521
8663 3150521 5013230 2365128 -818228 -1898624 -2117085 -2872182 -3621561 -3754679 -3838709
8654 -3838709 -4650267 -6153638 -7001149 -4982819 36366 3649123 916604 -6220793 -9760689
8645 -9760689 -5788672 631450 3440046 3612117 4938888 6121301 3077923 -3061917
8637 -3061917 -6337070 -4185209 -632234 -568306 -3989539 -6734602 -5287469 -612739 2446263
8628 2446263 656045 -3133425 -3858205 -2180015 -3554780 -8444097 -10026134 -4966615
8620 -4966615 220726 -986551 -4820401 -3726323 1647083 5097045 5984463 8587406
8612 8587406 12060162 10509138 3525896 -1931433 -1806556 442999 1531040 3397597
8604 3397597 7514133 10506972 9468796 6849012 6117035 6201546 3943939 -471649 -3701208
8595 -3701208 -3433014 -605269 1484627 87950 -3241896 -2799173 4181069 11787741 11533072
8586 11533072 3787535 -2486153 -2054334 656431 -38515 -2748891 -2714852 692639 4164765
8577 4164765 5097661 2919315 -1470622 -5068252 -4476913 -528070 1881639 595186 -826394
8568 -826394 776634 3328803 3981822 4031098 5070362 4191728 -1410252 -7643525 -7476409
8559 -7476409 -968541 4116478 2162549 -4270461 -9130816 -9774020 -7705358 -5344880
8551 -5344880 -4101104 -4327445 -5554218 -6776964 -6920478 -5344536 -2581714 -528580 -661509
8542 -661509 -1876651 -1725622 -79753 666003 -233627 -245793 2277404 4962005 4844951
8533 4844951 2830289 1947884 2749070 3430312 3533492 4346259 5715346 5322951 1983776
8524 1983776 -2167502 -3912742 -2670436 -1102722 -1759129 -3485288 -2425269 2581304
8516 2581304 7281524 7025333 3304989 1833450 4389684 6644159 4802050 156560
8508 156560 -4448171 -8243749 -10257226 -7948751 -1828965 2332749 417920 -3672633
8500 -3672633 -3304940 1184897 3070448 -1288062 -8131592 -11524252 -9205087 -3079726
8492 -3079726 2958508 5437480 4026954 1858583 1425780 1453858 160690 -489074 2286381
8483 2286381 6233885 5941246 731869 -3764847 -3124774 406830 1635206 -1067494 -4730016
8474 -4730016 -5676312 -3220703 -237990 -171500 -2820938 -4189375 -1865368 1268252 1170661
8465 1170661 -1380021 -2500532 -1525407 -1237899 -2288225 -2228981 -729509 -936848 -3895828
8456 -3895828 -5831254 -3526426 879704 3247068 3074928 2895564 3678654 3667600 1341527
8447 1341527 -2289844 -4368400 -2682065 1878992 5330211 4332952 40366 -3210856
8439 -3210856 -2987993 -818285 709598 784305 176260 242015 2129988 4954239 5360766
8430 5360766 1756815 -1758799 229400 6076457 7989563 2776938 -3268843 -3044866
8422 -3044866 2145348 5785779 5070614 2321092 3306 -1107510 -266602 2401068 4150627
8413 4150627 2575816 -223140 -200418 2268047 2660947 -669188 -3908212 -3709019 -2124834
8404 -2124834 -3101097 -6403753 -7992636 -5596010 -1429310 866091 420767 -407488 871432
8395 871432 4004270 6349540 5871551 3319550 1170838 805962 1301981 905558 -941803
8386 -941803 -3276638 -4832417 -5003902 -3603421 -447938 3972102 7777347 9058510 8306440
8377 8306440 7975127 8782734 8217160 4413875 -88697 -1039405 1894173 4891285 5071188
8368 5071188 3194550 1414002 1018516 2385647 4375834 3893989 -636529 -5336777 -4471477
8359 -4471477 1247177 4398437 559771 -6171014 -9721565 -9552558 -8240765 -5913521
8351 -5913521 -1793620 1854353 2423183 1615387 2661735 4538017 3707893 325726 -2212551
8342 -2212551 -3080705 -4362702 -5819935 -4352857 619511 5468053 6896579 4834741
8334 4834741 768298 -3206076 -4049220 -810869 2238108 303159 -4247459 -4619849 -517489
8325 -517489 511500 -5092154 -10684568 -9294689 -3715196 -1036919 -1714570 -832925 2409204
8316 2409204 3579063 989364 -1305826 270794 3954338 5629295 3828099 367718
8308 367718 -2107101 -2192498 -458686 1315232 1962302 1635534 739988 -372268 -484901
8299 -484901 1278543 2668612 23744 -5590673 -7713694 -2858487 3952737 5769801
8291 5769801 2660382 -310667 -1025490 -831753 541269 4357249 8393851 9385272 9208190
8282 9208190 11993549 15535098 13459013 6899187 5194278 11548022 16358841 10530907
8274 10530907 -1336642 -8005349 -6747967 -3789293 -3032150 -2537384 -1078855 -664030
8266 -664030 -1896587 -2719471 -2710419 -3824610 -6144331 -7236606 -6270011 -4653055 -2461731
8257 -2461731 1134314 3626825 776546 -6147089 -10041452 -7219563 -2211268 -560048
8249 -560048 -1482364 -1358895 -353878 -793822 -1762207 -332811 3176655 5560505 5577558
8240 5577558 4629056 3159935 98492 -4168587 -7517547 -8924382 -8863050 -7151171 -3474846
8231 -3474846 -23668 -227002 -4093329 -7598027 -7571593 -4787824 -1556744 1147059 3183250
8222 3183250 4260987 4619279 4849558 4453133 2677108 976169 1644231 3383167 1960961
8213 1960961 -3132071 -6662271 -5015421 -1805570 -2195852 -4713829 -3786474 1351839 5851203
8204 5851203 6980092 7119551 8035165 7344690 3138525 -1857463 -3806741 -2812457 -1670532
8195 -1670532 -1674401 -2334248 -3504917 -4941320 -4907132 -2025956 2052167 4281898 4204801
8186 4204801 4064943 5048483 5576114 3748485 -125636 -3912612 -5460166 -3903898 -309026
8177 -309026 2831122 3703446 2882263 2179843 2061694 1309322 -759524 -2829162 -2754518
8168 -2754518 150989 3973806 5438100 3197392 27602 49864 3015362 3743580 -743614
8159 -743614 -5992589 -5573608 -235413 3006995 876485 -2062208 -888718 2724622 4164336
8150 4164336 2921876 1980945 2400765 2810806 3260619 5281101 8030805 8355391 5779597
8141 5779597 4136119 6441496 10622858 12382667 10438675 6682852 2673913 -1075683
8133 -1075683 -2862947 -373905 5102925 7695613 2968530 -5934948 -10902006 -7895265
8125 -7895265 -1102347 2679121 1398682 -2109915 -5054784 -6814426 -7199425 -5928752
8117 -5928752 -4174213 -3910183 -4877351 -4344364 -793839 4027050 7554117 9033416 8871485
8108 8871485 7385471 5363626 4046230 3336933 1746306 -808500 -2112185 -821234
8100 -821234 1500917 2849134 3039894 2091602 -848888 -4794592 -6044362 -3027955 498780
8091 498780 501940 -1495980 -1619764 -394164 -1216659 -3402563 -2529727 2023704 5267832
8082 5267832 3642551 -578574 -3391093 -3607960 -1917951 692732 2016700 -81337
8074 -81337 -3785996 -4476511 -1304758 1552384 2042251 3665826 8665645 12788136 11510537
8065 11510537 7523929 6501566 8184248 7551841 3290644 -740968 -1958298 -1551093
8057 -1551093 -542628 1392713 2548082 -246861 -6174538 -10031810 -9146784 -6664643
8049 -6664643 -5893086 -5450274 -2965369 -64765 158097 -1624633 -2149084 -722714 371226
8040 371226 94100 -18555 1115342 2534782 3187161 3256975 2988939 2108520 989621
8031 989621 604311 710260 -57288 -1530365 -1533095 640377 2412115 1695919 653440
8022 653440 2634019 6351552 6866804 2746548 -1509355 -1792155 202265 524704 -710108
8013 -710108 -163141 2884701 5234592 4242733 670660 -3035805 -4795823 -3319606 801601
8004 801601 4330628 4372725 2168316 1155485 1667346 1331853 599592 2725301 6896089
7995 6896089 7015659 530943 -6616360 -8281220 -6849639 -8006915 -10508767 -8532971
7987 -8532971 -2558258 181124 -3026042 -6015592 -3393220 1648276 3148564 1217967
7979 1217967 165031 943647 762664 -1081506 -1940261 -678780 172525 -1472725 -3627906
7970 -3627906 -2500472 2876566 9625768 13945053 13983276 10263042 4627736 -554080 -2867635
7961 -2867635 -1053052 3412032 6641659 5600778 1241793 -2574580 -3597186 -3538103 -5072684
7952 -5072684 -7453690 -6967573 -2165672 3144532 4014133 852505 -710190 2768089 7842587
7943 7842587 9054373 6421879 4641266 5794866 7020117 5823351 3504359 1810543
7935 1810543 121187 -1808823 -2020928 -189149 168953 -3086743 -6357339 -5285508 -1275233
7926 -1275233 1723657 4179006 8533926 11592213 7089562 -3360364 -9441307 -5308229
7918 -5308229 2509288 4417579 -64157 -4450949 -5764932 -6583608 -8020288 -6951518
7910 -6951518 -1683555 4009309 5290496 2562492 588096 1957656 4151581 3975356
7902 3975356 2458106 2629191 3706093 1708735 -3372186 -5676517 -1645237 3954884
7894 3954884 4542230 988921 -1169004 -1379118 -4041624 -9486485 -12267767 -9675155 -5396161
7885 -5396161 -2760952 -576101 1796373 1469989 -2255291 -4786720 -2975031 -33911
7877 -33911 482128 682203 3436019 6071791 4648852 811650 -1414728 -2444707 -4842676
7868 -4842676 -7237899 -6900699 -5811707 -7290218 -8616819 -4584663 2580775 4749691
7860 4749691 -358741 -6518084 -9136928 -10447519 -12402016 -11906677 -7048885 -1979347
7852 -1979347 -1013617 -2545509 -3189854 -3707376 -5923197 -7237540 -3827353 2411954 5330975
7843 5330975 2624439 -1659830 -3058332 -1919391 -1753293 -4306203 -7311239 -6746171 -1355699
7834 -1355699 5246641 8113426 6463869 3671714 1761361 -799502 -4495836 -5732984
7826 -5732984 -1706380 4255050 6309639 3861769 1537212 1599375 759124 -3909117 -9315183
7817 -9315183 -9605422 -3799416 2553316 3732115 275526 -1975139 1217761 7668407
7809 7668407 11351005 9035311 3209799 -1404465 -2718917 -2019792 -1214717 -806261 -244475
7800 -244475 989384 2922927 5005820 6160273 5376875 2802864 248547 -37938 2140691
7791 2140691 3889335 1924101 -3189321 -6782177 -5126812 315602 4920025 5987062
7783 5987062 4127250 885624 -2311810 -3383137 -942745 2976316 4241745 1649819
7775 1649819 -1615376 -2451955 -1388858 -448917 129324 1231196 2795352 4279385 5769695
7766 5769695 6992717 6582135 3892767 293383 -2632597 -4690029 -5750515 -4911331 -2562975
7757 -2562975 -1029981 -1184914 -908031 710760 693396 -2709971 -5260168 -2310028 2813615
7748 2813615 2385293 -4096335 -8719589 -7017949 -4174328 -6015202 -9892353 -9730111 -5790083
7739 -5790083 -3352280 -4162140 -5188544 -4786624 -4417163 -4256680 -2309935 1230718 3231877
7730 3231877 2529687 1728970 2670882 3696887 3087207 1827691 966616 -621793 -3437910
7721 -3437910 -5015378 -2993229 1525537 5923419 9261663 11360049 11165452 8822526
7713 8822526 7146357 7895841 8541571 6135252 2534884 1805906 3796873 4710492 3356569
7704 3356569 2167498 1961843 567454 -2202309 -2684851 1314243 6587470 8208259 5054975
7695 5054975 182195 -2402268 -492187 4528264 7951624 6233072 1718888 149119
7687 149119 3101811 6310175 6070996 3297978 21111 -3661265 -6974384 -7157601 -3775174
7678 -3775174 -696654 -704980 -1541102 -388394 1319140 1079894 -292327 -1432373 -3951652
7669 -3951652 -8522914 -10823009 -6996912 -720001 1094984 -2001182 -4484866 -3907391
7661 -3907391 -3277786 -4561581 -5697966 -4870706 -2877968 -634766 1328035 919581 -3099948
7652 -3099948 -6835413 -4907169 1137131 4029966 1680428 513475 5216706 11146646
7644 11146646 11320104 6552054 3513606 5084903 7393386 5861921 721668 -4009004
7636 -4009004 -5309967 -4170832 -3720940 -4531331 -3596897 500047 3840775 1962167 -3424254
7627 -3424254 -6864263 -7045078 -7093813 -7643695 -5643790 -800992 2711542 2629576 1376512
7618 1376512 764931 -782822 -3754007 -5519628 -4909150 -3657309 -1465965 4336117 11712873
7609 11712873 13169786 5961679 -2984290 -6556215 -5976898 -5438602 -4639364 -2280363 -940401
7600 -940401 -1977967 -1151071 3649725 5919229 226083 -6477333 -3226569 8149298
7592 8149298 14942985 11317813 4230131 1233295 1784180 2473429 2523575 1380849 -2175243
7583 -2175243 -5813952 -4633160 1223169 5562088 4851577 2255790 901549 -735435
7575 -735435 -3693678 -4627637 -1217761 2918164 2865117 -1204358 -5589581 -8037822 -8173920
7566 -8173920 -5768932 -1595463 2055097 3927195 4895197 5218493 3585401 421903 -1095300
7557 -1095300 657257 3456274 5201668 6924657 9467980 10448015 7683915 3207388
7549 3207388 615442 96612 -944625 -3376443 -5047128 -3744740 -39935 2637951
7541 2637951 759974 -5225039 -10026421 -8997226 -4064872 -1132090 -1976639 -2941108 -1882269
7532 -1882269 -1077302 -1514668 85290 5182408 9298214 8462545 5806538 6566637 9481418
7523 9481418 8873757 3694595 -1168299 -2245639 -1036555 202461 1491762 2605731
7515 2605731 1556924 -2074015 -4979339 -3856821 91023 2653189 2030885 599853
7507 599853 796051 1141464 -1672106 -7260475 -10733167 -8573873 -3131604 862101 2401985
7498 2401985 3892597 6063350 6893390 5292953 2358328 -973563 -4121643 -5125890
7490 -5125890 -2847595 -617363 -2616070 -6307064 -4537738 3236487 8402406 5095905
7482 5095905 -1592866 -3948390 -2568061 -2984545 -5630598 -6086685 -3168268 -469452 -703435
7473 -703435 -3455394 -7607360 -11576403 -12334681 -8554290 -3607610 -1433448 -1008594 863157
7464 863157 3311578 3016353 384014 -1375279 -2068226 -3672036 -4760952 -2220081 1788146
7455 1788146 1464517 -3177527 -5233785 -1123790 4293514 5244386 2050864 -2054323 -5627807
7446 -5627807 -7281756 -4522008 1496462 4401526 392152 -5752839 -6951159 -3223080
7438 -3223080 -89802 89811 -199049 336786 -470481 -3505487 -5551656 -3354796 1838673
7429 1838673 5893761 6837478 6401810 6565705 6351722 3634278 -527144 -2010795 815283
7420 815283 4288668 4568746 3051335 2967598 2774394 -1485125 -7829310 -9087832 -3816753
7411 -3816753 30306 -3728137 -10046154 -9875567 -3164453 1783724 338554 -3540528
7403 -3540528 -4881939 -4450193 -5497137 -7723491 -7952908 -5254084 -2354824 -1857742 -3107092
7394 -3107092 -3871475 -3972146 -5265214 -7807094 -8385267 -4731765 546331 3074918 2647966
7385 2647966 2525105 3336469 2173999 -1505716 -3902683 -2940841 -1843140 -3494194 -5256609
7376 -5256609 -3549490 -356926 -261863 -3109394 -4769341 -4045090 -3550754 -3861372 -2102607
7367 -2102607 2356875 5335649 3329365 -1481137 -4162516 -3028351 -507267 794402
7359 794402 811094 940530 1690278 2172542 1754242 1236855 1362723 865976 -1802856 -4768956
7349 -4768956 -3791617 1696515 6721500 7100576 4586034 2816459 1372063 -1927782 -5379752
7340 -5379752 -5268832 -2023281 777281 2732190 6327884 10504652 10729854 6617861 3473983
7331 3473983 4187578 5263675 3642849 1845023 2546525 3224734 1090216 -920738 1203849
7322 1203849 4962815 4541724 -34509 -2894661 -946425 2920277 5347304 6086952 5377645
7313 5377645 2677527 -488054 -812208 1611817 2249684 -1227568 -4617458 -2623244 3872425
7304 3872425 9368237 10997348 10773382 11259869 12290265 12318638 10427177 6275568 216030
7295 216030 -5441278 -7030161 -3111771 3145327 6482068 4406687 -1049373 -5944638
7287 -5944638 -7895119 -7309892 -6447820 -7483376 -10465119 -12771068 -11566660 -7374496 -4111738
7278 -4111738 -4563342 -6754108 -6254684 -1546045 4487991 8107520 7964102 4808875 100094
7269 100094 -4209428 -6159620 -5371452 -3326833 -1356925 623126 2788608 4241949 4213067
7260 4213067 3188441 1776611 -215493 -2342058 -2783281 -990956 309839 -1644953
7252 -1644953 -5167301 -5831801 -2735008 108209 -298533 -1583975 50738 3566822 4057122
7243 4057122 -375137 -5941972 -8481210 -8752980 -10017461 -12038624 -11200084 -6866072 -3761556
7234 -3761556 -5646717 -9435075 -9197188 -4482303 -438101 52260 -233083 1550732 3655985
7225 3655985 3137719 582246 -1425785 -2041322 -1679613 -245410 1374640 614899 -2806480
7216 -2806480 -4913053 -3218639 -1586667 -4441205 -8677044 -7715565 -2328682 -74896
7208 -74896 -3513806 -6637234 -5290472 -3637917 -5953691 -8473284 -5543290 561788 2691356
7199 2691356 -753258 -4769077 -5926159 -5612052 -5225754 -3742908 -1274809 -569223 -3060228
7190 -3060228 -6404442 -7408383 -5143057 -472694 4835998 7671975 5214916 -1179911
7182 -1179911 -5841197 -4472532 1288477 6368565 7833100 6273919 3021586 -1356471
7174 -1356471 -5635432 -7400372 -5576746 -2617287 -2325660 -5196538 -7441745 -5632769
7166 -5632769 -1008654 2491370 3480313 3969034 5242172 5854817 4619313 2958113 2782340
7157 2782340 4112541 6286541 9435561 12999171 14711379 13064033 9299844 5452221
7149 5452221 2241944 215550 283654 1278823 214826 -2429706 -1482794 4942467 10051143
7140 10051143 6570079 -2441379 -7645461 -6635287 -5545251 -7624595 -8436712 -4638000
7132 -4638000 -59250 872974 -176980 255688 1433931 1463123 2132570 5460918 8552387
7123 8552387 7345076 3476966 2184962 4407431 5687662 2579024 -3786992 -10220582
7115 -10220582 -14055590 -13627866 -9668208 -6034551 -5807785 -6922130 -5035994 -451951
7107 -451951 1822852 -543002 -3894257 -4323548 -3093956 -3623881 -5592792 -5426374 -1758384
7098 -1758384 2617191 4589722 4363149 4276805 5336383 6262044 5578277 3441532 1267917
7089 1267917 523245 2061059 5342407 7671932 5872919 303054 -4189731 -3580277 -28986
7080 -28986 692172 -3383698 -8520917 -10654507 -9386461 -6287500 -2764581 -645853 -1503190
7071 -1503190 -3991009 -4906294 -3941384 -3771563 -4375960 -2133445 3107517 5461877 1645657
7062 1645657 -2649415 -602634 5177619 6426199 1347541 -3768665 -4251978 -1900661
7054 -1900661 163285 1518835 2119045 1041756 -834905 -1121553 -224992 -1320297 -4618132
7045 -4618132 -5747323 -1954941 3398810 4857594 1158931 -4122864 -6443443 -3938516
7037 -3938516 1013018 3632809 1991831 -261808 1002958 4000948 3894459 1024582
7029 1024582 628693 3917197 5617497 2508086 -1392636 -1495313 510259 684455 -245763
7020 -245763 1213017 5014094 7667536 7284427 4928248 1964038 -961242 -3117742 -4185083
7011 -4185083 -4723541 -4724429 -3309165 -1181051 -960458 -3190656 -4521258 -2157891 2199497
7002 2199497 5141910 5852787 5241664 3379376 563768 -1448091 -2023262 -2996810 -4746331
6993 -4746331 -4014524 858245 5623492 5402484 1749913 -246086 258980 119685 -1483039
6984 -1483039 -2582322 -3348175 -5705944 -8168717 -6764177 -1802910 1607996 988607 -545075
6975 -545075 -208576 450841 -328116 -793185 1048931 3684853 4366080 2806130 610606
6966 610606 -853397 -655129 1226376 2512358 403467 -4240225 -7470486 -7786771 -7379341
6957 -7379341 -6912028 -4010330 810564 2252630 -1525962 -3749112 1931205 10753210
6949 10753210 12326179 5207533 -1438803 -1076851 2572577 3388812 1830866 1864154 3609232
6940 3609232 4229110 3497509 3370621 3267032 788598 -2827898 -2881930 1545837 4678859
6931 4678859 1470203 -4825470 -6519299 -1854009 2871265 2376883 -446144 644754
6923 644754 5809578 8736300 5551269 127278 -1373870 1499781 3918581 2944098 856917
6914 856917 846541 2317388 2320462 -83186 -3118787 -5159633 -6058949 -5801055 -4118191
6905 -4118191 -1951892 -1125871 -1492484 -379315 3545687 7605331 8423444 6576926 5406939
6896 5406939 5994849 6185839 4520823 2295144 1172901 1254977 2243211 4141381 5858338
6887 5858338 5389454 2590998 -151555 -1054018 -826820 -654256 -597996 -968407 -2607919
6878 -2607919 -4447687 -3628096 166154 3390017 3723648 3326643 4422347 5106341 3227743
6869 3227743 1235119 2372255 4373263 2390860 -2981389 -6140937 -4704187 -2043141
6861 -2043141 -1206555 -1369171 -1330027 -1757144 -2385222 -1266401 1379501 2434175 790990
6852 790990 -786063 -607421 -859894 -2849506 -3228815 1332910 8114517 10652336 6131100
6843 6131100 -1880184 -7134178 -5727573 882297 6316657 4572085 -3420638 -10143705
6835 -10143705 -9629536 -3243991 3605725 7479890 7811731 5248293 2259232 2843669 8019607
6826 8019607 13193469 13280732 9109828 5616817 4974184 4895703 2946679 -775710 -4859122
6817 -4859122 -7509122 -6681247 -2228216 2361008 3270017 1211710 54790 820548 494789
6808 494789 -2700207 -6374922 -7664216 -6845701 -5487214 -3579054 -789071 1442670 1771229
6799 1771229 1713861 3740793 7060253 8173724 5949099 3236971 2164325 683426 -3479449
6790 -3479449 -7501065 -6153095 492304 6297639 6982553 4567306 1975498 -1947236
6782 -1947236 -7951255 -11202871 -6887950 1126064 4060632 239076 -3366726 -2123365
6774 -2123365 731182 1392240 1344496 2537562 2947604 1306202 844150 3409603 4734441
6765 4734441 1225096 -2641947 -149886 7148626 11171613 8194335 2424831 -487819
6757 -487819 1117643 5011785 6593286 1891748 -6999727 -11763064 -7574645 -317418
6749 -317418 1119451 -3111055 -5758532 -3981822 -1534284 -861175 -754690 -1440523 -4278188
6740 -4278188 -6280445 -2803647 3610886 5125752 607549 -2523638 -396455 1985693
6732 1985693 615315 -939348 721263 2439132 1232329 352438 2758028 4909697
6724 4909697 3283247 1250373 2892099 5231898 3552760 -251639 -1763103 -2135405
6716 -2135405 -4581864 -6638294 -4036962 662427 1553678 -805477 -1367629 -368030 -2038743
6707 -2038743 -4599536 -1512372 6192339 8482758 403468 -10363164 -13949687 -9805168
6699 -9805168 -3693722 1032268 4353255 5891552 5024710 2586692 -356662 -3320048
6691 -3320048 -4559379 -1789620 3485046 6141011 4287113 2289468 4221736 7802852
6683 7802852 8160191 4734170 903197 -1081989 -1347064 -165354 2322932 5090125 7317605
6674 7317605 9483221 11428107 10900538 6393560 174004 -3929935 -4859831 -4313360 -3402191
6665 -3402191 -1768933 386636 1734357 1589859 776533 356559 343120 -135271 -1694177
6656 -1694177 -3576197 -3821784 -1345628 2209136 3771018 2097416 -1230935 -3763360
6648 -3763360 -3808190 -768877 4024127 7200289 6649286 4836997 5888226 9295213 10190490
6639 10190490 6676816 2753392 2036064 2609603 1168907 -1137137 -934111 1539919 2853829
6630 2853829 1463472 -1128830 -3433659 -4894790 -4341236 -831138 3878003 6462553
6622 6462553 5969785 4493550 3837411 3583425 2726939 1420451 652156 1304026 3443632
6613 3443632 5610746 5525801 2912529 830299 2326977 6157303 7824710 5047606 485625
6604 485625 -1603693 -344556 1018272 -684186 -4248272 -5246077 -2139733 639960 -1642663
6595 -1642663 -6547411 -6855860 -686415 5665964 6795286 5121452 5465775 7295351 7217726
6586 7217726 5822263 6392996 8683504 9411515 7965566 6649761 5962537 4409543 2420950
6577 2420950 1684761 1110673 -1617689 -4953839 -5252633 -3319949 -3369099 -5318816 -4630821
6568 -4630821 -833832 726854 -2118871 -4456329 -2679667 -316443 -1202154 -2861329
6560 -2861329 -1893367 -551563 -1876109 -2927655 90866 3443337 383450 -7644758
6552 -7644758 -11930459 -8331404 -1315076 4089689 7553163 9453111 8378722 5361859
6544 5361859 4927090 8328018 10260814 6356728 380793 -617176 3918362 7834215 6997587
6535 6997587 3794212 2303933 2684780 2333942 462428 -1066797 -1088785 -1119286 -2914145
6526 -2914145 -5172120 -4489735 108578 5112527 6141998 2859013 -939554 -1796412 -47452
6517 -47452 1189773 -294375 -3233367 -3852261 118804 6341553 9935966 9050767 6683478
6508 6683478 5902888 5366982 1930266 -3766099 -7489835 -6995782 -4475645 -2932190 -2683880
6499 -2683880 -2469051 -1829380 -906965 669872 3137044 5491067 6118793 4290947 707044
6490 707044 -2886476 -4526206 -3431338 -966008 528549 123048 -1121329 -1868006 -1735039
6481 -1735039 -742704 1141411 3324807 4446524 3620338 1300049 -1413498 -3744597 -5354834
6472 -5354834 -6181182 -6374940 -5873670 -4179068 -1353795 1101640 1719194 1366868 2364082
6463 2364082 4814343 5755599 3331649 189836 425140 3721449 5220788 1986548 -2822460
6454 -2822460 -4282645 -2593807 -2387086 -5215154 -6651249 -3069277 1957280 2140269 -2232314
6445 -2232314 -4484398 -1284527 2896644 3025800 651771 435527 2968147 5148706 5523956
6436 5523956 5119888 4323080 2896895 2272283 4084223 6933544 8056024 7611150 7690893
6427 7690893 7668495 4750047 -709438 -4651141 -4867847 -3373626 -2373121 -1590605 -719740
6418 -719740 -761536 -1236946 573507 5527051 10313655 11100197 7596800 2488277 -1233161
6409 -1233161 -2090977 -1693874 -4127405 -10504188 -14979793 -11116395 -1868485 3243649 1818561
6400 1818561 1631389 7006547 10638562 5212267 -3976684 -6468156 -1817593 2061936
6392 2061936 2831066 5742034 11879623 14354863 9053872 1397159 -1572977 -77973
6384 -77973 1432330 1595629 2057570 3109228 3492007 3071782 2838315 3252378 4388123
6375 4388123 6449906 8745967 9620890 8743528 8014527 8925429 10376921 10388218 8856528
6366 8856528 7448885 7482093 8664088 9415553 8256119 5484680 3158633 2485544 1926395
6357 1926395 -678109 -4722400 -7213334 -6058215 -1658843 3728562 6774421 5083960
6349 5083960 722328 -496235 3469607 6485987 2056643 -6413820 -9403451 -4808279
6341 -4808279 -571433 -2319870 -5477455 -3311918 3008912 7338672 7575674 6712482 7119808
6332 7119808 8060154 7762280 5165474 873681 -1966619 -88924 4960791 7437961 4916903
6323 4916903 1552010 1481430 3299714 4341544 5713623 8476962 9321804 5850497 2389071
6314 2389071 3911651 7271143 5944952 1230996 229605 3549261 4244009 91426
6306 91426 -2273295 1373461 5802520 5365964 3016678 4193124 6999905 5364455 -1053787
6297 -1053787 -6411934 -6630112 -2772637 2186932 5463425 4628743 269424 -2382750 1039314
6288 1039314 7372038 9192708 4627556 -728888 -2244216 -1747653 -2718867 -4321993 -3619267
6279 -3619267 -1053513 151132 -750901 -710955 2593137 7213634 9263036 7684342 5119444
6270 5119444 4115588 4122861 3328403 2168072 2745088 4926240 5771120 3969015 2294018
6261 2294018 3480411 5604967 4534918 136718 -2916719 -713662 5618161 11340699
6253 11340699 12248336 7775579 1689940 -907331 985855 2998718 1716871 166215
6245 166215 2932494 7536521 6810409 192382 -4244236 -1635555 2461720 1371177 -2016592
6236 -2016592 -584227 4923460 7082113 3556287 -134254 11378 1518602 1522245 1304701
6227 1304701 1982294 1254282 -2013538 -4542151 -3764196 -2310181 -3409618 -5270395 -4455012
6218 -4455012 -2024464 -1471012 -2494593 -1854357 632190 1864487 1009743 680314 2107756
6209 2107756 3269109 2720502 1620468 813402 -636181 -2492123 -2152181 1460499 5267328
6200 5267328 5642927 3023040 782060 705981 1674103 2229750 2490003 3268983 4502016
6191 4502016 5142549 4442963 3129989 3010824 5073787 8125067 9617883 7703838 2579655
6182 2579655 -3353191 -6566593 -5061397 -672395 2567032 3003394 2633469 3188007 3603334
6173 3603334 2930425 2670574 3524560 2789473 -1328018 -5364739 -4961078 -1479042 615647
6164 615647 1074691 2790858 4796182 3204006 -977607 -2258703 49729 410548 -2937294
6155 -2937294 -4209345 34187 4490184 3666735 498858 426277 2247657 1708435 114621
6146 114621 2052963 6880893 9188425 6569645 1639930 -2284419 -3026581 523756 5442150
6137 5442150 4702939 -4099991 -12833687 -12256752 -4776553 -256800 -1240703 -1258840 2735966
6128 2735966 5853835 4712453 2473433 1591144 -421876 -4366034 -5935559 -3395734
6120 -3395734 -2038853 -5764427 -9864191 -7966626 -1690527 2579378 3123509 3020286 3083303
6111 3083303 823471 -3801289 -6539330 -4008873 1756594 4971283 1934964 -4488279
6103 -4488279 -6940331 -1941083 5039273 6351651 2656748 1054660 3152396 2642612
6095 2642612 -3212271 -7884770 -5876321 -1303121 -132935 -416839 2262172 5005533
6087 5005533 1948535 -5154922 -9375366 -9292638 -8862817 -8582300 -5721449 -2391602 -4041079
6078 -4041079 -9483222 -11394131 -7931855 -5007032 -5234373 -4007902 259636 1526479
6070 1526479 -3134035 -6842107 -3585737 1870734 2453570 779860 3655540 9246146
6062 9246146 9836932 5095284 2329563 3580327 2429708 -3970781 -8564127 -4635921
6054 -4635921 4149038 9215117 7982759 4125989 466351 -2718581 -4199634 -2265921
6046 -2265921 1358593 2568521 563772 -990465 709316 4174162 6443632 6428319 4286272
6037 4286272 487240 -2718497 -1891629 2809920 5904879 3114016 -2207816 -3331275
6029 -3331275 155752 1875006 -1669202 -6128608 -6243143 -3298820 -2187282 -4184792
6021 -4184792 -6536414 -7149313 -5976611 -3297042 -219958 498624 -2106048 -4265842 -2163162
6012 -2163162 1525948 702310 -4894201 -9064623 -8625632 -7658917 -9949865 -12696490 -11694060
6003 -11694060 -8466242 -7321122 -8061270 -6722839 -2269003 2102864 3985840 4106649
5995 4106649 3525528 2031311 -41511 -1272069 -1284827 -1341589 -2326170 -3938652 -5924444
5986 -5924444 -8050749 -8862989 -6813408 -2970418 -376491 -309716 -1393021 -2647164 -4578487
5977 -4578487 -6389272 -5312688 -734795 3605041 4070894 1856027 574177 831236 467550
5968 467550 -867952 -1256387 -709584 -1954010 -5702833 -8444010 -7130811 -3659805 -2157122
5959 -2157122 -3499978 -5133985 -5100139 -3515520 -922311 1833282 2444058 -831299 -5515702
5950 -5515702 -6445984 -2095224 3393468 5790390 5499331 4851456 3763745 1183184 -1397301
5941 -1397301 -1642183 -472422 -780217 -2560616 -3024419 -1580770 -805203 -1540772 -841986
5932 -841986 3172366 7411348 7490444 3631602 377945 1172694 5038255 8203234 7811752
5923 7811752 4411349 1366859 1154798 2271346 1393002 -1405532 -2301705 409700 3208476
5914 3208476 2395633 -455595 -1328368 -24675 389541 -585768 -15889 3136047 5896530
5905 5896530 5940074 4981720 5478319 6668648 6439829 5194603 5004038 5909680 5861924 4209287
5895 4209287 2832419 3247228 4346586 3921212 1412794 -1611321 -3176998 -2610792 -889378
5886 -889378 420208 710267 737423 1317785 2147933 2481311 2283455 1720887 264415 -2109779
5876 -2109779 -3455460 -1935951 721395 856220 -1283550 -948948 3703379 7370227 4777439
5867 4777439 -830453 -1975968 1652753 2762586 -1822983 -5852242 -3137168 3462871
5859 3462871 7140451 6783714 6112598 6265121 5149586 2761549 1713278 2800457 4394002
5850 4394002 5769827 7059972 6781184 3760308 695078 1198776 4118841 5716580 6360292
5841 6360292 8893930 10968879 6608444 -3353526 -10080910 -8724368 -4489220 -3263754
5833 -3263754 -3348244 -1318007 553725 -1091021 -4023611 -4880885 -5734972 -9468065 -12733337
5824 -12733337 -11004857 -7332735 -7997845 -11718597 -11659703 -7097131 -4384707 -5961851 -6821749
5815 -6821749 -3656120 87652 945960 670101 1632039 2613440 2321914 2132357 2235141
5806 2235141 -224380 -5776600 -9692879 -8198684 -4185705 -3030952 -5465695 -7993960
5798 -7993960 -8050440 -5539151 -1197919 3531903 6358611 6298001 4958792 4146271 3595882
5789 3595882 2296710 374032 -1420815 -2411097 -1642524 1107505 3897918 4905649 5783523
5780 5783523 8875980 11431145 8221488 1041290 -971781 6212598 14690214 14907047
5772 14907047 7807300 1316827 -1037381 -1604182 -1652145 92163 2876743 3927046 3091998
5763 3091998 2767349 3330828 2979378 1796123 1619771 2052261 1020939 -593420 559924
5754 559924 4465438 6656025 4308595 -139122 -2913965 -3320158 -2624793 -1247478 925222
5745 925222 3041933 3776919 2728624 847295 12301 1654170 4618768 5233159 1257987
5736 1257987 -4843849 -8370099 -7468772 -4087311 -932277 339342 -1015304 -4043390
$$ [...]
##END NTUPLES=NMR SPECTRUM
##END=
