##TITLE=31Pdec_SR69+TFAA(2)R
 CDCl3, 124 sc
 1.6.2022
##JCAMPDX= 6.0         $$ Bruker NMR JCAMP-DX V2.0
##DATA TYPE= NMR SPECTRUM
##DATA CLASS= NTUPLES
##ORIGIN= UXNMR, Bruker Analytische Messtechnik GmbH
##OWNER= root
$$ XWIN-NMR		Version 3.5
$$ Wed Jun  1 13:48:45 2022 Russian Standard Time (UT+4h)  she@DPX200
##.OBSERVE FREQUENCY= 81.013821
##.OBSERVE NUCLEUS= ^31P
##.ACQUISITION MODE= SIMULTANEOUS
##.ACQUISITION SCHEME= undefined
##.AVERAGES= 24
##.DIGITISER RES= 16
##SPECTROMETER/DATA SYSTEM= spect
##.PULSE SEQUENCE= zgpg30
##.SOLVENT NAME= DMSO
##.SHIFT REFERENCE= (INTERNAL, DMSO, 0, 248.564)
##AUDIT TRAIL= $$ (NUMBER, WHEN, WHO, WHERE, WHAT)
$$ ##TITLE= Audit trail, XWIN-NMR		Version 3.5
$$ ##JCAMPDX= 5.01
$$ ##ORIGIN= Bruker BioSpin GmbH
$$ ##OWNER= she
$$ F:/spectra/data/she/nmr/P31/1/pdata/1/auditp.txt
$$ ##AUDIT TRAIL=  $$ (NUMBER, WHEN, WHO, WHERE, WHAT)
(   1,<2022-06-01 13:46:58.85 +0400>,<she>,<DPX200>,
      <created by zg, POWCHK disabled, PULCHK disabled
       configuration hash MD5:
       00 E9 B6 7A A2 85 ED C7 34 08 36 98 17 FE 4E 26
       data hash MD5: 32K
       02 8A 22 8F A0 ED 5E CD 5F 4F 93 36 A5 F6 AC 12>)
(   2,<2022-06-01 13:47:15.18 +0400>,<she>,<DPX200>,
      <Start of raw data processing
       efp BC_mod = 2 LB = 1 FT_mod = 6 PKNL = 1 PHC0 = -10226.79 PHC1 = 450.0538 SI = 64K 
       data hash MD5: 64K
       22 A6 61 FE 9C 79 FA A0 05 89 04 BC D6 FA 2C F6>)
(   3,<2022-06-01 13:47:42.78 +0400>,<she>,<DPX200>,
      <pk PHC0 = -165.9458 PHC1 = 0 
       data hash MD5: 64K
       91 F4 94 59 B9 C5 D8 AB D7 24 89 21 6C 38 18 BA>)
(   4,<2022-06-01 13:47:46.78 +0400>,<she>,<DPX200>,
      <abs ABSG = 5 
       data hash MD5: 64K
       7E 71 59 04 3B EF 07 D4 58 0C EC 91 41 11 8C 06>)
(   5,<2022-06-01 13:48:12.43 +0400>,<she>,<DPX200>,
      <pk PHC0 = 239.7321 PHC1 = -631.1999 
       data hash MD5: 64K
       4E B5 90 59 C7 AC AF 09 80 9A CF 1C 78 2E 4E 15>)
$$ ##END=
$$ 
$$ hash MD5
$$ A7 FD DE 05 15 87 1F B0 10 2F 9F FE 61 92 9C B7
##$RELAX= 
##$RELAX= 
##$RELAX= 
##$RELAX= 
##$RELAX= 
##$RELAX= 
##$RELAX= 
##$RELAX= 
$$ Bruker specific parameters
$$ --------------------------
##$DU= <F:/spectra>
##$EXPNO= 1
##$NAME= <P31>
##$PROCNO= 1
##$TYPE= <nmr>
##$USER= <she>
##$AMP= (0..31)
100 100 100 100 100 100 100 100 100 100 100 100 100 100 100 100 100 100 
100 100 100 100 100 100 100 100 100 100 100 100 100 100 
##$AQSEQ= 0
##$AQ_mod= 1
##$AUNM= <au_zg>
##$AUTOPOS= <>
##$BF1= 81.014009
##$BF2= 200.13
##$BF3= 200.13
##$BF4= 200.13
##$BF5= 200.13
##$BF6= 200.13
##$BF7= 200.13
##$BF8= 200.13
##$BYTORDA= 1
##$CFDGTYP= 0
##$CFRGTYP= 5
##$CHEMSTR= <none>
##$CNST= (0..31)
1 1 145 1 1 1 1 1 1 1 1 1 1 1 1 1 1 1 1 1 1 1 1 1 1 1 1 1 1 1 1 1 
##$CPDPRG= <waltz16>
##$CPDPRG1= <>
##$CPDPRG2= <waltz16>
##$CPDPRG3= <>
##$CPDPRG4= <mlev>
##$CPDPRG5= <mlev>
##$CPDPRG6= <mlev>
##$CPDPRG7= <mlev>
##$CPDPRG8= <mlev>
##$CPDPRGB= <>
##$CPDPRGT= <>
##$D= (0..31)
$$ [...]
##$SUBNAM3= <"">
##$SUBNAM4= <"">
##$SUBNAM5= <"">
##$SUBNAM6= <"">
##$SUBNAM7= <"">
##$SUBNAM8= <"">
##$SUBNAM9= <"">
##$SW= 501.771253377433
##$SWIBOX= (0..15)
0 1 3 0 0 0 0 0 0 0 0 0 0 0 0 0 
##$SW_h= 40650.406504065
##$TD= 32768
##$TD0= 1
##$TE= 0
##$TE2= 300
##$TE3= 300
##$TEG= 300
##$TL= (0..7)
0 120 53 12 22 120 120 120 
##$TP= (0..7)
150 150 150 150 150 150 150 150 
##$TP07= 0
##$TPNAME0= <>
##$TPNAME1= <>
##$TPNAME2= <>
##$TPNAME3= <>
##$TPNAME4= <>
##$TPNAME5= <>
##$TPNAME6= <>
##$TPNAME7= <>
##$TPOAL= (0..7)
0.5 0.5 0.5 0.5 0.5 0.5 0.5 0.5 
##$TPOFFS= (0..7)
0 0 0 0 0 0 0 0 
##$TUNHIN= 0
##$TUNHOUT= 0
##$TUNXOUT= 0
##$USERA1= <user>
##$USERA2= <user>
##$USERA3= <user>
##$USERA4= <user>
##$USERA5= <user>
##$V9= 5
##$VALIST= <valist>
##$VCLIST= <CCCCCCCCCCCCCCC>
##$VD= 0
##$VDLIST= <DDDDDDDDDDDDDDD>
##$VPLIST= <PPPPPPPPPPPPPPP>
##$VTLIST= <TTTTTTTTTTTTTTT>
##$WBST= 1024
##$WBSW= 4
##$XGAIN= (0..3)
0 0 0 0 
##$XL= 0
##$YL= 0
##$YMAX_a= 4281
##$YMIN_a= -4949
##$ZGOPTNS= <>
##$ZL1= 120
##$ZL2= 120
##$ZL3= 120
##$ZL4= 120
##$ABSF1= 248.5645
##$ABSF2= -253.2056
##$ABSG= 5
##$ABSL= 3
##$ALPHA= 0
##$AQORDER= 0
##$ASSFAC= 0
##$ASSFACI= 0
##$ASSFACX= 0
##$ASSWID= 0
##$AUNMP= <proc_1d>
##$AZFE= 0.1
##$AZFW= 0.5
##$BCFW= 0
##$BC_mod= 2
##$BYTORDP= 0
##$COROFFS= 0
##$CY= -3
##$DATMOD= 1
##$DC= 0
##$DFILT= <>
##$DTYPP= 0
##$F1P= 0
##$F2P= 0
##$FCOR= 1
##$FTSIZE= 65536
##$FT_mod= 6
##$GAMMA= 0
##$GB= 0
##$INTBC= 1
##$INTSCL= 5.30512e-09
##$ISEN= 30
##$LB= 1
##$LEV0= 0
##$LPBIN= 0
##$MAXI= 10000
##$MC2= 0
##$MEAN= 0
##$ME_mod= 0
##$MI= 50
##$NCOEF= 0
##$NC_proc= -8
##$NLEV= 6
##$NOISF1= 182.463
##$NOISF2= 159.3651
##$NSP= 0
##$NTH_PI= 0
##$NZP= 0
##$OFFSET= 248.5645
##$PC= 4
##$PHC0= -10153.01
##$PHC1= -181.1461
##$PH_mod= 1
##$PKNL= yes
##$PPARMOD= 0
##$PSCAL= 0
##$PSIGN= 0
##$REVERSE= no
##$SF= 81.014009
##$SI= 65536
##$SIGF1= 159.3651
##$SIGF2= -187.1042
##$SINO= 113.3802
##$SIOLD= 16384
##$SREGLST= <1H.CDCl3>
##$SSB= 0
##$STSI= 65536
##$STSR= 0
##$SW_p= 40650.406504065
##$SYMM= 0
##$S_DEV= 0
##$TDeff= 32768
##$TDoff= 0
##$TI= <>
##$TILT= no
##$TM1= 0
##$TM2= 0
##$TOPLEV= 0
##$USERP1= <user>
##$USERP2= <user>
##$USERP3= <user>
##$USERP4= <user>
##$USERP5= <user>
##$WDW= 1
##$XDIM= 65536
##$YMAX_p= 489149836
##$YMIN_p= -118716259
$$ End of Bruker specific parameters
$$ ---------------------------------
##NTUPLES= NMR SPECTRUM
##VAR_NAME=  FREQUENCY,     SPECTRUM/REAL,   SPECTRUM/IMAG
##SYMBOL=    X,             R,               I
##VAR_TYPE=  INDEPENDENT,   DEPENDENT,       DEPENDENT
##VAR_FORM=  AFFN,          ASDF,            ASDF
##VAR_DIM=   65536,         65536,           65536
##UNITS=     HZ,            ARBITRARY UNITS, ARBITRARY UNITS
##FACTOR=    0.620285442955139, 1,           1
##FIRST=     20137.2065510759, 0,            0
##LAST=      -20513.1999529892, 0,           0
##MIN=       -20513.1999529892, -118716259,  0
##MAX=       20137.2065510759, 489149836,    0
$$ Real data points
##PAGE= N=1
##DATA TABLE= (X++(R..R)), XYDATA
$$ [...]
43508b274755J846212k220742j597626J927987K787360M64375j233313j021100
43500a321602o43256o07925n10335j537292l874139m146221m11234L322390L073300
43491f656314J785790L556652M834407J38469o230256m752948L563263P145873
43483C384936J434937m331963k045113L368050L176915j750158m131176j709490
43475b603062J540960K533523J519120m98007k197813j667499O67054J036408
43467C30684k347046n388480l216351K757704O435614M380884j202935n491158
43459c741084m851455N98480O153833O189924O60966m226288l746506m08720M55622
43450b915228j849157l557861k235137Q26017L078816L177606J592196K32788
$$ plain form
43508 -2274755 -428543 -2649285 -4246911 -2318924 468436 932811 -300502 -1321602
43500 -1321602 -1964858 -2572783 -3083118 -4620410 -8494549 -12640770 -13052004 -9729614 -6656314
43491 -6656314 -4870524 -1313872 3520535 3659004 -2571252 -7324200 -3760937 3384936
43483 3384936 4819873 487910 -1557203 1810847 4987762 3237604 -893572 -2603062
43475 -2603062 -1062102 1471421 2990541 2492534 294721 -1372778 -705724 330684
43467 330684 -2016362 -7404842 -10621193 -7863489 -1427875 2953009 1750074 -3741084
43459 -3741084 -8592539 -7994059 -1840226 4349698 5010664 784376 -2962130 -3370850 -2915228
43450 -2915228 -4764385 -8322246 -10557383 -9731366 -6652550 -3474944 -1882748 -1649960
43442a649960N44571J393518O78541p71802r5451K122939J583649k504449m586337
43433c284781p50226M482641M195914q51913l589955q47097L017479K982210l89494
43424D964778k885799k131581L28852J309144m16180k736425k857357r87507K86880
43415e125195J69373M97134J890745K343410R93752j01604J11462n08159l010871
43406b739953m314919j770868K099284L069844J204670j18663O78022K462183
43398E69600L836194L593697P42209l125512l948096p82445J567072p66662m372266
43389b686209l581749O35277K263991o01865l650280l103749J97411L601339N454046
43380a471788M882027K152757p26280k295062l433736m369389k437397L236630
$$ plain form
43442 -1649960 -1105389 288129 966670 194868 99417 2222356 3806005 1301556 -3284781
43433 -3284781 -4035007 447634 4643548 3791635 201680 -645417 2372062 5354272 4964778
43424 4964778 2078979 -52602 276250 1585394 1169214 -1567211 -4424568 -5412075 -5125195
43415 -5125195 -4955822 -4458688 -2567943 -224533 769219 667615 779077 270918 -2739953
43406 -2739953 -7054872 -8825740 -6726456 -3656612 -2451942 -2570605 -1892583 569600
43398 569600 4405794 7999491 8741700 5616188 1668092 885647 2452719 1686057 -2686209
43389 -2686209 -6267958 -5632681 -3368690 -3970555 -7620835 -10724584 -10527173 -6925834 -1471788
43380 -1471788 3410239 5562996 4836716 2541654 -892082 -5261471 -7698868 -4462238
43372d462238P525278N084540j539330n288307m502306l166095k525347J29342
43364h744463M209463N078765K136588M65797K021122K054227k344038o497767
43356a620306n276150p53671J918437K055251K088927K093568O01107j281994
43348a74831j029752J135403K524544J567948j067705l619952l841158m22398
43340d927901M487646O335942L431046j005171l318097l169634j558411J232858
43332A508278L632827K600712j626663m149981k039626J094106Q36717j248083
43324F08287j153002L47859m08573k797836k661626K92727J697606j54609j509700
43315e738867M76126K940526J715474k298616m192643j378954L369259N141302
$$ plain form
43372 -4462238 3063040 8147580 6608250 1319943 -3182363 -6348458 -8873805 -8744463
43364 -8744463 -4535000 543765 2680353 3146150 5167272 7221499 4877461 -1620306
43356 -1620306 -6896456 -7650127 -5731690 -3676439 -1587512 506056 1107163 -174831
43348 -174831 -1204583 -69180 2455364 4023312 2955607 -664345 -4505503 -4927901
43340 -4927901 -440255 5895687 9326733 8321562 5003465 1833831 275420 1508278
43332 1508278 5141105 7741817 6115154 1965173 -74453 1019653 1856370 608287
43324 608287 -544715 -196856 -605429 -3403265 -6064891 -5772164 -4074558 -4229167 -5738867
43315 -5738867 -5262741 -2322215 -606741 -2905357 -7098000 -8476954 -5107695 33607
43307C3607K078908k853130n116037l408386n63683M34086j03529k0493J252474
43298h266183K305100J868948r5527k540696l325019m72796M748536P437077M297075
43289E956515j510627l569203k11364L436285K178967k822453n962244m228488
43281f732612l49962J261891J68225j30016K206777M055380J535168l945245o852127
43272h782521m439421O22480M605094O041298M113679j609357p669528p661788
43264a4780064m84945O160860N127515m83511k356289Q55389L017055J223573
43256a720417l26955J488528L388562J757944j180513j417737K95939L81401j460110
43247A206642k452558j785306j221628r44433J143542M970480O528946K800392
$$ plain form
43307 33607 2112515 -740615 -5856652 -9265038 -9828721 -9394635 -9498164 -9518657 -8266183
43298 -8266183 -5961083 -4092135 -4187662 -6728358 -10053377 -10526173 -5777637 1659440 5956515
43289 5956515 4445888 876685 665321 4101606 6280573 3458120 -2504124 -6732612
43281 -6732612 -7082574 -5820683 -5652458 -5782474 -3575697 479683 2014851 -1930394 -8782521
43272 -8782521 -13221942 -12599462 -7994368 -1953070 2160609 551252 -7118276 -14780064
43264 -14780064 -15265009 -9104149 -3976634 -4460145 -6816434 -5961045 -2943990 -1720417
43256 -1720417 -2047372 -558844 2829718 4587662 3407149 1989412 2285351 2666752 1206642
43247 1206642 -1245916 -3031222 -4252850 -5197283 -4053741 916739 7445685 10246077
43239A0246077l416136o135605l235000J225373K186420n11607k597926r29695
43231c168099K878767M525101J788458l155291n851552l965584L33485K872205
43223c742510K360644J282298J275062K89308l097819n178572j704019M163782
43215d351826M590101j323556n134102j231632M732708M537479o09070l306902
43207b096800j719213n79707j937440k492339n70327J057177Q03306P69482J685727
43198e080134Q77552k172761l323458j01924L727835L555891M67275j263256m29984
43189c742964R66746J601484J355568k33212k775403l784501j666006J415344
43181f862944K451971J803351J535061J321240l48510k187038j471315J086776
$$ plain form
43239 10246077 6829941 694336 -2540664 -1315291 871129 359522 -2238404 -3168099
43231 -3168099 -289332 4235769 6024227 2868936 -2982616 -6948200 -6614715 -3742510
43223 -3742510 -1381866 -99568 1175494 1464802 -1633017 -6811589 -8515608 -4351826
43215 -4351826 238275 -1085281 -6219383 -7451015 -2718307 1819172 1210102 -2096800
43207 -2096800 -3816013 -4395720 -6333160 -8825499 -9395826 -8338649 -7535343 -6765861 -5080134
43198 -5080134 -4202582 -6375343 -9698801 -9800725 -6072890 -2516999 -2049724 -3312980 -3742964
43189 -3742964 -2776218 -1174734 180834 -52378 -2827781 -6612282 -8278288 -6862944
43181 -6862944 -4410973 -2607622 -1072561 248679 -99831 -2286869 -3758184 -2671408
43173b671408J883719p0744k055082k385454k252457k019507P176L399539M395018
43164a769200J494311j516161j420179p70779k829090m650974j437610L991565
43156h908117L670379k800292n829712L43585Q268665P583019k90172n067681
43148c030326k431139K054852L243165K578415K324368Q45879k839682n326205
43140b580673l748285m44100J031533J027799J373251J319525j98176j392958
43132c612084p33554k35558j541927j927254J027249L958934K610968n22723K9246
43123i46703L286282L472889J38879j335145K43493l44449m774992o951736k667534
43114i879016L206063M134709J225830k11719P27258R64738l69603j495100j942449
$$ plain form
43173 -2671408 -787689 -858433 -2913515 -5298969 -7551426 -9570933 -9563757 -6164218 -1769200
43164 -1769200 -274889 -1791050 -3211229 -3982008 -6811098 -11462072 -12899682 -8908117
43156 -8908117 -5237738 -8038030 -13867742 -13524157 -5255492 2327527 2037355 -3030326
43148 -3030326 -5461465 -3406613 -163448 2414967 4739335 5585214 2745532 -2580673
43140 -2580673 -6328958 -6773058 -5741525 -4713726 -3340475 -2020950 -2219126 -3612084
43132 -3612084 -4345638 -4581196 -6123123 -8050377 -7023128 -3064194 -453226 -975949 -946703
43123 -946703 2339579 5812468 5951347 4616202 4859695 4515246 -259746 -7211482 -9879016
43114 -9879016 -6672953 -2538244 -1312414 -1524133 -796875 167863 -201740 -1696840 -3639289
43105c639289k277546j273943K148246N081611L221117k617430o395758m105131
43097i858123J647212N256194M306154J039274j150557j351912j036178j066335
43089b214271m22761J202875J496533j249328m363275l806788l11753J655146
43081h013622R51968Q60440K382565K052485j385557l647031j668261J247525
43073g219488J181142J1644J233634L269510K517484R2223l44570O42428l46868
43064A037139k702704k449545N09708J577052j250870m132478k964171J307217
43056i068652M425520L614112p3018k662035q96659L678245N674478K423927k795559
43047D320359n944947o967778o458843k485025M245038P010310K055333l264959
$$ plain form
43105 -3639289 -5916835 -7190778 -5042532 39079 3260196 642766 -5752992 -9858123
43097 -9858123 -8210911 -2954717 1351437 2390711 1240154 -111758 -1147936 -2214271
43089 -2214271 -2637032 -1434157 62376 -1186952 -5550227 -9357015 -9668768 -8013622
43081 -8013622 -7061654 -6201214 -3818649 -1766164 -3151721 -6798752 -8467013 -7219488
43073 -7219488 -6038346 -6026702 -4793068 -1523558 993926 1086149 741579 1384007 1037139
43064 1037139 -1665565 -4115110 -3605402 -2028350 -3279220 -7411698 -10375869 -9068652
43056 -9068652 -4643132 -1029020 -1102038 -3764073 -4660732 -982487 4691991 7115918 4320359
43047 4320359 -1624588 -8592366 -15051209 -17536234 -13291196 -6280886 -4225553 -7490512
43039g490512k52757O479653N131311l881465p527767r44522M936219J878025
43031a671815k549820O69922N660434J949448o524859o795166K205790Q088871
43023A032805M451585j045843q96235J446824L20476j904287m74890K391382J498000
43014F819817k073737l104374j249369q03236k442612k176123Q38493J956717
43006b234424j164633l937941j672865K991802L908320K20110l177729k800980
42998g868340J7509K491708L238859J715448j427111l081134o32979L253358L070564
42989G77882j274366l551454o01107K761468J793558n74931M83203K847694J270184
42980C932131k951332l825164q52689N42039j201776j532990J265868K702723
$$ plain form
43039 -7490512 -7743269 -1263616 3867695 -13770 -7541537 -8486059 -3549840 -1671815
43031 -1671815 -4221635 -3551713 2108721 4058169 -2466690 -9261856 -7056066 1032805
43023 1032805 5484390 4438547 3542312 4989136 5309612 3405325 2930435 5321817 6819817
43014 6819817 4746080 1641706 392337 -410899 -2853511 -5029634 -4191141 -2234424
43006 -2234424 -3399057 -7336998 -9009863 -6018061 -2109741 -1889631 -5067360 -7868340
42998 -7868340 -7850831 -5359123 -2120264 -404816 -1831927 -4913061 -5546040 -2292682 777882
42989 777882 -496484 -4047938 -4649045 -1887577 -94019 -668950 -185747 2661947 3932131
42980 3932131 980799 -2844365 -3697054 -3155015 -4356791 -5889781 -4623913 -1921190
42972a921190N46019n21727L024640O847915N189094n52219m698197n098531l290355
42963d74551j61439L529048M822219J693898l088045n267700m528908l125729
42955f601207j589529J72210K16784k168525k972363J286762O740698O683446
42947A768276J657552j594524q58198p86718l379824l782661R01279N113649K557216
42938A596047l832576n616324n90318M807504M711582O54813k282883k569342
42930c121497k536846l162825k203884J323682L764725J344309l131158k867799
42922a0591293K686394N652280J196147m044989j241318O507207P692196o42393
42914G214231q349168o817169j04404L004201J476477M83794J810571K541923
$$ plain form
42972 -1921190 -1375171 -1896898 1127742 7975657 13164751 12612532 7914335 2815804 -474551
42963 -474551 -635990 2893058 7715277 9409175 6321130 1053430 -3475478 -6601207
42955 -6601207 -8190736 -8018526 -7801742 -9970267 -12942630 -11655868 -4915170 1768276
42947 1768276 3425828 1831304 973106 186388 -3193436 -6976097 -6074818 -961169 1596047
42938 1596047 -2236529 -7852853 -8443171 -3635667 1075915 1730728 -552155 -3121497
42930 -3121497 -5658343 -8821168 -11025052 -9701370 -5936645 -4592336 -7723494 -10591293
42922 -10591293 -7904899 -2252619 -1056472 -5101461 -6342779 164428 7856624 7214231
42914 7214231 -1134937 -7952106 -8056510 -5052309 -3575832 -3092038 -1281467 1260456
42906A260456J343693J34990m8048l03124r94043j108676m50823J44723L73048
42897C52196K00751q21273k058172j509393P28008J333741r38814k067662Q85567
42888c895051L537279K40783o018589p064057k008695J636651J60802j203465
42880a4614342J915912N710783N188282K187400R91455R52303o48463k342019
42872f58689j268849O70704k36673k378773j036009L142435M243135J51075m145583
42863a517227l875943o27018R86698k85084j495195L23225M386710O398137L184184
42854G478487k660225n027599k251658O63586j3365j101599J000519K889213k97587
42845F79772n453799n527435r28363J567164L62684L79932K603754J972452k420004
$$ plain form
42906 1260456 2604149 2739139 2691091 2387967 1393924 285248 -165575 -20852 352196
42897 352196 552947 -268326 -2326498 -3835891 -3107883 -1774142 -2712956 -4780618 -3895051
42888 -3895051 -357772 -116989 -6135578 -13199635 -15208330 -13571679 -13410877 -14614342
42880 -14614342 -12698430 -6987647 -1799365 388035 1379490 2331793 1683330 -658689
42872 -658689 -1927538 -1256834 -1493507 -3872280 -4908289 -1765854 2477281 2628356 -1517227
42863 -1517227 -5393170 -6020188 -5033490 -5318574 -6813769 -6490544 -2103834 4294303 7478487
42854 7478487 4818262 -209337 -2460995 -1797409 -1810774 -2912373 -1911854 977359 679772
42845 679772 -4774027 -10301462 -11229825 -9662661 -9299977 -8920045 -6316291 -4343839 -6763843
42836f763843m545368j877532O65590Q23635L178911Q253510P836854j342882
42828F228875q894296n267148L041168L698999k424410m528346R4126L942166
42820d108866L283059K013585J667820r75927n026677m679901M92753L734082
42812c600072K008531R4048J298668K586071J842098J611093K172972o91631o664844
42803F56934p836797m84132P148449N638366k384224o743648l642031J665609
42795e981474L775566K545940M17669q89861q71506k07209q6016m15835p2693
42786a785419M92611n90499l075622m183079k604672J25944K693326M788539M807231
42777F68360J529843j618934J75666M646601L979458l075594p937271m752178
$$ plain form
42836 -6763843 -11309211 -13186743 -12521153 -11697518 -8518607 -265097 7571757 6228875
42828 6228875 -2665421 -7932569 -4891401 -1192402 -3616812 -8145158 -8051032 -4108866
42820 -4108866 -825807 1187778 2855598 1879671 -3147006 -7826907 -7334154 -3600072
42812 -3600072 -1591541 -1497493 -198825 2387246 4229344 5840437 8013409 7321778 656934
42803 656934 -7179863 -7663995 -515546 5122820 2738596 -4005052 -7647083 -5981474
42795 -5981474 -2205908 340032 757701 -132160 -1003666 -1210875 -1296891 -1712726 -1785419
42786 -1785419 -1292808 -1883307 -4958929 -9142008 -11746680 -11620736 -8927410 -4138871 668360
42777 668360 2198203 579269 754935 5401536 9380994 6305400 -1631871 -6384049
42769f384049Q38815P66811l585466m830412o97168M348452N896701L220740j519905
42760a945481m169623j533757L836353N542221K197871p62171m79799r58387m159063
42751b431836m767458J91510M241704J632110k435087q14789K651736p7715o248879
42742h058704o016925J163141N702500L216790l15225j8755J168928k09857k331306
42733e699413k474968r36851J331445L589577L350723o05824l596561k73727N773450
42724D57851N583228j458685o045094k980466J796249J594829j484768k091770
42716d628626l38185L58174k97769j00006J423615K943475L327052J667394k075898
42707B279226n115663l738992J386411M990729L683586k31202k442293j406248
$$ plain form
42769 -6384049 -5545234 -4778423 -8363889 -13194301 -13891469 -9543017 -3646316 -425576 -1945481
42760 -1945481 -6115104 -7648861 -3812508 1729713 3927584 3165413 2685614 1727227 -2431836
42751 -2431836 -7199294 -7007784 -2766080 -1133970 -3569057 -4383846 -1732110 -1809825 -8058704
42742 -8058704 -14075629 -12912488 -7209988 -3993198 -4308423 -4327178 -3158250 -3368107 -5699413
42733 -5699413 -8174381 -9111232 -7779787 -4190210 -839487 -1445311 -5041872 -5315599 457851
42724 457851 6041079 4582394 -1462700 -4443166 -2646917 -1052088 -2536856 -4628626
42716 -4628626 -4966811 -4608637 -4906406 -5006412 -3582797 -639322 2687730 4355124 2279226
42707 2279226 -2836437 -6575429 -5189018 -198289 3485297 3254095 811802 -594446
42699e94446J160050K076042q35512n562857o412081r16788N603426O419231K131900
42690C068965j695148k953125l161666k024461J059634K470318o23931k995483
42682f854897J648228Q262611O002738m231035r770119n176654R65443J364996
42674g788689j50027R66394J491533j047983j806978K016505M468861J113700
42666g36684k498892n38674K870679J425671k507958l228207j432150m65858Q90992
42657f221081L762596L636066j980589o504734l783680J344983J330898j324447
42649i739988q843K860914M20777m916888m612261J323482M640142K816343J436320
42640e780002K787535K878876N39035m83658L60954o08625l086669k349796J662106
$$ plain form
42699 -594446 565604 2641646 1806134 -3756723 -10168804 -11085592 -5482166 937065 3068965
42690 3068965 1373817 -1579308 -4740974 -6765435 -5705801 -3235483 -3859414 -6854897
42682 -6854897 -5206669 3055942 9058680 4827645 -4942474 -10119128 -9153685 -7788689
42674 -7788689 -7938716 -6972322 -5480789 -6528772 -8335750 -6319245 -1850384 -736684
42666 -736684 -3235576 -3774250 -903571 522100 -1985858 -5214065 -6646215 -7112073 -6221081
42657 -6221081 -2458485 1177581 -803008 -7307742 -11091422 -9746439 -8415541 -9739988
42649 -9739988 -9748831 -6887917 -6467140 -11384028 -15996289 -14672807 -10032665 -7216322 -5780002
42640 -5780002 -2992467 -113591 425444 -58214 302740 -305885 -3392554 -5742350 -4080244
42631d080244L334094R36732r14151R3609P31798o55209j311796p8791P63246
42622a180712Q68503K003950K306442j694043o671937n125604K089973N443032
42614a960396J529206j779508J022535M307928K002709k121058k134962k15079
42606F51375j075149k421387K95953M262218L375984j050932k364273K29256R17757
42597B820802k245747l904993k96449M599784M900290P87002k642229k371868
42589A646592l95406r3508j799997k971858k094079p36024q58091j659449j104141
42580a0065961O13456J852879K881017M966385O507672M284567q05513l619356
42572F615146j911839M92146j83438k233341k007859L66555K098059K158869J375762
$$ plain form
42631 -4080244 -746150 190582 -723569 -629960 101838 -553371 -1865167 -1943958 -1180712
42622 -1180712 -312209 1691741 3998183 2304140 -4367797 -9493401 -7403428 -1960396
42614 -1960396 -431190 -2210698 -1188163 3119765 5122474 3001416 866454 651375
42606 651375 -423774 -2845161 -2549208 1713010 5088994 4038062 1673789 1903045 2820802
42597 2820802 575055 -3329938 -3626387 973397 5873687 6660689 4018460 1646592
42589 1646592 1251186 1157678 -642319 -3614177 -5708256 -6444280 -7302371 -8961820 -10065961
42580 -10065961 -9452505 -7599626 -4718609 247776 6755448 11040015 10234502 6615146
42572 6615146 4703307 5195453 5012015 2778674 770815 1137370 3235429 5394298 6770060
42563F770060p7997k169494l299558k025792K98923J096975K25998j29079J034898
42554A724934K069699J031418j599398l099472j497472J590693K087677j461006
42546H47073n077855l890410J185204M303105K385046j308348k344821p40112
42538d641118N50813M11247L21761J350956K418172J601363j512241m720173m781457
42529i000677r31032L670131N203385L329390O73713r08914j585052j788727j490640
42520b828423r39967l23264P22004J726780R98590j397343k383520l94786J312317
42511c507612l68509k738029j604271J078110K63731k778399j541906M785979
42503f410906Q898833N886669l77147l947555l931589k047842J108458L808442
$$ plain form
42563 6770060 6692063 4522569 1223011 -802781 -503858 593117 819115 690036 1724934
42554 1724934 3794633 4826051 3226653 127181 -1370291 220402 2308079 847073
42546 847073 -4230782 -8121192 -6935988 -2632883 -247837 -1556185 -3901006 -4641118
42538 -4641118 -4090305 -3679058 -3357297 -2006341 411831 2013194 500953 -4219220 -9000677
42529 -9000677 -9931709 -6261578 -1058193 2271197 2944910 2035996 450944 -1337783 -2828423
42520 -2828423 -3768390 -4091654 -3369650 -1642870 -644280 -2041623 -4425143 -4819929 -3507612
42511 -3507612 -3876121 -6614150 -8218421 -7140311 -6876580 -9654979 -11196885 -6410906
42503 -6410906 2487927 8374596 7997449 4049894 118305 -1929537 -821079 2987363
42495B987363K435463k963145o648004m501138M44694L105340K910941J817783
42487d10703N499k370286k921620p98978O44881q45008j868342J212396N385942
42478a966219M927269K62425k573410p09348K150986J556815k031348m477036
42470b859866k976686R59895L232085K047165K01180P16354J740903l72736l972070
42461a283776l677508P34487L491383K241978J191738K319559J347925l285871
42453C079915n517847j825503J380459j601504m757881O6303Q007885P364108
42445F195935j660585o580852j386852N576298N168810o15689m373476l535761
42437a212172m06599K578408L572421J340894k291323l340613j128321N36933
$$ plain form
42495 2987363 5422826 2459681 -4188323 -8689461 -8244767 -5139427 -2228486 -410703
42487 -410703 -405204 -2775490 -5697110 -6496088 -5851207 -6696215 -8564557 -7352161 -1966219
42478 -1966219 2961050 3223475 650065 -59283 2091703 3648518 1617170 -2859866
42470 -2859866 -5836552 -4876657 -1644572 402593 603773 1320127 3061030 2688294 -1283776
42461 -1283776 -4961284 -4226797 -735414 1506564 2698302 5017861 6365786 3079915
42453 3079915 -2437932 -4263435 -2882976 -4484480 -9242361 -9176058 -1168173 6195935
42445 6195935 4535350 -2045502 -3432354 2143944 7312754 6697065 2323589 -1212172
42437 -1212172 -1618771 959637 4532058 5872952 3581629 241016 -887305 -350372
42429c50372p80570k791242k628455p44498J007965J882691J458033m02908j795371
42420e144727m81405J796215P26145l649793n737460k034929L940726O599740
42412c985488M758169J095254j612028j674870R51765L358188K045208j685631
42404C250567k351804J611441M536439J560061l842692m773780p29943K421101
42396A681390J135920j888394k801606j644968p73409p54845k7415J955239L056319
42387f1769J077339k472950l375314n70059J476958q20243l675930q52492N760896
42378c513564P097466J91758o244567l912662L018957M387885j025461m667824
42370d668012j357265M242522N711024L139666L63599j345774l042378m490844
$$ plain form
42429 -350372 -1130942 -3922184 -6550639 -7295137 -6287172 -4404481 -2946448 -3349356 -5144727
42420 -5144727 -5626132 -3829917 -3103772 -6753565 -12491025 -14525954 -10585228 -3985488
42412 -3985488 772681 1867935 255907 -1418963 -467198 2890990 4936198 3250567
42404 3250567 898763 2510204 7046643 8606704 4764012 -9768 -739711 1681390
42396 1681390 2817310 928916 -1872690 -3517658 -4291067 -5045912 -5073327 -3118088 -61769
42387 -61769 1015570 -1457380 -4832694 -5402753 -3925795 -4746038 -8421968 -9274460 -3513564
42378 -3513564 3583902 3775660 -2468907 -6381569 -3362612 1025273 -188 -4668012
42370 -4668012 -6025277 -1782755 3928269 7067935 7431534 6085760 3043382 -1447462
42362a447462m440576l017192j137362J191615L691533M341461J732844j967376
42354a052515l018848p46708K012208K731875J270537j457408m261372n070160
42346i592391k358726K041808M016425K116729o95237j286663q4264P74335P79502
42337d288482P40360R04373J086017J167562L29588k129537m198781k510163K020160
42328f878903L833238Q23682j671082O44839L184466k63161n969925m559572M243578
42319f612840J0150930O738630q97359n220709n311532l597640o70092K385076
42311c035536K461622m46983j813999M7863Q60315j569141k678309N05565L008550
42302b660053K63948l292124j526529K657190K280190j971335l681966j547462
$$ plain form
42362 -1447462 -5888038 -8905230 -10042592 -8850977 -5159444 -817983 914861 -1052515
42354 -1052515 -4071363 -4818071 -2805863 -73988 1196549 -260859 -4522231 -9592391
42346 -9592391 -11951117 -9909309 -5892884 -3776155 -4471392 -5758055 -5842319 -5067984 -4288482
42337 -4288482 -3548122 -2643749 -1557732 -390170 -60582 -2190119 -6388900 -8899063 -6878903
42328 -6878903 -3045665 -2221983 -3893065 -3248226 -63760 -326921 -6296846 -10856418 -6612840
42319 -6612840 3538090 10276720 9379361 4158652 -1152880 -4750520 -5420612 -3035536
42311 -3035536 -573914 -1020897 -2834896 -2787033 -1926718 -3495859 -6174168 -5668603 -2660053
42302 -2660053 -2396105 -5688229 -7214758 -4557568 -2277378 -4248713 -7930679 -9478141
42294i478141L62975J081481K851974M259097J935867j685758r60736K952972
42286A319731L319864p88304l188601j465549j30795j313522j410576M42906k92439
42277c507285m067639m017710K639631Q051933M973264k101086m111869n65572
42269b706333J936471P30023p54093j70008Q78831Q59651K56573o46811k241750
42260a857446l612919k790100O04202M332713N235722J958582k926519m242269
42252c298034l7455M794427M298665o7157j800107K05168K92551l623015n874524
42243e109481k608018J489001R80645j788532j701406O89701J917889K358501
42235c771700L594310K934881k048469o474904l654264L927859P139093L331824
$$ plain form
42294 -9478141 -9115166 -8033685 -5181711 -922614 1013253 -672505 -1633241 1319731
42286 1319731 4639595 3851291 662690 -802859 -933654 -2247176 -3657752 -3214846 -3507285
42277 -3507285 -7574924 -11592634 -8953003 -901070 4072194 1971108 -2140761 -2706333
42269 -2706333 -769862 -39839 -793932 -963940 -85109 774542 1031115 384304 -1857446
42260 -1857446 -5470365 -8260465 -7656263 -3323550 1912172 3870754 944235 -3298034
42252 -3298034 -3335489 1458938 5757603 5690446 3890339 4095507 4388058 765043 -5109481
42243 -5109481 -7717499 -6228498 -5247853 -7036385 -8737791 -8048090 -6130201 -3771700
42235 -3771700 -177390 2757491 709022 -5765882 -9420146 -5492287 1646806 4978630
42227D978630r38168j036461j85164j818159l135011o19523L063070K713403j560184
42218A462433m565455l043240Q17070K706737R35569k307734l371910q53127K687201
42209e532456L179909l48262m197745l799954Q94038M662117K689890l212538
42201e665001o133910k877399J534605J256728j246476P92296O426838O897617
42193I85298l56095n826937j570674O100915N568034k762779p379619k620617
42185g862474M393548N146213L83179l625768l781881j554605N71121J012375
42177e318292j81951q27978R24239L057943J786348k264560l934309r20766K744217
42168d935109K704912J10219j165708p4726J598831K348411J524926j031032l659117
$$ plain form
42227 4978630 4040462 3004001 2818837 1000678 -2134333 -2753856 309214 3022617 1462433
42218 1462433 -3103022 -6146262 -5329192 -2622455 -1686886 -3994620 -7366530 -8219657 -5532456
42209 -5532456 -2352547 -2700809 -6898554 -10698508 -9804470 -5142353 -2452463 -5665001
42201 -5665001 -11798911 -14676310 -13141705 -11884977 -13131453 -12339157 -5912319 985298
42193 985298 629203 -5197734 -6768408 -667493 4900541 2137762 -5241857 -7862474
42185 -7862474 -3468926 1677287 2060466 -1565302 -5347183 -6901788 -6330667 -5318292
42177 -5318292 -5500243 -6328221 -5403982 -2346039 -559691 -2824251 -6758560 -7679326 -4935109
42168 -4935109 -2230197 -2119978 -3285686 -3360412 -1761581 586830 2111756 1080724 -2578393
42159b578393l368739J30998L142983K870417R97685q864j030025l281235m190332
42150g315505r62915L711382M665320J943116K05154Q63519N99257j628724k250212
42141a69608J00519J325781j057840k893147k38374L222254J705603k868708l607078
42132d480598L12422K756354J017428m42902J291844K224441j206989n150108
42124c678108l966781J053296M004321K861613N75672o06701j022360p50269O18351
42115i10966J718072O87682j575591k558347j775249l83156J348989K893308J874577
42106A319319k192982m802099k211648J843945J442747j429798M9941N062415
42098i18160N097609j876997o729445k845229L975527N144528J692871Q0873J150888
$$ plain form
42159 -2578393 -5947132 -5816134 -2673151 197266 1194951 1186087 156062 -3125173 -7315505
42150 -7315505 -8278420 -4567038 98282 2041398 2246552 3110071 3709328 2080604 -169608
42141 -169608 -69089 1256692 198852 -2694295 -2932669 289585 1995188 -873520 -4480598
42132 -4480598 -4168176 -1411822 -394394 -837296 454548 2678989 1472000 -3678108
42124 -3678108 -7644889 -6591593 -2587272 274341 850013 243312 -779048 -1529317 -910966
42115 -910966 807106 1494788 -80803 -2639150 -4414399 -4797555 -3448566 -555258 1319319
42106 1319319 -873663 -5675762 -7887410 -6043465 -4600718 -6030516 -5980575 -918160
42098 -918160 4179449 2302452 -4426993 -7272222 -3296695 1847833 3540704 3621577 4772465
42089D772465R34475j109081k008677j347845j149507j291556l97999M21323l79606
42080a556008j130428j88667q3042k897922m574586o07719N061005M749309p01354
42071a929412k965592M00865K717326K41535j533313K020223N894624L070166
42063G916422m114107o970897k477755L607353N086824K157176q66704j655872
42055B682440j925186l864058n844569l764471K338010N907188J771282n497309
42047h196673o417372O09967P341723P456177L757953J121737r71323m129697
42039E72492n170919j139939L723744L220939r32299j793447J401947K299170
42031B181688j605536m813437l013873N52336J646190J846913L906495N344010
$$ plain form
42089 4772465 5706940 4597859 2589182 1241337 91830 -1199726 -1597725 -1176402 -1556008
42080 -1556008 -2686436 -2875103 -2958145 -5856067 -10430653 -11038372 -5977367 -1228058 -1929412
42071 -1929412 -4895004 -4494139 -1776813 -1535278 -3068591 -1048368 4846256 7916422
42063 7916422 3802315 -3168582 -5646337 -2038984 3047840 5205016 4338312 2682440
42055 2682440 757254 -3106804 -8951373 -12715844 -10377834 -4470646 -2699364 -8196673
42047 -8196673 -14614045 -14004078 -6662355 793822 4551775 5673512 4702189 572492
42039 572492 -4598427 -5738366 -2014622 1206317 274018 -1519429 -117482 2181688
42031 2181688 576152 -4237285 -7251158 -6698822 -5052632 -3205719 700776 6044786
42023F044786K656445j693666k897923j850637k773821m525396k022187L775285
42015c287114N507041Q44648l590921k936153j042756k046461k426314J818013
42007g160017O349348N045912N94898m13341Q02239j547961n444008l337235L639015
41998a471150N755617P04045k573972K53667J500784l843109p727252k451171
41990i852541N353942N224190j31805n70157L833440L903643k064400n615770
41982H0542k571745J155769M90547j661969j466112m38453r81968j874234j621841
41973h889464j322031j486761m34980K063934L660439L408948K812754K102310
41965A915149P5157j784085m18426K557263J632416l704678o765230l206348K553218
$$ plain form
42023 6044786 8701231 7007565 4109642 2259005 -514816 -5040212 -7062399 -3287114
42015 -3287114 2219927 3064575 -526346 -3462499 -4505255 -6551716 -8978030 -7160017
42007 -7160017 -810669 4235243 4830141 4416800 5219039 3671078 -1772930 -5110165 -1471150
41998 -1471150 4284467 4988512 2414540 2668207 4168991 325882 -7401370 -9852541
41990 -9852541 -4498599 725591 593786 23629 3857069 7760712 5696312 80542
41982 80542 -2491203 -1335434 -844887 -2506856 -3972968 -4411421 -5393389 -7267623 -8889464
41973 -8889464 -10211495 -11698256 -12133236 -10069302 -6408863 -2999915 -187161 1915149
41965 1915149 1990306 206221 -212205 2345058 3977474 272796 -6492434 -9698782 -7145564
41956g145564M002550J234300q40350K38373K478354K718002k66043m291425m892374
41947f764177m45505M265794L509287j085518l068244j532622j698071m263182
41939a1082238k919255M036019Q314117L883136k785571k432474K739196L518993
41931C271923j155768l259525P33730M428823J830911l857939n472585j720201
41923e200631K108226J672732j170608j302140K479074N098920J848427m050636
41915A483364m776471P47458M316534J39565o280610o122119l6196L748808K000523
41906d779144k30447R62904K719850J542471o81339n56189Q20536J25809k023909
41897b099458j722074J637765L545120P27417l681921m198819o16588K091648
$$ plain form
41956 -7145564 -3143014 -1908714 -2749064 -2510691 -32337 2685665 2419622 -1871803 -6764177
41947 -6764177 -7209682 -2943888 565399 -520119 -3588363 -5120985 -6819056 -11082238
41939 -11082238 -14001493 -9965474 -1651357 2231779 -553792 -2986266 -247070 3271923
41931 3271923 2116155 -1143370 -409640 4019183 5850094 1992155 -3480430 -5200631
41923 -5200631 -3092405 -1419673 -2590281 -3892421 -1413347 3685573 5534000 1483364
41915 1483364 -3293107 -2545649 1770885 1910450 -4370160 -10492279 -10528475 -6779667 -4779144
41906 -4779144 -5009591 -4046687 -1326837 215634 -465705 -1021894 -201358 -75549 -2099458
41897 -2099458 -3821532 -2183767 1361353 2088770 -1593151 -5791970 -6408558 -4316910
41889d316910J341315J24632J048520J647564p21009l071244j214601K469005
41881b692728K079409k007256l358019Q8351K955189J551615q77927q61373p9056
41872c201795m24078L6937J914891J470734k274807l556679R26794M744819J190661
41863H27477n062562m629936J835192N243118K594149n4857R03146J924709P83024
41854D363460O38463K552304K055188k601208n749297k854678K028985K845762
41846C278979Q51343J261765L941086L911093k99473m679494n971439n002033
41838b708173l348042j056200J131259J047931j452468l107627j476397J509344
41830i460373K448747J164705j23157q67044k044725k616929k55974L764939M732509
$$ plain form
41889 -4316910 -2975595 -2850963 -1802443 -154879 -875888 -3947132 -5161733 -2692728
41881 -2692728 -613319 -2620575 -5978594 -5890243 -2935054 -1383439 -2261366 -3122739 -3201795
41872 -3201795 -3625873 -3588936 -1674045 -203311 -2478118 -6034797 -5108003 -363184 827477
41863 827477 -4235085 -8865021 -7029829 -1786711 807438 752581 1655727 3580436 4363460
41854 4363460 5001923 7554227 9609415 7008207 1258910 -1595768 433217 3278979
41846 3278979 4130322 5392087 9333173 13244266 12944793 8265299 2293860 -2708173
41838 -2708173 -6056215 -7112415 -5981156 -4933225 -6385693 -9493320 -10969717 -9460373
41830 -9460373 -7011626 -5846921 -5970078 -6837122 -8881847 -11498776 -11754750 -7989811 -3257302
41821c257302J375234j663188j002822L14074j005886j832101J621108N178412
41813b72471K213665m206135m355328K715900O939999K847746k667253k593051
41805F23072r3251k38844l83519K980359N190803P89857n566817n463663r9906
41796b261909K383049O5161j840414j203444o62526l57441J902062M005706J909068
41787C939312k075002k183111M34572k71421l478174k287666L177940M650884
41779A907334k54231l953388k115957j42800j992964l047562J32567K624400L60076
41770f482525k234945r04827L48713k466233m691942j243622L334589K370610
41762a1970182j053213M23727N456781O580257K812203j74722o24372j872189
$$ plain form
41821 -3257302 -1882068 -3545256 -4548078 -4234004 -5239890 -7071991 -5450883 -272471
41813 -272471 1941194 -2264941 -6620269 -3904369 3035630 5883376 3216123 623072
41805 623072 529821 290977 -92542 2887817 8078620 8868477 3301660 -2162003 -2261909
41796 -2261909 121140 186301 -1654113 -2857557 -3520083 -3877524 -1975462 2030244 3939312
41787 3939312 1864310 -318801 115771 -155650 -3633824 -5921490 -2743550 1907334
41779 1907334 1653103 -2300285 -4416242 -4559042 -6552006 -9599568 -9467001 -6842601 -6482525
41770 -6482525 -8717470 -9622297 -9273584 -11739817 -16431759 -17675381 -14340792 -11970182
41762 -11970182 -13023395 -12599668 -7142887 -562630 2249573 2074851 1450479 -421710
41754d21710l789951k340165J873787L019684o28561l921487k995464l7175J636847
41745g604195J776749J018918o28431j819397o29821J825138K351244N68174q63854
41736d005475o56711K81282J600847K907770J846451k160937m026208P03419O936432
41727C426870N298135l553636q478831l705943L389079M119986K94467j203837
41719d13710P36099K389168K447713J997855L90836k950967m925368k559783J227876
41710a660281J094908k471561l636453J11157M587640N065281J871292j487325
41702C474658k771418j997394q9197J752559K301486J177030o23065j459598n16468
41693A248593J190234J519653l23268k384881k320652p50062k96363j470358k101497
$$ plain form
41754 -421710 -4211661 -6551826 -4678039 -1658355 -2286916 -6208403 -9203867 -9241042 -7604195
41745 -7604195 -5827446 -4808528 -5436959 -7256356 -7886177 -6061039 -3709795 -3141621 -4005475
41736 -4005475 -4662186 -4380904 -2780057 127713 1974164 -186773 -4212981 -3509562 3426870
41727 3426870 8725005 5171369 -3307462 -7013405 -3624326 495660 790127 -413710
41719 -413710 322389 2711557 5159270 7157125 7547961 4596994 -328374 -2888157 -1660281
41710 -1660281 -565373 -3036934 -6673387 -6562230 -1974590 3090691 4961983 3474658
41702 3474658 703240 -1294154 -1383351 369208 2670694 3847724 3224659 1765061 1248593
41693 1248593 2438827 3958480 3635212 1250331 -1070321 -1820383 -2116746 -3587104 -5688601
41684e688601j146979p5015L12250J136502K270872J536718r75603j563109J349764
41675b843201L810179K188703j045550j659350n51869j128135k354386n45362
41667d128971L269736M160990J308309r43383n86221n10484k342732l512290k335009
41658e620055o93830L25971K131415L888524K010392k811948m395148p70043J463853
41649d470869k227015n932250k807448K857597K344586k806258l517121J289348
41641a5269430L416206L05416n72283M248002O913783J369108n399223l660964
41633h649385M002433P104826K748680k272261k892504r31788P26994J643138
41625A480133R38416k487445n673658l472670L478265P839290M904024j439280
$$ plain form
41684 -5688601 -6835580 -6910595 -6598345 -5461843 -3190971 -1654253 -2629856 -4192965 -2843201
41675 -2843201 966978 3155681 2110131 450781 -101088 -1229223 -3583609 -4128971
41667 -4128971 -859235 3301755 4610064 3666681 3080460 2569976 227244 -3285046 -5620055
41658 -5620055 -6313885 -5987914 -3856499 32025 2042417 -769531 -5164679 -5934722 -4470869
41649 -4470869 -6697884 -12630134 -15437582 -12579985 -10235399 -13041657 -16558778 -15269430
41641 -15269430 -11853224 -11547808 -12120091 -7872089 -958306 410802 -4988421 -8649385
41633 -8649385 -4646952 2457874 5206554 2934293 41789 -889999 -163005 1480133
41625 1480133 2418549 -68896 -5742554 -9215224 -5736959 2102331 7006355 5567075
41617E567075m453769k610050N62405J684564J28389k433370l182289o41182K832420
41608b545807L074124n07715l933192l820131r27628K198089L990518L237824
41600G66082p19400n363776o029652j858601K421192L035364K068247K841516
41592b839028L899219J784723k699269n540603n276153l474701q11565K870542
41584a2086835N432957M094306K50879j649474m05029Q17493R6513p64321l49285
41575d562796j0978n49820m04344Q97377J151413l76983p90984J619699L672606
41566F45190J863632k011569l624291k484874j536086j797825j587016l63526
41558a0896365O79471J553548L028282L382541M0444m901602n463518N1703N835815
$$ plain form
41617 5567075 1113306 -1496744 -934339 750225 878614 -1554756 -4737045 -5378227 -2545807
41608 -2545807 528317 20602 -3912590 -7732721 -8660349 -6462260 -2471742 766082
41600 766082 46682 -5317094 -11346746 -13205347 -10784155 -7748791 -5680544 -2839028
41592 -2839028 1060191 2844914 145645 -5394958 -10671111 -14145812 -14957377 -12086835
41584 -12086835 -6653878 -2559572 -2308693 -3958167 -4363196 -3545703 -3449190 -4213511 -4562796
41575 -4562796 -4573774 -5123594 -5527938 -4630561 -3479148 -3856131 -4647115 -3027416 645190
41566 645190 2508822 497253 -3127038 -5611912 -7147998 -8945823 -10532839 -10896365
41558 -10896365 -10216894 -8663346 -5635064 -2252523 -2212079 -7113681 -12577199 -12525496 -6689681
41549f689681O111208K314172l30998k46623K84206m005m51760j104962k272853
41540b391296k328544J56085K742357J785266j458597j988746J086437K708182
41532C11144l61843m450738m462215p72175K621434L826727L379009J322076k023831
41523f10412l936339j915998K226332M267197L029821Q83759n67511j949582l416430
41514a989163l695440k209570K76312L048850N161538M456687l7157n094375o059783
41505f142101k692061R67141K402557K585569K163156K32628k144817j876579
41497d504507Q98089J902981n59868k390806l34616K394575J384354j543523j372705
41488d126026J737753K675287n17647l816254l278991P7668K828041L489565K654591
$$ plain form
41549 -6689681 -578473 1735699 1404701 1158078 1442284 1438279 986519 -118443 -2391296
41540 -2391296 -4719840 -4563755 -1821398 -36132 -1494729 -3483475 -2397038 311144
41532 311144 -50699 -4501437 -8963652 -9735827 -7114393 -3287666 91343 1413419 -610412
41523 -610412 -4546751 -6462749 -4236417 30780 3060601 3944360 3376849 1427267 -1989163
41514 -1989163 -5684603 -7894173 -7617861 -4569011 592527 5049214 5012057 -82318 -6142101
41505 -6142101 -8834162 -7867021 -5464464 -2878895 -715739 -483111 -2627928 -4504507
41497 -4504507 -3606418 -1703437 -2263305 -4654111 -4988727 -2594152 -1209798 -2753321 -4126026
41488 -4126026 -2388273 287014 -230633 -4046887 -7325878 -7248210 -4420169 -930604 1723987
41479A723987R12473j454869l491131l628768j102225K618503M220467J680233
41471A478670k716660m285239j720512J166436R35946p61292m99003J111496O27376
41462d662782k195460l545548j112780K738103M349461K928374K92033j620021
41454b828620j856311m70608J417127K223691J291173m61602j323345k10869K161014
41445e8350L458075K047281p73635k320368k310976k750064l615698k099284K139343
41436f283676M692644K527140q67461n78369K099767K110391r63004k496213n01797
41427b60578J634628Q54394j679012l471938l627672j964212J162217L414264
41419c937909K496893J85401M06704K781397K647048j385442m810193m094537
$$ plain form
41479 1723987 2636460 1181591 -2309540 -5938308 -7040533 -4422030 -201563 1478670
41471 1478670 -1237990 -5523229 -7243741 -6077305 -5141359 -5902651 -6401654 -5290158 -4662782
41462 -4662782 -6858242 -10403790 -11516570 -8778467 -4429006 -1500632 -1208599 -2828620
41454 -2828620 -4684931 -5155539 -3738412 -1514721 -223548 -685150 -2008495 -2219364 -58350
41445 -58350 3399725 5447006 4673371 2353003 42027 -2708037 -6323735 -8423019 -6283676
41436 -6283676 -1591032 936108 68647 -509722 1590045 3700436 2737432 241219 -260578
41427 -260578 1374050 2228444 549432 -2922506 -6550178 -8514390 -7352173 -3937909
41419 -3937909 -1441016 -1255615 -848911 1932486 4579534 3194092 -1616101 -5710638
41411e710638j424367l3761O62891K035062K429013K96976j991303j346963J337877
41402c745213K999259K722422J321664r65018l314279l288519j80694K776697
41394a673681K484861j0112k146606l432232l534923p44505L678074L931833k077027
41385c524318o940646l196557M558505N441213j347240n373475r93743M917881
41377f458380M458210l72885l091254k472276j237932o916J627455J643752j178749
41368g088975l317223j078159L040837L644364L74324k439061k667869j781080
41360a1312842k57833K912847O031940N275866O08225l366441l776122k544613
41352f428973j650990J58402L371863M579679J235302l157924k953087J702339
$$ plain form
41411 -5710638 -7135005 -7168766 -6505875 -4470813 -2041800 -1744824 -3736127 -5083090 -3745213
41402 -3745213 -745954 1976468 3298132 2333114 -981165 -4269684 -4450378 -1673681
41394 -1673681 811180 801068 -1345538 -4777770 -8312693 -9057198 -5379124 -1447291 -3524318
41385 -3524318 -10464964 -13661521 -9103016 -3661803 -5009043 -10382518 -11376261 -6458380
41377 -6458380 -2000170 -2373055 -5464309 -7936585 -9174517 -9181433 -7553978 -5910226 -7088975
41368 -7088975 -10406198 -11484357 -8443520 -4799156 -4424832 -6863893 -9531762 -11312842
41360 -11312842 -11570675 -8657828 -2625888 2649978 3258203 -108238 -3884360 -6428973
41352 -6428973 -8079963 -7921561 -4549698 29981 1265283 -1892641 -4845728 -3143389
41344c143389M833789K563336k259431m205007j650561K222540L441760J143008
41336B946045k005151k749581p73165J020556J92272k052285k561270n15314J737880
41327d760013K102291J104523K90567K5398j6517L86162J255980J418874l9033
41318A768232j804970j641130K66573J016100j189220m234210m396111r90581
41310a1205317K558637K651366k49986k185607n55504K561360L011470Q4191k427270
41301e756660j456504J012853J034360j123142j221193K179227M791929K620920
41293B081790j870696l075934l32520J441771n55853k867331j373266K274993
41285d277046L263623Q84379q28446L90687J841618O55463j421646q25000K042134
$$ plain form
41344 -3143389 1690400 4253736 1994305 -2210702 -3861263 -1638723 1803037 2946045
41336 2946045 940894 -1808687 -2581852 -1561296 -1369024 -3421309 -5982579 -6497893 -4760013
41327 -4760013 -2657722 -1553199 -1262632 -1237234 -1253751 -867589 388391 1807265 1768232
41318 1768232 -36738 -1677868 -1411295 -395195 -1584415 -5818625 -10214736 -11205317
41310 -11205317 -8646680 -5995314 -6245300 -8430907 -8986411 -6425051 -3413581 -3329390 -5756660
41301 -5756660 -7213164 -6200311 -5165951 -6289093 -7510286 -5331059 -539130 2081790
41293 2081790 211094 -2864840 -3197360 -1755589 -2311442 -5178773 -6552039 -4277046
41285 -4277046 -1013423 -129044 -957490 -566803 1274815 1930278 508632 -316368 1725766
41276A725766L081748L25962l306462l807904o81143L187900M813255L334301
41268H673423J47136k164236j832903L15638J663744P54531j396258l035003l239571
41259a13499j510416J971215M679659L016896k562605o104505l049423L108481
41251e64197M937508R92410k772895j791284J454643K213051N1881j913427j704841
41242I02849J99352K403344L324311J932185o04078j716078j135399j379740l020737
41233I06009k658462J696043O258693O157720K150135j304526k612562l147783
41225G445267k506649Q11494M470084L884473l48673k035813J773491O421108
41217A9914782O581145L191441M67947j39404M31509J961982L852721L555872
$$ plain form
41276 1725766 4807514 5133476 1827014 -1980890 -2662033 525867 5339122 8673423
41268 8673423 8820559 6656323 4823420 5139058 6802802 7557333 6161075 3126072 -113499
41259 -113499 -1623915 347300 5026959 8043855 5481250 -623255 -3672678 -564197
41251 -564197 4373311 5365721 2592826 801542 2256185 4469236 4521117 2607690 902849
41242 902849 1102201 3505545 6829856 8762041 8157963 6441885 5306486 3926746 906009
41233 906009 -1752453 -56410 6202283 12360003 14510138 13205612 10593050 7445267
41225 7445267 4938618 5750112 10220196 14104669 13755996 11720183 13493674 19914782
41217 19914782 26495927 29687368 30155315 30015911 30447420 32409402 36262123 39817995
41209C9817995Q9278k929171j715915J975443L714175L352878M336517O972813
41201E5614013P877613O583041P128483J1089725J4057729J2438694R842043J2339347
41193A36970688J9771817K6378988K8896633K9304238K9441522K7601133K2134495
41186C20499514J4573490O532652l421332j6282763k8073113l3146058l1491536
41179B29190854k8409032k6466380k2537807j4911243q597285r070641j3563275
41172A05635191j4093231q478830k972415k964000n932391o207868l159867j078819
41164F0747770k565119n361406n799030l388483j204423j986726m303975l921368
41156C2217240N9040K615964n91935n848343n569166N57239M822757L214636R04866
$$ plain form
41209 39817995 39907273 36978102 35262187 37237630 40951805 44304683 48641200 55614013
41201 55614013 63491626 70074667 77203150 88292875 102350604 114789298 124631341 136970688
41193 136970688 156742505 183121493 212018126 241322364 270763886 298365019 320499514
41186 320499514 335073004 341605656 338184324 321901561 293828448 260682390 229190854
41179 229190854 200781822 174315442 151777635 136866392 128269107 119198466 105635191
41172 105635191 91541960 83063130 80090715 77126715 71194324 64986456 61826589 60747770
41164 60747770 58182651 52821245 47022215 43633732 42429309 40442583 36138608 32217240
41156 32217240 32276280 34892244 34300309 28451966 22882800 23440039 28262796 31477432 32382298
41147C2382298K520968M035086N26840l918248k415532K501631K375725l163534
41139C4845234n841891k523023N38145m22600n09698L436436N402846K19302o182182
41130B8962569n107819J115272K900610j539941m146973m818N924269P098564
41122C5201733L997801J428468J616745K917088K827198M40597k436054k364712
41114D3628864J400127M426260K259871k671661l674686Q00158N327765N699366
41106E7196064L492677R69003k625889o655053o736233j396842L460559J957887
41098D9662173l428729o204184n197170l651976k045366R52950K261207k484084
41090B9864821r543608r507977j183312N234749K613471l244640l681616k31734
$$ plain form
41147 32382298 34903266 38938352 39465192 35546944 33131412 35633043 38008768 34845234
41139 34845234 29003343 26480320 27018465 26595865 26086167 29522603 34925449 35144751 28962569
41130 28962569 23854750 24970022 27870632 26330691 22183718 22178900 28103169 35201733
41122 35201733 39199534 40628002 42244747 45161835 47989033 48429630 45993576 43628864
41114 43628864 45028991 49455251 51715122 49043461 45368775 46168933 51496698 57196064
41106 57196064 60688741 61657744 59031855 52376802 45640569 44243727 47704286 49662173
41098 49662173 46233444 40029260 34832090 31180114 29134748 30087698 32348905 29864821
41090 29864821 20321213 10813236 9629924 14864673 17478144 14233504 10551888 10320154
41082A0320154k8421l110902l285911N01161K600706O83630o97309J567311M102131
41073A2652550L237741O46188n90497r26549j759917j816449n629J338012J00155
41064A2875605j421546k39348J620952m1647m246499n388589j398265L179756
41056D940419L568358N82453j859984k284406k161364k288425j365227J481616
41048F13440M362462M151740L83840l494025l789761q32356J936398K603573K228423
41039H163734J736171M76067j202887j216144O72500J684753N99913J07639J774223
41030A2795969K365395p43941l877480k055736K744035M268636J535897n12411
41022A6520364N55979J889117J529610J331561K385935K907570K195221J846287
$$ plain form
41082 10320154 10291733 7180831 3894920 4396081 6996787 7680417 6983108 8550419 12652550
41073 12652550 15890291 16536479 15945982 15019433 13259516 11443067 11437438 12775450 12875605
41064 12875605 11454059 11214711 12835663 12794016 8547517 3158928 1760663 4940419
41056 4940419 8508777 9091230 7231246 4946840 2785476 497051 -868176 613440
41048 613440 4975902 9127642 9511482 6017457 2227696 1395340 3331738 5935311 8163734
41039 8163734 9899905 10375972 9173085 7956941 8629441 10314194 10914107 11021746 12795969
41030 12795969 15161364 14417423 10539943 8484207 11228242 15496878 17032775 16520364
41022 16520364 17076343 18965460 20495070 21826631 24212566 27120136 29315357 31161644
41014C1161644J852109M63904j095937O41311M723654N867529K899484P46601
41006D7260299J923667K940634J918875K288840N188044O070989L700495M198233
40998G5490076R855376J2524357O586015M31878M397429J3927659J7157032J4360334
40990A54730156J5869728K3070860K6545770K3957120K4996925L4524935M3770714
40983C47466208M4108977L8413818L1989711K2164636N006486j5230327l1290547
40976D42628962m1590224m7016065m5475384l7124132k9260530k7853424k8723618
40969A85585585k4889693j8044437j4225549j2474448p895659l187950n907625
40962I8960224j4418238j7440657r855386K80538L662746O01325l685651p000515
$$ plain form
41014 31161644 33013753 33477657 32381720 33023031 37746685 43614214 46513698 47260299
41006 47260299 49183966 52124600 54043475 56332315 61520359 67591348 71291843 75490076
40998 75490076 85345452 97869809 104455824 104887702 109285131 123212790 140369822 154730156
40990 154730156 170599884 193670744 220216514 244173634 269170559 303695494 347466208
40983 347466208 391575185 429989003 461978714 484143350 489149836 473919509 442628962
40976 442628962 401038738 354022673 308547289 271423157 242162627 214309203 185585585
40969 185585585 160695892 142651455 128425906 115951458 108055799 104867849 98960224
40962 98960224 84541986 67101329 57245943 57526481 61189227 61790552 58104901 51104386
40954E1104386q562522o060989j67660K923462o41800n805067n567408j019993
40946B6202409J775538J803124K585679L533968M35431m965986m867612J980676
40938B8483227N904864K20548p423660n608610L602471P597145J712440n297111
40930B9191314n506426j838580k7485P58187L106661M014442K9830m760777l839109
40921B1128057J370841L802521J596751p88975j101619j291677j464226M01719
40913B3653392K441309M98104l431281k610392K915368M973237M13025l360638
40905B5492124o12348L610093K881000J45229J213454L819106K154895j993945
40897C6709608j938852K450428M737795K497100L1970M25522J723620J784634
$$ plain form
40954 51104386 42541864 36480875 36313215 39236677 38594877 32789810 27222402 26202409
40946 26202409 27977947 29781071 32366750 35900718 36336149 31370163 26502551 28483227
40938 28483227 34388091 34608639 27184979 21576369 25178840 32775985 34488425 29191314
40930 29191314 23684888 21846308 21818823 22577010 25683671 29698113 29727943 24967166 21128057
40921 21128057 22498898 26301419 27898170 27109195 26007576 24715899 23251673 23653392
40913 23653392 26094701 26592805 23161524 20551132 23466500 28439737 28852762 25492124
40905 25492124 24879776 28489869 31370869 31516098 32729552 36548658 38703553 36709608
40897 36709608 34770756 37221184 41958979 44456079 44488049 44913571 46637191 48421825
40889D8421825J306425J246240J659792L117057N308868N252877J312393k451507
40881F5173970j075377L490313M970900K117922n27256o02311m69786j882427
40873G1195948m001356o555606r086352p853864n58094O444816M130597n360572
40865D8355517j0218637o336519k988404o843208j0753857o073816K488943M257141
40857A1887160q24969l559171n46431K451485J633717J25775M47675K55357j645774
40848A0224824j867518J307613L672388J393685k480358k518609P35739J873523
40840A2341287r71352l652771k555821N04403J863139J391046J356283J779804
40832A2056018O05817j831239k318545J01184J820599k75512l967831m721419
$$ plain form
40889 48421825 49728250 50974490 52634282 55751339 61060207 66313084 67625477 65173970
40881 65173970 64098593 67588906 72559806 74677728 74150472 73548161 73078375 71195948
40873 71195948 67194592 60638986 51552634 43698770 43140676 49585492 53716089 48355517
40865 48355517 38136880 31800361 28811957 21968749 11214892 5141076 7630019 11887160
40857 11887160 11062191 7503020 6956589 9408074 11041791 11167566 11615241 11870598 10224824
40848 10224824 8357306 9664919 13337307 14730992 12250634 9732025 10467764 12341287
40840 12341287 11369935 7717164 5161343 5665746 7528885 8919931 10276214 12056018
40832 12056018 12661835 10830596 8512051 8613235 10433834 10158322 6190491 1469072
40824A469072j806912J539063K812052K077632Q4213k227469k841246n11011K628054
40815C223448L211605J236693l33297j25368O07647R89323J002267n71427m596968
40806D643923q118105o997400k365405L94168j97022P9814L314517N595035L690536
40797D0061L03382r04720q30512j473076j265769J490490M023567K832615n55753
40788C660285k178750j738855j650209k059003j401607k71508k25649j19002J952524
40779d031774M286858L644179P40845p61256j6005O87208P35451J634337K809699
40770I729542J744141j230619k755997j840003j161054j954461j870097L96026
40762A057478K224427J131340j302924j969708n48874P94457M75348j305302l118721
$$ plain form
40824 1469072 -337840 1201223 4013275 6090907 6175120 3947651 1106405 595394 3223448
40815 3223448 6435053 7671746 7338449 7213081 7820728 8810051 9812318 9240891 4643923
40806 4643923 -3474182 -10471582 -12836987 -12442819 -12639841 -12560027 -9245510 -3650475 40061
40797 40061 343443 -561277 -1391789 -2864865 -4130634 -2640144 1383423 4216038 3660285
40788 3660285 1481535 -257320 -1907529 -3966532 -5368139 -5639647 -5865296 -5984298 -4031774
40779 -4031774 255084 3899263 4640108 3878852 3862847 4550055 5285506 6919843 9729542
40770 9729542 11473683 10243064 7487067 5647064 4486010 2531549 661452 1057478
40762 1057478 3281905 4413245 3110321 1140613 591739 1386196 1861544 556242 -2562479
40753b562479l057959l36737L082915L943016J449990j790452k943130j551337
40745c766173J035077K898677K175317j233097m200605l074020J479307M643959
40737d1558L299529n36273k937901k418398L330K763661M346975L739326J591285
40728I809976m49132k049274l882200m836305k594145K028613M727142L479199
40720F233874J288812P95996j67306l937174p170916m838456J503632M971734
40712a319804K924617R5514R52240L598838L666961O70641k486394l894869l581151
40703F26593j729488J142217L099592K427385P1229j418219j041103J22852R72039
40694D273097J231671O82825o61870j823914j910169j593721j918273k142697
$$ plain form
40753 -2562479 -5620438 -5957175 -2874260 1068756 2518746 728294 -2214836 -3766173
40745 -3766173 -2731096 167581 2342898 1109801 -3090804 -6164824 -4685517 -41558
40737 -41558 3257971 2721698 -216203 -2634601 -2631271 132390 4479365 8218691 9809976
40728 9809976 9360844 7311570 3429370 -1406935 -4001080 -1972467 2754675 6233874
40720 6233874 7522686 8318682 8151376 4214202 -2956714 -7795170 -6291538 -1319804
40712 -1319804 1604813 1700327 2652567 6251405 9918366 10589007 8102613 4207744 626593
40703 626593 -1102895 39322 3138914 5566299 5637528 4219309 3178206 3301058 4273097
40694 4273097 5504768 6187593 5525723 3701809 1791640 197919 -1720354 -3863051
40686c863051q27996J297128J995469J035859M05967P03845K51555j343890j836427
40677b181541r0563J697097J522188O60948R60465J670487J642883J992093L232156
40668A1106213K437398k356987p002473n843412n38895J593505j561672l755162
40660e921485k5162O042474Q144324O048232M325433N139957O672955P261768
40652C7688496P079047N980335K890068k111877o923323r090024p720219m278395
40644B3514108j927626k800662n214875n238944j925828J111259P53340j350763
40636F920009j778314m55157K24216o8464N13601J965632J823345p11008k936894
40627E496966k335144K8963J438902J341111J207590J364668L78200j916027k992738
$$ plain form
40686 -3863051 -4691047 -3393919 -1398450 -362591 43376 747221 998776 -345114 -2181541
40677 -2181541 -2272104 -575007 947181 1608129 2568594 4239081 5881964 7874057 11106213
40668 11106213 13543611 11186624 4184151 -1659261 -2198156 -604651 -2166323 -5921485
40660 -5921485 -5946647 95827 8240151 14288383 18613816 23753773 30426728 37688496
40652 37688496 44767543 50747878 53637946 51526069 44602746 35512722 27792503 23514108
40644 23514108 21586482 18785820 13570945 8332001 6406173 7517432 8270772 6920009
40636 6920009 5141695 4686538 4910754 4842290 5355891 7321523 9144868 8433860 5496966
40627 5496966 3161822 3190785 4629687 5970798 7178388 8543056 8921256 7005229 4012491
40618D012491r98089J873991J912225p01943k123484r41304l93296k620247m339563
40609d319219j667153L437434N657229L501199p2242k653625l662007k179703
40601a958087J483095L301988K01699l802827k507236K157922K398475k494920
40593a219891m398295J41548M022246J771792j311050J029335M672145K200236
40585F908066m030693n200834L55849N383141M612123M04974k385386j823898
40577D223342O78471J632079j540547o052429n557008N03666M486815K057893
40569D32282l32679L503875P649985L315366n253512o396560N0535K810303j847730
40560C931865m828325p90043L062021M43733l089210m75286M509395M177311n4224
$$ plain form
40618 4012491 3014402 4888393 6800618 6098675 3975191 3033887 2640591 20344 -4319219
40609 -4319219 -5986372 -2548938 3108291 6609490 6537248 3883623 221616 -1958087
40601 -1958087 -474992 2826996 3028695 -774132 -3281368 -1123446 1275029 -1219891
40593 -1219891 -5618186 -5476638 -1454392 317400 -993650 35685 4707830 6908066
40585 6908066 2877373 -2323461 -1967612 3415529 8027652 8432626 6047240 4223342
40577 4223342 4901813 6533892 4993345 -1059084 -6616092 -6112426 -1625611 432282
40569 432282 99603 3603478 11253463 14568829 9315317 2918757 2969292 5779595 3931865
40560 3931865 -896460 -1686503 1375518 1819251 -1269959 -1745245 2764150 6941461 6887237
40551F887237q17364K591658L509902j045034n829989n206602q66479P51489k761911
40542b787093n932223k109431O457373R535274K629506n270994l795450L387167
40534B114129M491031j625130m428940M1066K974325r78144m038095M66889N330075
40525D347206J348922o476393o603682O68250M817176K246226l36242P20762P98118
40516A530343k684786m615230r51668M193745M900248J748747n91208m66982J58594
40507C221803j8561l87442n59975j112752k169038k707056j624087R14350L316442
40498a126316L852708K189719m18677k127066j411385J877639N155272M274218
40490A2266112j532441p045201o577540j282526K750173K888216J779303J197380
$$ plain form
40551 6887237 6069873 8661531 12171433 11126399 5296410 89808 -776671 -25182 -2787093
40542 -2787093 -8719316 -10828747 -4371374 5163900 7793406 2522412 -1273038 2114129
40534 2114129 6605160 4980030 551090 592156 3566481 2588337 -1449758 -982869 4347206
40525 4347206 5696128 -780265 -7383947 -6715697 -1898521 347705 11463 732225 1530343
40516 1530343 -1154443 -5769673 -6721341 -2527596 2372652 4121399 3530191 3063209 3221803
40507 3221803 3203242 2815800 2255825 1143073 -1025965 -3733021 -5357108 -4442758 -1126316
40498 -1126316 2726392 4916111 4497434 2370368 958983 2836622 7991894 12266112
40490 12266112 10733671 3688470 -2889070 -4171596 -1421423 1466793 3246096 4443476
40482D443476j44696j899511j342325R95624J063656j301532j327511J711033
40474B198214J950076k622066n101051q66598L767692J708873k822967j575320
40466c363147L522788L783506j604542m831151k435361N79332P5809k002965k708242
40457h983973j520243J709911N975310O741183J111338n396360m763202J363822
40449c762214L666435o56238m664603l647263q71631Q82522L914350P950021P183868
40440I995247L31094m594051j920845K415437M29231n164510n893222r49271K764063
40431b586827J795150m21635o81746L3815J25543k18200q07847j789760j985745
40422f537252j94745J958880J593391j126311l072344k400665j88379J888123
$$ plain form
40482 4443476 4298780 2399269 1056944 2052568 3116224 1814692 487181 2198214
40474 2198214 4148290 1526224 -3574827 -4441425 -673733 1035140 -1787827 -3363147
40466 -3363147 159641 3943147 2338605 -2492546 -4927907 -4348575 -4272766 -6275731 -8983973
40457 -8983973 -10504216 -8794305 -2818995 3922188 5033526 -362834 -5126036 -3762214
40449 -3762214 -95779 -752017 -5416620 -9063883 -9935514 -9052992 -5138642 2811379 9995247
40440 9995247 10326341 5732290 3811445 6226882 6656113 1491603 -4401619 -5350890 -2586827
40431 -2586827 -791677 -1213312 -1895058 -1861243 -1735700 -1953900 -2761747 -4551507 -6537252
40422 -6537252 -6731997 -4773117 -3179726 -4306037 -7378381 -9779046 -9967425 -8079302
40414h079302L027059K642698O31936j532402j825665J2075K347507L524247K893751
40405C641904P86681j386745j878921n78819O74525O36017J49002Q0116m57900
40396A665860k214399l725410l088570p54770J176960J627865J182280R46734
40388c183450J666474K818651K249244j142041m030807j563467M881820P250510
40380H946934J462907n754818n815623n93599J080410k573502m136450K08889
40372g174852M305551K502860p56513J600892P120411P173749N23918m648863
40364A0647153l002944J041343J311342j405226k832198k505478k294306r74266
40356a4580L657222Q774611Q674516K990807k426855l266077l79580M791420J2417821
$$ plain form
40414 -8079302 -5052243 -2409545 -1777609 -3310011 -5135676 -5123601 -2776094 748153 3641904
40405 3641904 4428585 3041840 1162919 584100 1258625 1894642 2043644 2123760 1665860
40396 1665860 -548539 -4273949 -7362519 -8117289 -6940329 -5312464 -4130184 -3183450
40388 -3183450 -1516976 1301675 3550919 2408878 -1621929 -3185396 1696424 8946934
40380 8946934 10409841 4655023 -1160600 -1754199 -673789 -3247291 -7383741 -7174852
40372 -7174852 -2869301 -366441 -1122954 477938 7598349 14772098 15296016 10647153
40364 10647153 7644209 8685552 9996894 8591668 5759470 3253992 959686 -14580
40356 -14580 3642642 12417253 21091769 24082576 21655721 18389644 18010064 22801484 35219305
40347C5219305J9887621K1125382J3955542L582735m734840j1630317j8138795
40340E9266633j9850039j3177065l600318j6135k783717m735866k859614j164223
40332A1079656j949199k283045p94024n61025k583528k968799J49694K824947
40324B914677J950734J67927K80323J61005k205780l552660n80076L608309L978759
40315F723218J328170j07197j35323j634526l889012l153989O77286L580950L531925
40306F921502K128595K63663k570680m403591j848034L597066N600642J654147
40298A1343310k926737k529851J205031K837131R42046j492890k361952k018483
40290D997605o71882J759473L349678J532268k428840l699546k97217L462949
$$ plain form
40347 35219305 55106926 76232308 90187850 93770585 89035745 77405428 59266633
40340 59266633 39416594 26239529 22639211 22623076 19839359 15103493 12243879 11079656
40332 11079656 9130457 6847412 6053388 5492363 2908835 -59964 89730 2914677
40324 2914677 4865411 5033338 5313661 5474666 3268886 -283774 -863850 2744459 6723218
40315 6723218 8051388 7944191 7808868 6174342 2285330 -868659 -191373 3389577 6921502
40306 6921502 9050097 9313760 6743080 2339489 491455 4088521 9689163 11343310
40298 11343310 8416573 5886722 7091753 9928884 10870930 9378040 7016088 4997605
40290 4997605 4325723 6085196 9434874 10967142 8538302 4838756 4541539 8004488
40282H004488K433163k277413m815693k550304R65102J832280J267167K639544
40274G498334N228667M764583J20031m197015l888995o12902P04691j101178k271565
40265F244651j88157K522500K001643o50762n47579L546568O525133L900821j265405
40256B2089413k275122J532763L879253J114673k352341j137837K742324L197771
40248B8790897n49181l035024o39210L839806N525219L222325k26618j393723
40240C5534491N21029K903032K669419O59269R15248M194706N806677L066616
40232E6270487P65069L903682Q569389P251350J085210j559285J754213M534975
40224H2575090K639398j40354j62106O88901R80049L097237O685230O545030J655219
$$ plain form
40282 8004488 10437651 8160238 3344545 794241 1759343 3591623 4858790 7498334
40274 7498334 12727001 17491584 17611615 13414600 9525605 8912703 9617394 8516216 6244651
40265 6244651 6056494 8578994 10580637 9929875 9382296 12928864 19453997 23354818 22089413
40256 22089413 19814291 21347054 25226307 26340980 23988639 22850802 25593126 28790897
40248 28790897 28241716 25206692 24567482 28407288 33932507 37154832 36928214 35534491
40240 35534491 36055520 38958552 41627971 42287240 43202488 47397194 53203871 56270487
40232 56270487 57035556 60939238 69508627 76759977 77845187 76285902 78040115 82575090
40224 82575090 85214488 85074134 84912028 85600929 86580978 89678215 96363445 102908475 104563694
40215A04563694j457884N81575K128927o04353j659885L532192P658703K668257
40207A17411226n599751o046685l93080O28781m062036n285212j016867K7647
40199I5664023n527664r469334o291662k025833l022935n981052n627227l704755
40191E4013561l433632k431283J703616M973618L270347j40903k90656J010027
40183E8674695p03433l973054m148124j730647j128102l150917m890801n200701
40175C3748916m606681j853017L467541O670390K849293m843258p991340l912277
40167B3529567J737548L496642J865543q7849r64964p04464J50501M5643j642709
40158B7425458k487661j88920L028415L294625J318194Q13177J656789N56578
$$ plain form
40215 104563694 103105810 103687385 105816312 105211959 103552074 107084266 114742969 117411226
40207 117411226 111811475 105764790 105371710 106000491 101938455 96653243 95636376 95664023
40199 95664023 90136359 80667025 74375363 72349530 69326595 63345543 57718316 54013561
40191 54013561 50579929 48148646 49852262 54825880 58096227 57955324 57664668 58674695
40183 58674695 57971262 53998208 49850084 48119437 46991335 43840418 38949617 33748916
40175 33748916 29142235 27289218 30756759 37427149 40276442 35433184 27441844 23529567
40167 23529567 25267115 28763757 30629300 30541451 29576487 28872023 29022524 29068167 27425458
40158 27425458 24937797 24748877 27777292 31071917 32390111 33203288 34860077 35416655
40150C5416655j775105j048298K116336J657380l499462o089477j783834L318263
40142B8312458K353891j353497n44991L405049L085632k029852m544877j272774
40134B7411039K242482J533419j53018J093702K525580j42179m593712m910008
40126B5007305o26662K787026K021693l51506r24504j46025k13401j090758r75241
40117B5487927N24457J685319R72113j148061k845248k766131j053006J079957
40109B1937327K379860K228656R08908l60021k59406Q82372P71832j968628m985556
40100B1535344m458651n42777K055710L16240k807340k702310K93054J720231
40092A5409501o38430m513268o891615o805689m341089j57310L361918L572223
$$ plain form
40150 35416655 33641550 32593252 34709588 36366968 32867506 26778029 24994195 28312458
40142 28312458 30666349 29312852 28767861 32172910 35258542 33228690 28683813 27411039
40134 27411039 29653521 31186940 31033922 32127624 34653204 34511025 29917313 25007305
40126 25007305 24380643 27167669 29189362 28837856 27913352 27767327 27553926 26463168 25487927
40117 25487927 26012384 27697703 28669816 27521755 24676507 21910376 20857370 21937327
40109 21937327 24317187 26545843 27454751 27094730 26835324 27717696 28489528 26520900 21535344
40100 21535344 17076693 16533916 18589626 18905866 16098526 13396216 13689270 15409501
40092 15409501 14771071 10257803 3366188 -3439501 -7780590 -7937900 -4575982 -1003759
40084a003759J207480k03922N57416J017581j00599l77219J607201K819159O33388
40075F156726j869738j24867M202205M946912N84746l512643k996821m6986J211474
40066H551008P94496J028360J377794p11467m585610n890931k288601K893211
40058A168260M380191J079333l112049m163673k023959M17849J086607K91771
40050h75670p06094j083204l28137J689290L793151L881173J311418j827223k820344
40041C034360j247004Q83780J366623l39460k727228l266620q24479K497842L313007
40032B690821J262471n03233m8467O29772o08051k202381j749625m66492j037117
40023b032302k514653j703148J052442K092259O04163k03094R55869J173337j034192
$$ plain form
40084 -1003759 203721 -201 557215 1574796 1474197 1096978 2704179 5523338 6156726
40075 6156726 4286988 4162121 8364326 13311238 13895984 10383341 7386520 7339534 8551008
40066 8551008 9345504 10373864 11751658 11040191 6454581 563650 -1724951 1168260
40058 1168260 5548451 6627784 3515735 -647938 -2671897 -2254048 -1167441 -875670
40050 -875670 -1581764 -2664968 -2993105 -1303815 2489336 6370509 7681927 5854704 3034360
40041 3034360 1787356 2671136 4037759 3698299 971071 -2295549 -3120028 -622186 2690821
40032 2690821 3953292 3450059 3401592 4031364 3423313 1220932 -528693 -995185 -2032302
40023 -2032302 -4546955 -6250103 -5197661 -3105402 -2501239 -2704333 -1748464 -575127 -1609319
40014a609319k486462o97087J578193R21381r31541k90283J853780J346982k054203
40005b368559m023541k210483Q65907K332575K614029L091574L219948K001057
39997E522507K47441n69614m38984l23108o01210j082686j496965j088286R17560
39988A086655L373435L395021K72102k274128m50258L595152L530764k390079
39980A0138664p607417n101665L077254Q051725N525935N40494p01281O40022
39972A4563731m03651l517370l330410J534027N366650L330720j990199m959704
39964A0593794m255874k379016o90562R01051J231535p27455k770386j944349
39956d1262N31322J060890j89752J98775K289948K290492k58712q27821K030638
$$ plain form
40014 -1609319 -4095781 -4792868 -3214675 -2293294 -3224835 -3515118 -1661338 -314356 -2368559
40005 -2368559 -6392100 -8602583 -7736676 -5404101 -2790072 301502 3521450 5522507
39997 5522507 5769948 5200334 4761350 4438242 3837032 2754346 1257381 169095 1086655
39988 1086655 4460090 7855111 8127213 5853085 5402827 8997979 12528743 10138664
39980 10138664 2531247 -2570418 506836 8558561 14084496 14624990 13923709 14563731
39972 14563731 14160080 10642710 7312300 8846327 14212977 17543697 15553498 10593794
39964 10593794 6337920 3958904 3268342 4169393 5400928 4673473 1903087 -41262
39956 -41262 490060 1550950 1361198 1559973 3849921 6140413 5881701 5053880 7084518
39947G084518L037501j114777m933390k094933L813254L958966k256761o210221
39939A284157k814909L012331M668229K412398L18999m46464j236526j956040
39931E242175j434025j66436K14024p25445k037994k353814l60115L507860N457148
39922G343378J797481m987920p791549m354069m47106o40206j222604K667119
39914g635476P582938O433357j48997m623103l710843j416902p86575J5710J942191
39905b347700K237621q43j312228O1135Q75763j036536k428736l57706K241590
39896b067640J371410j196110r35722K038617L537753J802182r51144k598693
39888A000653k934529k071678k81631J124741J343105J450428J920296P56443
$$ plain form
39947 7084518 10122019 9007242 4073852 1978919 5792173 9751139 7494378 1284157
39939 1284157 -1530752 1481579 6149808 8562206 8881205 8434741 7198215 5242175
39931 5242175 3808150 3641714 3855738 3130293 1092299 -1261515 -1621630 1886230 7343378
39922 7343378 9140859 4152939 -3638610 -7992679 -8439785 -9079991 -10302595 -7635476
39914 -7635476 -52538 6380819 6231822 1608719 -2102124 -3519026 -4305601 -4289891 -2347700
39905 -2347700 -110079 -110922 -1423150 -1362015 -486252 -1522788 -3951524 -4309230 -2067640
39896 -2067640 -696230 -1892340 -2828062 -789445 2748308 4550490 3599346 1000653
39888 1000653 -1933876 -4005554 -4287185 -3162444 -1819339 -368911 1551385 2307828
39880B307828k797154m967890k132717K896855M257444J853184J207222M109029
39872F733801N317967R35469m903879n544083r22033K958702K293768n45944j348981
39863D974787N83289K602375K606318J137535j85883q99391j433136j474887l63370
39854G547637Q31642j63395l097621m154441q01590L888972M634382R56893k364214
39845G278265k124366p16815j691113l843063k720610K588457P166825O073717
39837A2011297O64881l125760k323063m2471k74002k321071k736923p04031J675342
39828B824199L116638L655688K389007j187532m041843k469823J650987K409826
39820H347147j553145n254957n303623l663301j645108K872902Q680592Q977153
$$ plain form
39880 2307828 -489326 -5457216 -7589933 -4693078 -435634 1417550 2624772 6733801
39872 6733801 12051768 12987237 8083358 2539275 1617242 4575944 6869712 6323768 4974787
39863 4974787 5558076 8160451 10766769 11904304 11718421 10819030 9385894 7911007 7547637
39854 7547637 8379279 8215884 5118263 963822 162232 4051204 8685586 9642479 7278265
39845 7278265 5153899 4437084 2745971 -1097092 -3817702 -1229245 5937580 12011297
39837 12011297 12676178 9550418 7227355 7184884 6910882 4589811 1852888 1148857 2824199
39828 2824199 5940837 9596525 11985532 10798000 6756157 4286334 5937321 8347147
39820 8347147 6794002 1539045 -3764578 -7427879 -9072987 -6200085 2480507 11457660
39812A1457660J505273n453635m108497J360170K252352o69208k72432L120105
39804I191788J980167m712515q620657n020281N17543J876215J088945K708571
39796i90224N448161M788259N50022k728345j714359K076938M082600J426605
39788A2939657l559957n459437k540022Q95631J017920j69182M57222J209490
39780D791322k88222j119094J863575M555577J415264m088035m175187J17321
39772C072521Q83798k599789l145858O33865J880891j257641k020615J923507
39764f29321L752761L74533j690286J129245K631201q13764k720847Q10695K416048
39755E260265k961732o929071j599031N228116K244733n862903n732615L013381
$$ plain form
39812 11457660 12962933 7509298 3400801 4760971 7013323 6344115 6071683 9191788
39804 9191788 11171955 6459440 -2161217 -7181498 -6663955 -4787740 -3698795 -990224
39796 -990224 4457937 9246196 9796218 7067873 5353514 7430452 11513052 12939657
39788 12939657 9379700 3920263 1380241 2275872 3293792 3124610 3581832 4791322
39780 4791322 4503100 3384006 5247581 9803158 11218422 7130387 2955200 3072521
39772 3072521 3956319 1356530 -1789328 -1155463 725428 -532213 -2552828 -629321
39764 -629321 3123440 3497973 1807687 2936932 5568133 4754369 2033522 2844217 5260265
39755 5260265 2298533 -4630538 -6229569 -1001453 1243280 -4619623 -10352238 -7338857
39747g338857Q129468M207626j863210m074757l721042k464737L16478K666792
39739d142239J559964q33985m06815R44602q68487k886074M35073N720741M632005
39730D154785j904579m772132j538984J282162J001275J799788L959112K287170
39722F268597k536102l161035R64036J503240l691640n987109j501864J533886
39714f607991k101228m529260J035487P124136M297106k297626j317852N845612
39706A448384P657227J056706m924483m062364o45814k31097j352809j37629K567467
39697A375588K764329o78972m504735m920572j766599J470996K004067J106636
39689c149262J397949K056430L30027k745987k942238K47033K390173J239904
$$ plain form
39747 -7338857 790611 4998237 3135027 -939730 -4660772 -7125509 -6809031 -4142239
39739 -4142239 -2582275 -3416260 -3823075 -2878473 -3746960 -6633034 -6197961 -477220 4154785
39730 4154785 2250206 -2521926 -4060910 -2778748 -1777473 22315 3981427 6268597
39722 6268597 3732495 571460 1535496 3038736 -652904 -6640013 -8141877 -6607991
39714 -6607991 -8709219 -13238479 -12202992 -5078856 -781750 -3079376 -4397228 1448384
39706 1448384 9105611 10162317 5237834 1175470 529656 298559 -1054250 -1191879 1375588
39697 1375588 4139917 3460945 -1043790 -5964362 -7730961 -6259965 -4255898 -3149262
39689 -3149262 -1751313 305117 635144 -2110843 -5053081 -4806048 -2415875 -1175971
39681a175971j33571O27878J223896n21397k739007l240941k706992j607503J305151
39672h968457M872809N019455J177497k025014k236164k586490m297590k957366
39664a2001320L268505Q362382O974322K299040k62036j374218l493339m288260
39656e14924j498257R45797q32862l162119j227303J946450J202637r10110P13876
39647c336815L162522N09398m010223k225132M434848O383223J545240k092718
39639D370343o46440M60673j996576l278084m69030J706455j85367k017969j40067
39630b196062J775933k83808l187948k229945Q54001J379639n65517j326619J37509
39621e642817J849534K533821K243207J133660Q3570M11881J294394J82914k849279
$$ plain form
39681 -1175971 -1309542 -681664 542232 20835 -2718172 -5959113 -8666105 -10273608 -8968457
39672 -8968457 -4095648 923807 2101304 76290 -2159874 -4746364 -9043954 -12001320
39664 -12001320 -8732815 -370433 6603889 8902929 8640893 7266675 3773336 -514924
39656 -514924 -2013181 -1067384 -1900246 -5062365 -6289668 -4343218 -3140581 -4050691 -3336815
39647 -3336815 -174293 335105 -3675118 -5900250 -1465402 4917821 6463061 4370343
39639 4370343 3723903 4184576 2188000 -1090084 -1559114 147341 -38026 -2055995 -2196062
39630 -2196062 -420129 -703937 -3891885 -6121830 -5267829 -3888190 -4453707 -5780326 -5642817
39621 -5642817 -3793283 -1259462 983745 2117405 2200975 2612856 3907250 4090164 1240885
39612A240885m472125l108238r33537K97113J278718J858031N05866j467456n40951
39603e341694K304169J552925l427287n504837m97540N493453M964480o7930k266794
39594b791055Q5044K855929L637398L134992J312309j775623l174897q66721J380590
39585C797966r93101n027722l615103L203928P165630L276122l535407n665878
39577a393565k288031J329392J125396j846590l685005k185992Q66163K050760
39569f027472Q99711M23452K248546L841334K557272k16141j651937j588012r53691
39560d66938R52464L699154L354114j949050o695847m545900J480917K623870
39552a547216k123182m096334J619902Q398305P654796M22124n520098o055317
$$ plain form
39612 1240885 -3231240 -6339478 -7273015 -6975902 -5697184 -3839153 -3333287 -4800743 -5341694
39603 -5341694 -3037525 -1484600 -4911887 -10416724 -10914264 -5420811 -456331 -524261 -2791055
39594 -2791055 -2706011 149918 3787316 6922308 8234617 6458994 3284097 2417376 3797966
39585 3797966 2804865 -2222857 -5837960 -2634032 4531598 7807720 4272313 -1393565
39577 -1393565 -3681596 -2352204 -1226808 -3073398 -6758403 -8944395 -8078232 -6027472
39569 -6027472 -5127761 -4704309 -2455763 1385571 3942843 3726702 2074765 486753 -466938
39560 -466938 485526 4184680 7538794 5589744 -1106103 -5652003 -4171086 -1547216
39552 -1547216 -3670398 -7766732 -6146830 2251475 9906271 10328395 4808297 -1247020
39544a247020l278649j64467K428430M136635M156486K337433m64639l000625
39536D903584l972898k835845q00763L50427P24668J700687K769529J743182j233276
39527C349295k978403j924474n11168j167251k653042k534210r22537N21417J352083
39518g468290J959140K145564J977571K327970K876853J573278k009153m806567
39510a423634l896766k73748K904741L980040K935807K21247k347732j924573
39502A75382J475148L676903J775245j522590k263405j446754k586333m991000
39494e707404m601880r25347J989088K020992J758994L404591M876106L190432
39486F005572r64276m164867m175175j536178J536453K932956K240633R01156
$$ plain form
39544 -1247020 -4525669 -4690136 -2261706 1874929 6031415 8368848 7904209 4903584
39536 4903584 930686 -1905159 -2705922 -2355495 -1630827 69860 2839389 4582571 3349295
39527 3349295 370892 -1553582 -2064750 -3232001 -5885043 -8419253 -9341790 -8820373 -7468290
39518 -7468290 -5509150 -3363586 -1386015 941955 3818808 5392086 3382933 -1423634
39510 -1423634 -5320400 -5594148 -2689407 1290633 4226440 4447687 2099955 175382
39502 175382 1650530 5327433 7102678 5580088 3316683 1869929 -716404 -5707404
39494 -5707404 -10309284 -11234631 -9245543 -7224551 -5465557 -2060966 2815140 6005572
39486 6005572 5041296 876429 -3298746 -4834924 -3298471 -365515 1875118 2776274
39478B776274J51212n13823j695095k256577j182080K9560n22233j709572j076186
39469e998520R58246J946824J660166J731951J737756m4695k228658j525040J260622
39460e01348J573512j480766l351818j434157J079005J209204P79540J728030
39452c98798J921980k52074j757219j43704J199356j538901n354955m629021q2430
39443a1035766K699634K090520J422465J917389J055417j540330k496320l52063
39435f239054K071967K531944K336621K876935L002481J593223m25360k084924
39427E663833l583932m508523l712429j753015n33039l4412J360292L035401K560238
39418a505586M78957J78190J875954J711624j295369k732419k61507J741812n94864
$$ plain form
39478 2776274 2927486 2413663 718568 -1538009 -2720089 -2690529 -3212762 -4922334 -5998520
39469 -5998520 -5040274 -3093450 -1433284 298667 2036423 1991728 -236930 -1761970 -501348
39460 -501348 1072164 -408602 -3760420 -5194577 -4115572 -2906368 -2126828 -398798
39452 -398798 1523182 1271108 -486111 -629815 569541 -969360 -6324315 -10953336 -11035766
39443 -11035766 -8336132 -6245612 -4823147 -2905758 -1850341 -3390671 -5886991 -6239054
39435 -6239054 -4167087 -1635143 701478 3578413 6580894 8174117 7748757 5663833
39427 5663833 2079901 -2428622 -6141051 -7894066 -8427105 -8461517 -7101225 -4065824 -1505586
39418 -1505586 -1026629 -848439 1027515 2739139 1443770 -1288649 -1550156 191656 -403208
39409d03208l604937k049603J584496P82195l842182m685788R74704O221883M295868
39400g26572k115904n171558k095789K871391M995613L739328J172971j231716
39392A437764l129953m171346l700593j585772J066336K343296J134617j398940
39384h004591k374149p1L963980N377040K199077k632260m147252j264466J927966
39375d954726J579637j194274k722642k054225r77686O3745K332506M962997M685913
39366A721245Q48045k556371k051672O11555J363272m27448j753747n51033J871610
39357i24544K769535R19674k157158l377878j282824J814635K370951L50240r45433
39348d62802j29622M27714p47617j378440M07842K417851J945205N5495j014927
$$ plain form
39409 -403208 -4008145 -6057748 -4473252 -3691057 -7533239 -12219027 -11244323 -5022440 -726572
39400 -726572 -2842476 -8014034 -10109823 -7238432 -2242819 1496509 2669480 1437764
39392 1437764 -1692189 -5863535 -9564128 -11149900 -10083564 -7740268 -6605651 -8004591
39384 -8004591 -10378740 -10378811 -6414831 -1037791 1161286 -1470974 -5618226 -6882692 -4954726
39375 -4954726 -3375089 -4569363 -7292005 -9346230 -10323916 -10260171 -7927665 -2964668 1721245
39366 1721245 2569290 12919 -2038753 -1427198 -63926 -491374 -2245121 -2796154 -924544
39357 -924544 1844991 2764665 607507 -2770371 -4053195 -2238560 132391 482631 -462802
39348 -462802 -592424 -164710 -912327 -2290767 -1882925 534926 2480131 2535626 1520699
39339A520699j834738l309047l199668J11902K975410J293835j935318n39061
39331d915986M287903M914787m93089m570108k350572J163638k62140m045381
39323f270948l769097J51518J888002M0116r89971R10618K574973J851463J341914
39314b271412L324509N128334L011700j745340m134974k054658J251761J771831
39306D281751l69157j861419j012804K83264k07782j535628j031349J409895K845310
39297B802081J470393r39902j866890j365572j010222j201628j376224j528058
39289e016022j544295l06071K290854L593365J210850k910839m368868k031546
39281i082572J048964K401645K509897J968935l203k653483k706776J183876N443054
$$ plain form
39339 1520699 -314039 -3623086 -6822754 -6710852 -3735442 -2441607 -4376925 -4915986
39331 -4915986 -628083 4286704 3793615 -776493 -3127065 -1963427 -2225567 -6270948
39323 -6270948 -10040045 -9888527 -8000525 -7960409 -8950380 -8039762 -5464789 -3613326 -2271412
39314 -2271412 1053097 6181431 9193131 7447791 3312817 1258159 2509920 4281751
39306 4281751 3912594 2051175 1038371 1321635 1113853 -421775 -1453124 -43229 2802081
39297 2802081 4272474 3332572 1465682 100110 -910112 -2111740 -3487964 -5016022
39289 -5016022 -6560317 -6866388 -4575534 -982169 228681 -2682158 -7051026 -9082572
39281 -9082572 -8033608 -5631963 -3122066 -1153131 -1156334 -3809817 -6516593 -5332717 110337
39272A10337N651934J837193k585607n226512n585296l537824j19059J719114
39264g735720N02440q59726R10032L855864L508146K61191j223247j824k32830
39255a015674l127709l843666L25225M472219L555076M36605N22901K282872K97443
39246C905292m501552n539602j315315K237286J485244J12254J648433L285446
39238A317486J246045k469369l286482p44123K166022L807276M288429L236758
39230I562042P57204j177561j411573j760709l591658m684823k871745j72604
39222e351427O80193J114644L197526L888294o85685o640778n768825J734121
39214g831937N909268J321169m694757l202763K928308L977870j644456n425416
$$ plain form
39272 110337 5762271 7599464 5013857 -212655 -5797951 -9335775 -9454834 -7735720
39264 -7735720 -7233280 -8093006 -7182974 -3327110 181036 442227 -781020 -782844 -1015674
39255 -1015674 -4143383 -7987049 -7661824 -3189605 365471 802076 1324977 3607849 3905292
39246 3905292 -596260 -6135862 -7451177 -5213891 -3728647 -3616393 -1967960 1317486
39238 1317486 2563531 94162 -3192320 -3936443 -1770421 2036855 6325284 9562042
39230 9562042 10319246 9141685 7730112 5969403 2377745 -2307078 -5178823 -5351427
39222 -5351427 -4671234 -3556590 -359064 3529230 2843545 -3797233 -9566058 -7831937
39214 -7831937 -1922669 -601500 -5296257 -8499020 -5570712 -1592842 -3237298 -8662714
39206h662714j630216M965134O595976K643003j383882k037089j124433j498283
39198b132504k979107l378164j761607O88457K482341L202764K885132J245588
39190B52900j349626k832293j149509K704684N128113M151153J466914q73587
39182G498749l406598o433547o595522q24184O806122P742083M32240o007511
39174g88168l549752L593726N327259K99905l341233j394021O35134k024349m956052
39165f197551k184754L423360M581487J083461p48157J192797K170719o80020
39157B641342l810839l430673q19643Q45282O48274r73156l179792l243038J354033
39148i968210P587100Q635304L244883j891668j966148m61316j648667k781239
$$ plain form
39206 -8662714 -10292930 -5327796 1268180 3911183 2527301 490212 -634221 -2132504
39198 -2132504 -5111611 -8489775 -10251382 -9562925 -7080584 -3877820 -992688 252900
39190 252900 -1096726 -3929019 -5078528 -2373844 2754269 6905422 8372336 7498749
39182 7498749 4092151 -2341396 -8936918 -9761102 -2954980 4787103 5219343 -788168
39174 -788168 -4337920 -744194 4583065 4882970 1541737 147716 782850 -1241499 -6197551
39165 -6197551 -8382305 -4958945 -377458 706003 -42154 1150643 3321362 2641342
39157 2641342 -1169497 -4600170 -5419813 -4574531 -3926257 -4899413 -8079205 -11322243 -9968210
39148 -9968210 -2381110 6254194 9499077 7607409 5641261 5179945 3531278 750039
39140G50039M1108L200271N44253n864744q074858m183384j64871L73700O78075
39131a2700411L402102N487944L684261J31069j127042K22193J691351K010733
39123B802200J535038M66869j104544k491585l059616k704513j333011P96062
39115e093100K280767J924849P08161L43550K40904j436578l823182l633501p3831
39106h561961L433984L644070J336083m50527k77679P33638P12274q41694k227770
39097b499582j253161J586697L008039J274461j279062j899852j171765n33879
39089b768104R77017L640732L718230j412857o965576n980704J84812L437893
39081e168557R21329j840426q16719R52784J86684j109876n82349j03380j307027
$$ plain form
39140 750039 791147 3991418 4535671 -1329073 -9403931 -13587315 -13752186 -13378486 -12700411
39131 -12700411 -9298309 -3810365 -126104 4965 -1122077 -899884 791467 2802200
39123 2802200 4337238 4804107 3699563 1207978 -1851638 -4556151 -5889162 -5093100
39115 -5093100 -2812333 -887484 -179323 164227 405131 -1031447 -4854629 -8488130 -8561961
39106 -8561961 -5127977 -1483907 -147824 -598351 -876030 -142392 569882 -271812 -2499582
39097 -2499582 -3752743 -2166046 841993 2116454 837392 -1062460 -2234225 -2768104
39089 -2768104 -1791087 1849645 5567875 4155018 -2810558 -8791262 -8606450 -5168557
39081 -5168557 -4247228 -6087654 -6904373 -5951589 -5764905 -6874781 -7457130 -7560510 -8867537
39072h867537j599418J034910L534674K420917o61771k146666j976867j908230
39064a0169988j548814j10377P00176m67672j294951Q40291M249081N190318K951283
39055C39347k70958k616475l104931j200553J659059K484749Q74128j04937Q75936
39046a064635J074647r73041k169297l07965J645366Q86079L2999K137638M450546
39037E712337K818697j019294k470851j652897j836115k684043j390139J165667
39029a356638J714984P45933J094830J545014j475290o224876o591088j443334
39021a1990465L248020L050136K88419j035123n66213J80213Q19856J287826J086125
39012c631206O82629J131021J869661J518605O10231M96046J89360k041837m497446
$$ plain form
39072 -8867537 -10466955 -9432045 -5897371 -3476454 -4138225 -6284891 -8261758 -10169988
39064 -10169988 -11718802 -11829179 -11129003 -11596675 -12891626 -12051335 -7802254 -2611936 339347
39055 339347 68389 -2548086 -5653017 -6853570 -5194511 -2709762 -1835634 -1940571 -1064635
39046 -1064635 10012 -963029 -3132326 -3440291 -1794925 -908846 -875847 1261791 5712337
39037 5712337 8531034 7511740 5040889 3387992 1551877 -1132166 -2522305 -1356638
39029 -1356638 358346 1104279 2199109 3744123 2268833 -3956043 -10547131 -11990465
39021 -11990465 -8742445 -5692309 -5403890 -6439013 -7005226 -6825013 -6005157 -4717331 -3631206
39012 -3631206 -2948577 -1817556 52105 1570710 2180941 2676987 2866347 824510 -3672936
39003c672936l600204M08132L287995K527744k31186k367787k568718n34265K231375
38994d519850K420999p39973k952086p91301K271043J155168k139486j926862
38986g222348J169971J624967o84324l87272L115085M506789K690062K418723
38978G231653L775152L58827q130776j1799157n053294L862229N034808P71666
38970c948892p24180J124419J144274r26140q47690J650680K810609J668033L78137
38961B329250o08390j908308j803309R36580L107211J464385j502016j825294
38953A90109j049056k543042l938123r03232L708113K994447k368175m159752
38945h068711Q39814O136697N382505L88985l173895k814874K41877L199618K846827
$$ plain form
39003 -3672936 -7273140 -6865008 -3577013 -1049269 -1280455 -3648242 -6216960 -6751225 -4519850
38994 -4519850 -2098851 -2838824 -5790910 -6582211 -4311168 -3156000 -5295486 -7222348
38986 -7222348 -6052377 -4427410 -5111734 -5499006 -2383921 2122868 4812930 7231653
38978 7231653 11006805 11365632 3234856 -8564301 -13617595 -9755366 -4720558 -3948892
38970 -3948892 -4673072 -3548653 -2404379 -3330519 -4178209 -2527529 283080 1951113 2329250
38961 2329250 1720860 -187448 -1990757 -1054177 2053034 3517419 2015403 190109
38953 190109 -858947 -3401989 -7340112 -8243344 -4535231 -1540784 -3908959 -8068711
38945 -8068711 -7228897 -1092200 4290305 4679290 1505395 -1309479 -1067602 2132016 4978843
38936D978843j481508n445272m378854l34215O95300j557146j207633L528063
38928e202422O687508L863012j193580k953682j713329p13990k95846N84272O62499
38919b75558j265832k933309j587964J656624L775011M036289L266704J267437
38911G939402j776761l447541k073337J01501n6951j832397k080387j82752J542132
38902a867091J682598J200738J281313J795335J845277P02190j305109k439765
38894B895486j491389k07493j357043l964317l881075k83005K393139J164179
38886d731518r66706l15975J561409J262914n05844q73858J2778L38398P30428
38877c487974K356236L236010J339733r35205n31789N45282r13646k495985k87236
$$ plain form
38936 4978843 3497335 -1947937 -6326791 -6661006 -5965706 -7522852 -8730485 -5202422
38928 -5202422 1485086 5348098 4154518 1200836 -512493 -1226483 -1522329 -938057 -275558
38919 -275558 -1541390 -4474699 -6062663 -4406039 -631028 3405261 6671965 7939402
38911 7939402 6162641 2715100 641763 743264 686313 -1146084 -3226471 -3409223 -1867091
38902 -1867091 -184493 1016245 2297558 4092893 5938170 6640360 5335251 2895486
38894 2895486 1404097 1196604 -160439 -4124756 -8005831 -8288836 -5895697 -4731518
38886 -4731518 -5698224 -6014199 -4452790 -3189876 -3695720 -4569578 -4556800 -4218402 -3487974
38877 -3487974 -1131738 2104272 3444005 2508800 1977011 2522293 1608647 -887338 -1174574
38868a174574K593193J87670m906465m293139J742966L456554k117015n483492
38860i994302m34889N323193L059524k758461k923206J042483J030029k806640
38852h462269l062493J299054L670025J875864R55926K696895K284942j943823
38844f85879m255044r16258L380980K842442j306389m008939l159514J7920L294236
38835d796445L816012M48091k741157o11440M161029L301029l653486o667940
38827f744307o03974N622926K840517l436044k268966M251472M445369l317250
38819G89743p748740l012314K521334Q77230k712574N20069P764337Q686382J201139
38810H886606n880217n707819j261958J413073J630147K052896K436278L53170
$$ plain form
38868 -1174574 1418619 1606289 -3300176 -7593315 -5850349 -2393795 -4510810 -9994302
38860 -9994302 -10429191 -5105998 -2046474 -4804935 -7728141 -6685658 -5655629 -8462269
38852 -8462269 -11524762 -10225708 -6555683 -4679819 -3723893 -1026998 1257944 -685879
38844 -685879 -4940923 -5857181 -2476201 366241 -940148 -4949087 -8108601 -8090681 -4796445
38835 -4796445 -980433 -532342 -3273499 -3884939 276090 3577119 -76367 -6744307
38827 -6744307 -7348281 -1725355 1115162 -2320882 -4589848 -338376 4106993 789743
38819 789743 -6958997 -9971311 -7449977 -6572747 -9285321 -8765252 -1000915 7685467 8886606
38810 8886606 3006389 -2701430 -3963388 -2550315 -920168 1132728 3569006 3922176
38802C922176l236462m044463r67950J487005k74373l124085j760102K819917
38794e178337M425968J173277j661294j77215K075580M17338k844849k045732
38786c815264K504284M754913K031121j515089j514249R79108K189694P50870
38778F365388j782749l489968l609902k695344j974808j794919j036436Q15305
38770i203433K121155J509575N74032J480205K939494J893530j278807k881129
38762b845378j431729M79675O22242R3089N90699J526356J436973K77690j019391
38753b69774j839980j962415j539534j192826r51678L64473L070205M844627L296041
38744C819139n23125l567329m703659m476372k522048J112589L430219J733845
$$ plain form
38802 3922176 685714 -3358749 -4326699 -2839694 -3114067 -6238152 -7998254 -5178337
38794 -5178337 -752369 420908 -1240386 -1417601 657979 1075317 -1769532 -3815264
38786 -3815264 -1310980 3443933 5475054 3959965 2445716 3424824 5614518 6365388
38778 6365388 4582639 1092671 -2517231 -5212575 -7187383 -8982302 -10018738 -9203433
38770 -9203433 -7082278 -5572703 -4998671 -3518466 -578972 1314558 35751 -2845378
38762 -2845378 -4277107 -3797432 -3175190 -3082101 -2491402 -965046 471927 749617 -269774
38753 -269774 -2109754 -4072169 -5611703 -6804529 -7756207 -7391734 -4321529 523098 3819139
38744 3819139 3296014 -271315 -4974974 -9451346 -11973394 -10860805 -7430586 -5696741
38736e696741j407042j291982J413424J877435l49362n64034K195036K642272
38728a180994j420892m116253o36859M240496L027057k704904m256638J521908
38720e527079P513706N566484l282552r934760p496984J036088O267748L492567
38712b364782k015847k756882Q81711K730260R52018l82750M96276M99449j286195
38703c246742j200549J729459L061782Q45329o13517J059475J440766k239390
38695H36613m889410k263601Q45070j070700l724263j01292O566202P129110J144638
38686D472367l061149j766484N83664J035548J705136K753471R45271k875933
38678C791891l291616L47832K015701q11778k801235m9024L536688L319018R49623
$$ plain form
38736 -5696741 -7103783 -8395765 -6982341 -5104906 -5454268 -6018302 -3823266 -1180994
38728 -1180994 -2601886 -6718139 -7354998 -3114502 -87445 -2792349 -7048987 -5527079
38720 -5527079 1986627 7553111 4270559 -5664201 -13161185 -12125097 -5857349 -2364782
38712 -2364782 -4380629 -7137511 -6255800 -3525540 -2573522 -2956272 -2459996 -1960547 -3246742
38703 -3246742 -4447291 -2717832 343950 1189279 575762 1635237 3076003 836613
38695 836613 -4052797 -6316398 -5471328 -6542028 -10266291 -10367583 -3801381 3327729 4472367
38686 4472367 1411218 -355266 228398 1263946 2969082 5722553 6667824 3791891
38678 3791891 500275 848107 2863808 2052030 -749205 -798229 2738459 6057477 7007100
38669G007100j92929q35895k427849l048888j364605k6789p08044n01605K111523
38660A2019K856449j119869m560352j607097L925760L808216j529664l858619
38652b073157m55891K293724M5114l022664k236822O0815j98393j483151l05745
38643g376170J648347K69194l187306l337671P31458L918792K935599M06031n03985
38634d495711o20727j288266q43257J718092L189777P34941k724898k581348R3061
38625f818336O59327j031291q03646J977477L186035J341275k54767l12858j680821
38616c737605m163958k532163M045840P643496K722425m387207m496454P97901
38608d107725K907176K62575r01700J508830K307638j072658l997626k595315
$$ plain form
38669 7007100 6814171 5978276 3550427 501539 -863066 -889855 -1597899 -2099504 12019
38660 12019 2868468 1748599 -2811753 -4418850 -493090 3315126 1785462 -2073157
38652 -2073157 -2529048 -235324 -190210 -3212874 -5449696 -5388881 -5587274 -7070425 -7376170
38643 -7376170 -5727823 -5458629 -8645935 -11983606 -11252148 -7333356 -4397757 -3991726 -4495711
38634 -4495711 -5116438 -6404704 -7247961 -5529869 -2340092 -1605151 -4330049 -6911397 -6818336
38625 -6818336 -6159009 -7190300 -7993946 -6016469 -2830434 -1489159 -1743926 -2056784 -3737605
38616 -3737605 -7901563 -10433726 -6387886 1255610 3978035 -409172 -4905626 -4107725
38608 -4107725 -1200549 -937974 -1839674 -330844 1976794 904136 -3093490 -5688805
38600e688805N40104J781593J993904L146045L852260J976341j254623k836890
38592C509929j927865k40782K50279q26319j668313j44595K514442K039838k272331
38583A234283m484465j66567N544217M663951j106866k851852J233780L374564
38575G441045m75342m443314l444088j133724j906673k849895k20459K653804
38567d378646J296292j380467k60643K362712O83082l733998l563509K433933
38559f541244P126310N554743J096354q66795j15047J82830j261733k979461l200207
38550a004250j574342N54517J273808M21835O3127J294218J995221P538k826691
38541B04981k799908K31946K701748K416326P26074o15197j717381k737250k404773
$$ plain form
38600 -5688805 -5148701 -3367108 -1373204 1772841 5625101 7601442 6346819 3509929
38592 3509929 1582064 1341282 1591561 765242 -903071 -1047666 1466776 3506614 1234283
38583 1234283 -3250182 -3416749 2127468 6791419 5684553 2832701 4066481 7441045
38575 7441045 6965703 2522389 -921699 -2055423 -3962096 -6811991 -7032450 -4378646
38567 -4378646 -3082354 -4462821 -4723464 -2360752 -1677670 -5411668 -8975177 -6541244
38559 -6541244 585066 6139809 7236163 6369368 6254321 6437151 5175418 2195957 -1004250
38550 -1004250 -2578592 -2024075 -750267 -328432 -265305 1028913 3024134 3031672 204981
38541 204981 -2594927 -2362981 338767 2755093 3481167 2865970 1148589 -1588661 -3993434
38532c993434n7905K384354K288307k62689k239965j230444J495235K390533J24100
38523H98092k622775k747233p72236M48659m7953q62628j217916j411599o68579
38514i004168J896219M013735K077479k718387m346177j31308M980709N179870
38506A947972J383117j342659j194810n66130j172042k009222j801953p79720
38498e535447R3247K81291L04644J493801L922566M850643J740127l138425m582187
38489e69740j671403Q04574m88448l003045l079634r83436J352788L544890M836407
38480G42953L011279j469268m022345k029387J242972J920337O48564o80218k417890
38471c053003l631459p80504N160478O406651l11803o189936k374065N804208
$$ plain form
38532 -3993434 -4051339 -1666985 621322 358633 -1881332 -3111776 -1616541 773992 898092
38523 898092 -1724683 -4471916 -5244152 -4795493 -4843446 -5706074 -6923990 -8335589 -9004168
38514 -9004168 -7107949 -3094214 -1016735 -3735122 -8081299 -8212607 -3231898 1947972
38506 1947972 3331089 1988430 793620 227490 -944552 -2953774 -4755727 -5535447
38498 -5535447 -5442200 -5160909 -4856265 -3362464 560102 5410745 7150872 4012447 -569740
38489 -569740 -2241143 -1436569 -1925017 -4928062 -8007696 -8991132 -7638344 -4093454 742953
38480 742953 3754232 2284964 -1737381 -3766768 -2523796 -603459 45105 -635113 -3053003
38471 -3053003 -6684462 -7464966 -2304488 4102163 3790360 -2399576 -4773641 1030567
38463A030567O606456q6176l958894j489174L33858j932897k625581J398404M484151
38454C760714K349763o70381m0784J288244m11138k217707m16768J960662L56585
38445E959190l022820l040273l78469L79463r25040m21561K150115K642271l70660
$$ plain form
38463 1030567 7637023 7550847 3591953 2102779 2436637 503740 -2121841 -723437 3760714
38454 3760714 6110477 5440096 5399312 6687556 6276418 4058711 3641943 5602605 5959190
38445 5959190 2936370 -103903 -482372 -102909 -1027949 -1449510 700605 3342876 2972216
$$ [...]
##END NTUPLES=NMR SPECTRUM
##END=
