##TITLE=31Pdec_SR69+TFAA(2)R
 CDCl3, 24 sc
 30.5.2022
##JCAMPDX= 6.0         $$ Bruker NMR JCAMP-DX V2.0
##DATA TYPE= NMR SPECTRUM
##DATA CLASS= NTUPLES
##ORIGIN= UXNMR, Bruker Analytische Messtechnik GmbH
##OWNER= root
$$ XWIN-NMR		Version 3.5
$$ Mon May 30 10:27:57 2022 Russian Standard Time (UT+4h)  she@DPX200
##.OBSERVE FREQUENCY= 81.013821
##.OBSERVE NUCLEUS= ^31P
##.ACQUISITION MODE= SIMULTANEOUS
##.ACQUISITION SCHEME= undefined
##.AVERAGES= 8
##.DIGITISER RES= 16
##SPECTROMETER/DATA SYSTEM= spect
##.PULSE SEQUENCE= zgpg30
##.SOLVENT NAME= CDCl3
##.SHIFT REFERENCE= (INTERNAL, CDCl3, 0, 248.564)
##AUDIT TRAIL= $$ (NUMBER, WHEN, WHO, WHERE, WHAT)
$$ ##TITLE= Audit trail, XWIN-NMR		Version 3.5
$$ ##JCAMPDX= 5.01
$$ ##ORIGIN= Bruker BioSpin GmbH
$$ ##OWNER= she
$$ F:/spectra/data/she/nmr/P31/1/pdata/1/auditp.txt
$$ ##AUDIT TRAIL=  $$ (NUMBER, WHEN, WHO, WHERE, WHAT)
(   1,<2022-05-30 10:25:49.17 +0400>,<she>,<DPX200>,
      <created by zg, POWCHK disabled, PULCHK disabled
       configuration hash MD5:
       00 E9 B6 7A A2 85 ED C7 34 08 36 98 17 FE 4E 26
       data hash MD5: 32K
       BD 19 D1 58 0A C3 BF 6C D6 36 9A 4B 78 4C 1E 4D>)
(   2,<2022-05-30 10:25:52.92 +0400>,<she>,<DPX200>,
      <Start of raw data processing
       efp BC_mod = 2 LB = 1 FT_mod = 6 PKNL = 1 PHC0 = -9891.812 PHC1 = 30.8537 SI = 64K 
       data hash MD5: 64K
       AC F1 B7 E3 D2 B2 CC E4 44 3B 60 52 51 3B 51 9F>)
(   3,<2022-05-30 10:26:20.87 +0400>,<she>,<DPX200>,
      <pk PHC0 = 20.70369 PHC1 = 0 
       data hash MD5: 64K
       18 67 7E 45 A1 1F A1 2B 6D 12 CA E5 F4 19 95 DC>)
$$ ##END=
$$ 
$$ hash MD5
$$ E2 4D 0B 42 77 5C D5 BD E3 02 CD 64 83 AF B7 2F
##$RELAX= 
##$RELAX= 
##$RELAX= 
##$RELAX= 
##$RELAX= 
##$RELAX= 
##$RELAX= 
##$RELAX= 
$$ Bruker specific parameters
$$ --------------------------
##$DU= <F:/spectra>
##$EXPNO= 1
##$NAME= <P31>
##$PROCNO= 1
##$TYPE= <nmr>
##$USER= <she>
##$AMP= (0..31)
100 100 100 100 100 100 100 100 100 100 100 100 100 100 100 100 100 100 
100 100 100 100 100 100 100 100 100 100 100 100 100 100 
##$AQSEQ= 0
##$AQ_mod= 1
##$AUNM= <au_zg>
##$AUTOPOS= <>
##$BF1= 81.014009
##$BF2= 200.13
##$BF3= 200.13
##$BF4= 200.13
##$BF5= 200.13
##$BF6= 200.13
##$BF7= 200.13
##$BF8= 200.13
##$BYTORDA= 1
##$CFDGTYP= 0
##$CFRGTYP= 5
##$CHEMSTR= <none>
##$CNST= (0..31)
1 1 145 1 1 1 1 1 1 1 1 1 1 1 1 1 1 1 1 1 1 1 1 1 1 1 1 1 1 1 1 1 
##$CPDPRG= <waltz16>
##$CPDPRG1= <>
##$CPDPRG2= <waltz16>
##$CPDPRG3= <>
##$CPDPRG4= <mlev>
##$CPDPRG5= <mlev>
##$CPDPRG6= <mlev>
##$CPDPRG7= <mlev>
##$CPDPRG8= <mlev>
##$CPDPRGB= <>
##$CPDPRGT= <>
##$D= (0..31)
0 1 0 0 0 0 0 0 0 0 0 0.03 2e-05 3e-06 0 0 0 0 0 0 0 0 0 0 0 0 0 0 0 0 
0 0 
##$DATE= 1653891948
##$DBL= (0..7)
120 120 120 11 120 120 24 19 
##$DBP= (0..7)
150 150 150 150 150 150 150 150 
##$DBP07= 0
##$DBPNAM0= <>
##$DBPNAM1= <>
##$DBPNAM2= <>
##$DBPNAM3= <>
##$DBPNAM4= <>
##$DBPNAM5= <>
##$DBPNAM6= <>
##$DBPNAM7= <>
##$DBPOAL= (0..7)
0.5 0.5 0.5 0.5 0.5 0.5 0.5 0.5 
##$DBPOFFS= (0..7)
0 0 0 0 0 0 0 0 
$$ [...]
##$SUBNAM2= <"">
##$SUBNAM3= <"">
##$SUBNAM4= <"">
##$SUBNAM5= <"">
##$SUBNAM6= <"">
##$SUBNAM7= <"">
##$SUBNAM8= <"">
##$SUBNAM9= <"">
##$SW= 501.771253377433
##$SWIBOX= (0..15)
0 1 3 0 0 0 0 0 0 0 0 0 0 0 0 0 
##$SW_h= 40650.406504065
##$TD= 32768
##$TD0= 1
##$TE= 0
##$TE2= 300
##$TE3= 300
##$TEG= 300
##$TL= (0..7)
0 120 53 12 22 120 120 120 
##$TP= (0..7)
150 150 150 150 150 150 150 150 
##$TP07= 0
##$TPNAME0= <>
##$TPNAME1= <>
##$TPNAME2= <>
##$TPNAME3= <>
##$TPNAME4= <>
##$TPNAME5= <>
##$TPNAME6= <>
##$TPNAME7= <>
##$TPOAL= (0..7)
0.5 0.5 0.5 0.5 0.5 0.5 0.5 0.5 
##$TPOFFS= (0..7)
0 0 0 0 0 0 0 0 
##$TUNHIN= 0
##$TUNHOUT= 0
##$TUNXOUT= 0
##$USERA1= <user>
##$USERA2= <user>
##$USERA3= <user>
##$USERA4= <user>
##$USERA5= <user>
##$V9= 5
##$VALIST= <valist>
##$VCLIST= <CCCCCCCCCCCCCCC>
##$VD= 0
##$VDLIST= <DDDDDDDDDDDDDDD>
##$VPLIST= <PPPPPPPPPPPPPPP>
##$VTLIST= <TTTTTTTTTTTTTTT>
##$WBST= 1024
##$WBSW= 4
##$XGAIN= (0..3)
0 0 0 0 
##$XL= 0
##$YL= 0
##$YMAX_a= 1517
##$YMIN_a= -2058
##$ZGOPTNS= <>
##$ZL1= 120
##$ZL2= 120
##$ZL3= 120
##$ZL4= 120
##$ABSF1= 0
##$ABSF2= 0
##$ABSG= 0
##$ABSL= 0
##$ALPHA= 0
##$AQORDER= 0
##$ASSFAC= 0
##$ASSFACI= 0
##$ASSFACX= 0
##$ASSWID= 0
##$AUNMP= <proc_1d>
##$AZFE= 0.1
##$AZFW= 0.5
##$BCFW= 0
##$BC_mod= 2
##$BYTORDP= 0
##$COROFFS= 0
##$CY= -3
##$DATMOD= 1
##$DC= 0
##$DFILT= <>
##$DTYPP= 0
##$F1P= 0
##$F2P= 0
##$FCOR= 1
##$FTSIZE= 65536
##$FT_mod= 6
##$GAMMA= 0
##$GB= 0
##$INTBC= 1
##$INTSCL= 5.30512e-09
##$ISEN= 30
##$LB= 1
##$LEV0= 0
##$LPBIN= 0
##$MAXI= 10000
##$MC2= 0
##$MEAN= 0
##$ME_mod= 0
##$MI= 50
##$NCOEF= 0
##$NC_proc= -10
##$NLEV= 6
##$NOISF1= 182.463
##$NOISF2= 159.3651
##$NSP= 0
##$NTH_PI= 0
##$NZP= 0
##$OFFSET= 248.5645
##$PC= 4
##$PHC0= -9871.107
##$PHC1= 30.8537
##$PH_mod= 1
##$PKNL= yes
##$PPARMOD= 0
##$PSCAL= 0
##$PSIGN= 0
##$REVERSE= no
##$SF= 81.014009
##$SI= 65536
##$SIGF1= 159.3651
##$SIGF2= -187.1042
##$SINO= 113.3802
##$SIOLD= 16384
##$SREGLST= <1H.CDCl3>
##$SSB= 0
##$STSI= 65536
##$STSR= 0
##$SW_p= 40650.406504065
##$SYMM= 0
##$S_DEV= 0
##$TDeff= 32768
##$TDoff= 0
##$TI= <>
##$TILT= no
##$TM1= 0
##$TM2= 0
##$TOPLEV= 0
##$USERP1= <user>
##$USERP2= <user>
##$USERP3= <user>
##$USERP4= <user>
##$USERP5= <user>
##$WDW= 1
##$XDIM= 65536
##$YMAX_p= 401281960
##$YMIN_p= -322699256
$$ End of Bruker specific parameters
$$ ---------------------------------
##NTUPLES= NMR SPECTRUM
##VAR_NAME=  FREQUENCY,     SPECTRUM/REAL,   SPECTRUM/IMAG
##SYMBOL=    X,             R,               I
##VAR_TYPE=  INDEPENDENT,   DEPENDENT,       DEPENDENT
##VAR_FORM=  AFFN,          ASDF,            ASDF
##VAR_DIM=   65536,         65536,           65536
##UNITS=     HZ,            ARBITRARY UNITS, ARBITRARY UNITS
##FACTOR=    0.620285442955139, 1,           1
##FIRST=     20137.2065510759, 0,            0
##LAST=      -20513.1999529892, 0,           0
##MIN=       -20513.1999529892, -322699256,  0
##MAX=       20137.2065510759, 401281960,    0
$$ Real data points
##PAGE= N=1
##DATA TABLE= (X++(R..R)), XYDATA
$$ [...]
45392 1508702 3927849 -6577148 -14068093 -10187794 -4709407 -5282181 -4627709 3106807
45384 3106807 8870899 3930812 -3709876 -2098393 4669883 3957801 -4517173 -10306448
45376 -10306448 -10488920 -11411651 -14441829 -14466165 -11861395 -11836853 -11624403 -2970399 10629579
45367 10629579 14288578 3953227 -6099585 -4927890 -593541 -4460381 -11482204 -9015765
45359 -9015765 2016297 8199469 2908379 -6967740 -12817463 -13125753 -9966005 -5011874
45351 -5011874 -1003351 -963428 -3647124 -4050049 -104179 4489817 5208673 1542432 -3924399
45342 -3924399 -8475228 -10265073 -8671111 -5038412 -1901204 -549257 107562 1965248
45334 1965248 5372363 8450718 8896531 6707831 4394572 3535403 2304248 -1569927
45326 -1569927 -6496587 -8708812 -7615285 -5629937 -2652141 4459044 15141698 22263865
45318 22263865 19219054 7393422 -5771332 -13800286 -14492565 -9378747 -2776037 697525
45310 697525 223584 -948317 -481450 263534 -458835 -2200712 -5008675 -10744200 -18657014
45301 -18657014 -23384905 -21509348 -17201379 -16627636 -18729030 -16791830 -8702017 -565086
45293 -565086 1330960 -1242410 -648501 7138737 17063856 20068623 13491815 4236606
45285 4236606 -247835 -1418902 -5612703 -12426424 -14145867 -7710602 94622 2510761
45277 2510761 1084146 -258510 -2721285 -7883487 -10736583 -5220726 5896128 13265087
45269 13265087 11437916 2288883 -8981579 -15983585 -13166439 -2507937 4923325 1154659
45261 1154659 -7893209 -11058520 -7525310 -4466292 -2707045 2985925 10145083 8815748
45253 8815748 -1661407 -9060626 -6907107 -4736387 -11701159 -20219669 -16835377 -2886162
45245 -2886162 7069816 4775418 -3508853 -7505734 -3472102 6126075 16664332 23421908
45237 23421908 23989934 20000176 14330073 7593025 132929 -4561528 -2800052 3783722
45229 3783722 9693622 12152314 12607439 12259217 10265030 6900299 4793470 5418369 6451939
45220 6451939 4052547 -2836331 -10708438 -14010825 -10566983 -4766267 -3337477 -7304941
45212 -7304941 -10970077 -10074248 -7161866 -6227367 -6002053 -2786784 3025471 8049127 11246150
45203 11246150 13124378 11711184 5478743 -676212 649084 8290529 11584272 3175227
45195 3175227 -11862704 -22455642 -23269078 -17283936 -10156440 -5588597 -4431222 -5273137
45187 -5273137 -6317306 -7705679 -10676801 -14123610 -14837670 -12503219 -11281274 -13838814
45179 -13838814 -16276586 -12388641 -1807022 9313185 15434816 16485293 14978642 11059896
45171 11059896 2908371 -8280593 -16256089 -15066020 -6449097 694771 21861 -4859815
45163 -4859815 -5297021 1403026 9349849 12124412 9483513 5065914 1253719 -1344549
45155 -1344549 -1995289 -302574 2584344 5272426 8047773 12368850 18927596 26263146
45147 26263146 30255055 26052768 13428252 -262858 -6443737 -4993629 -3042874 -3551126
45139 -3551126 -1587113 5129265 9343017 4438908 -3947216 -5091756 825214 3137843
45131 3137843 -3245890 -11410994 -14097006 -13366126 -14284736 -15433718 -11466771 -1626734
45123 -1626734 9027627 14828764 12940540 4412655 -5055452 -8265756 -3973332 1100141
45115 1100141 838808 -2329749 -1647378 4475288 11504799 15382826 15568829 12823822 8326711
45106 8326711 4018851 -37596 -6807962 -16065847 -19519503 -9438924 8399676 18761197
45098 18761197 15870167 10253258 12967698 20630176 21977837 13203949 -30983 -10791634
45090 -10791634 -13531251 -3451609 16703197 31490227 25704572 3734586 -13894358
45083 -13894358 -15429801 -9116152 -6156235 -4718344 574559 3806189 -4205754 -18266265
45075 -18266265 -23267007 -15397799 -5969390 -2755121 -467067 5765308 9695876 5015447
45067 5015447 -1970266 -875878 6844904 10318125 4806657 -3860806 -8859861 -8491983
45059 -8491983 -3728249 2795439 5772044 2592064 -475143 4715565 14619829 16354863
45051 16354863 6076191 -3916080 -1503318 9139074 14661160 11099091 7798227 13966726
45043 13966726 26782887 33676485 24735402 3709370 -13289540 -13391914 -1534664 5756778
45035 5756778 1935233 -2068844 4447837 15859916 19865850 16043836 13676160 14856731
45027 14856731 12127155 3063719 -4355208 -4232123 -1368400 -2743299 -7324592 -9409950
45019 -9409950 -7267251 -4012647 -3267503 -6905235 -13653260 -17737088 -13094300 -1577009
45011 -1577009 6991179 5584097 -2795274 -10488853 -13185706 -10332146 -3068995 4472562
45003 4472562 6620472 3123849 563854 3116713 6671676 6175959 3063210 -111541
44995 -111541 -6184545 -16712759 -24053108 -19888245 -8585847 -1928934 -2411311 -2544948
44987 -2544948 148928 -27281 -3435398 -1618528 7567595 13552051 9399886 3507240
44979 3507240 4977309 7220378 -572451 -12480002 -12112157 2495774 15873301 17976604
44971 17976604 14688267 11542743 2787598 -14146316 -26410202 -21295351 -5966573 2159333
44963 2159333 -173502 -1493838 3090826 5794259 3234129 4119664 13134364 19878338
44955 19878338 13845645 1409958 -3362467 900067 3238665 -1743420 -7603589 -7551363
44947 -7551363 -2456732 3748046 7965319 5571173 -6993769 -23669057 -30424765 -20513646
44939 -20513646 -2882018 8632729 9368651 3442198 -4348976 -10269639 -10447763 -5291174
44931 -5291174 -2033639 -5772918 -10418776 -6482508 3328376 5391949 -6314237 -21462150
44923 -21462150 -27209935 -23721741 -19874881 -18855239 -16263678 -10652287 -7078752 -7926177
44915 -7926177 -7221838 883428 12146242 16745754 12063174 4771487 111962 -4047864
44907 -4047864 -9644728 -11596660 -5072919 4056838 4135084 -6786498 -17413374 -17513659
44899 -17513659 -10293550 -6849915 -11716297 -17870943 -15206382 -1952106 12181535 14875164
44891 14875164 4995988 -4248873 -703 14010266 22155831 17435215 9151342 8073113
44883 8073113 12733511 15183478 12369598 5557170 -4204163 -12640149 -11476537 -194994
44875 -194994 8148689 3942670 -2201847 6190709 24058635 28905311 13325085 -4235692
44867 -4235692 -7032934 -1837046 -3040783 -8968113 -8255234 -679066 3955607 3282830
44859 3282830 4087107 7959844 8674335 4541687 938462 -1655663 -9903382 -23543724
44851 -23543724 -30920230 -26026868 -19931619 -24826390 -33973558 -30471105 -13020222 990641
44843 990641 176507 -5930904 -3289764 5517702 7143521 -942244 -6766743 -1473028
44835 -1473028 10092624 19234146 24537573 27759593 26200991 17268970 6622317 3401205
44827 3401205 8221710 12536822 9718057 907664 -9932201 -20278878 -27119542 -26907791
44819 -26907791 -20300922 -12743235 -7980392 -4496217 53366 4896093 8381659 9928828
44811 9928828 7835085 66968 -9726929 -12033893 -2249400 11563027 16768102 10319570
44803 10319570 543813 -3834327 -2058567 992120 1683820 958519 2176414 6218172
44795 6218172 9389731 7945307 3914528 2603074 4098622 2480529 -4894469 -13254295
44787 -13254295 -18428369 -22233173 -25206230 -21654715 -9989110 -1388415 -6883007 -19306225
44779 -19306225 -20713522 -7328412 5835005 7418597 3498298 3284007 3671031 -1994735
44771 -1994735 -9083770 -8189432 -1579492 -294977 -5859077 -6938321 3338023 16810785
44763 16810785 21920185 18486856 14588723 13253766 9403216 -491914 -10979832 -12026295
44755 -12026295 363555 18839354 30457507 28509147 18275666 9930310 7149336
44748 7149336 5877648 3304759 2251561 4426883 4995038 -803160 -8883539 -10548984
44740 -10548984 -4605455 858003 -480776 -5879010 -9064676 -8101426 -5126596 -2699606
44732 -2699606 -3702354 -10788557 -21686579 -28252075 -24858000 -15304188 -6935622 -955551
44724 -955551 5444186 10143323 7806050 435244 -2859987 717005 2889429 -2391838
44716 -2391838 -8613825 -6694176 579861 2953602 -1527353 -4513686 -1024653 3350244
44708 3350244 1215055 -7020905 -15223461 -18542260 -15802734 -9181550 -4184008 -5839878
44700 -5839878 -11572324 -11492408 -59626 15093812 20829023 13920675 3948058 460770
44692 460770 2134073 1118251 -5634152 -13847960 -19365829 -22798394 -25025341 -22765054
44684 -22765054 -13455252 -2327646 1801013 -1326520 -1818562 6405738 15754784 14978633
44676 14978633 5090545 -2510859 -2495266 -1640849 -6663958 -13563788 -13326040 -3345929 10829247
44667 10829247 21398893 22653219 13546257 -32017 -8954676 -10595506 -11262212 -15351788
44659 -15351788 -17561876 -12127029 -4368973 -3402184 -6303930 -1433536 11703672 18468727
44651 18468727 10140967 -1987324 -2239106 7716221 13484124 9621899 4957626 7190890
44643 7190890 13348441 17795487 20262112 21732874 20041522 14921056 11507622 12938838
44635 12938838 14123482 9231275 1755800 6960 4806265 9315201 10343267 11455133
44627 11455133 13394359 10182668 -288097 -8605904 -4313914 9128149 17324719 12342336
44619 12342336 695417 -6755908 -6759253 -3109333 519707 2686833 1961361 -2640790
44611 -2640790 -9239768 -13976569 -14381063 -10667537 -5237738 -2593804 -6940495 -16067174
44603 -16067174 -19829431 -10431835 5928625 13838597 6966360 -3954656 -4545000 6786300
44595 6786300 19863877 25518948 21865809 11562019 -263074 -6881396 -5302797 -401473
44587 -401473 1600413 2265131 6879479 12811502 11179236 1206785 -6973902 -7410388 -6433659
44578 -6433659 -9720528 -10658708 -1016539 13404251 18988037 13252661 6964948 7890726
44570 7890726 12103831 12753113 9145797 4496149 948744 -603201 -491818 -1504975
44562 -1504975 -5597957 -8843817 -5037548 4813879 12281071 12060642 7012566 1214006
44554 1214006 -5657864 -14285606 -21886028 -25926782 -26936494 -24590238 -16019366 -1717036
44546 -1717036 11374714 16714507 14596754 8770256 1121479 -6539138 -10086328 -7610473
44538 -7610473 -3185230 -1537209 -1846573 -1125831 -501711 -3033057 -7696791 -10536028 -9927780
44529 -9927780 -6424209 -73058 6956704 8044402 -562553 -11349345 -12152875 -2102719
44521 -2102719 6234236 3209107 -5980627 -10314377 -8772850 -10143437 -18403068 -25485844
44513 -25485844 -21479691 -7695314 4734304 7322752 738940 -10103594 -21114621
44506 -21114621 -27462429 -24045371 -13168666 -6609517 -12373588 -22388648 -21785898 -8733052
44498 -8733052 4338185 8844384 8644909 8729061 6837121 1373532 -2653189 -2522425 -3867809
44489 -3867809 -10275781 -14993774 -11703807 -6064501 -6453327 -9626682 -7050697 -715704
44481 -715704 -9904 -5274676 -7407685 -3923638 -3008094 -9046917 -15017563 -13724579 -8010830
44472 -8010830 -4406391 -2592106 3368326 16011499 29782226 34169371 21982195 -2427932
44464 -2427932 -24137195 -30740350 -23675516 -13211684 -5114452 1993795 8537263 11034728
44456 11034728 7609565 609165 -6497211 -10326109 -7230931 2781403 13313320 17996992
44448 17996992 17336109 14367619 8728037 2489035 5277243 21785658 38992385 40212081
44440 40212081 29368881 25164255 31473671 32189677 19655565 9016583 14242612 25647042
44432 25647042 24789871 11141527 376920 2652857 14127535 25637153 30517695 27514468
44424 27514468 22868754 24989817 31776670 30209619 14627328 -3157444 -9995244 -8793133
44416 -8793133 -9759387 -12709777 -10556561 -3996816 986298 5945827 15894912 24660853
44408 24660853 19626010 2521283 -8646750 -2982721 9458237 13214001 7466641 2699979
44400 2699979 3234669 2211548 -6272624 -16558277 -16890444 -4353845 9818092 12766085
44392 12766085 4717686 -4532743 -11257465 -19746325 -27801683 -23881219 -6096241 8196787
44384 8196787 3711386 -10938372 -16395259 -10200472 -5096950 -4462779 1559723 15008880
44376 15008880 23992416 22518292 19673541 21456594 18889942 5211265 -7924548 -5698909
44368 -5698909 6418515 9512498 -1836720 -13752348 -14978167 -11921376 -16571433 -27855785
44360 -27855785 -32726866 -23304553 -6948220 1863010 -3072143 -14104053 -18501744 -10758095
44352 -10758095 4026658 16533969 21088552 18914371 16155565 17753409 21376823 19441273
44344 19441273 9865467 1633321 4350314 14499945 19368218 14341238 7877383 7246446
44336 7246446 8494058 6017808 3746895 7633370 12386292 7295607 -5680841 -11501684
44328 -11501684 -2917208 8823740 10631042 5854200 5877300 9959187 7321311 -2050838
44320 -2050838 -4266192 5964946 13768063 4816988 -13334242 -23104890 -21508417 -17755981
44312 -17755981 -12463143 1626882 18897674 21438053 6170954 -6780237 -2308679
44305 -2308679 8960693 10121491 3796306 3015535 7288842 5761365 -1952613 -5840958
44297 -5840958 -3610432 -2062883 -1144878 6800902 19706742 23371503 11930332 -1941630
44289 -1941630 -4457425 1269653 2424844 -5045809 -13329337 -15138205 -12206906 -10263088
44281 -10263088 -8981662 -1160700 15356991 28560022 23941788 5957225 -4347045
44274 -4347045 1392462 6161641 -4471763 -16393152 -8303895 11143181 12642105 -9667021
44266 -9667021 -29054122 -25297410 -9200844 314213 1804478 1725969 -1875780 -10604877
44258 -10604877 -14852769 -7500645 2157796 2569498 -1777867 -593493 3050696 -99416
44250 -99416 -6358200 -4554131 3199158 3271889 -7319694 -15653818 -11627979 538479
44242 538479 11781310 18315423 19764619 16895320 14330481 17437210 23609815 23669086
44234 23669086 14527616 4122852 1302538 6436426 14034973 18937565 17532548 8379960
44226 8379960 -4940833 -15402806 -19694021 -20710725 -21106575 -18437589 -10054661 250655
44218 250655 5091544 2480253 -1908924 -2656046 -1673883 -4379536 -10505096 -13555994 -10370470
44209 -10370470 -5919665 -5134882 -5024377 -723943 4912187 5748379 3400774 4032857 5604319
44200 5604319 309051 -8835802 -7226744 9672408 25876135 25133156 12578046 5927267
44192 5927267 11671991 20693567 23162071 17112988 4363672 -11962960 -25292664 -28583942
44184 -28583942 -21239681 -9328386 466495 4298464 1450762 -4750169 -8909025 -9922159
44176 -9922159 -12018128 -16519710 -18014524 -13443902 -9210264 -12576230 -20295721 -22601591
44168 -22601591 -15460122 -3318785 6913836 9870244 4350632 -3062336 -2448029 6323558
44160 6323558 11768722 7909769 4241228 9803495 16605275 11390508 -3000256 -11941685
44152 -11941685 -9987977 -3463078 4130137 13988464 21100007 17518712 7607335 5022113
44144 5022113 11921403 15344663 8008554 -1119139 -2588121 -280170 -2174487 -7345455
44136 -7345455 -9823699 -7941016 -3373660 2733738 7288148 4996680 -4240619 -12797100
44128 -12797100 -14395186 -11214031 -9128312 -10785058 -15518199 -20757431 -21847605 -16231943
44120 -16231943 -8983837 -7798415 -11738764 -12319917 -6469663 156306 3918921 7381731
44112 7381731 10316349 7194437 -1769319 -7078722 -3483406 1702911 454481 -3429687
44104 -3429687 -791526 9753817 21451971 27298088 23585944 11088910 -3018130 -10247237
44096 -10247237 -11408351 -15346482 -24061411 -28376438 -23410234 -17852771 -19759943 -22753076
44088 -22753076 -17012955 -6715406 -4640328 -13682231 -24654549 -29648769 -27615260 -19242224
44080 -19242224 -6774374 1960520 -533722 -10302556 -14822386 -8543168 1112874 4683377
44072 4683377 1420857 -3098033 -5250714 -6173835 -8377190 -11569538 -12216312 -8223228
44064 -8223228 -3536772 -4397074 -10007076 -11900697 -5419512 3324293 6207714 3918052
44056 3918052 2295977 1873108 -1650907 -7933522 -10046951 -3492190 6949091 11333635
44048 11333635 4518399 -8228416 -15831890 -12791094 -4649362 498865 2985087 8046098
44040 8046098 14059426 14012336 8512994 5641300 5444831 -2048583 -17438189 -24620103
44032 -24620103 -13419342 2355731 3107588 -9233342 -17168275 -14405502 -9932744 -8266864
44024 -8266864 -3005033 8091142 16510721 16149639 11787219 9660136 8748830 6309895
44016 6309895 4755752 7989055 15289809 21804102 22187349 14053406 2103460 -2948922
44008 -2948922 4078325 13857841 12713183 1026847 -6875476 -1631204 10882930 19622571
44000 19622571 20339787 14765348 5475639 -4187029 -10105827 -10769351 -7694203 -1811484
43992 -1811484 6591977 14540025 17955329 16627055 13044226 7491371 -128945 -5472815
43984 -5472815 -4124347 174130 -340301 -5294883 -6558175 -1344646 3714899 3335487
43976 3335487 364013 -531555 1079860 3675116 5696378 3997798 -3021926 -10098813
43968 -10098813 -9857721 -2981855 3690079 8104214 12817131 15166481 9395081 -793671
43960 -793671 -4398108 147636 3326898 2043159 3860633 9123544 5388720 -11367545
43952 -11367545 -25192052 -21667823 -8162991 446416 4572839 13021400 22350985 20491165
43944 20491165 6951529 -5765260 -9248062 -5468108 1640825 9149064 11879947 7545865
43936 7545865 3174760 5733465 9275134 3425838 -7844853 -9758298 873425 10308182
43928 10308182 7476911 -2687316 -8899195 -6701456 1140606 8624106 8105031 -3796601
43920 -3796601 -19169819 -25118525 -18882561 -9257777 -2497864 3669195 10418816 13146296
43912 13146296 10640062 9043203 10876401 8701838 -3205155 -17507575 -21798425 -13948160
43904 -13948160 -2912734 3165445 3865818 2575898 615330 -2923607 -6595564 -4544689
43896 -4544689 6634396 18463804 15723833 -3240892 -19051310 -14068430 3632712
43889 3632712 12039214 6022444 -248708 323078 -891015 -7060939 -6677374 5455755
43881 5455755 16085788 14174535 7797933 7087528 5497468 -5638614 -17107337 -15361950
43873 -15361950 -5954578 -3174746 -3946742 5772187 22466377 26137332 11066040 -5575571
43865 -5575571 -9838631 -6830302 -5018707 -2520424 3041726 6069152 3242720 270002
43857 270002 935880 640174 -2750399 -3597098 -880368 -3328347 -13964071 -21839603 -18603105
43848 -18603105 -11481999 -9431107 -8407973 -2978470 -1204867 -12347241 -27858410 -31172835
43840 -31172835 -21696017 -13590993 -13876955 -16702867 -17624878 -18894984 -20290602 -17668400
43832 -17668400 -11722871 -7375415 -4632917 -376186 2649535 357437 -1769538 3776840
43824 3776840 10254211 4611260 -8436577 -9281125 6183403 18804194 15990181 9710742
43816 9710742 13590622 20439392 17921972 11075447 10614849 10415430 -2569181 -22522576
43808 -22522576 -29622046 -18733692 -4790372 773258 1922177 4241712 5248470 3171179
43800 3171179 2234771 3914068 3822206 1716549 3879042 10848079 13507148 7185631 -402559
43791 -402559 -1921071 -1513055 -5199530 -8891685 -5785269 673470 1754010 -2396062
43783 -2396062 -3631468 924790 5887403 7989826 11162386 19107031 28553960 32471764
43775 32471764 26942331 13997579 295557 -6915264 -5084642 2171136 9816884 15428670
43767 15428670 16919441 10864651 -1877124 -12574982 -13841161 -10427866 -12270762 -17121396
43759 -17121396 -10974892 10076971 29006295 28029583 12655686 3669739 8043996 11681846
43751 11681846 3597031 -6626851 -4474189 6602620 11094431 5495711 1930304 7489179
43743 7489179 14232237 14404746 12578224 14252830 13397606 3080429 -9340293 -11369592
43735 -11369592 -5191980 -3666652 -8096109 -5718074 8103987 20300479 19149576 10437723
43727 10437723 6279409 8001842 9628848 10238496 12429963 14052096 11408512 6967295
43719 6967295 5245952 4482376 467896 -4939809 -7265748 -7649446 -9155326 -8814859 -2901027
43710 -2901027 3346648 1782053 -5529608 -10156475 -11571803 -15129650 -17901507 -11565393
43702 -11565393 -25900 2186841 -6919472 -11541043 -3063521 5485662 696525 -9305219
43694 -9305219 -8264578 2722536 8358814 2099603 -8125019 -14050202 -14639523 -11426934
43686 -11426934 -6959785 -6246855 -10591066 -12606683 -6181903 2765287 5391028 4327341
43678 4327341 6455331 6803802 -3933146 -18593057 -19260090 -5295925 3417027 -3855634
43670 -3855634 -14300269 -14443066 -9346798 -8137611 -7295617 -2389259 -1534475 -10348748
43662 -10348748 -15860380 -4621131 12340018 13596676 657276 -4854292 4515397 13368209
43654 13368209 11818292 10202344 17306048 23230226 16250244 2323645 -5639088 -7495885
43646 -7495885 -11525500 -17870488 -19480320 -15208492 -10190940 -5535952 2079156 11611309
43638 11611309 17330787 17157602 14209141 10415483 5076672 -502044 -3038560 -2231571
43630 -2231571 -789984 289072 1911928 2944336 887647 -3569978 -6913621 -7705005
43622 -7705005 -7641572 -8340493 -10331521 -13861530 -17158978 -16144979 -10529711 -7661630 -13860787
43613 -13860787 -23344701 -23447856 -11410020 1742896 6258103 5036237 5719427 8161270
43605 8161270 6870041 2425252 2239038 8932627 14170247 8203194 -6826555 -17713237
43597 -17713237 -15292271 -5109288 529853 -899258 314765 10464111 20831344 17592073
43589 17592073 -37203 -18297527 -24757724 -19628640 -11091886 -5678236 -5335477 -8583771
43581 -8583771 -10785691 -6414809 5238448 17762619 23211198 19375294 10767027 3727659
43573 3727659 1199110 949490 -1526930 -7379650 -12258798 -11491250 -6268333 -1770468
43565 -1770468 155849 2649715 7755500 12434009 12239776 6545719 -1201050 -6765342
43557 -6765342 -8160274 -6976379 -6573456 -7562318 -6520871 -1530216 3366472 3383637 754715
43548 754715 1838998 7458311 12194878 13022016 11840134 8991006 2183980 -5953527
43540 -5953527 -7635233 -1622359 2375706 -3065441 -11968244 -14228009 -10512704 -9090458
43532 -9090458 -11133412 -9133253 -117782 8366587 8386761 1810396 -2995913 -1002637
43524 -1002637 5646797 11118839 11019647 5695742 -15743 -1471975 391629 -418348 -7833648
43515 -7833648 -17756451 -20834320 -12350644 1159747 7529896 2579729 -4461919 -2441363
43507 -2441363 7115758 12526026 8496014 2765644 3624612 7835153 6532917 -1552894
43499 -1552894 -9251088 -10915466 -7330837 -1813168 3247892 5961233 5243891 2155549
43491 2155549 -1399379 -4677639 -6874284 -5784439 -553810 5835214 9635189 10357540
43483 10357540 9506907 7796892 6204288 6616490 8281749 7421223 4238434 5419976
43475 5419976 13638430 19288939 11355894 -5883311 -16411784 -12437599 -1706032 5925328
43467 5925328 9422744 10803355 7731824 -1502099 -11272062 -13660589 -7726051 840798
43459 840798 7051488 9692720 9107817 6047416 2413192 543429 1331136 3479418 4286031
43450 4286031 2165873 -67394 3503147 13925816 22926595 21803656 13298957 7635563
43442 7635563 7175767 3920052 -5679001 -13149160 -10606766 -2536258 2366489 4140272
43434 4140272 7365574 9448703 4136959 -5306468 -7648258 240831 8378234 7995302
43426 7995302 3131886 3365205 10627424 18290840 19772265 13595263 2535308 -7878892
43418 -7878892 -11409372 -5776338 4340239 11146854 10862327 6089091 1808501 316347
43410 316347 -116405 -2232621 -5334226 -4571487 3414372 14369098 19152975 14012470
43402 14012470 5072359 72796 -1394639 -5099383 -11215652 -11938707 -1764601 14009131
43394 14009131 24087975 22383363 12187825 1475472 -2984525 1190086 10258940 15645677
43386 15645677 10912179 -942892 -9679427 -8681210 -1374392 4299611 4645753 1023446
43378 1023446 -4846262 -11707987 -16038285 -13799835 -6483487 -1657061 -5075076 -14424986
43370 -14424986 -22689303 -25334919 -22085034 -14481594 -5574832 -336999 -1580809 -5607228
43362 -5607228 -6783594 -6960622 -13997098 -27828201 -34895775 -23797846 -2411544 9987568
43354 9987568 6761332 -82368 397401 3720129 1580443 -2433806 461552 7956067
43346 7956067 9532609 3639032 30224 4390710 11747231 17383794 23331409 29536318
43338 29536318 28625051 16395920 405790 -8646335 -8780495 -4641555 583027 5342985
43330 5342985 7384904 7284195 9316554 13600558 13706836 7993755 5410281 11503327
43322 11503327 16460913 8509089 -6667545 -12871230 -6062912 3341474 8542794 12217240
43314 12217240 14418912 9852518 369504 -3686313 431636 2797469 -2513506 -7479896
43306 -7479896 -3865564 3834516 7265733 6642600 5726859 2949973 -2933100 -5701359
43298 -5701359 -691025 4544685 -474552 -12410331 -16970994 -7495101 7698568 16152757
43290 16152757 12862397 1817691 -8285639 -10786793 -7935607 -8829642 -16666679 -22779958
43282 -22779958 -19306153 -12254307 -12915348 -20152588 -22318988 -15753124 -9627913 -9974502
43274 -9974502 -9559854 475879 16106710 24531384 19524101 7072620 -3111054 -7260766
43266 -7260766 -7997855 -8029786 -6605340 -3320431 -2421159 -8152704 -15786818 -14036621 54999
43257 54999 14671074 17220885 9731561 3201498 704084 -4686083 -16121930 -26171198
43249 -26171198 -25996568 -15606000 -3033027 3070091 -118775 -7018432 -8280366 -1187606
43241 -1187606 6874062 8864674 7543280 8653397 9924754 5738029 -1360292 -4639932
43233 -4639932 -6022154 -12624360 -21474130 -21374904 -11511259 -4216577 -5588614 -7197982
43225 -7197982 -2412514 2943057 3419653 3580830 5671794 1625307 -10623328 -16255324
43217 -16255324 -4584101 10299163 8491233 -4348390 -5768672 7579902 15987139
43210 15987139 9800906 3231256 7831275 13029300 5639599 -7132145 -9432671 -1450868
43202 -1450868 2304642 -6115302 -20792880 -31424951 -30558116 -16136543 3573162 12315944
43194 12315944 3208838 -10286528 -10759240 396154 8211618 7547077 6300180 6765297
43186 6765297 910304 -12090762 -19519647 -13875942 -5022522 -4516535 -8887372 -9020905
43178 -9020905 -6687063 -9190432 -14255372 -13726317 -8659328 -7344852 -9487298 -5599139
43170 -5599139 6040943 13793074 8639444 -3148937 -8783892 -4461265 2578551 3512880
43162 3512880 -3730020 -12663733 -13634468 -4374884 5435323 5283183 -1627579 -2424096 6777634
43153 6777634 15482612 14624445 8481546 5899910 7590208 8434252 6448487 3419212
43145 3419212 1276215 2434218 8450280 14305417 10921389 -1430288 -9898767 -5991044
43137 -5991044 2097304 2586542 -2101378 -1411961 5692730 11399706 12951835 12920460 8697078
43128 8697078 -3993676 -17854064 -19106054 -7806511 940785 -320975 -1438728 6536251
43120 6536251 15788083 14524369 5537409 1211055 5895404 12924338 15609341 13077080
43112 13077080 7432293 1658009 -1188925 -1283679 -2384488 -5477540 -5779856 -268555
43104 -268555 5695798 4397086 -4258222 -13196380 -16228982 -12169732 -3962763 2831472
43096 2831472 3974312 2063975 3885638 9142947 8101860 -3822294 -15416556 -12432977
43088 -12432977 2675221 13673393 12175950 6146026 4670987 3864412 -5477069 -21373212
43080 -21373212 -30107966 -22955945 -7900248 -609266 -5710066 -12402471 -10007564 -1827395
43072 -1827395 1763347 -968621 -3221519 -3084947 -5385308 -8789280 -3660013 11408601
43064 11408601 22233335 17355128 5039672 1430669 8335512 14445201 14093522 12040839
43056 12040839 11076226 7238760 -988434 -8640226 -11952917 -12393290 -11076060 -6258454
43048 -6258454 1372366 6970598 7382855 4329213 966632 -430859 2186057 8409390
43040 8409390 12821179 9962333 1518284 -6251936 -10761687 -13286718 -13302786 -9770217
43032 -9770217 -6269015 -7030923 -9269602 -7728341 -5257877 -9166628 -17803415 -21584854
43024 -21584854 -18035130 -14605833 -14636558 -12030410 -3455878 5057512 8247442 8334223 7140952
43015 7140952 1833969 -6105349 -7961190 -532161 7235871 6908360 1264596 -3570164
43007 -3570164 -7033262 -8456075 -3003253 8160079 13722567 8117947 2085657 6408175
42999 6408175 14145173 11698427 38825 -8557498 -9012567 -5357927 396915 7266827
42991 7266827 7650497 -4485307 -20468926 -26069887 -21289361 -16906061 -14506162 -6611109
42983 -6611109 4714419 7919423 2569532 1737371 9546823 14037461 8769214 3948547
42975 3948547 6591121 5891886 -8758770 -27809463 -33568321 -23332408 -7922427 5034305
42967 5034305 13651373 14427046 6218059 -2128353 -679393 7329512 11361023 11083327
42959 11083327 15478248 25100811 28714806 21008976 11955306 11896503 15864296 11678760
42951 11678760 -433861 -6046537 4009301 19568965 22587838 10419262 89550
42944 89550 6452330 22626181 29182964 18948726 3282375 -5617483 -8151429 -10214133
42936 -10214133 -12436609 -12556965 -11655545 -11495624 -10119327 -5422714 540304 4852334
42928 4852334 7524657 9144433 9537477 10950978 16086613 20693473 16859579 7523704
42920 7523704 7096185 20675392 33364468 30352785 18163654 13263120 16833252 15661342
42912 15661342 4578907 -6639587 -8875265 -4294652 -214790 -1243004 -7449491 -12930920
42904 -12930920 -8590482 5594129 15353776 9377340 -2982700 -4040072 6148744 11357345
42896 11357345 5040871 -2432314 -3734817 -4407164 -8107679 -8127009 -662725 7204490
42888 7204490 10206553 12849955 17038014 14449129 747807 -13620724 -16990178 -11640986
42880 -11640986 -6068797 -1495909 3597518 4382336 -2885011 -10824980 -10016942 -3270163
42872 -3270163 -152356 -1927351 -2882599 -2717537 -5857020 -10218361 -7943223 2051713
42864 2051713 11175800 11998204 5234875 -4640113 -14806242 -24058094 -31176470 -33882125
42856 -33882125 -28659670 -14839459 153506 5871902 2134390 -154779 4265816 6526836
42848 6526836 -1238617 -11829663 -14090039 -9724727 -6733156 -2910922 9367071 25450100
42840 25450100 30720506 20601367 5238805 -6274741 -13747374 -16804141 -11127855 2171678
42832 2171678 14148964 19569770 22368071 26199455 28100601 25263039 20164231 15102247
42824 15102247 8911742 2796306 2198721 8427293 14473626 13638868 7710325 3113382
42816 3113382 3024744 5883904 7971248 5875200 129354 -3193731 1106841 9632248
42808 9632248 14080795 11754581 6558766 1310483 -3234759 -3248004 4498894 13733120
42800 13733120 14044019 6838459 5018885 13377887 20222928 14077711 -621420 -10927634
42792 -10927634 -10918930 -3911024 3946961 6513008 348767 -9933723 -14443180 -10247631
42784 -10247631 -4805733 -4012759 -4788261 -3685425 -3614593 -5817824 -4264368 3898993 10194677
42775 10194677 6071728 -4188035 -10748896 -12271491 -13023728 -11472914 -3098263 8084939
42767 8084939 11712402 4940732 -3981538 -6481835 -2088646 3528161 4135480 -2368018
42759 -2368018 -11167863 -14693898 -12115915 -9989177 -10542975 -6936116 4116953 13427734
42751 13427734 11878154 4715152 2903016 6266799 6936797 4559040 4823388 5987416
42743 5987416 1090100 -7173712 -7989535 -206159 4820386 958656 -4855170 -6458279
42735 -6458279 -7642337 -11557253 -12305879 -5153471 3581422 5239518 1046373 -2008523
42727 -2008523 -2278790 -3199911 -6092885 -9953849 -15096700 -20945891 -23253998 -19447972
42719 -19447972 -14154259 -13564051 -16502769 -17166738 -15081334 -15398180 -19029095 -19411595 -11986933
42710 -11986933 -1711545 3452420 3540706 5359863 10602379 11684697 3087004 -8134075
42702 -8134075 -9958501 -1587210 5989834 6215069 4903127 8582558 13982502 15590129
42694 15590129 15431149 16275117 12198637 -2168563 -17518641 -18687230 -6359230 3758358
42686 3758358 4246442 4119313 10301317 15902733 14528182 13146735 19833920 28460101
42678 28460101 27771401 19020022 12188288 9285680 4476114 -1092140 1847099 14791415
42670 14791415 25753741 24099416 12952636 2108709 -4309064 -7324988 -6185592 134284
42662 134284 6943943 7175101 1345927 -2229171 519149 2922363 -2236225 -10340638
42654 -10340638 -10100732 -257217 7095963 2903886 -6405747 -9036179 -5116240 -5082555
42646 -5082555 -12424028 -17602102 -11882061 120379 6883012 5081283 2871723 8545924
42638 8545924 19375537 23585334 13629188 -3829092 -14274117 -12222690 -6730068 -6904353
42630 -6904353 -8551328 -3081157 5442101 4304359 -7214090 -14076309 -6481809 6436358
42622 6436358 10593493 5732809 1924502 3782533 7420970 9776163 12428667 16707306
42614 16707306 20842045 22104311 18806385 11555819 4210043 353826 -2509528 -9933164
42606 -9933164 -19720870 -21640592 -12178361 -1396829 1437119 967420 5961335 14215115
42598 14215115 18205258 19216543 22632689 23908011 14583641 378130 -3420882 3798316
42590 3798316 5270550 -6512628 -17020650 -12765976 -2673371 -3396129 -13864757 -19326046
42582 -19326046 -14412975 -7186303 -2981534 1309135 6370214 6933504 2303279 -241018
42574 -241018 3015887 6045641 3554930 122948 2468524 8060565 8583293 1946018
42566 1946018 -5597823 -8286712 -6422412 -3000349 761622 5037780 9007357 10560838
42558 10560838 8321180 4097591 2784740 7585764 14730262 16024922 8730415 63675
42550 63675 -1045756 5835681 14091545 18969921 20098937 16933236 8211092 -3183283
42542 -3183283 -10372047 -9707419 -4176032 1456691 4638652 3276751 -4254035 -14467594
42534 -14467594 -19345970 -15604416 -9174789 -6316168 -4644078 1555412 10720845 15531013
42526 15531013 13475366 9363588 7256469 5593273 1536155 -4126389 -8079706 -8207112
42518 -8207112 -5683851 -4461639 -7202662 -10390989 -6814746 4356063 14256481 15414641
42510 15414641 11353279 8904897 6030944 -3367086 -15551946 -19059272 -10865649 -4238
42502 -4238 6488968 11087110 16633786 19913088 18821291 17163025 17530779 17414034 16618511
42493 16618511 19481680 24411806 21232299 6817402 -5765057 -3704813 7210288 11700640
42485 11700640 6837730 2660812 4206656 5700023 2964078 463418 3181271 9521921
42477 9521921 15130304 17776180 16284773 9699856 -215445 -8846833 -12203316 -8823818
42469 -8823818 307797 11142959 18181208 19718400 18637174 15677252 7716815 -2837883
42461 -2837883 -4754865 7302849 21179975 21488164 10952263 4878141 7343329 7911518
42453 7911518 2404829 626476 7908447 13183833 4780157 -11586620 -20297717 -15238946
42445 -15238946 -3597332 5127375 6598097 1260415 -7212987 -14177739 -17703544 -18376893
42437 -18376893 -15669661 -9650283 -5927184 -10420471 -17544449 -13857225 2090519 14156228
42429 14156228 9777020 -3430948 -11275500 -13279484 -17129637 -20782947 -15466632 -3148979
42421 -3148979 4186906 2728583 668845 2555792 3152332 24667 -887087 2145838
42413 2145838 658590 -9223817 -16279848 -9071336 5706365 11371741 4035677 -4335079
42405 -4335079 -4756382 -1591735 -1124070 343048 9877773 24465235 32082247 26174406
42397 26174406 13555593 5620796 4836566 3565285 -4135730 -13462395 -14439809 -5015977
42389 -5015977 5185801 5115225 -6378530 -20831652 -29270362 -28872724 -22612675 -15394843
42381 -15394843 -10021641 -4695056 4842070 18387629 27604276 23064047 5690168 -11955326
42373 -11955326 -17139058 -7553928 9626197 25064676 31758243 27236103 16485592 10216182
42365 10216182 14403924 22129795 21195724 9748620 -1847933 -5745461 -5824146 -8436030
42357 -8436030 -11319757 -9103723 -4795314 -5886404 -10383197 -7399220 5652818 16169730
42349 16169730 13025173 3191612 2958187 15616853 27016703 23996428 9581341 -3176646
42341 -3176646 -6754743 -4178478 -2230151 -4813075 -11767695 -19523329 -22235281 -15690661
42333 -15690661 -1948444 11056931 15369193 8301307 -6670824 -21909834 -29275743
42326 -29275743 -25578024 -15845384 -8690112 -7213949 -7129057 -4848648 -3093506 -5236461
42318 -5236461 -8296429 -7243160 -3880093 -4556162 -9376447 -11121434 -6891905 -3611514
42310 -3611514 -7357436 -12897088 -10443885 119745 8758073 8612853 3497100 521522
42302 521522 744475 1091003 2212718 8452769 19054403 24571207 16947751 1548018
42294 1548018 -6995541 -2544433 4958492 3778795 -3665343 -6543315 -2846220 -183528
42286 -183528 -225346 5342257 19367412 30501692 27141201 12679142 -485429 -6320780
42278 -6320780 -7332206 -6447093 -4426730 -2186161 285673 3933926 5519704 -880568
42270 -880568 -11683979 -12270640 2736433 16593810 11375980 -5073803 -9756938 1544995
42262 1544995 9755458 2747178 -9076127 -12955185 -11907823 -13158493 -12897093 -4832384
42254 -4832384 5872051 9259528 5043135 702029 309430 3456826 9987524 17749962
42246 17749962 20406770 15003676 7281913 2948875 -767197 -7830511 -14168002 -14691843
42238 -14691843 -13995983 -19714633 -28806588 -30813196 -22900224 -12267697 -4893007 -699909
42230 -699909 1031543 62258 -1189576 5834 1217273 -1142171 -3559940 736627
42222 736627 9975520 13775398 5619963 -10611046 -25619710 -30145747 -18777906 2439131
42214 2439131 14689444 4312822 -17909801 -27212887 -15809434 -627781 2809745
42207 2809745 -316949 1601795 6376604 4096385 -5104132 -12145959 -13428302 -12722471
42199 -12722471 -11098083 -5578056 2518200 6936652 5104044 501312 -3843260 -7657259
42191 -7657259 -8993152 -4503914 4132029 9823260 8162504 1399764 -6786035 -15200919
42183 -15200919 -21947607 -22946595 -17487883 -11478359 -11086658 -15350799 -18276044 -16217358
42175 -16217358 -10121742 -2554527 3641210 4787918 -1413215 -12482196 -22531433 -27369228
42167 -27369228 -26295698 -19651166 -8270587 4041794 11563390 12559360 11195747 10913071
42159 10913071 8992752 1895855 -6332751 -7089609 999947 9125811 9268936 3061877
42151 3061877 -3324722 -7769253 -10490704 -8518404 25484 8077793 5730728 -4023055
42143 -4023055 -5060932 10863863 30370978 33796329 19464456 3094631 -4548308 -7874761
42135 -7874761 -12622003 -13696207 -4319212 10510858 19202684 18439951 14166955 10283563
42127 10283563 5761158 2138137 3494253 7164050 4694031 -4004562 -7660460 -1366696
42119 -1366696 2574533 -8029647 -24413827 -26935034 -13261719 -2076574 -6558485 -17156795
42111 -17156795 -16721264 -2838070 12753491 20174243 18509235 11360666 3907249 2550961
42103 2550961 9379765 16408348 12191594 -3399625 -16286759 -14009760 -1140266 6301189
42095 6301189 951546 -7609478 -7418630 -921627 166038 -6305793 -9980234 -5529140
42087 -5529140 -1253885 -3595734 -4398004 4980612 16013559 15041006 7392313 10780939
42079 10780939 25346653 30650556 17576190 3498032 5168019 13486040 9978758 -4385724
42071 -4385724 -13825108 -13025928 -10505547 -10617488 -8437911 -2314985 2175808 2439931 2358845
42062 2358845 4099522 5357167 5725601 7665728 10242733 9191608 4003766 -1119062
42054 -1119062 -3217556 -2233458 1368001 4856286 2322263 -7334283 -14924356 -11743895
42046 -11743895 -2541221 1411372 -1022896 -1448738 3331216 8362461 10780479 11712672
42038 11712672 9090049 196443 -9446695 -11734806 -9536811 -11692494 -15861397 -11808236
42030 -11808236 -1745757 490328 -6578353 -7973196 1768217 7831175 -45967 -10451356
42022 -10451356 -10794563 -7786992 -11374081 -13067575 195090 20835466 29435352 22514800
42014 22514800 12587099 5079849 -5352620 -17332291 -21086201 -16104857 -13139523 -14972002
42006 -14972002 -11003180 3679080 17963027 20336361 13369263 5894450 1050147 -967481
41998 -967481 2067808 8537679 10129942 3251148 -3332945 -748703 5896634 4967918
41990 4967918 -4580611 -13652092 -17918983 -21210935 -23869628 -19222170 -5975159 5274397
41982 5274397 5148667 -1079363 -1534260 4522666 6730906 918630 -4017858 -254648
41974 -254648 6688615 6547995 -1033884 -8680404 -13941804 -20043013 -25215252 -21510518
41966 -21510518 -6797741 9757482 17620773 14835714 5993481 -3622098 -9186860 -7665611
41958 -7665611 -1671192 2323764 1796489 -450918 -3291659 -8352869 -12480515 -8326990
41950 -8326990 3466716 12018294 11978942 12065717 19701506 26193086 18535651 -62752
41942 -62752 -13648408 -14338289 -8227890 -2289380 3066996 7683792 8205933 3912740 -725722
41933 -725722 -1387971 2648280 9886708 16620794 17456456 11606964 6191616 6630745 7023767
41924 7023767 -1241112 -13978105 -18067589 -10507505 -2495090 -2470475 -5483517 -3550339
41916 -3550339 1993864 3885508 -889630 -8655549 -13331539 -11235687 -4715484 -513104
41908 -513104 -730151 1218983 8764203 11208320 -3044711 -24423314 -29544199 -13891581
41900 -13891581 -408300 -6868816 -19896146 -15374223 6106660 21469894 18321736
41893 18321736 8610993 7413108 12680604 13090981 6909559 3717020 9714277 18815958
41885 18815958 20898869 15330273 11509437 15398048 20707348 17957574 8372873 1345252
41877 1345252 -142404 -2130472 -6828893 -7703148 -1702956 3543964 1706749 -1668165
41869 -1668165 701330 4482010 1382450 -5043573 -3908349 4434121 7187236 -1520304
41861 -1520304 -11264108 -10094221 -442150 5413595 384305 -11899660 -22615927 -24455561
41853 -24455561 -15935395 -3039678 5452488 6936419 6711686 8516886 7604386 -1907632
41845 -1907632 -15802222 -22564486 -17351032 -7050557 125619 4059599 8013349 9964100
41837 9964100 5591565 -2330728 -5613906 -2983910 -3254018 -12165358 -22227942 -22067229
41829 -22067229 -12115328 -3553397 -2946484 -5418595 -4027819 790464 3888680 2594939
41821 2594939 -1880617 -6807036 -9177893 -7586624 -4988131 -6497341 -12118939 -14767115
41813 -14767115 -8556449 3129550 10906823 9514573 2271642 -3717203 -4654332 -2306351
41805 -2306351 -301166 893503 3826509 8464844 9959710 5353316 -88284 1385644
41797 1385644 8831158 13046659 8641762 -14860 -5976224 -7145056 -4937852 -1311068
41789 -1311068 652783 -1259588 -3461047 549307 9725736 14442961 9796732 3434022
41781 3434022 4941377 13213975 20325552 22859291 22690339 20512585 15633308 9771254
41773 9771254 5193345 1427001 -1370540 408103 7483676 12830073 10513078 5828374
41765 5828374 8157784 16111653 19029899 12588264 3850670 216370 1947420 7052689
41757 7052689 14918666 21996063 21432910 11375069 -1599211 -10609483 -15069085 -16434148
41749 -16434148 -13326159 -5564123 1370599 1362141 -4768293 -10574556 -11406126 -7774721 -3185283
41740 -3185283 -1419602 -4375708 -9756913 -11855610 -7117668 1408037 6896526 5911866
41732 5911866 1795397 1021464 6367542 13361290 14212078 6568688 -2567805 -4112702
41724 -4112702 2234943 7586752 5210063 -1013015 -2001349 4722632 12209569 13142261
41716 13142261 8482288 5015543 6288597 9605232 11890021 13830375 15751136 14157517
41708 14157517 7551664 1841281 2537172 4301876 -1726595 -11117366 -9924516 1497939
41700 1497939 3858441 -12230295 -26959830 -17012834 8807042 19737476 6151210
41693 6151210 -8297179 -1481201 18765085 29932161 24264413 11382024 1123221
41686 1123221 -4080420 -4678384 -2225705 -290432 -421421 538000 4277477 6183107 2402259
41677 2402259 -2227044 -68472 8001894 13613347 11887741 6015898 1790698 1923449
41669 1923449 4837888 5894961 1614777 -4818434 -5791029 -207137 2799242 -3592334
41661 -3592334 -12666681 -13070398 -5224566 278554 -1165914 -3847440 -4237102 -7146343
41653 -7146343 -15206866 -21187728 -17683037 -8637932 -3854080 -5531901 -7616369 -6539077
41645 -6539077 -4562370 -1964253 5733425 18563628 26739961 21779419 9840168 5272486
41637 5272486 10523420 11807366 -661279 -16630171 -19060136 -8218627 -398885 -2994943
41629 -2994943 -4141333 7418705 23508269 27755854 19025345 11782544 14910701 21281814
41621 21281814 20328011 11910774 3284706 -1537701 -4117888 -6684205 -9577286 -12202671
41613 -12202671 -13328465 -11369046 -6671460 -2418276 -1023481 -702964 1722982 5088691
41605 5088691 3999234 -4429617 -16325491 -24970588 -26824624 -21678666 -9647850 7015983
41597 7015983 19714581 18081324 2791578 -11030223 -9166721 5363206 17202297
41590 17202297 17747117 11904246 6611864 2259848 -1332501 585127 10389325 20842021
41582 20842021 22451056 15206358 7020904 2965303 1880160 1660959 1765027 1208222
41574 1208222 -712440 -2265277 -2247935 -3547932 -8525901 -12635575 -9626296 -2925123
41566 -2925123 -3970314 -16555977 -29317435 -28261759 -12917729 4101719 11255206 8230759
41558 8230759 3212922 2982825 6157554 5750472 -1483519 -9801282 -11147317 -6151333
41550 -6151333 -4205433 -11297567 -21436776 -22975540 -11829101 3772681 11131691 4750959
41542 4750959 -8997933 -18102005 -15987351 -6087371 4438038 12664554 19100156 21845836
41534 21845836 17123800 6018002 -4203265 -7732094 -6212547 -5105217 -6428661 -7512370
41526 -7512370 -6093087 -4611316 -8038499 -16495280 -21461241 -13832485 2680128 11880046
41518 11880046 3748739 -12119107 -18957439 -14601041 -10881433 -13380278 -14441215 -8468938
41510 -8468938 -1184662 2720424 9672043 25020137 39051889 37249728 20726155 5312592
41502 5312592 1388724 4211772 4615649 822790 -2377534 -264499 7580455 15674124
41494 15674124 15907518 7152516 -59751 5039700 18162199 23510319 13335507 -3240762
41486 -3240762 -12634149 -11189497 -4684303 145041 71684 -3564086 -4898455 1239257
41478 1239257 11661194 16682256 11836606 3130026 -1338494 355006 6062251 13239908
41470 13239908 17227524 13186594 4756626 3441128 12670719 19651747 12117671 -2759137
41462 -2759137 -7562059 594778 7178348 2348176 -6364943 -7199738 61436 7139788
41454 7139788 9097126 7452768 6010364 7872478 13090241 16651939 12803288 3095304
41446 3095304 -4932724 -8532841 -12432073 -18330140 -20226754 -15489835 -12195761 -17117419
41438 -17117419 -22764216 -16619240 25947 12714712 12557536 5378204 1678339 5237935
41430 5237935 12739995 17953537 15202691 4808401 -4227208 -3143270 4608343 7189490
41422 7189490 681664 -6584088 -7829856 -6889061 -9123012 -11640724 -9139374 -3224875
41414 -3224875 1223955 4181820 7612230 8460417 3027568 -3444128 -390218 13624877
41406 13624877 27087945 29084147 21976533 17136630 20574577 26378368 24809259 15096982
41398 15096982 7551929 10933351 19695704 19252046 5234710 -8765323 -7528938 6494196
41390 6494196 17331762 16586485 11925033 13226291 18041591 16064275 4355712 -7763533
41382 -7763533 -9542393 -1115487 7222482 7227626 1582311 -990023 2602230 6822932 6042115
41373 6042115 1629613 -1074305 1138043 8388583 18487156 25551356 22575166 10278569
41365 10278569 -324840 61076 7209593 9722793 4895172 871646 3426382 8183605
41357 8183605 8093112 3030670 -984811 912561 7559311 12447186 9840267 2145185
41349 2145185 -1582257 1958615 3921529 -3691872 -12834928 -8223931 9335327 21029307
41341 21029307 15018602 1658121 -2811055 2489735 7419752 8444923 10254539 13763759
41333 13763759 14398405 12203056 13487477 20319165 26610362 27867519 27847267 30806365
41325 30806365 32460180 25297368 11216295 2364486 7112790 18778101 22137135 10832696
41317 10832696 -4871095 -9186357 2357588 19310202 28166088 24900270 15847057 9264447
41309 9264447 7835197 8589790 8715110 9843411 14818109 21233878 22852910 19089042
41301 19089042 17431848 21990489 25242764 18618045 7096985 3512263 10157762 17010998
41293 17010998 18655106 20976241 27465171 30665935 24433578 15417072 13477169 17150148
41285 17150148 17695142 13329303 10716252 14412801 22090946 29264795 33283385 33418320
41277 33418320 30826659 27366896 22803177 16443980 12391993 16699182 26716419 31360747
41269 31360747 26761493 22980136 28389574 36577457 38506604 39092023 48221718 60419479
41261 60419479 58675067 38581355 15951241 7997044 16199445 29638280 37428825 36345675
41253 36345675 32373259 35043842 45549275 53353782 50594926 44688021 47710687 58699975
41245 58699975 68046048 74526155 83635351 92232835 91499379 84882880 85903049 96104414
41237 96104414 102590522 101258326 104256455 117681610 129953623 132205778 133613375 144328958
41229 144328958 158127811 166093583 174586030 193713612 217857897 233693237 240209678
41222 240209678 245953897 253284678 260207862 271150344 289893839 307267017 312746973
41215 312746973 314102204 327206073 348061691 354173203 335854790 308643486 290385214
41208 290385214 281796155 275081787 266929171 255811366 239270710 221567132 212834408
41201 212834408 213352043 209716095 194451809 178029972 171666084 169275607 159471822 146846709
41193 146846709 145388065 154266452 156056665 140513797 117027656 99582040 90293325
41186 90293325 83894515 79787730 80847527 84382774 83095024 75287839 67868074 67167673
41178 67167673 70996063 72663243 70045788 66741576 65045456 61953755 53818449 42575387
41170 42575387 35020593 36255108 44714799 53466529 56723291 55830884 57375773 63372726
41162 63372726 66021019 57418777 42997509 37343574 45046336 54345464 54309256 49820926
41154 49820926 51990564 60838777 67670945 70235272 74113762 80184556 81512923 74279724
41146 74279724 63374968 55286130 52234923 54249551 60177328 65918343 68464726 71898716
41138 71898716 81938029 94643151 99553948 95112128 91260303 94227054 98479365 97447585
41130 97447585 92511231 86343517 76732108 63556950 53853398 52886013 56919177 61063262
41122 61063262 66723041 74060103 75230702 65032440 52165127 48918985 53471496 53428249
41114 53428249 44989748 37567128 38695704 43932033 44542317 38653871 31841703 30443695
41106 30443695 35754660 42619345 44355127 40872434 39185306 43309343 48057520 47047321
41098 47047321 41675372 36065831 28520156 16681811 7359081 10649339 24914855 37194827
41090 37194827 39426975 35818071 32817390 30128165 24703538 17341222 12059502 12665951
41082 12665951 20676589 32526811 39553620 36191926 27602341 23456223 25352347 27148816
41074 27148816 26373882 26932682 30754720 35546804 41116410 48535426 52397826 44851955
41066 44851955 29948668 22861728 30382769 42498840 48245653 49045167 49920366 48901678
41058 48901678 44487690 43713327 51475038 59418991 57380914 50022178 49720848 57290180
41050 57290180 62797767 63155066 65491766 72803083 78741884 79145379 78233978 80129892
41042 80129892 83100338 85438177 88972759 93373291 94518344 92323179 93409636 101995094
41034 101995094 114152585 124943392 135202525 146730685 156402208 160836261 163226003
41027 163226003 170027142 182953233 198428531 213062613 226031581 237730719 249373707
41020 249373707 262730611 277803210 292093701 304077628 315626173 329080691 343830441
41013 343830441 357793643 370474267 382389470 392738128 399491331 401281960 398780275
41006 398780275 395213296 394723324 397518949 397105162 385938156 364028898 338237343 313254486
40998 313254486 288455971 264323719 245353560 233217585 222296263 206361190 186344704
40991 186344704 168217845 156391799 151585621 151028675 148212750 137386824 121445092
40984 121445092 110063508 106661236 103603668 94727189 85097933 81801119 82606900 82364050
40976 82364050 83302318 87839788 87473425 73136003 53603684 48023867 59519575 71341493
40968 71341493 72179815 69982967 74424647 80216581 78102053 71201123 68048397 66631508
40960 66631508 58094685 42925578 31956109 31565552 36770069 39968433 39906572 40201380
40952 40201380 42952806 45457593 42569759 33350779 24799435 24718078 30613029 32102909
40944 32102909 26047303 21275436 24588663 30910123 33362986 34393042 38767387 43501996
40936 43501996 44340191 45021678 49370385 51133828 44368787 37820997 43909028 57347134
40928 57347134 61421092 54251687 51135764 59000941 66511315 64851115 61428821 64598087
40920 64598087 69568134 69791388 69835419 75421714 80865680 78535384 72945972 73591639 79857386
40911 79857386 84288548 85780592 88517161 91715970 91033453 87605851 86499962 88562586
40903 88562586 91644856 96222918 101551676 100857229 90253259 78401608 76183346 79703855
40895 79703855 75719946 62707603 53615456 55997019 61020059 56125772 40029280 21619812
40887 21619812 10513762 10749044 17965308 22172526 18978468 16576496 24252145 36758509
40879 36758509 40775796 35449741 33372787 39578356 43303860 35568921 22743686 15795720
40871 15795720 15946648 17887646 18638336 16735806 10634684 3824683 3486575 8903127
40863 8903127 10611769 6477672 6951512 16495345 22648064 15365173 5504642 8796976
40855 8796976 20402045 22845144 13546861 5978916 5888088 5221773 699624 105499 5626448
40846 5626448 7368342 398624 -5694704 -2281151 5224743 8247905 8211538 9198182 6941771
40837 6941771 -3338516 -14355773 -13701381 -752285 12753352 17721045 15839708 13730218
40829 13730218 15087686 18106404 16858803 7364309 -4764377 -7533034 1837914 10282556
40821 10282556 5043839 -8586267 -14763883 -8712503 -258347 2753893 3018787 4253013
40813 4253013 4262493 2013762 2501989 8286720 12745195 8498747 -1697610 -8602133 -8118183
40804 -8118183 -3936485 -862832 -674471 -3223183 -6929464 -8726784 -7309915 -5836549
40796 -5836549 -7834228 -11040041 -9357932 -1492858 5902378 5417429 -2606996 -10216494
40788 -10216494 -9960554 -2507353 3566331 38981 -12378570 -24374156 -27258930 -20723697
40780 -20723697 -11386222 -6106908 -7681030 -13835123 -17860791 -13082637 -361247 10813322
40772 10813322 12460129 7275320 3113840 618438 -6585760 -19227946 -27846772 -24420440
40764 -24420440 -12641385 -2150393 2886271 4665810 5356974 5793942 7944176 12415578
40756 12415578 14838060 10897681 4285402 2906034 6728551 6866547 -698922 -7844369
40748 -7844369 -5737258 2585468 8123907 10067795 14972463 23070115 25521779 18196931
40740 18196931 9314643 7365648 8331501 3471395 -4520798 -4114766 6415021 14462916
40732 14462916 11739140 7300791 13230757 24404613 24600667 10801052 -1115956 2077153
40724 2077153 14057762 19523022 14071203 6028685 3104013 5042310 7719243 7998218
40716 7998218 4911781 656228 -441441 2299597 3394188 -1024464 -5956572 -4400009
40708 -4400009 1290414 3192190 1418829 3650054 10142957 10883508 2442981 -3532773
40700 -3532773 2695730 12318193 9688082 -4640855 -15006474 -12721143 -4455250 2462063
40692 2462063 10592540 23272128 35183906 39727143 39192983 39839878 41492646 40016153
40684 40016153 36974453 37978111 41859037 39899852 28085111 13671593 6190020 6553470
40676 6553470 8704337 8449926 6439769 4405394 2638259 1014488 -196394 -842319
40668 -842319 -1168260 -2348800 -7065094 -16688405 -26110401 -25497276 -12146159 2110454
40660 2110454 2552032 -9236432 -15735739 -6296567 8051018 9454176 -2516681 -11370720
40652 -11370720 -7139745 1664342 3105796 -948343 -862950 3589084 2996229 -5907522
40644 -5907522 -15232660 -19667371 -25038285 -36036658 -43294749 -33870632 -11905904 2944785
40636 2944785 -289804 -11109958 -13286586 -5085106 2597217 2071535 -4756810 -12269027
40628 -12269027 -16380157 -15751579 -12939826 -12066790 -11683592 -5181918 6386976 9651111
40620 9651111 -3121410 -18424276 -17715897 -4660357 679898 -6597446 -10286441 -2190102
40612 -2190102 3820899 -3491113 -13155508 -11537064 -5502480 -8431455 -15415680 -12214638
40604 -12214638 -714998 4982040 3224033 5390690 13487181 16468000 9908727 1934670
40596 1934670 -2403739 -6662914 -11108277 -10978514 -8307975 -9604705 -10870762 -3023128
40588 -3023128 6481617 -704571 -21616785 -29286396 -12205352 7163868 7740887 735097
40580 735097 5616092 15898839 14239342 6312353 10756529 23976802 24597347 10624020
40572 10624020 3576927 12516674 20389302 14063392 4708886 6240507 12137829 8489280
40564 8489280 -2804772 -8732647 -5184439 861662 4727029 8468633 13552498 17565960
40556 17565960 18432972 16573626 12534009 5876908 -2729800 -9447466 -8457609 2381252
40548 2381252 16061886 20865885 14033957 6607760 9046389 16692861 17571231 10769406
40540 10769406 6694974 10541678 16506938 19183911 20120908 20626327 17629210 10367028
40532 10367028 3433036 -343302 -3681315 -9051715 -14979202 -19510457 -21516773 -18607389
40524 -18607389 -10784989 -5434068 -9891170 -19254637 -21430530 -14725364 -9579734 -11392355
40516 -11392355 -13220234 -8584251 -481291 5989229 9673687 9089729 2856838 -3290059
40508 -3290059 -1967964 1518326 -5056943 -18083356 -19265804 -5665191 1640189 -9900715
40500 -9900715 -22995565 -17779110 -2793739 1183230 -5783516 -8118006 -2974345 71469
40492 71469 1121675 8588907 18878944 19542645 11775846 8857029 12066304 9119936
40484 9119936 -1663082 -6769019 -1296652 2685224 -2334038 -8167955 -8650789 -10625130
40476 -10625130 -18253120 -22730224 -17923263 -12010934 -13378342 -18002330 -20453123 -24006629
40468 -24006629 -29612593 -28639889 -18289011 -10573483 -12765123 -12684621 570833 14174071
40460 14174071 9543740 -6657331 -11287635 537717 11422915 11144575 8636939 11898293
40452 11898293 15547248 14081261 10912042 7823292 542003 -8383395 -7349536 4850601
40444 4850601 11523999 1277536 -13545222 -14829691 -4886964 740451 -624797 2223162
40436 2223162 11438491 14448260 5220044 -4126942 -1307485 7510519 7728186 -1418071
40428 -1418071 -6268957 851658 11225604 12976225 7052677 3772450 7218693 10636939
40420 10636939 7911954 2957007 3679412 10686994 17262854 18639911 15795714 10682813
40412 10682813 3727225 -2861964 -5098382 -2977259 -1241402 -1613053 652393 8695096
40404 8695096 17299424 18856748 12140059 822828 -11811587 -20989118 -18851871 -3486673
40396 -3486673 13745242 19419621 15106321 13938424 21393143 30173054 34453772 37266453
40388 37266453 40851713 41406677 38312882 37572246 39984105 36896719 25563426 17994614
40380 17994614 24438368 37589049 45014288 48873035 59358662 74724695 83183220 81561472
40372 81561472 77276379 73359022 66041726 56556655 50514445 45243035 33116034 18654922
40364 18654922 15335887 21856487 19828102 2383004 -12711571 -9360713 3615553 9372049
40356 9372049 8977532 13335620 19774899 16353888 4571430 -1035459 4533105 10494916
40348 10494916 7951584 239692 -6394739 -10357092 -10319074 -4232487 4000024 6460309
40340 6460309 3135371 3193600 11144588 20151779 22660031 19416750 13813728 5752821
40332 5752821 -2808966 -3619774 8144094 23638956 27783734 16243711 -584390 -10164959
40324 -10164959 -9307877 -2661250 4722168 9713508 9319471 2514906 -5353056 -5610289
40316 -5610289 2518020 8514965 4696655 -433174 7037750 23721122 29988607 16942576
40308 16942576 -1134658 -8556232 -9395005 -15474377 -24538453 -25784789 -19715033 -15586111
40300 -15586111 -13141686 -4113448 9573502 16514071 15513557 17201049 23354490 22710060
40292 22710060 13008041 8947471 18414598 27160564 20377227 6436403 3750416 13099859
40284 13099859 19047198 13787088 4544374 -789311 -2144752 -1173286 2592708 8105749
40276 8105749 12833268 16245208 17019645 9552741 -8217845 -25858600 -29746751 -21277383
40268 -21277383 -15286083 -18617349 -20964703 -11497180 4958621 15565775 16652727 14822094
40260 14822094 14445576 12872572 8256075 4713757 6417278 10716871 11033896 5028107
40252 5028107 -3223317 -8600049 -9562650 -7187944 -2744543 1980057 4279856 3252063
40244 3252063 1949129 4211797 9640992 13943761 14227640 11995282 10765313 12269129
40236 12269129 15085430 16034553 13244157 8387394 4958670 4344483 5729336 9519830
40228 9519830 16565106 23238667 23225586 16848174 12166913 12927355 12957212 8264747 5712366
40219 5712366 10295889 12555194 2144548 -12330231 -13239106 -692014 8001226 5440942
40211 5440942 2286835 5279193 6202127 285948 -1718218 9148495 24209458 29782366
40203 29782366 24427994 13781377 196232 -11550251 -10677849 3942692 15199892
40196 15199892 9367510 -2970850 -3006973 7833857 12921814 7550588 2120611 1304412
40188 1304412 -948045 -5522330 -5306658 -851756 -2379722 -11658097 -16592689 -9803072
40180 -9803072 167179 2759635 -659283 -3887935 -7033292 -12137543 -14916193 -9788505
40172 -9788505 251227 5527303 396105 -11049028 -18503662 -13907083 640304 13194373
40164 13194373 13782643 5446757 -626559 642298 4853548 7631935 9639676 11487950
40156 11487950 11396450 9971477 10619681 12896678 11533898 4584033 -2918360 -5888963
40148 -5888963 -4894230 -2654101 474396 4661565 7492550 5357899 -2875334 -13536346
40140 -13536346 -19078031 -14427888 -4399695 -123108 -4760158 -8962744 -5464862 35408
40132 35408 664127 1682130 9266511 13993934 2609873 -17917965 -27014678 -20476829
40124 -20476829 -14380222 -17148652 -18395717 -11249532 -4854412 -4715688 -439173 12886020
40116 12886020 18751417 2957265 -19845866 -23709371 -7447759 7043759 8179000
40109 8179000 6012359 9820903 13490904 9239808 1789922 490173 5636696 9934496
40101 9934496 9022033 5227920 3118090 4528595 7246166 7736176 5438822 2975683
40093 2975683 1388604 -1636986 -6835116 -10572450 -10197394 -8379894 -8341754 -8416573 -5474249
40084 -5474249 -390220 3734976 5164770 2107215 -6840450 -16382359 -15507382 -2086563
40076 -2086563 9636237 5792853 -7229422 -11021397 -1388462 6302014 11571 -12813255
40068 -12813255 -18131660 -15040820 -13244614 -15507195 -13369507 -1649656 11384157 14047526
40060 14047526 6984005 1474607 3120703 5873627 4770742 4950690 10660856 13808337
40052 13808337 5396614 -6899972 -7335338 3268038 7637025 -1066725 -9280694 -5916573
40044 -5916573 1178132 1263073 -1580485 668255 3824179 740508 -3011771 2111989
40036 2111989 12579940 18237133 19215483 21280005 20574561 10011330 -3365239 -5456323
40028 -5456323 2084363 3982730 -3486780 -7440798 -1154135 5549690 4140452 321838
40020 321838 2147586 7901456 12837447 17152766 20815344 20209162 15644098 13087171
40012 13087171 13809558 11944212 6463296 4678903 8837183 10858300 6861456 5231540
40004 5231540 12089654 19726589 19129410 14360109 14029139 16928170 17256717 16822903 20053230
39995 20053230 22416070 16207023 4468196 -2640282 -3413431 -5261193 -10236801 -10758945
39987 -10758945 -1903580 10425394 16806424 14474480 8048628 4020885 6012721 12745415
39979 12745415 19516967 22398969 20437546 14420865 6895743 3083885 6041461 10002846
39971 10002846 5887150 -4257547 -7211970 2452235 13043415 12758217 6732013 6944606
39963 6944606 12814050 14268467 9354199 6082819 9149782 16291589 25615822 34891833
39955 34891833 35750713 21896505 2876666 -3898986 3634673 10261180 6954678 1670442
39947 1670442 1748121 631172 -8524933 -18401305 -18589559 -12491969 -11003901 -15250685 -17462006
39938 -17462006 -14977703 -11663793 -7794746 -386177 6780006 5328402 -3284483 -6515747
39930 -6515747 1192970 8442590 2538742 -11392066 -16607839 -7819390 1876653 -533625
39922 -533625 -10774940 -14746693 -8246002 -308064 2647547 5853285 14335044 20702186
39914 20702186 15101080 3246457 1676573 13774501 23259207 17370010 5017719 1598530
39906 1598530 4424069 -2299401 -20971686 -34508649 -30146801 -16890359 -12134119 -19363173
39898 -19363173 -27465275 -27134794 -19554153 -10809695 -5034419 -3417678 -4797630 -5966306
39890 -5966306 -4134054 547875 6232599 11497988 14420290 12592367 7534052 5916222
39882 5916222 11308261 17207896 14670586 5411291 -228549 1620598 3746606 356002
39874 356002 -4660011 -6443689 -7751476 -11745888 -13234417 -6666955 1404270 -1293406
39866 -1293406 -14787918 -25484787 -24160111 -16084106 -10155311 -6584434 -783580 7073341
39858 7073341 13126869 16660514 19516833 20608188 16491063 6925053 -3991239 -11644027
39850 -11644027 -12942156 -6197064 6850655 19404839 24323658 21428282 17025431 15199329
39842 15199329 12797982 5298008 -4835028 -9661829 -5971905 -206506 -294774 -4967794
39834 -4967794 -6127891 -1555054 1278127 -3056345 -9101879 -9575811 -7641195 -11041081
39826 -11041081 -17570305 -17867549 -11965336 -10076416 -14376711 -13809112 -3221413 6106997
39818 6106997 5248292 4138399 14530272 26271931 19717382 -2193424 -14643953 -5816940
39810 -5816940 7646127 6553460 -5623087 -13362062 -12263848 -9496498 -9255063 -9611392
39802 -9611392 -9318405 -8097684 -3566575 4184004 8759535 5822031 996595 1239855
39794 1239855 2961362 -1224503 -7566527 -5099301 6288637 14182979 12253116 8916906
39786 8916906 12654082 18791621 18183373 11918775 9179303 14096724 21691062 25243156
39778 25243156 22598575 16153070 10243687 7733080 7094609 4495478 -327655 -3768146
39770 -3768146 -5042634 -7767125 -12071194 -11609804 -3668052 3999472 3942830 1318611 5699843
39761 5699843 14297339 15357299 7441959 1827361 2955005 775707 -9948164 -16050508
39753 -16050508 -4646105 13615783 16265505 735162 -12296257 -8915692 733870
39746 733870 1647437 -3746620 -3845718 1510044 3141941 863509 4555625 15643300 20913743
39737 20913743 10804438 -5614287 -11903361 -4813042 4678539 7969367 7828074 9954232
39729 9954232 12708148 9726657 245475 -7396352 -3887392 10420516 24818407 29479882
39721 29479882 26077363 24116232 27078415 27362283 17574410 1808773 -9617549 -13316700
39713 -13316700 -14026878 -14323601 -11105856 -3609984 2409851 2023013 -2564701 -6271444
39705 -6271444 -6788984 -2729564 8018929 22687595 31126364 25707274 11160061 -1333388
39697 -1333388 -6987058 -7940780 -4488067 4799520 14935307 16679504 9199801 1919244
39689 1919244 619388 267184 -4009887 -7830926 -6424908 -4671144 -8865754 -14277153
39681 -14277153 -12293737 -7054081 -12039389 -28507139 -39365023 -30436159 -9217668 5216776
39673 5216776 5593282 1395635 3006174 9629758 14446950 14957413 13949677 13619540 13388192
39664 13388192 12833444 12920065 13545936 12863628 10507822 8835297 8815302 7445576 2738221
39655 2738221 -1152215 1006166 6406457 6507843 -765770 -7678531 -7700855 -3280406 625887
39646 625887 3646425 5565907 2010092 -7906574 -15309229 -11688103 -1109226 6594914
39638 6594914 10612551 16524609 22234183 19344757 8090438 -1955593 -7165363 -12857741
39630 -12857741 -19017822 -17505592 -8337249 -4205931 -11295297 -19288120 -19360754 -17790220
39622 -17790220 -19895053 -15341151 3438224 20262235 14194611 -7157452 -16260873 -5694632
39614 -5694632 3708984 -2583930 -13341755 -14782793 -12195774 -15217993 -18240580 -11755703
39606 -11755703 -1989675 -2603025 -13338997 -21781311 -22239642 -19428095 -16052257 -9625625
39598 -9625625 -1051473 4688012 6631405 7582805 6757308 2087677 -1518070 2826876
39590 2826876 10798796 10524590 1310869 -3592637 2603900 9104612 4484085 -5413493
39582 -5413493 -7162009 -773175 1007440 -7509328 -16778642 -15578506 -5064950 4157314
39574 4157314 4520639 -2206252 -8871471 -10501349 -7932294 -4919834 -3101199 -1661449
39566 -1661449 -1150235 -3652049 -8077148 -9731387 -7114885 -4671438 -5180906 -4346881 1463825
39557 1463825 6562386 2855102 -7120790 -13014400 -12002080 -11805577 -16726867 -20343515
39549 -20343515 -16468145 -8938212 -4492189 -3038478 -1940529 -3275149 -7969088 -8375700
39541 -8375700 1774152 12888405 8549197 -9350281 -18124021 -3593153 19231010
39534 19231010 25119757 11010042 -3208511 -3524393 2352822 1151548 -5779273 -6932488
39526 -6932488 1138147 9950571 12154617 10006827 9001949 9496684 8360635 4930891
39518 4930891 1300474 -1041311 -1400453 1389441 6810417 10696876 9416973 5262249
39510 5262249 3670034 5603929 7155654 6489642 5671189 4585231 -798652 -11150257
39502 -11150257 -20319881 -23357368 -23348552 -25384648 -27758157 -24878392 -16028731 -5494618
39494 -5494618 3597576 9822900 10414773 4475554 -2293902 -2973587 1275408 3743170
39486 3743170 2605864 1520621 1519883 1469471 5500649 18294938 31506978 28178121 6305975
39477 6305975 -14045310 -15394051 -4181137 2344647 914569 906570 4741609 4741659 -1588901
39468 -1588901 -6344781 -3302815 4502513 11385427 15384213 16351975 14253674 10451339
39460 10451339 5401073 -3831883 -17517161 -27333671 -25340989 -17004951 -14669218 -18786691
39452 -18786691 -18146387 -10174631 -6834621 -14968696 -24147733 -22734432 -14924932 -11408330
39444 -11408330 -12075609 -9711152 -4249365 -1165950 -177644 2296676 2390954 -6856057 -21024128
39435 -21024128 -26311384 -17695603 -4859722 1893734 1616249 -3775110 -14658062 -26403741
39427 -26403741 -26531739 -8516248 16121455 27758167 19304329 1714238 -9261827
39420 -9261827 -7209672 2189098 7789464 3283473 -5463576 -4740174 11583740 32480411
39412 32480411 40089449 28789968 9279192 -5779790 -13905896 -18776199 -20734241 -17494334
39404 -17494334 -11627385 -10175978 -15074683 -18910763 -13980702 -3054597 3315693 -122982
39396 -122982 -7277038 -9237599 -5060983 -748867 -299 -677571 -178314 418258 -673136
39387 -673136 -2397564 -2997753 -3420181 -5829530 -10252385 -15152291 -19621254 -22077396 -18955733
39378 -18955733 -9669567 -2133923 -6594266 -21265007 -30221723 -21321042 -2476424 7112650
39370 7112650 653136 -9256581 -8581939 1477135 10342823 13427131 13734495 12134736
39362 12134736 5663177 -4272841 -10432393 -9143980 -4812546 -2251427 -782292 274852
39354 274852 -3078917 -12156185 -18307364 -11378843 5997713 20094651 22142614 15975373
39346 15975373 9104329 3569719 -1596961 -5445246 -7362102 -9750077 -13567117 -14522911
39338 -14522911 -8833949 -479261 2651443 -1140350 -6091576 -7402896 -5761913 -2888022
39330 -2888022 1854075 7696890 9781097 4427498 -5336961 -13681803 -19739127 -26494855
39322 -26494855 -32277074 -29776065 -16894545 -3443086 -711379 -6581832 -8596655 -2347181
39314 -2347181 2006950 -3758219 -11258938 -7103239 5297166 8321149 -4238322 -16702328
39306 -16702328 -12827771 2563528 12695188 12340853 10387938 12246859 12461147 6131103
39298 6131103 -3125994 -10238777 -15100874 -17812814 -15317326 -8000202 -2965077 -4663445
39290 -4663445 -7574952 -4331258 3606858 9739784 12334842 13014881 9639871 -312592
39282 -312592 -11298891 -14052676 -8173294 -1625786 2305879 7548152 13184748 10597186
39274 10597186 -1529319 -9751430 -2961527 9963750 10691077 -3715751 -17750594 -19179316
39266 -19179316 -13038148 -10793313 -14721454 -19286934 -22039807 -25365859 -29373493 -29930348
39258 -29930348 -24718708 -16687945 -9963062 -5698466 -3834094 -5957875 -13208712 -22482019
39250 -22482019 -27840278 -26022113 -18625352 -8969281 603457 7738695 9613963 6082153
39242 6082153 1707813 1779045 6249097 9381279 5665572 -4671881 -15748745 -21230142
39234 -21230142 -20268886 -18131546 -19098478 -19406734 -11641594 2649503 10678505 3432215
39226 3432215 -11654000 -19551049 -16123466 -10144273 -8260760 -6619684 988081 13889031
39218 13889031 26173403 32192761 28485393 15724636 1052516 -6451595 -4804237 337631
39210 337631 4269355 6617327 6417016 1990623 -2881931 -1603009 3845058 3592880 -4583165
39201 -4583165 -10887025 -9377439 -6415817 -6390495 -2187675 9377543 15488808 5658657
39193 5658657 -8249833 -8106107 2038679 3783666 -3807900 -3032912 10959139 20635095
39185 20635095 14596564 4769743 4453558 7120910 1113672 -8577434 -9469055 -3273130
39177 -3273130 -2006506 -7278306 -8678553 -1569084 6602917 9080213 8416887 9204623
39169 9204623 9515516 3726728 -9330427 -23659520 -31116021 -29248825 -23774864 -21229168
39161 -21229168 -20394310 -15828084 -9038482 -8237444 -15122431 -20657642 -18396130 -13836596
39153 -13836596 -14800085 -20154788 -24672302 -27446919 -27743827 -20261625 -4527831 7331822
39145 7331822 3679499 -9877822 -18033565 -16690076 -14304455 -14539125 -11106625 -1324601
39137 -1324601 7303769 7827105 2109951 -4736600 -10108492 -11456215 -6080862 3347395
39129 3347395 9747773 10558342 9446807 8096599 4114806 -1500225 -3861333 -3574864
39121 -3574864 -6765801 -12151458 -9310980 3612590 11661394 2841599 -12463934 -14639865
39113 -14639865 -2399903 6556658 1567904 -7418335 -5612714 7287386 19044416 20123087
39105 20123087 11857703 2492840 -1493115 -1517169 -4947296 -14828609 -23187691 -20181178
39097 -20181178 -9411528 -5765933 -14823012 -22990580 -15389304 2838935 13222475 9043186
39089 9043186 2194455 3895585 10187577 12040890 9896441 8927285 6526627 -3905730
39081 -3905730 -18997574 -26566522 -21683928 -11710416 -3308876 5313001 14920156 18378019
39073 18378019 11292996 1898798 667459 5035127 4689480 -1010850 -2198059 4891020
39065 4891020 11409269 9333205 2674368 135199 2542852 3136228 -2802907 -12706717
39057 -12706717 -19149531 -15399964 -1406056 13747897 18685620 11696246 3141676 3499296
39049 3499296 11663922 17595753 13932526 2310123 -9280858 -12486117 -4444155 8733612
39041 8733612 16009835 12448376 4884937 3209138 7741265 10266145 7235888 5519596
39033 5519596 11722865 20559303 20029473 7519251 -5111607 -5193646 5651262 14284332
39025 14284332 12526049 5843330 4151644 8275247 9752169 2700759 -8604885 -15281888
39017 -15281888 -14064541 -9577552 -7481800 -7959355 -6799807 -1246110 7175192 15253329
39009 15253329 21239236 24580859 24581744 21002284 14665738 6269570 -3293419 -10122645 -8849287
39000 -8849287 -741663 3973938 -1649174 -9821002 -7360059 4928982 12705268 9097493
38992 9097493 3630782 5671808 10484638 9777491 6303978 7431347 11497808 12293779
38984 12293779 11994941 17107321 24363132 23539127 14136972 7145399 8333859 10638582
38976 10638582 6522963 -1415978 -6573362 -7578678 -6539394 -3358297 3526472 13209838
38968 13209838 21308495 21610699 10340239 -7750716 -20288597 -19771214 -12681742 -10157086
38960 -10157086 -13256513 -15568170 -16290596 -19275802 -21085388 -13303520 2059372 12111059
38952 12111059 10783953 5332064 2269560 -839098 -5335473 -5766314 -471850 3073457
38944 3073457 -37725 -4973196 -7168576 -8910295 -10618870 -7646883 -2074267 -4199097
38936 -4199097 -14102756 -16384633 -4297805 5892777 -636475 -12409200 -9829584 2770911
38928 2770911 4859578 -6979321 -15936528 -13255308 -7897269 -6137351 -1757678 7980848
38920 7980848 13830586 9595236 2378135 624371 2817370 4305547 5444482 6780347
38912 6780347 4776126 -1689212 -7461947 -8312382 -5881221 -2738173 539699 1167909
38904 1167909 -5156854 -16510178 -24649670 -24748057 -18801443 -9600007 144679 3722970
38896 3722970 -2867968 -9779120 -2539658 15105998 22586390 11732089 -1153390 -584119
38888 -584119 6450726 6026910 556135 1201322 7239624 9545980 8009433 9074116 9985255
38879 9985255 1726028 -13598834 -23382247 -23242980 -21471859 -22778018 -20696341 -10776120
38871 -10776120 -546297 165715 -7868526 -15505686 -16236297 -11363942 -6855616 -6784238
38863 -6784238 -8590933 -6358563 -734597 -705334 -10183932 -18678103 -14496784 -2870225
38855 -2870225 934640 -5402564 -8650708 -1578175 6644733 6093458 -125664 -4253673
38847 -4253673 -5653576 -6778326 -6147749 -3031486 -1494145 -2331194 1318222 12140196
38839 12140196 20191322 16125041 6211885 2962877 5921071 4218195 -4638726 -11418783
38831 -11418783 -10355867 -5950677 -3415028 -2848792 -4555098 -9964559 -15002080 -12569213
38823 -12569213 -4680851 -2178844 -8421977 -13377695 -9463317 -3450095 -4951483 -11223173
38815 -11223173 -12416596 -6229338 1390609 5957941 6956938 4277651 -374367 -1717492
38807 -1717492 2599588 7224834 7308603 6603200 9495723 10563725 2695541 -8631804
38799 -8631804 -11656995 -6612845 -4218457 -6516021 -4296990 3852376 5737822 -4426498
38791 -4426498 -14151156 -10652577 355142 5030207 1900021 -305334 646558 -1125807
38783 -1125807 -6981117 -11019684 -9871178 -6109018 -1758135 3686333 8548339 9612316
38775 9612316 8072364 8272223 9800173 7075112 -1766811 -10727559 -12507556 -6039025
38767 -6039025 3076162 7477955 4648711 685013 4204554 13603436 16035705 4867650
38759 4867650 -8203443 -7858433 2871546 7409519 98028 -7948289 -8422538 -6858379
38751 -6858379 -9369299 -11717089 -9615905 -8945069 -15557237 -22933250 -20849675 -10961808
38743 -10961808 -3046890 629704 6075158 13928535 16171579 8837747 -643642 -3216366
38735 -3216366 28440 446911 -6285873 -14757517 -16335830 -9229429 -557665 2160015
38727 2160015 -304485 -1863752 -1567035 -5010402 -13584856 -19382655 -16222290 -10179027
38719 -10179027 -11376351 -18379026 -19498803 -9339921 4191766 11199645 11137455 9720164
38711 9720164 9977569 10357655 8350376 2736133 -5328398 -11162814 -9195423 718565
38703 718565 11688406 16596866 14689047 10097637 6656256 6087953 8170501 9777270
38695 9777270 6314555 -2764959 -12148117 -17342766 -20160980 -23364531 -23256470 -14484800
38687 -14484800 -888304 6743889 5312083 3615009 7833758 10616825 2204660 -12748273
38679 -12748273 -19263240 -11870702 -1130350 1342092 -3721730 -8363415 -8857891 -6399193
38671 -6399193 -1427308 5508725 9339677 4159896 -7864399 -16778508 -16197495 -10638111
38663 -10638111 -9012300 -13466139 -17715589 -15266543 -6264870 3997270 10790667 12822287
38655 12822287 11374228 9118717 9136797 12146428 14289702 10904320 3811147 1078399
38647 1078399 6645616 13814365 13533582 6308483 297151 -424556 832661 808282 -131833
38638 -131833 -1993418 -5396829 -7114729 -3252968 1848782 -1039762 -11080892 -15630031
38630 -15630031 -8165297 2012372 4598733 2887131 4608287 7209496 3720326 -3285817
38622 -3285817 -5920908 -4864125 -7022700 -12429163 -15248909 -15380640 -16949494 -17017727 -8787094
38613 -8787094 3964484 8641175 1950008 -5383055 -4540088 1363701 5657512 6311011
38605 6311011 3255031 -2675479 -5989349 -1559911 5253940 4449891 -1614372 -197987
38597 -197987 10376351 16087148 9189815 -171306 -1942030 -1249529 -5553450 -9987504
38589 -9987504 -7597466 -3207562 -4308165 -7114574 -4121928 2557679 7403213 12516580
38581 12516580 19516016 19186117 4694966 -11808143 -12957939 -2184295 1804231 -5417363
38573 -5417363 -8524533 1568385 13662609 13829735 3238947 -8051061 -14252414 -14638857
38565 -14638857 -10194204 -5312528 -5747771 -10385420 -11422916 -5729616 1085698 4661995
38557 4661995 7774632 12244223 13003034 6092929 -3350690 -7134921 -4311290 -833574
38549 -833574 -1709427 -6565671 -10331290 -6676162 5681773 18905088 22496221 14902705
38541 14902705 4174500 -3109596 -7230396 -9072090 -7109445 -3971152 -7134694 -16948343
38533 -16948343 -21759138 -13380890 -1268483 -673332 -10298970 -14523290 -8387860 -6245046
38525 -6245046 -18402145 -30988389 -22816378 2715680 18872192 11333065 -2632907
38518 -2632907 26386 15453833 20983024 9318993 -3429236 -4052690 1165197 2001983
38510 2001983 1146459 5599252 12334227 13332853 7378244 -1902302 -11986263 -17581060
38502 -17581060 -10976482 3356018 5487154 -14497700 -37132997 -36556253 -15671564 572398
38494 572398 1870481 547880 3788195 1957699 -9154129 -15811669 -7258144 6830553
38486 6830553 11911180 9388357 9839426 14605372 15844749 9427329 -1195540 -9983251
38478 -9983251 -11531479 -4453540 4172072 3943691 -5622234 -13998911 -14513836 -11353188
38470 -11353188 -8684525 -3959296 2645748 3729264 -2842975 -7504396 -3433861 2450951
38462 2450951 1786299 -1802710 -1477168 16243 -2595965 -5685915 -4002728 -1502695
38454 -1502695 -2429356 919025 17018779 36911096 42294196 29471213 11584412 -1131111
38446 -1131111 -9438462 -14172435 -11811324 -3653251 2601228 4072800 5863909 10044495
38438 10044495 10712736 3843117 -5646218 -10647926 -9759358 -5352146 798804 6581323
38430 6581323 8111130 2495846 -8917192 -20314297 -24045272 -16406376 -3005985 5201187
38422 5201187 3901687 -875455 -3124006 -3578068 -2181089 6130645 20030027 25921948
38414 25921948 14943950 -1921328 -8307576 -4713883 -1987272 54570 9197296 20290574
38406 20290574 18766110 5025099 -4464666 -3027110 -1286432 -4613098 -3416062 6355558
38398 6355558 12666622 8312692 4613791 10984959 16867075 9700874 -2628862 -4947327
38390 -4947327 27674 -1540757 -9494326 -10441128 -889212 7868425 8306415 5379975
38382 5379975 5196151 7356862 10370397 14173344 15873177 12171328 6321187 3744927
38374 3744927 1844067 -5294712 -13163221 -10819175 -44071 3375168 -7552612 -19688737
38366 -19688737 -19023766 -10667710 -9391788 -17377974 -22818513 -18068382 -9092119 -5659640
38358 -5659640 -8776516 -10586536 -4248868 7568117 14181736 8204629 -4924507 -12164538
38350 -12164538 -8374141 -1925307 -2521971 -8667304 -11957084 -9634090 -6158188 -3979061
38342 -3979061 -69606 6875850 11683098 8915441 900921 -4336628 -2525461 2414855
38334 2414855 3991486 1057457 -1856757 -1721741 -2124944 -9280233 -23463446 -36454716
38326 -36454716 -38424372 -26926695 -9303400 2932975 2913282 -6048267 -13265016 -10961080
38318 -10961080 -2242178 3225666 1584676 -874399 2411367 8359459 9025034 3929770
38310 3929770 1077151 4877296 9251190 6276935 -2709835 -9512242 -9960337 -6883421
38302 -6883421 -3205051 1586241 6452892 6202353 -1656653 -10795989 -12083310 -4825009
38294 -4825009 2572885 3381357 -278803 -2335526 -878002 1517277 2996117 4010301
38286 4010301 3943084 -273213 -10009855 -20603843 -23813327 -16075104 -3317790 4696658
38278 4696658 5098143 4414256 9118303 16970801 21146153 20174631 18256491 16766690 12412823
38269 12412823 5404609 2448042 7422383 14619640 16588756 14209311 12780524 12024526
38261 12024526 7907827 2341941 2100077 7425298 9927501 4094304 -6078142 -14329037
38253 -14329037 -18831331 -18494204 -10444422 3176958 12396423 10305070 2192913 -2603692
38245 -2603692 -3302585 -5041489 -8538599 -11394042 -15919269 -24923071 -31572242 -25492828
38237 -25492828 -9826114 -119600 -2976845 -7366519 -2408484 7187748 10806532 7303586
38229 7303586 1748623 -4768320 -11571772 -11544581 -62525 13339138 14624794 4778998
38221 4778998 -1907429 1884102 9667745 14596582 17006670 16109315 6992028 -8286369
38213 -8286369 -17164264 -11613029 875401 8061709 7973960 6527109 6671851 7610677 9650289
38204 9650289 11721926 7942423 -4921305 -18794481 -21348793 -11339309 139981 4242414
38196 4242414 3969909 7356590 15714249 21784102 18363307 7184198 -1730819 -890626
38188 -890626 5338266 5678454 -3800405 -15396794 -20909683 -20563819 -17524692 -10663072
38180 -10663072 668874 9813751 8829476 -740046 -9538818 -11077076 -5274074 5752844
38172 5752844 18379707 25658102 22407438 12483925 5057579 3493970 3354963 1289545
38164 1289545 -85421 2560636 7714561 10302664 6243598 -3753517 -12804710 -12684440
38156 -12684440 -3422274 4780670 3203334 -5205650 -11719642 -13353219 -12444360 -9746528
38148 -9746528 -6187466 -7447383 -17204307 -28633758 -32489765 -30937562 -32396111 -35312715
38140 -35312715 -30533662 -19119562 -12654654 -13572941 -10657030 847984 9848569 7955515
38132 7955515 3397135 6139185 11369722 10000073 5359464 5520386 6772270 90106
38124 90106 -10326522 -10692608 729910 10025204 8287318 3694982 7583989 17208869
38116 17208869 19267367 6651505 -13423908 -26812590 -25491284 -13777450 -2556609
38109 -2556609 1979735 2212784 2256942 1854404 -579883 -3492211 -5112791 -7373800 -11984172
38100 -11984172 -15165230 -11562544 -2057197 6985445 11489639 12744691 13284192 13173407
38092 13173407 10632131 4739958 -2070175 -4499093 -171260 5374222 4300233 -2570355
38084 -2570355 -6943394 -6528472 -8704821 -16863853 -22688362 -19367181 -13990032 -16828928
38076 -16828928 -24610347 -25865605 -19188364 -14525998 -17625785 -23926387 -28026218 -29484846
38068 -29484846 -28093771 -21985428 -12326110 -3217809 3899910 9692710 11568196 6471151
38060 6471151 -1211194 -3046567 967149 1589803 -5645688 -13166389 -11704885 -2255745
38052 -2255745 5858529 5248883 -3177663 -11250529 -10756649 -2652799 2451524 -3007919
38044 -3007919 -13211050 -16921868 -12269956 -5842659 -347244 6651024 13223036 13756996
38036 13756996 9927877 9924482 14834664 16736531 12980774 10820274 13464320 13085058 4443878
38027 4443878 -4448357 -3369574 5883258 13805370 15493394 11935341 4897818 -2894413
38019 -2894413 -7527155 -9467040 -14304134 -23267608 -29076837 -26143232 -18359284 -11696453
38011 -11696453 -6300107 -1430737 -123025 -2227133 -1099595 5280152 8678079 4561583
38003 4561583 1740091 7038175 10673071 1901080 -9293552 -4967914 10751092 15356714
37995 15356714 2609541 -7435820 326804 13269424 11167753 -4213005 -13826639
37988 -13826639 -8589155 1377575 2978274 -4405188 -11179510 -9848337 -3048927 -202783
37980 -202783 -5934648 -13486041 -13398295 -7143692 -5425440 -12674558 -21355823 -24265372 -24150174
37971 -24150174 -26034225 -27188024 -21866904 -11543042 -3330987 -468953 -60201 1192430
37963 1192430 3691862 6448485 8326344 8274579 5899446 515750 -9780765 -23646844
37955 -23646844 -31541066 -23303176 -3505641 9689362 6842444 -185983 3720999 14469177
37947 14469177 16083511 5019967 -6586538 -9895237 -7719818 -3755897 2323199 6362175
37939 6362175 646509 -11215385 -13967382 -3036874 6036945 1217108 -5627872 2737397
37931 2737397 19337261 21432885 5540163 -6281782 1194501 15614202 17370126 6854827
37923 6854827 -581643 1605963 5167395 1711938 -7194138 -14903627 -17653665 -16430556
37915 -16430556 -14680384 -14520073 -13741799 -8648052 -1196633 974081 -5334572 -13417211
37907 -13417211 -15529473 -12419177 -8622088 -3318553 6213809 15097674 13924819 1535097
37899 1535097 -12377809 -18169001 -14194818 -4338930 5916513 10630361 7055703 -523264
37891 -523264 -5373444 -6396658 -6277546 -3469863 5542717 16348715 19213297 13926775
37883 13926775 11703422 17580260 20925257 10916919 -6589740 -16615299 -13709359 -3935780
37875 -3935780 7075854 17451646 22455696 15801126 -85203 -13279597 -15459794 -10426553
37867 -10426553 -6651108 -6356719 -6235346 -5638688 -8297464 -15247399 -20223175 -15711282
37859 -15711282 -2939812 7892022 8938306 2861243 -3299313 -8353122 -14949949 -20149946
37851 -20149946 -17171615 -7381185 -1058752 -2588581 -3840919 1951657 8237213 5604395
37843 5604395 -2231693 -3453743 3865648 9319249 5849958 -924665 -1176341 7341607
37835 7341607 17852947 20923304 11876002 -4305042 -15558093 -13721461 -2516673 7757134
37827 7757134 10783438 6261973 -3690721 -13536669 -13807300 -931552 13660855 13794088
37819 13794088 -1218800 -15379575 -16769156 -10463521 -7130633 -7621825 -5776391 -752579
37811 -752579 1814642 -311833 -1592014 3898600 13934573 19863603 16962939 10690665
37803 10690665 9748763 14161228 15735368 11257918 7449464 8358483 6544784 -4237576
37795 -4237576 -14868644 -12072550 333954 5988362 673469 -3452274 -469292 -397724
37787 -397724 -9186972 -15051028 -6947416 5271763 3916853 -10414581 -20460209 -16881439
37779 -16881439 -7839718 -4268547 -7032581 -10591005 -10722482 -6315478 183286 2718572
37771 2718572 -2637263 -11397365 -15227353 -12721951 -10221822 -12062556 -16005061 -18894348
37763 -18894348 -20711784 -21423999 -19428649 -15509947 -13595306 -14871667 -15214021 -11599422
37755 -11599422 -7839432 -10156425 -18460852 -25124748 -22397761 -9554623 7026378 19624287
37747 19624287 24730810 23508294 18056005 9187677 -1456224 -9455968 -10677964 -6216918
37739 -6216918 -2110321 -3222572 -8195355 -11089510 -8040981 -1999387 79529 -4629357
37731 -4629357 -10965781 -11764166 -5953861 2150504 9465422 14964404 15252429 6959818
37723 6959818 -4665939 -7448048 2695087 14742019 16545994 10427451 7420021 10025777
37715 10025777 9849966 1550117 -9491477 -15297772 -14804320 -12604584 -12301183 -13426362
37707 -13426362 -12843224 -8509753 -3143929 -2384574 -6729091 -8488119 -1776860 7267635
37699 7267635 7335166 -2300770 -11253936 -13819106 -15719902 -21197500 -22564176 -10843644
37691 -10843644 8247246 18244799 11260791 -3765312 -13076435 -12501268 -7549755 -3842435
37683 -3842435 -1849395 147624 1714825 486836 -3986581 -7592702 -4049219 8255878
37675 8255878 21397506 22796173 8553261 -9023016 -12141170 2734512 20685242
37668 20685242 26612544 21707910 15906508 10487960 -384199 -13346354 -15832703 -6144683
37660 -6144683 383040 -6372748 -14832611 -9462578 4156440 7247174 -3837209 -13406419
37652 -13406419 -10286365 -514424 6766975 11895601 17127726 18446190 13171636 7096209
37644 7096209 5837439 5894965 2217214 -1451925 1374686 7874702 9075942 2919808
37636 2919808 -4173672 -7900230 -10380632 -13325360 -13942100 -9970468 -3880707 556493
37628 556493 2870520 5145030 8689378 12653539 14519844 11599619 3746090 -4899305
37620 -4899305 -8375634 -4194491 3944497 9004034 6821980 319720 -3305095 -1297971
37612 -1297971 -8513 -7268162 -20523409 -27823730 -22477128 -11510150 -6024688 -7923055
37604 -7923055 -11285854 -12884853 -14247121 -14871719 -10930391 -2028227 6381982 9354696
37596 9354696 7234684 3018606 -562393 13647 7547297 18171644 21609592 12320874
37588 12320874 -2544627 -11407284 -12121608 -11521636 -12558118 -10131677 -2029694 3960329
37580 3960329 117274 -8956425 -11889160 -6360491 -1416804 -3705888 -9329822 -12100674
37572 -12100674 -12818154 -15518554 -19694535 -21826387 -21199622 -19065907 -15094098 -9815470
37564 -9815470 -7397837 -9963949 -12017805 -7592647 -769833 -778378 -7359992 -10151202 -3907583
37555 -3907583 4692398 8396386 8926742 10607217 12100778 10386606 6743000 2591928
37547 2591928 -4840163 -15594870 -20958370 -13392886 316172 5340851 -1971206 -9913123
37539 -9913123 -8076381 -105044 4144461 2825840 2240699 5424814 7015219 1034327
37531 1034327 -9756584 -15517370 -10242117 1229236 8422311 6083922 -1962604 -8488638
37523 -8488638 -9498427 -5862471 -1929753 -2745373 -9008826 -14352031 -11693615 -2938368
37515 -2938368 2511058 63361 -5127494 -7777226 -9985059 -14403107 -16538718 -11143140
37507 -11143140 -1833402 3560978 4399007 5819443 7543301 2973707 -9371811 -20985857
37499 -20985857 -22825477 -15002075 -4976985 446505 145834 -1495189 483147 4819284
37491 4819284 4234396 -4026710 -11225516 -7115129 5295857 13026479 10765431 6395730
37483 6395730 7226752 9509885 5689111 -5025144 -17965746 -28909475 -33950735 -29155654
37475 -29155654 -16079450 -3440117 2214886 4113881 8636544 15033365 17857672 16544285
37467 16544285 15389699 15149739 11717144 3946560 -3130608 -4970671 -3129052 -1704041
37459 -1704041 -857479 3446935 13655053 25624164 30097948 20749664 1595113 -15439235
37451 -15439235 -21710650 -18695210 -12681566 -6650067 -810929 2739847 1888247 -569742
37443 -569742 163178 3517579 4867222 3933705 5142826 8716438 9094151 5219777 4558575
37434 4558575 11269680 17224616 12946244 2908553 51291 6408170 9420785 -247030
37426 -247030 -15811069 -23770578 -20252904 -13060842 -11340777 -17557139 -26865227 -30846583
37418 -30846583 -24422138 -12004059 -3968676 -4648445 -7904759 -7477520 -5830757 -7103377
37410 -7103377 -7083364 771076 12177760 15037322 6189211 -3615790 -3808708 3999134
37402 3999134 10879075 11730494 8827134 8326384 14326868 22633715 22079477 8421013
37394 8421013 -5656617 -4547217 7421243 10668853 -8117 -6644401 3468017 16461117
37386 16461117 12417873 -4943230 -15642960 -12705645 -6592810 -4534035 -3001282 -193854
37378 -193854 292894 -171260 3840110 8061451 600781 -17710170 -29215010 -22573953
37370 -22573953 -7906519 -987658 -2968997 -4826962 -3205911 -1678481 -1746535 -1714836
37362 -1714836 -1597256 -2755740 -5148946 -8617679 -12862210 -13823749 -6734882 4103339
37354 4103339 6987255 -869133 -7691706 -4366191 2180880 1660856 -2742854 -2000563
37346 -2000563 1539636 -1482334 -9863609 -13141575 -9662820 -9568331 -17866617 -26627641
37338 -26627641 -27507700 -21721014 -13422583 -2571890 10051265 18163771 16778134 9409166
37330 9409166 3698283 2900552 4742685 5413266 2284925 -3876308 -7551569 -3293610
37322 -3293610 6207028 11366018 7508559 921486 -65301 4278782 7495456 6448850
37314 6448850 3392945 554532 -2012909 -3242679 -511189 5692597 9410560 4683360
37306 4683360 -6753254 -15654439 -14626155 -5922001 2249800 5800669 6915810 6185570
37298 6185570 -791793 -14734572 -25975739 -23582777 -9082111 5687739 13398515 16898848
37290 16898848 20147372 21362941 17731627 10528441 2138370 -7017437 -15491576 -19759978
37282 -19759978 -19842336 -21260467 -26875130 -30802503 -25847131 -14190800 -4818279 -1533985
37274 -1533985 673485 6777253 14060978 15462131 8078211 -3445233 -11070835 -10358578
37266 -10358578 -4118746 901246 1593123 1844434 6838156 14959300 18291389 12154669
37258 12154669 1758556 -3250080 -178567 3990949 2545173 -1576215 -311765 7211386
37250 7211386 12830435 11067291 6314954 4145849 1281297 -8446399 -21551221 -27446195
37242 -27446195 -23486921 -18738747 -20500130 -24858885 -24445058 -18857077 -12499785 -7608818
37234 -7608818 -4899115 -6463556 -11822528 -14588740 -9651994 -1467024 1293741 -2047174
37226 -2047174 -3996349 -738049 2579469 127572 -6500439 -11458251 -12579681 -13212442
37218 -13212442 -17304039 -23982519 -26882250 -20125005 -6453756 3036776 748819 -7954921
37210 -7954921 -11801951 -8204732 -4321749 -4250183 -3597051 760972 3904126 1468984 -1321954
37201 -1321954 3553318 14984321 24769827 28925489 29474221 26625201 17733119 4926555
37193 4926555 -4172036 -6124730 -5652160 -6893129 -7135996 -3775373 -1621340 -6618991
37185 -6618991 -15719706 -19995165 -16568477 -11171044 -8927643 -8446278 -6369813 -3046148
37177 -3046148 -1282085 -2125654 -3673603 -2857450 1667524 7156149 8689477 5642110
37169 5642110 3727910 6612736 8332172 693274 -13014888 -20054662 -15390809 -8411062
37161 -8411062 -8885800 -14026523 -15149171 -10735747 -5902493 -3572608 -3345035 -5555272
37153 -5555272 -9257036 -9195566 -2528913 3632479 -265527 -12120579 -20145383 -19269251
37145 -19269251 -16813162 -19720618 -24560369 -24525649 -19767600 -15349661 -13177625 -11097403
37137 -11097403 -7581996 -3247173 794172 3182728 2270878 -1801090 -5872297 -6302911
37129 -6302911 -2645939 1323069 231136 -7192671 -13883184 -9984082 3611215 12260812
37121 12260812 5376823 -6991108 -6152175 8362686 17551566 11023911 1468371 3107380
37113 3107380 8962060 2679438 -15404940 -28905604 -28586973 -20910215 -13673843 -6181642
37105 -6181642 3133174 9795298 9487128 4891773 1798351 2145397 3670214 3643860 1695027
37096 1695027 1029700 5680057 13323290 13888109 1519816 -14269458 -17387277 -4621605
37088 -4621605 11735829 20474555 21280065 17281512 9404231 2369615 4811860 15610318
37080 15610318 19502442 6222205 -12885460 -18330069 -8066031 1919669 713363 -5452895
37072 -5452895 -5535386 1874415 10012093 12800355 8613202 321898 -5324045 -2308860
37064 -2308860 8180805 18648947 23263724 21503927 14525276 3827698 -5410354 -6244071
37056 -6244071 1423056 8910827 8665652 2004846 -5497550 -11155226 -14056533 -12257542
37048 -12257542 -6673255 -3820596 -8385299 -15381435 -15748272 -8349062 -624027 1937019
37040 1937019 1271309 1656489 4466685 8756688 12460200 12091854 5540892 -3608734 -8238218
37031 -8238218 -5303601 1840238 8867948 13983318 15316757 10011194 -1350983 -13086214
37023 -13086214 -20091815 -22638396 -23300969 -21923083 -16519782 -7537788 1296291 6038686
37015 6038686 6029915 5497129 10676240 22039803 29868517 22576165 1143875 -19037689
37007 -19037689 -23284412 -11698047 3129932 8754629 1895665 -10697846 -18158905 -15844453
36999 -15844453 -10616671 -11177877 -13928518 -7405647 7541987 14174663 3472078 -10237588
36991 -10237588 -8944676 2590055 5113839 -5099463 -11297589 -1967618 13688300 20271398
36983 20271398 14098057 1348185 -11499592 -19182521 -17482656 -7859850 2522022 8595722
36975 8595722 10126705 6309711 -3554927 -12467936 -10098727 870157 4509996 -5468671
36967 -5468671 -14640227 -9492765 1456357 1947215 -5711370 -5934457 2924286 5472645
36959 5472645 -5272926 -16760076 -17094854 -11846612 -11774310 -15033742 -12906257 -6266035
36951 -6266035 -4226276 -8674004 -10889670 -4889453 3901797 6502607 1677448 -4371553
36943 -4371553 -6690920 -6181999 -6313309 -8157660 -9443285 -7373599 -2046394 2276541
36935 2276541 -127360 -10462508 -21724596 -23636013 -13382943 450490 7241223 5649071
36927 5649071 1971356 -563269 -4455997 -9705542 -10486179 -3714432 5129821 9860070
36919 9860070 12244615 16400317 18654261 11744530 -1773726 -9404248 -4582899 4597037
36911 4597037 7036347 3471967 3270112 9173314 12903028 7441320 -2584283 -7535020
36903 -7535020 -6286641 -6424810 -10969127 -12391524 -4117840 7792460 11595680 5515334
36895 5515334 -1630067 -4369964 -5938127 -8338467 -7061145 -632473 3255279 -1331375
36887 -1331375 -7881811 -6377290 1271707 3992987 -2219989 -10076675 -13218994 -14218361
36879 -14218361 -17972778 -23601716 -26333336 -23534328 -16310108 -7864699 -1889031 -243688
36871 -243688 -1140214 -1425030 -859110 -2108916 -6583921 -12403772 -16509831 -17269869 -15496042
36862 -15496042 -13973270 -14697678 -15863213 -14129600 -10605325 -10159253 -12796700 -11538593
36854 -11538593 -3040483 5767311 7866718 7119760 10562820 14597461 9951374 -1523631
36846 -1523631 -6980445 -967847 6916377 6084315 -2189422 -9811338 -11912697 -7531938
36838 -7531938 2782676 15127258 23329387 26027478 27983545 31424650 31893333 26261147
36830 26261147 18695165 14022372 10779180 6009938 1832280 1582861 3967634 6916956
36822 6916956 12858792 23205616 30950705 26782641 11779070 -2788037 -8480002 -6878316
36814 -6878316 -3579063 -783867 2470352 7000327 12383201 16563784 15956265 9006968
36806 9006968 82680 -3991967 -2494884 -1773487 -5195648 -6506471 1645655 15005370
36798 15005370 20644392 13685973 4147169 2984211 7455928 7597127 2911307 2166388
36790 2166388 7057651 7920071 -216658 -8223976 -6952258 -1478185 -1354155 -4091329
36782 -4091329 -946447 5229813 2163157 -11991361 -24109596 -23939439 -15261464 -5989308
36774 -5989308 1919211 7465328 5280108 -7079173 -22197038 -29515661 -25873837 -16327367
36766 -16327367 -8481415 -7567528 -11788008 -11527336 5964 14474160 15620578 1006060
36758 1006060 -13733849 -16640456 -14421880 -18513242 -26444168 -27417957 -19350834 -9454218
36750 -9454218 -2209697 3070989 5306439 1601240 -6491899 -13437303 -15714358 -12859897
36742 -12859897 -5446499 2986307 5671130 131159 -7231650 -9484002 -8402692 -9766274
36734 -9766274 -13576177 -15425022 -14104857 -11713083 -9715399 -10403576 -17305538 -27608730
36726 -27608730 -29928203 -18107943 -2328946 2964006 -1926026 -5104087 -1710517 1958663
36718 1958663 1386545 -333905 119551 2685722 7783336 14761109 17122517 9276135
36710 9276135 -2130549 -4599694 1401415 1768569 -9624821 -20051949 -15252950 1001868
36702 1001868 12720202 12070762 6337678 6105078 12317131 16617346 12624859 4360871
36694 4360871 872164 3470337 4445334 611733 78640 9383579 21474889 25449851
36686 25449851 21841949 17671916 12297222 1233816 -10243639 -12198179 -6978872 -6220021
36678 -6220021 -11506293 -13344858 -9576700 -8049036 -9084160 -3497983 7348795 8512122
36670 8512122 -3540770 -11359082 -3348802 6591416 731288 -15068506 -21894801 -15323862
36662 -15323862 -5859617 551666 6115422 10157731 9435138 6471511 5129815 1728156
36654 1728156 -7186469 -12897675 -4423446 12565295 21075815 15994777 8484820 7589046
36646 7589046 10869472 14079093 16752582 15866123 6691332 -6181585 -10143828 -1706012
36638 -1706012 7654937 7841747 2965135 1766408 3610083 1956527 -3562504 -6706072
36630 -6706072 -4431298 -796561 -444449 -1969694 -169482 5324617 6582024 -3094922
36622 -3094922 -16839250 -19160359 -6579288 5399007 2956196 -7184610 -10221295 -6396047
36614 -6396047 -6565951 -10043816 -5655114 5549972 8697606 648493 -2499972 7609791
36606 7609791 15448328 5888956 -10627508 -14133388 -5217600 -204300 -3070794 -2258249
36598 -2258249 6005112 10449282 4409870 -3172670 -2843897 1397840 686790 -5018674
$$ [...]
##END NTUPLES=NMR SPECTRUM
##END=
