##TITLE=31Pdec_SR68_rm1
 , 24 sc
 4.06.2021
##JCAMPDX= 6.0         $$ Bruker NMR JCAMP-DX V2.0
##DATA TYPE= NMR SPECTRUM
##DATA CLASS= NTUPLES
##ORIGIN= UXNMR, Bruker Analytische Messtechnik GmbH
##OWNER= root
$$ XWIN-NMR		Version 3.5
$$ Fri Jun  4 13:57:18 2021 Russian Standard Time (UT+4h)  she@DPX200
##.OBSERVE FREQUENCY= 81.013821
##.OBSERVE NUCLEUS= ^31P
##.ACQUISITION MODE= SIMULTANEOUS
##.ACQUISITION SCHEME= undefined
##.AVERAGES= 24
##.DIGITISER RES= 16
##SPECTROMETER/DATA SYSTEM= spect
##.PULSE SEQUENCE= zgpg30
##.SOLVENT NAME= CDCl3
##.SHIFT REFERENCE= (INTERNAL, CDCl3, 0, 248.564)
##AUDIT TRAIL= $$ (NUMBER, WHEN, WHO, WHERE, WHAT)
$$ ##TITLE= Audit trail, XWIN-NMR		Version 3.5
$$ ##JCAMPDX= 5.01
$$ ##ORIGIN= Bruker BioSpin GmbH
$$ ##OWNER= she
$$ F:/spectra/data/she/nmr/P31/1/pdata/1/auditp.txt
$$ ##AUDIT TRAIL=  $$ (NUMBER, WHEN, WHO, WHERE, WHAT)
(   1,<2021-06-04 13:56:06.12 +0400>,<she>,<DPX200>,
      <created by zg, POWCHK disabled, PULCHK disabled
       configuration hash MD5:
       00 E9 B6 7A A2 85 ED C7 34 08 36 98 17 FE 4E 26
       data hash MD5: 32K
       0D F5 4E E7 B5 73 5F 72 BD 44 DD A5 50 DC AB 6E>)
(   2,<2021-06-04 13:56:08.82 +0400>,<she>,<DPX200>,
      <Start of raw data processing
       efp BC_mod = 2 LB = 1 FT_mod = 6 PKNL = 1 PHC0 = -6328.415 PHC1 = 967.0753 SI = 64K 
       data hash MD5: 64K
       75 01 70 D3 B2 73 CF A8 77 42 6A 1F 66 DD 67 57>)
(   3,<2021-06-04 13:56:43.90 +0400>,<she>,<DPX200>,
      <pk PHC0 = 370.8222 PHC1 = -695.4006 
       data hash MD5: 64K
       CA 44 9B 61 5E 06 D9 9B 88 2C 3B 24 81 5D F7 DA>)
$$ ##END=
$$ 
$$ hash MD5
$$ 9D EC C5 64 B1 C2 74 A6 D1 82 D2 7B A2 48 51 D0
##$RELAX= 
##$RELAX= 
##$RELAX= 
##$RELAX= 
##$RELAX= 
##$RELAX= 
##$RELAX= 
##$RELAX= 
$$ Bruker specific parameters
$$ --------------------------
##$DU= <F:/spectra>
##$EXPNO= 1
##$NAME= <P31>
##$PROCNO= 1
##$TYPE= <nmr>
##$USER= <she>
##$AMP= (0..31)
100 100 100 100 100 100 100 100 100 100 100 100 100 100 100 100 100 100 
100 100 100 100 100 100 100 100 100 100 100 100 100 100 
##$AQSEQ= 0
##$AQ_mod= 1
##$AUNM= <au_zg>
##$AUTOPOS= <>
##$BF1= 81.014009
##$BF2= 200.13
##$BF3= 200.13
##$BF4= 200.13
##$BF5= 200.13
##$BF6= 200.13
##$BF7= 200.13
##$BF8= 200.13
##$BYTORDA= 1
##$CFDGTYP= 0
##$CFRGTYP= 5
##$CHEMSTR= <none>
##$CNST= (0..31)
1 1 145 1 1 1 1 1 1 1 1 1 1 1 1 1 1 1 1 1 1 1 1 1 1 1 1 1 1 1 1 1 
##$CPDPRG= <waltz16>
##$CPDPRG1= <>
##$CPDPRG2= <waltz16>
##$CPDPRG3= <>
##$CPDPRG4= <mlev>
##$CPDPRG5= <mlev>
##$CPDPRG6= <mlev>
##$CPDPRG7= <mlev>
##$CPDPRG8= <mlev>
##$CPDPRGB= <>
##$CPDPRGT= <>
##$D= (0..31)
0 1 0 0 0 0 0 0 0 0 0 0.03 2e-05 3e-06 0 0 0 0 0 0 0 0 0 0 0 0 0 0 0 0 
0 0 
##$DATE= 1622800565
##$DBL= (0..7)
120 120 120 11 120 120 24 19 
##$DBP= (0..7)
150 150 150 150 150 150 150 150 
##$DBP07= 0
##$DBPNAM0= <>
##$DBPNAM1= <>
##$DBPNAM2= <>
##$DBPNAM3= <>
##$DBPNAM4= <>
##$DBPNAM5= <>
##$DBPNAM6= <>
##$DBPNAM7= <>
##$DBPOAL= (0..7)
0.5 0.5 0.5 0.5 0.5 0.5 0.5 0.5 
##$DBPOFFS= (0..7)
0 0 0 0 0 0 0 0 
$$ [...]
##$SUBNAM2= <"">
##$SUBNAM3= <"">
##$SUBNAM4= <"">
##$SUBNAM5= <"">
##$SUBNAM6= <"">
##$SUBNAM7= <"">
##$SUBNAM8= <"">
##$SUBNAM9= <"">
##$SW= 501.771253377433
##$SWIBOX= (0..15)
0 1 3 0 0 0 0 0 0 0 0 0 0 0 0 0 
##$SW_h= 40650.406504065
##$TD= 32768
##$TD0= 1
##$TE= 0
##$TE2= 300
##$TE3= 300
##$TEG= 300
##$TL= (0..7)
0 120 53 12 22 120 120 120 
##$TP= (0..7)
150 150 150 150 150 150 150 150 
##$TP07= 0
##$TPNAME0= <>
##$TPNAME1= <>
##$TPNAME2= <>
##$TPNAME3= <>
##$TPNAME4= <>
##$TPNAME5= <>
##$TPNAME6= <>
##$TPNAME7= <>
##$TPOAL= (0..7)
0.5 0.5 0.5 0.5 0.5 0.5 0.5 0.5 
##$TPOFFS= (0..7)
0 0 0 0 0 0 0 0 
##$TUNHIN= 0
##$TUNHOUT= 0
##$TUNXOUT= 0
##$USERA1= <user>
##$USERA2= <user>
##$USERA3= <user>
##$USERA4= <user>
##$USERA5= <user>
##$V9= 5
##$VALIST= <valist>
##$VCLIST= <CCCCCCCCCCCCCCC>
##$VD= 0
##$VDLIST= <DDDDDDDDDDDDDDD>
##$VPLIST= <PPPPPPPPPPPPPPP>
##$VTLIST= <TTTTTTTTTTTTTTT>
##$WBST= 1024
##$WBSW= 4
##$XGAIN= (0..3)
0 0 0 0 
##$XL= 0
##$YL= 0
##$YMAX_a= 25064
##$YMIN_a= -27285
##$ZGOPTNS= <>
##$ZL1= 120
##$ZL2= 120
##$ZL3= 120
##$ZL4= 120
##$ABSF1= 0
##$ABSF2= 0
##$ABSG= 0
##$ABSL= 0
##$ALPHA= 0
##$AQORDER= 0
##$ASSFAC= 0
##$ASSFACI= 0
##$ASSFACX= 0
##$ASSWID= 0
##$AUNMP= <proc_1d>
##$AZFE= 0.1
##$AZFW= 0.5
##$BCFW= 0
##$BC_mod= 2
##$BYTORDP= 0
##$COROFFS= 0
##$CY= -3
##$DATMOD= 1
##$DC= 0
##$DFILT= <>
##$DTYPP= 0
##$F1P= 0
##$F2P= 0
##$FCOR= 1
##$FTSIZE= 65536
##$FT_mod= 6
##$GAMMA= 0
##$GB= 0
##$INTBC= 1
##$INTSCL= 5.30512e-09
##$ISEN= 30
##$LB= 1
##$LEV0= 0
##$LPBIN= 0
##$MAXI= 10000
##$MC2= 0
##$MEAN= 0
##$ME_mod= 0
##$MI= 50
##$NCOEF= 0
##$NC_proc= -7
##$NLEV= 6
##$NOISF1= 182.463
##$NOISF2= 159.3651
##$NSP= 0
##$NTH_PI= 0
##$NZP= 0
##$OFFSET= 248.5645
##$PC= 4
##$PHC0= -5957.593
##$PHC1= 271.6747
##$PH_mod= 1
##$PKNL= yes
##$PPARMOD= 0
##$PSCAL= 0
##$PSIGN= 0
##$REVERSE= no
##$SF= 81.014009
##$SI= 65536
##$SIGF1= 159.3651
##$SIGF2= -187.1042
##$SINO= 113.3802
##$SIOLD= 16384
##$SREGLST= <1H.CDCl3>
##$SSB= 0
##$STSI= 65536
##$STSR= 0
##$SW_p= 40650.406504065
##$SYMM= 0
##$S_DEV= 0
##$TDeff= 32768
##$TDoff= 0
##$TI= <>
##$TILT= no
##$TM1= 0
##$TM2= 0
##$TOPLEV= 0
##$USERP1= <user>
##$USERP2= <user>
##$USERP3= <user>
##$USERP4= <user>
##$USERP5= <user>
##$WDW= 1
##$XDIM= 65536
##$YMAX_p= 391198669
##$YMIN_p= -210892457
$$ End of Bruker specific parameters
$$ ---------------------------------
##NTUPLES= NMR SPECTRUM
##VAR_NAME=  FREQUENCY,     SPECTRUM/REAL,   SPECTRUM/IMAG
##SYMBOL=    X,             R,               I
##VAR_TYPE=  INDEPENDENT,   DEPENDENT,       DEPENDENT
##VAR_FORM=  AFFN,          ASDF,            ASDF
##VAR_DIM=   65536,         65536,           65536
##UNITS=     HZ,            ARBITRARY UNITS, ARBITRARY UNITS
##FACTOR=    0.620285442955139, 1,           1
##FIRST=     20137.2065510759, 0,            0
##LAST=      -20513.1999529892, 0,           0
##MIN=       -20513.1999529892, -210892457,  0
##MAX=       20137.2065510759, 391198669,    0
$$ Real data points
##PAGE= N=1
##DATA TABLE= (X++(R..R)), XYDATA
$$ [...]
43755a043964K640422K542314J038775K28795L28804m7947j254307k103714j755340
43746E73838p43779m0924Q5389Q0585L13455M98287J27721n04158l89524O14964
43736F15854J155993K43480j098781j275401m00301L84419J022796J960762K110554
43727D719375L8364k794121k872353L78422L068224J889284j422225k692953r07562
43718e95545J103435R43305n97742j340927o44105L46459O47376O27279R94106
43709A483641J250832K17878j745551k411757o56137J416986J096118r59136j656711
43700a963837j64393J034929L33522n75206N3500Q39964l07054k308978k213229
43691e270782L61302K693450K799101J468757J68616q58345j545108j023526Q40688
$$ plain form
43755 -1043964 1596458 4138772 5177547 5406342 5735146 5687199 4432892 2329178 573838
43746 573838 -169941 -210865 -125476 -44891 268564 766851 894572 390414 890 615854
43736 615854 1771847 2015327 916546 -358855 -759156 -374737 648059 2608821 4719375
43727 4719375 4757739 1963618 -908735 -530313 2537911 4427195 3004970 312017 -595545
43718 -595545 507890 1451195 853453 -487474 -1131579 -785120 -137744 489535 1483641
43709 1483641 2734473 2952351 1206800 -1204957 -1861094 -444108 652010 -307126 -1963837
43700 -1963837 -2128230 -1093301 -759779 -1334985 -1281485 -441521 -748575 -3057553 -5270782
43691 -5270782 -4909480 -2216030 583071 2051828 2220444 1362099 -183009 -1206535 -365847
43682c65847K250720J531786k90647o99945P02770J590519L59984j470974j454157
43673B154209L54997J681294J194114k10322j196226j489872j306709p17061j52174
43664C12250l22369r99332j000199J2465R16701R53873P71200Q31178M12440o08537
43654A279670p57346N16617J051708r01968l175829k326321R39695K392832N12917
43645d68025j330295p9159K603112L060782O82371j953919k681954j489630N43164
43636a113553K164849K128678J31248k237427k694732q27513J305515J552230
43628D09295J08864j007057o72435Q1728k0554l08609O81910K240229J817320
43619C330691r50004k743732q53854K692322L634134J114963j742923k448195
$$ plain form
43682 -365847 1884873 3416659 3126012 2426067 3128837 4719356 5079340 3608366 2154209
43673 2154209 2509206 4190500 5384614 5174292 3978066 2488194 1181485 464424 312250
43664 312250 -10119 -1009451 -2009650 -1997185 -1080484 -126611 644589 1475767 1888207 1279670
43654 1279670 522324 1038941 2090649 1188681 -1987148 -4313469 -3373774 -980942 -468025
43645 -468025 -1798320 -1877479 725633 3786415 4468786 2514867 -167087 -1656717 -1113553
43636 -1113553 1051296 3179974 3311222 1073795 -1620937 -2448450 -1142935 409295
43628 409295 518159 -488898 -1161333 -1079605 -1100159 -1408768 -726858 1513371 3330691
43619 3330691 2380687 -363045 -1216899 1475423 5109557 6224520 4481597 2033402
43611B033402j640885q26846k26960K62511N4246r82771j704718j025767P51528
43602c306260K402703K811596J540139o00786j735311r40077K35024j80703j403274
43593a176949q62537J666348L259457J802984j281000l133489k619277n88802
43585b933265J514515K481220J946087P83078O2909l00799p93065q46630P2613
43576A986663O46395o16485k376314k006739O4659Q15617m26042j121965k43221
43567c277432Q4130r93357r61629J542817L687449K659548o004j185446p76841
43558G73235o59246j119913j148189o70331j12988O83303J269446M17279j087498
43549a654902k92754L009208M443924J194672l216526m044123k173512j385224
$$ plain form
43611 2033402 392517 -434329 -661289 -398778 -344532 -1327303 -3032021 -4057788 -3306260
43602 -3306260 -903557 1908039 3448178 2847392 1112081 172004 407028 226325 -1176949
43593 -1176949 -2039486 -373138 2886319 4689303 3408303 274814 -2344463 -2933265
43585 -2933265 -1418750 1062470 3008557 3791635 3854544 3553745 2760680 1914050 1986663
43576 1986663 2633058 2016573 -359741 -2366480 -2301821 -1486204 -1912246 -3034211 -3277432
43567 -3277432 -3193302 -4186659 -5148288 -3605471 81978 2741526 2735522 1550076 773235
43558 773235 113989 -1005924 -2154113 -2824444 -2937432 -2254129 -984683 -567404 -1654902
43549 -1654902 -1947656 1061552 5505476 6700148 3483622 -560501 -2734013 -4119237
43541d119237j526168J62560K747468K589682l8149j133152J52915M85175j102337
43532a781243j347362R32123K152490K15750j405815O49869L741343L138430p38412
43523E557173l182030j994010L55152J018449P1078r01884j197614j078957p57803
43514b110446j74520O05446J225687J328949J003496P44672P66448O88131K61132
43505D338995j07476r2282o1101k76284l18263j54723o87617k005991k335603
43496a700345m95724J686831J618379j74611q81253K39168J010384N2323j218368
43487A36784j087525q897M45819k60903j318968j520997k40348J754195K621406
43478E20566J484377k88317q29145r5556O69944Q11116K68118j021588k157100
$$ plain form
43541 -4119237 -5645405 -5482845 -2735377 -145695 -183844 -1316996 -1164081 -678906 -1781243
43532 -1781243 -3128605 -2196482 -43992 171758 -1234057 -584188 3157155 6295585 5557173
43523 5557173 2375143 381133 736285 1754734 1825812 923928 -273686 -1352643 -2110446
43514 -2110446 -2284966 -1679520 -453833 875116 1878612 2623284 3389732 4077863 4338995
43505 4338995 4231519 4139237 4078136 3801852 3483589 3328866 2641249 635258 -1700345
43496 -1700345 -2196069 -509238 1109141 934530 53277 292445 1302829 1355152 136784
43487 136784 -950741 -959638 -513819 -774722 -2093690 -3614687 -3855035 -2100840 520566
43478 520566 2004943 1716626 887481 791925 1461869 2272985 2541103 1519515 -637585
43469f37585j270993J530536L002603J002380j988048k511293j239655q05092
43461b917147o92322J022661K580082Q33191k266345j743349J833050K588539
43453A238360q07921k646638N9859K403139J56322k869007j408649K393160K838823
43444A357448j46135j876756p44800N78655N49641K65053K31519n6849R4506J418957
43434A671239K128604K18487k581087k938426j122059j15176k89969P10629K957194
43425F39436L512811J343603r58557j345530q11004o56809l84517L94637O46351
43416B380421j03775o88551m04981j82619n29298k96337J138557K123628Q16840
43407D253885j919594l222048j651028J042111J897659K56149j336784l90215
$$ plain form
43469 -637585 -1908578 -378042 2624561 3626941 1638893 -872400 -2112055 -2917147
43461 -2917147 -3609469 -2586808 -6726 826465 -1439880 -3183229 -1350179 1238360
43453 1238360 430439 -2216199 -2156340 246799 403121 -2465886 -3874535 -1481375 1357448
43444 1357448 1211313 -665443 -1410243 -831588 -281947 -16894 214625 157776 252282 1671239
43434 1671239 3799843 4018330 1437243 -1501183 -2623242 -2738418 -3028387 -2317758 639436
43425 639436 4152247 5495850 4537293 3191763 2380759 1723950 1339433 1734070 2380421
43416 2380421 2276646 1588095 1183114 1000495 471197 174860 1313417 3437045 4253885
43407 4253885 2334291 -887757 -2538785 -1496674 400985 657134 -679650 -1069865
43399a069865J984993K488533N05353r68043j47328O98684p65441k817061k458072
43390b548247k27029J126907J210763J602663K010759P14554j603254k286084
43382A032j016628j39811m31928q4381J487182K217735Q17699j249415k251316
43373f49831k168240j392917J45588J819764K442973K021303J359124J89586j733024
43364B034326k360835K19749L425661K650761j510464l387067q01814J659058
43356A929375K52577k136310j329741J408239K300530J317757Q67147P53957p97366
43347D566165k760177k500835l72655R58335R74956J225295J516857J93582k122101
43338A679422k960143k123388j620553j477598L30086L257337L752717Q41530
$$ plain form
43399 -1069865 915128 3403661 3909014 2940971 2793643 3492327 2726886 -90175 -2548247
43390 -2548247 -2775276 -1648369 -437606 1165057 3175816 3890370 2287116 1032
43382 1032 -1015596 -1155407 -1587335 -1671716 -184534 2033201 2850900 1601485 -649831
43373 -649831 -2818071 -4210988 -4065400 -2245636 197337 2218640 3577764 3767350 2034326
43364 2034326 -326509 -106760 3318901 5969662 4459198 1072131 270317 1929375
43356 1929375 2181952 45642 -1284099 124140 2424670 3742427 4609574 5363531 4566165
43347 4566165 1805988 -694847 -1067502 -109167 865789 2091084 3607941 3801523 1679422
43338 1679422 -1280721 -3404109 -5024662 -6502260 -6172174 -2914837 837880 1679410
43330A679410j728227r68436J073748J051019m97736p94171K76108L19154j231852
43321h20983k046489m88817J995114K883745J572673m27329j431191r96697J58416
43312C98442R87211Q44175j96758j433700j987814j472518l62465M79360O72570
43303b071497M46939K4215m95899o50909K6023R16097P29949m74150r95584l1490
43293b576306R55829O45510Q6329P37246J690903J176487k26171n85376j53330
43284A751121q36239k305919k014473L52862J788507N21858j438210j889714j528957
43275e599164j415088l64620K277418L835813J826277j479518j862457M75601
43267b305738J394494n34295k011352n13978J945673K392057J297548J073813
$$ plain form
43330 1679410 -48817 -1017253 56495 1107514 609778 -184393 91715 410869 -820983
43321 -820983 -2867472 -3356289 -1361175 1522570 3095243 2667914 1236723 240026 398442
43312 398442 1385653 2229828 2033070 599370 -1388444 -2860962 -3223427 -2744067 -2071497
43303 -2071497 -1624558 -1600343 -2096242 -2747151 -2721128 -1805031 -1075082 -1549232 -2544816 -2576306
43293 -2576306 -1620477 -974967 -888638 -151392 1539511 2715998 2489827 1904451 1751121
43284 1751121 914882 -1391037 -3405510 -3052648 -1264141 -742283 -2180493 -4070207 -5599164
43275 -5599164 -7014252 -7378872 -5101454 -1265641 560636 -918882 -2781339 -2305738
43267 -2305738 -911244 -1445539 -3456891 -3970869 -2025196 366861 1664409 2738222
43259B738222K052845K362658Q97225j459587l133048l134876j514730N09310
43251f81981J366799P90802N6729Q1816K45921k28213q21488o19468K36436R92381
43241A419734J382787J374930O87821m42473r21223l24505J24744o72133j838165
43232G91517j826485p29518K80850J015612J901304K156384N85850j821607k355646
43223a739k54560J942355J616937p44024k523836k111878j98576J362938J290580
43214C78197j29772j429357j566158r36858l35398L87652J532584K138539J075874
43205A115303p54326j236671j00825Q01162M91930P42j0733m45899j594999j969630
43195c703946p51596N11048L21133l19651K68079J562453J796484P85703j85795
$$ plain form
43259 2738222 4791067 7153725 8050950 6591363 3458315 323439 -1191291 -681981
43251 -681981 684818 1475620 1532349 1614165 1860086 1631873 810385 190917 427353 1419734
43241 1419734 2802521 4177451 4865272 4422799 3501576 3177071 3301815 2629682 791517
43232 791517 -1034968 -1764486 -1483636 -468024 1433280 3589664 4175514 2353907 -1739
43223 -1739 -256299 1686056 3302993 2558969 35133 -2076745 -2275321 -912383 378197
43214 378197 248425 -1180932 -2747090 -3683948 -4019346 -3631694 -2099110 39429 1115303
43205 1115303 360977 -875694 -976519 -175357 316573 317315 306582 -139317 -1734316 -3703946
43195 -3703946 -4455542 -3944494 -3623361 -3943012 -3674933 -2112480 -315996 469707 283912
43186B83912n98060r21018j080494m84407O19319J300903J321663J140577Q36286
43177B418681J88712m67180n72941k57676n547J63330L45171K02072l46694n84926
43167A083002p6354M88022M28319J57132J95514J83209j40007k35317j12365p90805
43157A180350k104615j983213K32174J842189O64929j129772k66537K166857K340142
43148B942504j40559j848439j219105m09594q26174q37691O16557J654462O40740
43139E72701r87675j079446J43027J085403J125757N35742l47383p50356J23968
43130D21738J442243J278371m19745j396219m62193Q17918P74109j86089j046454
43121A223679j631961j577692j85844J608239J616309j07473q86536J64604M93638
$$ plain form
43186 283912 -314148 -1235166 -2315660 -2800067 -2180748 -879845 441818 1582395 2418681
43177 2418681 2607393 2140213 1567272 1309596 1304049 1467379 1812550 2014622 1667928 1083002
43167 1083002 1006648 1494670 1922989 2080121 2275635 2458844 2318837 2083520 1971155 1180350
43157 1180350 -924265 -2907478 -2675304 -833115 -168186 -1297958 -1564495 602362 2942504
43148 2942504 2801945 953506 -265599 -675193 -1501367 -2339058 -1722501 -68039 572701
43139 572701 -414974 -1494420 -1351393 -265990 859767 1395509 1048126 297770 421738
43130 421738 1863981 3142352 2722607 1326388 864195 1682113 2456222 2270133 1223679
43121 1223679 -408282 -1985974 -2171818 -563579 1052730 945257 58721 223325 716963
43112G16963j297979k565276r11349J701577K219078J173581P32306N32138p81730
43103A519309j929990r57661P83534P36004j33661Q87068K759007J867711j474445
43094D056876k717163r1844K670396K172911j47500j345584j305497j385348j463517
43085D43730p97485Q3798L80219L82593L59097k38194j176212j013652L13846
43076a262260O43953q98917j776853J68712K726619K185434r48204k483445o58511
43067b303472J553657J101878r86377j828046j070450o91575j280487j083301
43059f588173Q32754K630947K287182O56185L8120N26432K27925r65128p55844
43050a109600J365952K292468n1102k707043j692463J577880K022085j252514
$$ plain form
43112 716963 -581016 -3146292 -4057641 -2356064 -136986 1036595 1768901 2301039 1519309
43103 1519309 -410681 -1368342 -584808 151196 17535 904603 3663610 5531321 4056876
43094 4056876 1339713 1247869 3918265 6091176 5943676 4598092 3292595 1907247 443730
43085 443730 -353755 -269957 110262 492855 851952 613758 -562454 -1576106 -1262260
43076 -1262260 -618307 -1517224 -3294077 -3125365 -398746 1786688 838484 -1644961 -2303472
43067 -2303472 -749815 352063 -634314 -2462360 -3532810 -4224385 -5504872 -6588173
43059 -6588173 -5755419 -3124472 -837290 -181105 -142985 383447 611372 -353756 -1109600
43050 -1109600 256352 2548820 2497718 -209325 -1901788 -323908 1698177 445663
43042D45663l273713o47037L277671L256369n90145l510964k667069J29402J854786
43033a725037J835657J338310J316710J496016J096467o2708j190410j357667
43025B747338o54075o0710j82659p51915j338405j642768j104202N33640K064100
43016c89656J720533j91122j118124L14908K148575J677635r41164l154435l254829
43007c187679j647036N05932K279435K856841J920450L60949m57785k86810l4794
42998B309503k50726m63567j82474K35841R9741o26860j187413r07569j24513
42989a098037J09273l91133k27693J623144L488821K474294j289698l937286k785336
42980b033651j63520j51468k639146l425729k46426L965569M940849K363086l02976
$$ plain form
43042 445663 -2828050 -3475087 -197416 3058953 2468808 -1042156 -3709225 -3579823 -1725037
43033 -1725037 110620 1448930 2765640 4261656 5358123 5295415 4105005 2747338
43025 2747338 2093263 2032553 1849894 1097979 -240426 -1883194 -2987396 -2453756 -389656
43016 -389656 1330877 1139755 21631 336539 2485114 4162749 3221585 67150 -3187679
43007 -3187679 -4834715 -4328783 -2049348 807493 2727943 3088892 2631107 2344297 2309503
42998 2309503 2058777 1595210 1412736 1648577 1748318 1121458 -65955 -973524 -1098037
42989 -1098037 -988764 -1379897 -1607590 15554 3504375 5978669 4688971 751685 -2033651
42980 -2033651 -2197171 -2348639 -4987785 -8413514 -8659940 -4694371 246478 2609564 2306588
42971B306588m22385R91203J223858m69229k067473j618343J13362Q16004J2267
42962H85852l71787P64401J728299O61583j336050j747864m92386Q3190j037728
42953h62490k035422j043481J342118L081052K893062R31914j467441k356888
42945D82424r20090J008355Q22974j074743j510169O15992K248147P37250j880940
42936E29200j929899K32963R85808p51143k092577j050414N11410K16969j162623
42927d510306j355568n7842J314333K089298K508132K255463Q82241o67142q85352
42918A573257n1997K7679j112455j728295n40257J222693J563366M63102m47228
42909I69865m33967m19198j069060j444477m04388J361234J904564O64738o27416
$$ plain form
42971 2306588 1884203 2875406 4099264 3630035 1562562 -55781 57581 873585 885852
42962 885852 514065 1278466 3006765 3668348 2332298 584434 92048 175238 -862490
42953 -862490 -2897912 -3941393 -2599275 481777 3374839 4306753 2839312 482424
42945 482424 -437666 570689 1393663 318920 -1191249 -575257 1672890 2410140 529200
42936 529200 -1400699 -1167736 -181928 -933071 -3025648 -4076062 -3564652 -3347683 -4510306
42927 -4510306 -5865874 -5923716 -4609383 -2520085 -11953 2243510 3125751 2458609 1573257
42918 1573257 1521260 1548939 436484 -1291811 -1832068 -609375 953991 1417093 969865
42909 969865 535898 116700 -952360 -2396837 -2801225 -1439991 464573 1129311 501895
42900E01895l73260N20420K0368j718762k245631m60473J454228J053702q12575
42891b060088j361512l7120R27215J46012r44968n92675O10661R53103K79045
42882b080327j94698j46823n31601j591413j978392o21678J431777K119645J054801
42873b538709r853K68159R14886L32833r00762p31013R07832J542281N7997j050433
42863a206782O28189L159128K603816j064117l611264k464020R0167Q22765K7171
42854a014947R3891J426517K064683P14180j578707k696365j546980Q78758K278557
42845F19587J465328r2996k96262M08186p6648j488929j051190J729778L277163
42836D494017J006364k537515l268976j152436P00538P89328M926r47595j700541
$$ plain form
42900 501895 128635 649055 669423 -1049339 -3294970 -3755443 -2301215 -1247513 -2060088
42891 -2060088 -3421600 -3458720 -2531505 -2385493 -3330461 -3923136 -3312475 -2359372 -2080327
42882 -2080327 -2275025 -2421848 -2953449 -4544862 -6523254 -7144932 -5713155 -3593510 -2538709
42873 -2538709 -2548562 -2280403 -1365517 -1032684 -1933446 -2664459 -1756627 -214346 -156349 -1206782
42863 -1206782 -578593 2580535 5184351 4120234 508970 -1955050 -1864883 -1042118 -1014947
42854 -1014947 -921056 505461 2570144 3284324 1705617 -990748 -2537728 -1658970 619587
42845 619587 2084915 1991919 1695657 2103843 2027195 538266 -512924 1216854 4494017
42836 4494017 5500381 2962866 -306110 -1458546 -758008 31320 36246 -911349 -2611890
42827b611890r22307J785688L585812J592520k202065l054881m15585J395714
42819h46994M8613j512104k54045K223968K567437N02782j672140k442186j763906
42810c148575q7310J373617R63707r69886j515629R37270L724544L109124n15370
42801C871492l055276k043261O60888J764973M26952j446827j779318l93669J266713
42792g27333J927760J552785O31047p38831k258767k700995j215482R55256J702899
42783h71661R56961O14178J400509J758700M89304j321354j952298j164560J87967
42774I7746J298283J376627r6416k179255k806753j219342J011964K004243J444081
42765I31178N8470j309078j619594l04412J380013J368530k64684j277610p55925
$$ plain form
42827 -2611890 -3534197 -1748509 1837303 3429823 1227758 -1827123 -2242708 -846994
42819 -846994 -798381 -2310485 -2564530 -340562 2226875 2729657 1057517 -1384669 -3148575
42810 -3148575 -3235885 -1862268 -898561 -1868447 -3384076 -2446806 1277738 4386862 3871492
42801 3871492 816216 -1227045 -566157 1198816 1625768 178941 -1600377 -1994046 -727333
42792 -727333 1200427 2753212 3384259 2645428 386661 -2314334 -3529816 -2574560 -871661
42783 -871661 85300 699478 2099987 3858687 4347991 3026637 1074339 -90221 97746
42774 97746 1396029 2772656 2676240 496985 -2309768 -3529110 -2517146 -512903 931178
42765 931178 989648 -319430 -1939024 -2243436 -863423 505107 240423 -1037187 -1793112
42756a793112l13589q66738q23110R13411K562751K150624N46789l38508n78196
42747A460322j152825j488499n97782N50358L29857p29387p75117L64062J172827
42738h66184R59844M38971K11844L21700Q12471J293195P09436j001805k006876
42729H72596r36237Q83276J318354N15269J43013M61078K81153o67265j298423
42720A572814q67552L44852J645802K149456J221257k94491n51599N34927P45071
42711F500537q83085k129058j153985L24203l9846j277810j110944q929R4223
42702C15306m15758J47713J213730R63858j46835l75294j09249o92150j056484
42693a55163M54815K080694R80129j342261r76352J521980J730528r73168k218952
$$ plain form
42756 -1793112 -2106701 -2973439 -3796549 -2883138 -320387 1830237 2377026 2038518 1460322
42747 1460322 307497 -1181002 -1778784 -1228426 -898569 -1627956 -2403073 -2039011 -866184
42738 -866184 93660 532631 744475 1066175 1878646 3171841 3881277 2879472 872596
42729 872596 -63641 819635 2137989 2653258 2796271 3257349 3538502 2871237 1572814
42720 1572814 705262 1050114 2695916 4845372 6066629 5772138 5220539 5755466 6500537
42711 6500537 5617452 3488394 2334409 2658612 2618766 1340956 230012 221083 315306
42702 315306 -100452 47261 1260991 2224849 2078014 1702720 1593471 901321 -155163
42693 -155163 299652 2380346 3360475 2018214 1041862 2563842 4294370 3321202 1102250
42684A102250k32314J256561k53164j913604r70560O08449K56120p36410l76267
42675a258939K23781k44460j10966J774107K672590K27693k739336k140163R14423
42666f81270K136078Q86418K58167J216202J339366m96956k270905k343460j546171
42657a502531r22087j52894Q35544J023078J08125n78624N2728J322635J879811
42648B065785J377758M65462k15161n30935o58991o57844l42952K37792N18518
42639B259432K36335J41523Q12907J186720j23063k240692k761045j190606M75439
42630a203050Q68133N73535J554j275609k331398j147714J673310K667788P04077
42621E30626q54140N71384K598341J914985m67070j464472r82118r29154j095368
$$ plain form
42684 1102250 869936 2126497 1873333 -40271 -1010831 -402382 -146262 -882672 -1258939
42675 -1258939 -1035158 -1279618 -1390584 383523 3056113 3283806 544470 -1595693 -681270
42666 -681270 1454808 2341226 2599393 3815595 5154961 4658005 2387100 43640 -1502531
42657 -1502531 -2424618 -2577512 -1741968 -718890 -610765 -1189389 -1136661 185974 2065785
42648 2065785 3443543 3909005 3693844 3162909 2503918 1846074 1503122 1740914 2259432
42639 2259432 2495767 2637290 3450197 4636917 4513854 2273162 -487883 -1678489 -1203050
42630 -1203050 -334917 238618 240172 -1035437 -3366835 -4514549 -2841239 -173451 530626
42621 530626 -323514 247870 2846211 4761196 4294126 2829654 1847536 918382 -176986
42612a76986L46J468427J201802j79751k85941P61600O84288p07184j308037o91956
42602G66608o63999j572362j579890k55273M26987l19480n25884J120204K833965
42593B30876K342786P7646j784342k127259j407142l18681Q11147J665841J805301
42584A296173J056379k2581l39640M37002R52063k58109k251803k537237p85912
42575b453665N85937L17082O8675R59228J361547J92645o83010N1604L95770j065019
42565b69206j709807O61365K975055J378627j935779j980460P82472J530450o01426
42556H31291j689870m08063J88251r56985r14519J312628K582790J251493j96946
42547B000070j36873l54692j502322j101845J390115K461233L46256j728762j137110
$$ plain form
42612 -176986 -176640 1291787 2493589 2313838 2027897 2789497 3473785 2766601 1458564 766608
42602 766608 102609 -1469753 -3049643 -3304916 -2877929 -3197409 -3723293 -2603089 230876
42593 230876 2573662 2651308 866966 -1260293 -2667435 -2986116 -2174969 -509128 1296173
42584 1296173 2352552 2329971 1990331 2427333 3379396 3121287 869484 -1667753 -2453665
42575 -2453665 -1867728 -1550646 -1481971 -522743 838804 1031449 348439 400043 795813 -269206
42565 -269206 -1979013 -1317648 1657407 3036034 1100255 -880205 -97733 1432717 831291
42556 831291 -858579 -1266642 -1078391 -2035376 -2949895 -1637267 945523 2197016 2000070
42547 2000070 1863197 1508505 6183 -1095662 294453 2755686 3101942 1373180 236070
42538B36070o5980p65691j128938R95045L089602J921405j065021k461742k097736
42529a342986j580514m97534J865521L560233K697243Q50814J71635l13051j889278
42520C522083k594186o12104J597631J070057m34253K34958J626576L60814k358719
42511B412857k604655n27254M60185N9067P11239J761334L07374k388210j882280
42502a690343J511821K294144j302861m199074k497836J024938K263553J629594
42494i66064J361437J194427Q3391j034212j177394j279543j866996j576251L0693
42485e230512J233025J560490K876109M958578M100013q63700n071857m053415
42477d91269k74346J035773k64229m43524J089362J379017j98604p97264P09410
$$ plain form
42538 236070 170090 -595601 -1724539 -729494 2360108 4281513 3216492 754750 -1342986
42529 -1342986 -2923500 -3421034 -1555513 2004720 4701963 5552777 5724412 5411361 3522083
42520 3522083 927897 315793 1913424 2983481 2549228 2784186 4410762 4771576 2412857
42511 2412857 -191798 -719052 -258867 -199800 511439 2272773 2580147 191937 -1690343
42502 -1690343 -178522 2115622 812761 -3386313 -5884149 -4859211 -2595658 -966064
42494 -966064 395373 1589800 1673191 638979 -538415 -1817958 -3684954 -5261205 -5230512
42485 -5230512 -3997487 -2436997 439112 5397690 9497703 8634003 3562146 -491269
42477 -491269 -765615 270158 5929 -437595 651767 2030784 1832180 1034916 1744326
42468A744326J777921N85195j133620j137061O5821N96121M9966m56075p9794
42459B012800Q25110J115709J8177j733665k395410j437926l48977l19345m32231
42450b695758M35176J338570Q83169j36334j02146M31999j45238j107277k32848
42441a330687K121064L041721J530269k33296p91664j256638k032491j163262
42433a14984J881986L838332J999707j366160k240647p64777k45767j283586j048586
42424F55518J372704K939060J383926j261091j923323q15294j74444n01445n90500
42415A085111j60947L5372R2380O37307J083198M61831l34929L70746J797425
42406E067494J308154j281887k886469j694070K67521O72227K87042O98681J174465
$$ plain form
42468 1744326 3522247 4107442 2973822 1836761 1902582 2498703 2548669 2092594 2012800
42459 2012800 2837910 3953619 3971796 2238131 -157279 -1595205 -1944182 -2263527 -2695758
42450 -2695758 -2260582 -922012 -38843 -175177 -277323 154676 9438 -1097839 -1330687
42441 -1330687 790377 3832098 5362367 5129071 4337407 3080769 1048278 -114984
42433 -114984 1767002 5605334 7605041 6238881 3998234 3233457 2987690 1704104 655518
42424 655518 2028222 4967282 6351208 5090117 3166794 2351500 2177056 1675611 1085111
42415 1085111 924164 959536 1051916 1689223 2772421 3234252 2899323 3270069 5067494
42406 5067494 6375648 5093761 2207292 513222 780743 1452970 1740012 2438693 3613158
42397C613158N22890o2281P57969J141947j246277m388609m017687k79272K135095
42388a823067J063381l64041N40097J841549J018965n10431j73115J160973R16238
42379C670549o38504j068312M9073Q49707N66392L06621O22498P89272N07323
42370E654619K48485m504n28679p09008o713M22280p56809k350404j919791L26647
42360C76123J546686N05115p78401l84387Q85708J383601J083016P92844M69480
42351E879785k50098q98083p77477j3666P48805R92820L26979j100522j880403
42342C028140m44210K515065M150190K793551j11201k186738k816669k709934
42334D218194k243243j541177j031947o13599O68211K829389L997956K784739
$$ plain form
42397 3613158 4136048 4073767 4831736 5973683 4727406 338797 -3678890 -3958162 -1823067
42388 -1823067 -759686 -1123727 -583630 1257919 2276884 1766453 1593338 2754311 3670549
42379 3670549 3032045 1963733 2012806 2862513 3428905 3735526 4358024 5147296 5654619
42370 5654619 5903104 5898600 5369921 4660913 4654200 5076480 4319671 1969267 49476 376123
42360 376123 1922809 2427924 1649523 1265136 2150844 3534445 4617461 5410305 5879785
42351 5879785 5629687 4731604 3954127 3940461 4689266 5682086 6009065 4908543 3028140
42342 3028140 2583930 5098995 9249185 12042736 11931535 9744797 6928128 4218194
42334 4218194 1974951 433774 -598173 -1211772 -543561 2285828 6283784 9068523
42326I068523N44462m76731l35148p18123j743597j783423m38606O17927L03061
42317E038345l37153q1094O01712O47863Q6741m04280o09080m79206K79974J278882
42307F022704J077148q89540k733992k104467N01936K100887J111208p36432j059029
42298C290423N5742P71018L36098l28523n05934o15354j061121j351921q70821
42289b80393K52654J449738K273501K389954J680379O10922j57134o39627j189130
42280F390864j356181m57998N88517m0728j827004j717225J184636L195349J100042
42271G060272k408289k207311J416683L044449M48513k309179j757334j84703
42263C103101p79527j719794L44805L651009L445305l47148k785814j433279O26803
$$ plain form
42326 9068523 9612985 9136254 8801106 8082983 6339386 4555963 4117357 4735284 5038345
42317 5038345 4701192 4620098 5221810 5869673 5956414 5552134 4943054 4463848 4743822 6022704
42307 6022704 7099852 6210312 3476320 1371853 1873789 3974676 5085884 4349452 3290423
42298 3290423 3346165 4117183 4453281 4124758 3618824 3003470 1942349 590428 -280393
42289 -280393 -27739 1421999 3695500 6085454 7765833 8376755 8219621 7579994 6390864
42280 6390864 5034683 4576685 5165202 5124474 3297470 1580245 2764881 5960230 7060272
42271 7060272 4651983 2444672 3861355 6905804 7354317 5045138 3287804 3103101
42263 3103101 2323574 603780 948585 4599594 8044899 7697751 4911937 3478658 4105461
42254D105461M35321o45719n10306k38287j418207k390751p29965K197565K736418
42245C541530L33115j843536j651457l52090K90144N15741R76384R16329l01891
42236B424269j405557q75305N12001P10632m75955j198484m64422O23796R57142
42227H08117R61383J150929P84492n61253j331899R9261K435285K559632j48936
42218F757011k621710k072703M23275J600587K62470j543835j341859Q66838K740396
42209E070470K251410k8141j586055j095779j06463o63984k097444k024704j95951
42200d76641J089039P34248L69604J118628J527115L76974r27597q96683n58066
42191B356621j072642j044002P97345K358097J218720q87728p17556Q21338L34435
$$ plain form
42254 4105461 4540782 3895063 3384757 3146470 1728263 -662488 -1392453 805112 3541530
42245 3541530 3874645 2031109 379652 27562 317706 833447 1809831 2726160 2424269
42236 2424269 1018712 143407 655408 1366040 890085 -308399 -772821 -149025 808117
42227 808117 1769500 2920429 3704921 3143668 1811769 1911030 4346315 6905947 6757011
42218 6757011 4135301 2062598 2485873 4086460 4348930 2805095 1463236 2330074 5070470
42209 5070470 7321880 7293739 5707684 4611905 4505442 3841458 1744014 -280690 -476641
42200 -476641 612398 1346646 1716250 2834878 4361993 4738967 3811370 2914687 2356621
42191 2356621 1283979 239977 1037322 3395419 4614139 3726411 3008855 3830193 4164628
42182D164628j679939j444697J220626K370478J057973R55274L043862K941454
42174A2629659j273534m529544k582611Q58764M04823k004795r83870K543410
42166E062302K894263m61757k022636M39323K573498R88014j839530k442822j239774
42157C950881r0414Q10431J212688j54803k421683k158480J289784L660766J880596
42148G979766j183699j514309k41751r51624l154165l175065l28622K302652K854098
42139B587281K385820J593209k86455k636600l051948j003008R06608P19858j87834
42130A026931L02530J735778K087169Q12361p37036j319451j015221o81231q81206
42121A330624j272576r98463J5603N91984m9387p35754J58686J992065K449307
$$ plain form
42182 4164628 2484689 1039992 2260618 4631096 5689069 6644343 9688205 12629659
42174 12629659 11356125 6826581 4243970 5102734 5507557 3502762 2518892 5062302
42166 5062302 7956565 7494808 5472172 5911495 8484993 9473007 7633477 5190655 3950881
42157 3950881 3860467 4670898 5883586 5728783 3307100 1148620 2438404 6099170 7979766
42148 7979766 6796067 5281758 5040007 4088383 934218 -2240847 -2569469 -266817 2587281
42139 2587281 4973101 6566310 6279855 3643255 591307 -411701 494907 1214765 1026931
42130 1026931 1329461 3065239 5152408 5964769 5227733 3908282 2893061 2211830 1330624
42121 1330624 58048 -940415 -924812 -332828 -382215 -1117969 -959283 1032782 3482089
42112C482089R39887n97763p95278o52489j198779j399738r7514J510988J389797
42103B581200k58768j421771j210491m36849L58741J374054K042873J226538n58036
42094C697491j083020M48383J905267J190520o80312j133428J88081J059214p8444
42085E513752k117446k866050j529545P66351K183394J667887j39606j372154
42077B106583q51163N47579J067203L49316l83704k37331M27128R80521J175847
42068E181979O56437q01360k222249k100589o79050M253r10580j766059j056408
42059c693626L16647Q42806P09582N82074j45311j646476j879588O38376L496999
42050g78517L126518K09382j175153K99499J647866P02715r53426j421799j317013
$$ plain form
42112 3482089 4421976 3824213 3028935 2376446 1177667 -222071 -319585 1191403 2581200
42103 2581200 2322432 900661 -309830 -746679 -387938 986116 3028989 4255527 3697491
42094 3697491 2614471 3062854 4968121 6158641 5478329 4344901 4532982 5592196 5513752
42085 5513752 3396306 530256 -999289 -232938 1950456 3618343 3478737 2106583
42077 2106583 1255420 1802999 2870202 3219518 2835814 2598483 3025611 4006132 5181979
42068 5181979 5838416 5037056 2814807 714218 35168 39421 -871159 -2637218 -3693626
42059 -3693626 -3376979 -2534173 -1824591 -1242517 -1387828 -3034304 -4913892 -4275516 -778517
42050 -778517 2348001 2557383 1382230 1681729 3329595 4032310 3078884 1657085 340072
42041C40072j383774n13024J627428K784074J417174n82600r35026m02316n73128
42032A778880o17766O20738J478201O5512j708096p36966J848755K180855j1812
42023D898301j140761M0206O89543o27086j286244N10520K221238J126858j165311
42014E267264j525165k13597K82326l78347m99359J84740L19693k33254l01254
42005B903047p3970j028569k723159k385929J036195M498899M309758Q18187k100735
41996E253724j831447K91710J255956K6897j836634k497806j715201m49003M70472
41987a031332Q56451R15192R69376J121005R39977l3986j288940j647277r66941
41978a66475m74563o97227l75049J304969K705939J851938m31086j707334j577374
$$ plain form
42041 340072 -1043702 -1556726 70702 2854776 4271950 3689350 2754324 2352008 1778880
42032 1778880 1161114 1781852 3260053 3325565 1617469 880503 2729258 4910113 4898301
42023 4898301 3757540 3797746 4487289 3860203 2573959 3084479 5305717 6432575 5267264
42014 5267264 3742099 3528502 3810828 3432481 2933122 3117862 3437555 3204301 2903047
42005 2903047 2829077 1800508 -922651 -3308580 -2272385 2226514 6536272 7354459 5253724
41996 5253724 3422277 3713987 4969943 4996840 3160206 662400 -1052801 -1501804 -1031332
41987 -1031332 -174881 740311 1709687 2830692 3770669 3736683 2447743 800466 -166475
41978 -166475 -641038 -1338265 -1713314 -408345 2297594 4149532 3718446 2011112 433738
41969D33738j580808j842138q24814J281569K047833O40825p00886l19286M82909
41960c81058K74432m2941M23006M14775q46249j360914M44232K382485J643997
41951B951765n32211r40918K21721Q1504j566510j856273J12030J815849J559286
41942A846243O14674K48241n9544m36690P7818R41867J18190k016000k225410
41933h90611L78973K225014P21517j549401j050029J274263K226645J565115J181842
41924F083328R80728m05692k037269j776010k16334K23580n00403m84796J48149
41915B015281k48640q33394O92446K998233K083054j818097l517171q67375J733151
41906B237488O05659j485003p71641Q74647j94923k378958j511552J542712K090841
$$ plain form
41969 433738 -1147070 -2989208 -3814022 -2532453 -484620 156205 -544681 -863967 -381058
41960 -381058 -106626 -149567 273439 688214 -158035 -1518949 -1074717 1307768 2951765
41951 2951765 2419554 1478636 1700357 1781861 215351 -1640922 -1528892 286957 1846243
41942 1846243 2460917 2709158 2649614 2212924 2290742 3232609 3350799 1334799 -890611
41933 -890611 -511638 1713376 2434893 885492 -164537 1109726 3336371 4901486 6083328
41924 6083328 7064056 6658364 4621095 2845085 2628751 2852331 2351928 1867132 2015281
41915 2015281 1766641 933247 1625693 4623926 6706980 4888883 1371712 504337 2237488
41906 2237488 2843147 1358144 586503 1461150 1266227 -1112731 -2624283 -1081571 1009270
41897A009270l99307j499279O31980K491009J387181n65624p08436L582m27078
41888A923298j535166j882405j456381n26788J361134L321426K804954l82589
41880C627483k471952q80918J569869Q85212j800036k090244P06643K661857J240756
41871C448670j463262k269637p94240J194979K083066J166286j076498k718276
41863d28912j973424L69526J627540P78152l57182j10749O35560J87943j198463
41854d70009j716966n02678J436086K533052K127676P13508p09690j368311r91199
41845A051469K51656J621840J850317L15058j624010j753391k3947J107093L11672
41836C107757n30673L81095J367493r0733k692193k775389k3762J913578R35433
$$ plain form
41897 1009270 609963 -889316 -257336 2233673 3620854 3055230 2346794 2350376 1923298
41888 1923298 388132 -1494273 -2950654 -3477442 -2116308 1205118 4010072 3627483
41880 3627483 1155531 274613 1844482 2729694 929658 -1160586 -453943 2207914 3448670
41871 3448670 1985408 -284229 -1078469 116510 2199576 3365862 2289364 -428912
41863 -428912 -2402336 -2032810 -405270 372882 15700 -95049 540511 728454 -470009
41854 -470009 -2186975 -2689653 -1253567 1279485 3407161 4120669 3410979 2042668 1051469
41845 1051469 1303125 2924965 4775282 5090340 3466330 1712939 1688992 2796085 3107757
41836 3107757 2577084 2958179 4325672 4234939 1542746 -1232643 -1256405 657173 1592606
41827A592606q40928r89022j21182L29861Q22693K006170K527841J002414j290233
41818E040220j970388q84365R2006j21803q80594j198216o70270N53150J660787
41809A620527J590768L78768o32852o23761l28635n08012o25931j4849Q49557
41800A705580J255348J264127R28838r4112j237647j048363L45413P73750n08512
41791C384422j177722K93584J569691J72585j911470j196845J166230Q05260k546066
41782E59669l940947o69048L485122L836053J321805K56159J637561K260626K4499
41773H771499k948796l343186r45494J400226J500045K51747o044J140910J633940
41764G454847j2909k367411k851353j085272Q87153J357088N72493l00410n43598
$$ plain form
41827 1592606 751678 -237344 -358526 -28665 794028 2800198 5328039 6330453 5040220
41818 5040220 3069832 2185467 2277473 2155670 1275076 76860 -593410 -40260 1620527
41809 1620527 3211295 3590063 2957211 2333450 2004815 1496803 870872 856023 1705580
41800 1705580 2960928 4225055 5153893 5059781 3822134 2773771 3119184 3892934 3384422
41791 3384422 2206700 2500284 4069975 4242560 2331090 1134245 2300475 3105735 559669
41782 559669 -3381278 -4050326 -565204 3270849 4592654 4848813 6486374 8747000 8771499
41773 8771499 5822703 2479517 1534023 2934249 4434294 4686041 4679997 5820907 7454847
41764 7454847 7441938 5074527 2223174 1137902 2025055 3382143 3954636 3654226 3110628
41755C110628r6267N35445M71270n55890j504032j247177k44488J33904l23616
41746B79777o06643l13463j8246K36051J146655K425474K448299M92357j824945
41737D265316k356205j031143K46485Q5918p37124m49059J107595J857397L15502
41728C304682j717148j221167J331979K112755j71318j713745N92321L775274
41720F293633L034810p47782k480647q42094M11060o86830j440580L6111J355739
41711D933420L23625j199685q22686L26111J25625p63588p15065k74979m61753
41702A471025k49953J103762J491101p50774k940360j415215K559782M342664
41694E612032K606600M08702j59000k77683r37752j041508j15204K98124n89403
$$ plain form
41755 3110628 3014361 3549806 4021076 3465186 1961154 713977 469489 603393 279777
41746 279777 -326866 -640329 -658575 -422524 724131 3149605 5597904 6090261 4265316
41737 4265316 1909111 877968 1124453 1210371 473247 24188 1131783 2989180 3304682
41728 3304682 1587534 366367 1698346 3811101 3639783 1926038 2518359 6293633
41720 6293633 9328443 8580661 6100014 5257920 5668980 4982150 3541570 3577681 4933420
41711 4933420 5257045 4057360 3234674 3560785 3686410 2922822 2207757 1932778 1471025
41702 1471025 1221072 2324834 3815935 3065161 124801 -1290414 1269368 5612032
41694 5612032 8218632 8627334 8468334 8190651 7252899 6211391 6096187 6394311 5804908
41685E804908j201985k34818J143332J120550k70647j617605j861650q41307P65215
41676B805993J646582J143834L47349N79600J148164N07382p25616m79735R98040
41667G971593J066222r01382k126945q72054O85951J37207j176328o22860J158708
41658E320112J350394l31061j200262J19481J769143J697408M45865k59679j97037
41649H714364m59544j209680j096325O73546K549788K044018r28258l274819k317071
41640D696019O86885K218195J245531J27625N56925J147607K91054r20840p09910
41631I339091J41293m10704k066579k515952j112112K69525K97862j24733J28416
41622C946107O55857P23538O36536Q11543O87463k75573j364384j465616n47140
$$ plain form
41685 5804908 4602923 4368105 5511437 6631987 6361340 4743735 2882085 2040778 2805993
41676 2805993 4452575 5596409 5943758 6523358 7671522 8178904 7453288 6973553 7971593
41667 7971593 9037815 8136433 6009488 5137434 5823385 5960592 4784264 4161404 5320112
41658 5320112 6670506 6339445 5139183 5258664 7027807 8725215 9171080 8911401 8714364
41649 8714364 8254820 7045140 5948815 6622361 9172149 11216167 10287909 7013090 4696019
41640 4696019 5382904 7601099 8846630 8974255 9531180 10678787 10969841 10049001 9339091
41631 9339091 9480384 9069680 7003101 4487149 3375037 3644562 3942424 3817691 3946107
41622 3946107 4601964 5325502 5962038 6773581 7461044 7185471 5821087 4355471 3808331
41613C808331O30060J676470K440030K208279L25003k352376l726089k686635
41605B323073m43576Q89291O57804K3319R7426N05122K56188n11201o08165L60907
41595C550188J260189J060634L18164J02893J79627m16615j344077j142935K83164
41586C851232J026777j00308j548274j080320R80668K104927R34672j109478j836826
41577C223070q06316O21786J026706K54763n85522k24807J311867K374295J444115
41568H639957p38838j717629l89858J390899J135156r99677k410342j422980O93781
41559D180469J545821O42494k19949N40662K155865K383123M05370j808657j693965
41550H131233N73090J987456M63425k349523l167330j348404O14111Q67891M55778
$$ plain form
41613 3808331 4438391 6114861 8554891 10763170 11088173 8735797 5009708 2323073
41605 2323073 1879497 2768788 3426592 3449911 3547337 4052459 4308647 3797446 3189281 3550188
41595 3550188 4810377 5871011 6189175 6292068 6471695 6055080 4711003 3568068 3851232
41586 3851232 4878009 4777701 3229427 2149107 3129775 5234702 6169374 5059896 3223070
41577 3223070 2416754 3038540 4065246 4320009 3734487 3509680 4821547 7195842 8639957
41568 8639957 7901119 6183490 5793632 7184531 8319687 7320010 4909668 3486688 4180469
41559 4180469 5726290 6368784 6148835 6689497 8845362 11228485 11633855 9825198 8131233
41550 8131233 8704323 10691779 11155204 8805681 5638351 4289947 4904058 5771949 6227727
41541F227727Q65664J215164j40991k270052k466965l80751J209643O04142k39978
41532D623603Q53292K242888P67051k748562l724568k95125L579784L421764K81765
41523I001892j324788o9727J068623J14761j151571q99570l98449j171396j600553
41514C569222M04334K942640K173713j499716l285813r73831J694990P55777k006636
41505C774680k009539J205005L716021L120834J017886n40065j532152j942509
41497F810161n81648K169183L168000O14190k629833k663652j08810J138133j7329
41488G898395o32310J052005K670895J623389q12446j532404q4975J249248R53420
41479A2385217k85427j257037j542036j213962o32252m67698q10371n74052R65587
$$ plain form
41541 6227727 7093391 8308555 8167564 5897512 3430547 3049796 4259439 4863581 4623603
41532 4623603 5476895 7719783 8486834 5738272 2013704 1718579 5298363 8720127 9001892
41523 9001892 7677104 7607377 8676000 8790761 7639190 6739620 6341171 5169775 3569222
41514 3569222 3973556 6916196 9089909 7590193 4304380 3330549 5025539 5781316 3774680
41505 3774680 1765141 2970146 6686167 9807001 10824887 10284822 8752670 6810161
41497 6810161 6228513 8397696 11565696 12179886 9550053 6886401 6777591 7915724 7898395
41488 7898395 7266085 8318090 10988985 12612374 11799928 10267524 10182549 11431797 12385217
41479 12385217 12099790 10842753 9300717 8086755 7454503 6986805 6176434 5602382 6567969
41470F567969K462688J911879l67800j827864r71386R73856J993736J499555K03549
41461A2446182r04078j013776j14541N52509j09292j130735n94606J164618J618059
41452A1914340m9369j463198p81477M30654k8897j359817j316213O3941R15527
41443H325491P76482P43341R93919P09137J27482K12169N13441j26029r35266
41434A1340167j01534J609867J284106j334031k682429o11182K123744J899312
41426A3528020m96279j438158P7629J587124J361789N45312M74671K66732j349463
41417A4557377l174539k656857J34750J730552j87723k903259j861813K561215
41409H199703M794766J813953k246556k045776J244292K331170Q9499j627666
$$ plain form
41470 6567969 9030657 10942536 10574736 8746872 7775486 8749342 10743078 12242633 12446182
41461 12446182 11542104 10528328 10413787 10966296 10857004 9726269 9131663 10296281 11914340
41452 11914340 11864971 10401773 9620296 10050950 10022053 8662236 7346023 7409964 8325491
41443 8325491 9101973 9845314 10839233 11548370 11675852 11888021 12401462 12275433 11340167
41434 11340167 11238633 12848500 14132606 12798575 10116146 9504964 11628708 13528020
41426 13528020 13031741 11593583 11671212 13258336 14620125 15165437 15640108 15906840 14557377
41417 14557377 11382838 8725981 8860731 10591283 10403560 7500301 5638488 8199703
41409 8199703 12994469 14808422 12561866 10516090 11760382 14091552 14181051 12553385
41401A2553385r57145l11312q60552k08518K328409L196182M33502k426917j947745
41392A1799289k51270o49309j516487L23419L030329K457747m01469q67703J323289
41383A5247835J711874q02959j906461N54450K781565J435386j168119j544083
41375A6309488n50385o92203j266683k77322J181257N88812j363028j645923K60301
41366A2544314J788273J375026K31919j14706L42241R67854J282283P67932m73403
41357A8711733j024727J79658J784183J569006j28189q29381J12754N42567p00056
41348B0217548j624535m20878J224437O24860j380433j319800J622158M022697
41340B2966054K879616l63025k102000j419496n48628j066427j805743j010348
$$ plain form
41401 12553385 11596240 11284928 10424376 10215858 12544267 15740449 16173951 13747034 11799289
41392 11799289 11548019 10898710 9382223 9705642 12735971 15193718 14792249 13924546 15247835
41383 15247835 16959709 16156750 14250289 14804739 17586304 19021690 17853571 16309488
41375 16309488 15759103 15066900 13800217 13522895 14704152 15292964 13929936 12284013 12544314
41366 12544314 14332587 15707613 15939532 15824826 16167067 17134921 18417204 19185136 18711733
41357 18711733 17687006 17866664 19650847 21219853 21091664 20262283 20375037 20917604 20217548
41348 20217548 18593013 18172135 19396572 20021432 18640999 17321199 18943357 22966054
41340 22966054 25845670 25482645 23380645 21961149 21412521 20346094 18540351 17530003
41332A7530003J052400K586971K509525J332697K42071q6972P7835p68n23470
41323B4720292q15028l74607K27767L45159N27355J384560J725243j9700k535475
41314B5185566k453262P57948L445499K783823M94807m66531l39026q57577j360741
41305B7190506j48740J687105J577719p7346m81168Q13565J403003L54231o49494
41296C1669381q73136j491202k244739j032195J846838K905096Q70985p58565
41288C0892463Q77697L290443K479347j028261l377712k890010j094110N15839
41280B9665696J609193J640198K38465j304721j301317j38731N20585M76162Q06005
41271C2211535J438037J176981O027p37339n29839j88083k09788k55703k31415
$$ plain form
41332 17530003 18582403 21169374 23678899 25011596 25253667 25166695 25244530 25243762 24720292
41323 24720292 23905264 23530657 23758424 24103583 24630938 26015498 27740741 27721041 25185566
41314 25185566 22732304 23490252 26935751 29719574 30214381 29747850 29408824 28551247 27190506
41305 27190506 27041766 28728871 30306590 30229244 29748076 30561641 31964644 32318875 31669381
41296 31669381 30796245 29305043 27060304 26028109 27874947 30780043 31651028 30892463
41288 30892463 31770160 35060603 37539950 36511689 33133977 30243967 29149857 29665696
41280 29665696 31274889 32915087 33153552 31848831 30547514 30408783 30929368 31405530 32211535
41271 32211535 33649572 34826553 34832580 34095241 33565402 33377319 33167531 32911828 32680413
41262C2680413k74557J82903J630737K920911K405356O69902N9354J076370J408107
41253D2759496m54925k533402j964473Q20873K449027J007352j527765j914815
41245C8641368L31616K673761K966727J751563P21606L50571K93140R50574K639986
41236E1320912L822958K589549p1199j040566M23961J664588J012202K44804J057611
41227F1024820K043097J569800R92935J978625K898467J472479p11009l48974
41219G0920240J937615K449460O44455L6225K153271L931324K823825P52623N59691
41210H6208729J538332J381723M18205P61689K408966L180210K259043J256992
41202I9413889J464278K073537J853188J109948R84944J654426K304121K564664
$$ plain form
41262 32680413 32405856 32588759 34219496 37140407 39545763 40215665 40275019 41351389 42759496
41253 42759496 42304571 39771169 37806696 38627569 41076596 42083948 40556183 38641368
41245 38641368 38972984 41646745 44613472 46365035 47086641 47437212 47730352 48680926 51320912
41236 51320912 55143870 57733419 57662220 56621654 57045615 58710203 59722405 59967209 61024820
41227 61024820 63067917 64637717 65630652 67609277 70507744 71980223 71269214 70920240
41219 70920240 72857855 75307315 75951770 75987995 78141266 82072590 84896415 85649038 86208729
41210 86208729 87747061 89128784 89546989 90308678 92717644 95897854 98156897 99413889
41202 99413889 100878167 102951704 104804892 105914840 106899784 108554210 110858331 113422995
41194A13422995K883034L281982K841660J268561J61872J247091L604580M458225
41186A33170000L051139J764885K457283L726351L471863K401576K689559M287696
41178A57020352N068864M123067K653309J906903K259041L902832O244771P081984
41170A90261123M939722K031244K095820N113884P115277N881665L844793M063355
41162B25346883O056339P420993P387673O722841N697271M212640L010661L074696
41154B68929997M345540O019364P415698P953174P382001O623226O969316P813382
41146C23451698O939687M017544J786448K270931L782662L739350K766601L331378
41138C52086299N296076N838815L858357J780689K065478L828310M296325K631825
$$ plain form
41194 113422995 116306029 119588011 122429671 123698232 123860104 125107195 128711775 133170000
41186 133170000 136221139 137986024 140443307 144169658 147641521 150043097 152732656 157020352
41178 157020352 162089216 166212283 168865592 170772495 173031536 176934368 183179139 190261123
41170 190261123 195200845 197232089 199327909 204441793 211557070 217438735 221283528 225346883
41162 225346883 231403222 238824215 246211888 252934729 258632000 262844640 265855301 268929997
41154 268929997 273275537 279294901 286710599 294663773 302045774 308669000 315638316 323451698
41146 323451698 330391385 334408929 336195377 338466308 342248970 345988320 348754921 352086299
41138 352086299 357382375 363221190 367079547 368860236 370925714 374754024 379050349 381682174
41130C81682174Q98615J222141K932435L311838J151466j466566j893644o37370
41122C87201089n31769k285399l280438j824238k30413j549676m865581o530328
41114C66103247n353164l777169l856999m768524n115319n322544o222823p004410
41106C24682295o508081n604653o232564q263555r200837p453920m486372k938117
41098B73994196l624888n246197o276478o189854n364797m709985m961488n607096
41090B32013413n256889l977256l971544o247351q043276o387851l209883l004865
41082A91914498n526484n656669j888296M43194k377375n859783m304593l47193
41074A66397299q71080n719319p923308m793596j353741j465921k534051j690574
$$ plain form
41130 381682174 382580789 383802930 386735365 390047203 391198669 389732103 387838459 387201089
41122 387201089 386669320 384383921 381103483 379279245 379048832 377499156 372633575 366103247
41114 366103247 360750083 356972914 353115915 348347391 343232072 337909528 331686705 324682295
41106 324682295 318174214 312569561 306336997 298073442 288872605 281418685 276932313 273994196
41098 273994196 270369308 265123111 258846633 252656779 247291982 242581997 237620509 232013413
41090 232013413 226756524 222779268 218807724 212560373 204517097 198129246 194919363 191914498
41082 191914498 186388014 180731345 178843049 179286243 176908868 171049085 166744492 166397299
41074 166397299 165526219 159806900 151883592 147089996 145736255 144270334 141736283 140045709
41066A40045709r75568k521511l756217j941431M46919m42609l538594m897581
41058A22419117l839468k744424k434305j893565j396720k060058l085701k883348
41050A02081528k173179k721635l754276k956513n74402O94680k58699j864932
41042H8472572k644875k460821j306073N49183J493793K20396j848425k253328
41034H0222422j172856p72918j390897j367601m84846l82753j280459j368295
41026G2001797j29228N53872m81028j900331k173187j504286o28822K91083P39412
41017F6769282k28049k193620l195025k214702m59558M51660K27846n72756j356501
41008E7228577j484353p68297j20768m03482q38182j80052Q86522N89936q73238
$$ plain form
41066 140045709 139070141 136548630 132792413 130850982 131297901 130855292 127316698 122419117
41058 122419117 118579649 115835225 113400920 111507355 110110635 108050577 104964876 102081528
41050 102081528 99908349 97186714 93432438 90475925 89901523 90596203 90337504 88472572
41042 88472572 85827697 83366876 82060803 82609986 84103779 84324175 82475750 80222422
41034 80222422 79049566 78276648 76885751 75518150 75033304 74650551 73370092 72001797
41026 72001797 71872569 72426441 71945413 70045082 67871895 66367609 65738787 66029870 66769282
41017 66769282 66541233 64347613 61152588 58937886 58478328 58929988 59157834 58585078 57228577
41008 57228577 55744224 54975927 54855159 54451677 53613495 53433443 54319965 54909901 54036663
40999E4036663j457902n47406L11257K86555L94350J104137J191708q2604j651352
40990E3585406k314178j948699o23931J411018K505500Q77208k265966l533429
40982D7692929k114371q20542j199676r28748J778599M243871K928635j093919
40974E0486778l601082k982218j372490n94553n8625R97120J725770J114893l13273
40965D5402320j198294r86816k62185K09507L45698N98836J050773J108846N15837
40956D6784522Q3411N13579J002185K98488j201294j928878j470589p67982k56830
40947D3056612K79314K94015p33134j303336L67289K478820J123790l372582n539458
40938C6651330k365521J861039J588124k024609l250726k64617K835628K257489
$$ plain form
40999 54036663 52578761 52031355 52342612 52629167 53023517 54127654 55319362 55236758 53585406
40990 53585406 51271228 49322529 48698598 50109616 52615116 53492324 51226358 47692929
40982 47692929 45578558 44758016 43558340 42629592 44408191 48652062 51580697 50486778
40974 50486778 46885696 43903478 42530988 41936435 41877810 42874930 44600700 45715593 45402320
40965 45402320 44204026 43217210 42955025 43164532 43510230 44109066 45159839 46268685 46784522
40956 46784522 46867933 47381512 48383697 48682185 47480891 45552013 44081424 43313442 43056612
40947 43056612 43335926 43629941 42896807 41593471 41960760 44439580 45563370 42190788 36651330
40938 36651330 34285809 36146848 37734972 35710363 32459637 32195020 35030648 37288137
40930C7288137q92467l002378k386211k76476J144534Q81155j70876n16617m8801
40921C2020000J02857k34995O7108J005440P70602j286897l131883l002852j756536
40912B4552844o06168R78922K948294K980717Q6566k588120k041598k11419n10123
40903B5589915j791407o97908J615487R93781j929088j826296K360351M764586
40895B9079421J466046l377007l878140o48370J455348O75662q21108j390808
40887B2561044j130723P6638K113924L044355J258681j342234j406716Q98058
40879B6073027J989451J11833k334233k413800l31040J513723J506100q4937j829972
40870B4200152k187096o49690J599517K723999K090244N64397q07772j498974
$$ plain form
40930 37288137 36395670 33393292 31007081 30730605 31875139 32756294 32585418 32068801 32020000
40921 32020000 32122857 31887862 31954970 32960410 33731012 32444115 29312232 26309380 24552844
40912 24552844 23946676 24925598 27873892 30854609 30941175 28353055 26311457 26100038 25589915
40903 25589915 23798508 23100600 24716087 25709868 23780780 21954484 24314835 29079421
40895 29079421 30545467 27168460 23290320 22641950 24097298 24772960 23951852 22561044
40887 22561044 21430321 21506959 23620883 26665238 27923919 26581685 25174969 26073027
40879 26073027 28062478 28174311 25840078 23426278 23095238 24608961 26115061 26030124 24200152
40870 24200152 22013056 21363366 22962883 25686882 27777126 28341523 27533751 26034777
40862B6034777j091168N28498K301762K523057Q28338j166268j769209j039494
40854B7150293j36020M18032R16703J323847J059820J30100m42833O1463Q63957
40845C1345362O76467l07718n01001P00213J766403J155499l37465p45020N8004
40836C3810744K65958q29641j632057q95230J10736m16678j828383j917681l44824
40827B6322944P87873L9277j389576j562311m40813M59954K65773n62932j314554
40818B2605635j618350j064897N04289K033848J820706k03617j802520j163795
40810B1111299N32320P82254n38970j136096m3935Q60612P7552q98676O219J922904
40800B2675483K186753K30944j915379k683858k335988j373632J05892J155864
$$ plain form
40862 26034777 24943609 25472107 27773869 30296926 31125264 29958996 28189787 27150293
40854 27150293 27014273 27432305 28349008 29672855 30732675 30862775 30419942 30481405 31345362
40845 31345362 32021829 31714111 31213110 31913323 33679726 34835225 34497760 33752740 33810744
40836 33810744 34076702 33247061 31615004 30719774 30830510 30413832 28585449 26667768 26322944
40827 26322944 27110817 27150094 25760518 24198207 23757394 24217348 24483121 23920189 22605635
40818 22605635 20987285 19922388 20426677 22460525 24281231 24077614 22275094 21111299
40810 21111299 21643619 22425873 21886903 20750807 20706872 21567484 21645036 20746360 20752579 22675483
40800 22675483 24862236 25093180 23177801 20493943 18157955 16784323 16890215 18046079
40792A8046079M26670j341303j456791R25983L149784K697317O90634j55453L95553
40783B3378473M20372o14129j154245m00782L87133j45r96222j399189j004500
40774A8616766l32109L46529R39000J119087O80727j6801l94096k21634L27353
40765B1064822Q78852J035704P38378M68234O48084R14129O00262j28193m65229
40756B5755043l33621m90766r53405n95734Q66247J730696N36596j450291j769073
40747B3295692l68882M09584l68134p75237N95913J976737J087443j103787j793852
40738B2955477o84459o0247n90431j75983J983591L115561Q55540k570789k986296
40729B1841964j21021K065682R21911j663371k360918o71847J234072J661170
$$ plain form
40792 18046079 18472749 17131446 15674655 16600638 19750422 22447739 23138373 22982920 23378473
40783 23378473 23798845 23184716 22030471 21629689 22016822 22016677 21020455 19621266 18616766
40774 18616766 18284657 18631186 19570186 20689273 21370000 21353199 20959103 20737469 21064822
40765 21064822 21943674 22979378 23717756 24185990 24834074 25748203 26348465 26220272 25755043
40756 25755043 25421422 24930656 23977251 23381517 24247764 25978460 26515056 25064765 23295692
40747 23295692 22926810 23336394 22968260 22193023 22788936 24765673 25853116 24749329 22955477
40738 22955477 22271018 22210771 21620340 21444357 23427948 26543509 27399049 24828260 21841964
40729 21841964 21720943 23786625 24708536 23045165 20684247 20012400 21246472 22907642
40721B2907642Q91020N0965k68447j53276J50087N05362P81910P95635N96127
40712B6257025O27771J090195J246747K64599j138765j184437K55098R82851k80813
40703B8120271j568828n08196J792485K239685M37847r88578o76631j60359o98876
40694B7988820j326146j074247n55360j53856Q20256J862353R30767j807295k734509
40685B3950783J55991L520905L187187L12460p52728O94908J321143k45002j468338
40676C0677309o52189M18181J17230j29819J301851L100915L042824J295561m36435
40667C8735428j572751k347347k072056m6063K360295K724570Q00771r03227k20006
40658C7459614K042831L107510J459717j321970k180455j05879K530000K891991
$$ plain form
40721 22907642 23798662 23849627 23581180 23427904 23577991 24083353 24865263 25660898 26257025
40712 26257025 26884796 27974991 29221738 29486337 28347572 27163135 27418233 28401084 28120271
40703 28120271 26551443 26043247 27835732 30075417 30513264 29524686 28848055 28687696 27988820
40694 27988820 26662674 25588427 25033067 24879211 25699467 27561820 28492587 26685292 23950783
40685 23950783 24106774 27627679 30814866 31127326 30374598 31069506 32390649 32145647 30677309
40676 30677309 30025120 30443301 30560531 30430712 31732563 34833478 37876302 39171863 38735428
40667 38735428 37162677 34815330 32743274 32697211 35057506 37782076 38582847 37679620 37459614
40658 37459614 39502445 42609955 44069672 42747702 40567247 40461368 42991368 45883359
40650D5883359J258527K05594O38203Q52575j05922o57649M87051J919342J737938
40641E2219018M18486m46743p10145q72984k45828J620106K957073K065242N80912
40632E7585137J305301L428173L504131J104440m38374L77566R62537m13597j349558
40623F6065756L58926K478060J881554j56386j31307J814447K342148O31239m90352
40614G4794085M84945J412090L78404j157097r11775P33336J696095J194461Q4760
40605G8709304q27685j339412j300194o85179P0608M85741M71043J13291l52039
40596G5345478k54639Q30217J891057J206717j210603l112440k691330o93043
40588G1311414R09210J292560R56600M92016J73704O5799k53935j315683k502263
$$ plain form
40650 45883359 47141886 47347480 47985683 48838258 48732336 48074687 48561738 50481080 52219018
40641 52219018 52637504 52190761 51480616 50607632 50361804 51981910 54938983 57004225 57585137
40632 57585137 58890438 62318611 65822742 66927182 66488808 66866374 67828911 67415314 66065756
40623 66065756 66424682 68902742 70784296 70627910 70496603 72311050 74653198 75284437 74794085
40614 74794085 75279030 76691120 77069524 75912427 75000652 75733988 77430083 78624544 78709304
40605 78709304 77881619 76542207 75242013 74556834 74627442 75113183 75584226 75697517 75345478
40596 75345478 75090839 75921056 77812113 79018830 77808227 74695787 72004457 71311414
40588 71311414 72220624 73513184 74469784 74961800 75135504 75201303 74947368 73631685 71129422
40579G1129422k275131m69384R18312M13632p07949m15438R02194J130536l02088
40570G0324106j790106k029961j387384p00860k57123j79213m99552n88585K88192
40561F3179514J560177J612943j40959k314158l025970j738713M79228J939256
40553F1551318J631123J22947r66661q32252l20558l63960m98135O002M95304
40544F0825128l9808j004404j028385k55668R0611L2531N83864J367869R08224
40535F1479962n19416q95906P9387J68910j655227l183439k324643k80951O22536
40526E3491213M30376N87051Q93082J3713j663658k141745p31552J088621J831031
40517E3798132J403118K72321j211082k335482k203807r24556K61732M72201J41297
$$ plain form
40579 71129422 68854291 68384907 69303219 69716851 69008902 68593464 69495658 70626194 70324106
40570 70324106 68534000 66504039 65116655 64415795 64158672 63979459 63479907 62891322 63179514
40561 63179514 64739691 66352634 66211675 63897517 60871547 59132834 59612062 61551318
40553 61551318 63182441 63305388 62338727 61506475 61185917 60821957 60323822 60329824 60825128
40544 60825128 60785320 59780916 58752531 58496863 58587474 58620005 59203869 60571738 61479962
40535 61479962 60960546 60064640 60144027 60312937 58657710 55474271 53149628 52868677 53491213
40526 53491213 53921589 54508640 55401722 55415435 53751777 51610032 50878480 51967101 53798132
40517 53798132 55201250 55473571 54262489 51927007 49723200 48798644 49060376 49532577 49673874
40508D9673874J74229O73165Q64891J03072j242537k018516j622654q87871r79395
40499D4738258j557784j190907J69733O12758r26903k641141k105711K99431J909759
40490C9307493J360885j365m02909J35104M34245N8650k35734K48217R55203N16396
40480D2376185j381030k971503k201521M18010K001023Q74498j303281j988291
40472C5824090j112624n41468r90153j263192m37812P52036J052700K08323r62355
40463C2529545j366191m30578J349769K648349K477419J015128q69054k362990
40455C4991397k749237j624816K54863J212428N56362n13228o93850l41218m62433
40446C0630268r47552j052701p81831m59828K21371J273647J401393l33077k467944
$$ plain form
40508 49673874 49848103 50521268 51386159 51489231 50246694 48228178 46605524 45717653 44738258
40499 44738258 43180474 41989567 42159300 42772058 41845155 39204014 37098303 37397734 39307493
40490 39307493 40668378 40667013 40264104 40399208 40833453 40892103 40656369 40904586 41859789 42376185
40480 42376185 40995155 38023652 35822131 36240141 38241164 39115662 37812381 35824090
40472 35824090 34711466 34169998 33179845 31916653 31478841 32230877 33283577 33491900 32529545
40463 32529545 31163354 30732776 32082545 34730894 37208313 38223441 37354387 34991397
40455 34991397 32242160 30617344 30872207 32084635 32640997 32127769 31433919 31092701 30630268
40446 30630268 29682716 28630015 27848184 27388356 27609727 28883374 30284767 29951690 27483746
40437B7483746k615121n94420J624576K659662K542294J299833j024760k989426
40429B8386384k695637n12870J099234Q40066k86645j314260k486852l420867
40421A9608553k526208L79811K853878K818376J217830J02976m47403j518928
40413B2488885k580808j922870K93097J656769Q56373k82819O32682K912177L378963
40404B7432449P02230k481224k859577p65321N74059l10650j479288j034056J33686
40395A9912308L40717k12134n44505q94387j536144j233686P21006K381240J743010
40386B0677425J33599R254O71309k35702j929715j371301J354742K879933K008633
40377B4198177R42256N55001p65070k512711j527291J950915K964569m46171l282507
$$ plain form
40437 27483746 24868625 24274205 25898781 28558443 31100737 32400570 31375810 28386384
40429 28386384 25690747 25177877 26277111 27117177 26830532 25516272 23029420 19608553
40421 19608553 17082345 17462156 20316034 23134410 24352240 24455216 24007813 22488885
40413 22488885 19908077 17985207 18278304 19935073 20791446 20508627 21141309 24053486 27432449
40404 27432449 28134679 25653455 22793878 22028557 22602616 22291966 20812678 19778622 19912308
40395 19912308 20253025 20040891 19496386 18601999 17065855 15832169 16553175 18934415 20677425
40386 20677425 20811024 20820278 21491587 21255885 19326170 17954869 19309611 22189544 24198177
40377 24198177 25140433 25695434 24930364 22417653 20890362 22841277 25805846 25359675 22077168
40368B2077168j250193K321124K128920n55644q44849J172959J258543j041676
40360B5266352j753212L38021J767747N23668j041485q32144j50698m93839q69179
40351B2755231j35027Q95981J236644J145462P11755m71689j410372k55821K304152
40342B6776316L088264J043762j029926p95150L92651K93530p88896j395322j457666
40333B6127563j350553l88798J535888K527172J153980j000252j412657j15875
40325B7076468R46537J046481R93491J007346M09528p43294j465246j296616o42858
40316B7331837K50946J478171K648892K919885K001858N40432n43110q13973o16964
40307C5197974o94924j149649r87901N09913K257315K472978J213538J94009L793
$$ plain form
40368 22077168 20826975 23148099 25277019 24721375 23876526 25049485 26308028 25266352
40360 25266352 23513140 23851161 25618908 26142576 25101091 24268947 24118249 23624410 22755231
40351 22755231 22620204 23516185 24752829 25898291 26610046 26138357 24727985 24472164 26776316
40342 26776316 29864580 30908342 29878416 29083266 29475917 29769447 28980551 27585229 26127563
40333 26127563 24777010 24388212 25924100 28451272 29605252 28605000 27192343 27076468
40325 27076468 28023005 29069486 30062977 31070323 31479851 30736557 29271311 27974695 27331837
40316 27331837 27582783 29060954 31709846 34629731 36631589 37172021 36628911 35814938 35197974
40307 35197974 34503050 33353401 32365500 32875413 35132728 37605706 38819244 39013253 39017046
40298C9017046n12791j625455j739753j82891J153738N97832o19105l33840J262185
40289C7016966K267376J981210J264754P29833L18970J38684K15190q795o66991
40280D3257197p98267J6186M69376l91140j104521Q8941K042959K086361J42027
40271D5809119j097660j87989J252102J241084k6880j017730p10381Q88070K742186
40262D8891921L031655Q61692j943636k296973L68591L180701L326408J166918
40254E6587277q95160j456852r94645n01339l67406m38970m19404m2780Q48360
40245E2319081K094540K953437K404837L88540j429492j168646Q92012K650238
40237F1104547K957627K379800J061569j564172m048948l186044Q46056K911251
$$ plain form
40298 39017046 38504255 36878800 35139047 34956156 36109894 36707726 36088621 35754781 37016966
40289 37016966 39284342 41265552 42530306 43260139 43579109 43717793 43932983 43924188 43257197
40280 43257197 42458930 42475116 42944492 42553352 41448831 41537772 43580731 45667092 45809119
40271 45809119 44711459 44523470 45775572 47016656 46989776 45972046 45261665 46149735 48891921
40262 48891921 51923576 52785268 50841632 48544659 48913250 52093951 55420359 56587277
40254 56587277 55692117 54235265 53240620 52739281 52371875 51932905 51513501 51470721 52319081
40245 52319081 54413621 57367058 59771895 60160435 58730943 57562297 58454309 61104547
40237 61104547 64062174 66441974 67503543 65939371 61890423 58704379 59550435 62461686
40229F2461686j07805l745425k024731L124500M362873M7050l607793k345292
40221E8165063M95529O12945o39919P662J809565K086283J098320P08935N57572
40212F4901955n74602j560827p92598M46737M7389j013900l82801J426095K105111
40203F4602559J686276J923203K564967K059763J193687K053594L792861L472599
40195H3349509J062395m10721P3324L48534n07813o41564O63795J468370J010845
40186H6416674J369578L484123M894493L578522J139209j3198r6156m40008r02327
40177I9430910r57806j288066k247570k663112j968394j505036j969222j852051
40169H4979653l54955N90795m87835j788543j178411L53639J012071J617336L376065
$$ plain form
40229 62461686 62353881 58608456 56583725 59708225 64071098 64118148 60510355 58165063
40221 58165063 58660592 59273537 58633618 58641280 60450845 62537128 63635448 64344383 64901955
40212 64901955 64327353 62766526 61973928 62420665 62468054 61454154 61071353 62497448 64602559
40203 64602559 66288835 68212038 70777005 72836768 74030455 76084049 79876910 83349509
40195 83349509 84411904 84001183 84074507 84423041 83915228 83273664 83937459 85405829 86416674
40186 86416674 87786252 91270375 96164868 99743390 100882599 100869401 100773245 100333237 99430910
40177 99430910 98473104 97185038 94937468 92274356 90305962 88800926 86831704 84979653
40169 84979653 84624698 85215493 84727658 82939115 81760704 82114343 83126414 84743750 88119815
40160H8119815M402079K465332l65550k61098K013008J931478j519964m006377
40152I2778723k365538J085826K593046K033306J670314K186020K353029J408486
40144A03743212j17999j349824j778332j570453j640164k721924m258795n084387
40136H5221334n016209m621569l840863k455713j511714k236199l685961l688489
40128E8164617k173448j204829j504504j574653q13934o96218j809233k436781
40120D5951017j525092n66466q88397j445465j161277j107682k095125k299300
40112C4862213q9673K474839K129455o04848k090131r07378N10773p8188j704029
40103C4503033k136453r51463M57705Q02579k086j014911j128202j89735P45076
$$ plain form
40160 88119815 92521894 94987226 94621676 94360578 96373586 98305064 96785100 92778723
40152 92778723 90413185 91499011 94092057 96125363 97795677 99981697 102334726 103743212
40144 103743212 103625213 102275389 100497057 98926604 97286440 94564516 90305721 85221334
40136 85221334 80205125 75583556 71742693 69286980 67775266 65539067 61853106 58164617
40128 58164617 55991169 54786340 53281836 51707183 50893249 50197031 48387798 45951017
40120 45951017 44425925 43859459 42971062 41525597 40364320 39256638 37161513 34862213
40112 34862213 34772540 37247379 39376834 38771986 36681855 35774477 36285250 36207062 34503033
40103 34503033 32366580 31415117 31872822 32675401 32673315 31658404 30530202 30340467 31085543
40094C1085543P39125J97273R2334M51591N34698J41405k35164k91432q4475L37915
40084C2968813O72116K57226q29682j245959j44779J169709Q00040r79658k109542
40075C0558284j645367n73791K50506J146065K152987K228346P66318j237054
40067C3646294k376598k370654j772516r62686j14320M70431O48421O33907M57300
40058B8259579k79184j593096k510180j956133k16395J047734N67744q91212j127684
40049B1301173R07134L481888L830141J467550j240080k019208r33622Q64991
40041B7659967L046534N391109O468647N052545K313553O30168L97280l1498j224427
40032D9703878j713023p55985P2757o69325j900234j694051k60934N72802L60323
$$ plain form
40094 31085543 31824668 32021941 32114275 32565866 33100564 33241969 33006805 32715373 32630898 32968813
40084 32968813 33640929 33898155 33068473 31822514 31677735 32847444 33647484 32667826 30558284
40075 30558284 28912917 28339126 28589632 29735697 31888684 34117030 34883348 33646294
40067 33646294 31269696 28899042 27126526 26163840 26049520 26519951 27168372 27802279 28259579
40058 28259579 27980395 26387299 23877119 21920986 21704591 22752325 23320069 22428857 21301173
40049 21301173 22208307 25690195 29520336 30987886 29747806 27728598 26794976 27659967
40041 27659967 30706501 36097610 42566257 47618802 49932355 50562523 50959803 50928305 49703878
40032 49703878 47990855 47234870 47307627 46638302 44738068 43044017 42783083 43355885 43716208
40023D3716208N87715J949436K764659J247239j584221k866017j784841q70165
40015D3160013k393424m818087m793980k109430o3878m62746j101424J47416J458980
40006B9023440J53016k264528j980090Q77182K015646l29534k452551q42570K467087
39997B6667098L124824R34145k86957J374969L329557K426764p27165k720641
39989C4122594j629746Q82649J795029L50182j224251p29348J099425J667887
39981C6334421Q3195j801003k101965j224066p52184j187444j747423j703097
39973B5900434j068847l95360l71843j148636j837885j442891m18213k19028j061816
39964A7935915j534809r65401n78954j333686k144580j627801l40872K48627l261
$$ plain form
40023 43716208 44303923 46253359 49018018 50265257 48681036 45815019 44030178 43160013
40015 43160013 40766589 35948502 31154522 29045092 28981214 28518468 27417044 27564460 29023440
40006 29023440 29176456 26911928 24931838 25809020 27824666 27495132 25042581 24200011 26667098
39997 26667098 29791922 30726067 30439110 31814079 35143636 37570400 36843235 34122594
39989 34122594 32492848 33375497 35170526 35520708 34296457 33567109 34666534 36334421
39981 36334421 36417616 34616613 32514648 31290582 30538398 29350954 27603531 25900434
39973 25900434 24831587 24436227 24064384 22915748 21077863 19634972 19216759 18997731 17935915
39964 17935915 16401106 15435705 14856751 13523065 11378485 9750684 9409812 9658439 9655178
39955I655178k69315l89864n19674m8673J272752J915467L94452j985579k469853
39946G554891p39046R03174J258186J497464K122702J499875j040145l016164
39938A0040937j945684Q37268J879300L11004j414308j224808J83334Q76482q844
39929I534681j805243k912065j764227J455902M032230L246450m7510k174107
39921I566111j462118j92575o53793j638352r83313M23238K10165j101186q43429
39912C324748R35926J156855j000705k218902j96454K636103L019955J650324
39904I307850J001456P22112j058813l317331l124973o06852R86863L68994l11528
39895C967778K36979L26635j099184j963354l06940K294665K838381R29802j195686
$$ plain form
39955 9655178 9385863 8995999 8476325 8427652 9700404 11615871 12010323 10024744 7554891
39946 7554891 6815845 7719019 8977205 10474669 12597371 14097246 13057101 10040937
39938 10040937 8095253 8932521 10811821 11122825 9708517 8483709 8667043 9543525 9534681
39929 9534681 7729438 4817373 3053146 4509048 8541278 11787728 11740218 9566111
39921 9566111 8103993 7911418 7257625 5619273 4635960 5059198 5269363 4168177 3324748
39912 3324748 4260674 5417529 4416824 2197922 2001468 4637571 7657526 9307850
39904 9307850 10309306 11031418 9972605 6655274 3530301 2923449 3910312 4279306 3967778
39895 3967778 4204757 4531392 3432208 1468854 1161914 3456579 6294960 7224762 6029076
39886F029076j661566n01242R58461J268587J82336p93181k78139O53527o0523
39877E797336j789973j803373L8958O57614q89328j253673J562514M093496K525413
39868H938984j054504j903303m3355M49917j427464k301817m99075J310416Q54074
39859D323873l02610M1959J163885J203140K91585j84489L3238J59220j52446
39850F577355o47476j037006r99649m32785l9712o02200j485183j203193K90009
39841D20160J355764J027100Q6717n33002p78936n07871O99571K101351J962216
39832E833070N8367j580841j372426j42858N13850L41422j09490o45255r45282
39823A950557k72886J156370J755845O80861q09615j224196q51058p00607o93569
$$ plain form
39886 6029076 4367510 3866268 4824729 6093316 6275652 5482471 5204332 5857859 5797336
39877 5797336 4007363 2203990 2242948 2900562 2011234 757561 2320075 6413571 8938984
39868 8938984 7884480 5981177 5937822 6387739 4960275 2658458 2159383 3469799 4323873
39859 4323873 4021263 4063222 5227107 6430247 6721832 6537343 6570581 6729801 6577355
39850 6577355 5929879 4892873 3893224 3460439 3420727 2818527 1333344 130151 420160
39841 420160 1775924 2803024 2889741 2356739 1577803 1069932 1769503 3870854 5833070
39832 5833070 5891437 4310596 2938170 2795312 3309162 3650584 3541094 2895839 1950557
39823 1950557 1677671 2834041 4589886 5270747 4461132 3236936 2385878 1685271 991702
39814I91702l11590M8719j25710k54196K47401N63971k03580j096157m90404J204644
39804E74800J880401P08112q30726j081104p2040J005350J132665J07803j252770
39795B172491j497090P659J981703K461427J154928k92200m56049L16106P27097
39786F576072J38374r77343j684934j417867m60584L16400M18079K59718M21384
39777C589299O85020L95732m02528q78239n08445K78127O77255L65106k80474
39768C920853n51623n1246Q07780J114401N51220r2031O9306P22538O87789m46328
39758F732659j594558j378468J98796J584329J240737o87338k403170k263857
39750A429130m39649J409526J924790J178225K14118j4237O58654J404918R91144
$$ plain form
39814 991702 680112 728831 603121 348925 596326 1160297 956717 -139440 -629844 574800
39804 574800 2455201 3163313 2332587 1251483 1179443 2184793 3317458 3425261 2172491
39795 2172491 675401 683060 2664763 5126190 6281118 5988918 5532869 5848975 6576072
39786 6576072 6714446 5737103 4052169 2634302 2173718 2490118 2908197 3167915 3589299
39777 3589299 4274319 4670051 4267523 3389284 2880839 3158966 3836221 4201327 3920853
39768 3920853 3369230 3317984 4125764 5240165 5791385 5699354 5768660 6491198 7178987 6732659
39758 6732659 5138101 3759633 3958429 5542758 6783495 6096157 3692987 1429130
39750 1429130 989481 2399007 4323797 5502022 5716140 5701903 6360557 7765475 8756619
39741H756619p47466k173406j576006L66339J161744p8792j303077n48256J116870
39732D974569J277014j77254j134446p10230l64001j020012j186566N62339K660254
39723D881667K223165p15118k790360j735082N74444Q59310j007327k158426j056442
39714i24169N76531P37388J3266N6265O69593L66672q50022j258632K7355J836804
39704A251051K469752J300776j065241l034098k693313K12245L111371L139468
39696D692011Q12000p60519l28641K88688r3172p2858J149706J491876o94412
39687F484679l220062k897899l23431J262771R44514O41860R80809K39091j870920
39678B241412k687589n53302K250286K665478J159868M29605Q82035J96453k487177
$$ plain form
39741 8756619 8009153 5835747 4259741 4626080 5787824 5709032 4405955 3857699 4974569
39732 4974569 6251583 6074329 4939883 4229653 3865652 2845640 1659074 2221413 4881667
39723 4881667 7104832 6389714 3599354 1864272 2438716 3298026 2290699 132273 -924169
39714 -924169 -347638 389750 403016 459281 1128874 1495546 645524 -613108 -585753 1251051
39704 1251051 3720803 5021579 3956338 922240 -1771073 -1558828 1552543 4692011
39696 4692011 5504011 4743492 4414851 4703539 4610367 4537509 5687215 7179091 6484679
39687 6484679 3264617 366718 43287 1306058 2250572 2892432 3873241 4112332 2241412
39678 2241412 -446177 -999479 1250807 3916285 5076153 5505758 6387793 6584246 4097069
39669D097069m464639k905388J018223L226722J695552j273815k241268p60720
39661a608264Q78737J222326J143346J650573K030401J172194n01739j647783
39653D339791j713984r48198M06159J621525J166036j295224l243380j935861
39645a603136J429059K754655P88736r88686K53201K131793O97650l099522m305745
39636a941995j116686K552008K738014M66900r11514p70240o80640o28968O93496
39627D00375K446114K117389j96303j383781j60820R53056M9433j011335j85870
39618C028258R67690J92334j195305n94464J111384J101115k86578l29394Q60683
39609D855723N30694j295271j448417N79851J395057k51806j126428M87437J350788
$$ plain form
39669 4097069 -367570 -3272958 -2254735 971987 2667539 1393724 -847544 -1608264
39661 -1608264 -729527 492799 1636145 3286718 5317119 6489313 5987574 4339791
39653 4339791 2625807 1677609 2083768 3705293 4871329 3576105 332725 -1603136
39645 -1603136 -174077 2580578 3369314 2380628 2633829 4765622 5463272 2363750 -1941995
39636 -1941995 -3058681 -506673 2231341 2698241 1786727 1016487 335847 -293121 400375
39627 400375 2846489 4963878 4767575 3383794 3222974 4176030 4225463 3214128 3028258
39618 3028258 3995948 4188282 2992977 2398513 3509897 4611012 4324434 3995040 4855723
39609 4855723 5386417 4091146 2642729 3222580 4617637 4365831 3239403 3726840 5077628
39600E077628q77288k866055r85759K250127K102492p23214j649579J73500J208299
39591C710151j19497j417573r33323J39910N62182O11399K48902r12005j466437
39582D23709M74887L364622L230175m82533l562850k825353l2005J531590J421311
39573C543553J037342P48971K07979j64872Q3590L77756J33585k36614k78020
39564E453270l01278n44731p29367q65996j157106r70579L57056J651038J030645
39555C922952q40495j174981O47501J913116P71041j059022j290992m01981j53632
39546B333507p32750j182526j146401o50626M34773J521174J465390N87817N78555
39537C208913J380332O29199k252185m029598k008947J771114L296272J829173
$$ plain form
39600 5077628 4200340 1334285 348526 2598653 4701145 3977931 2328352 2501852 3710151
39591 3710151 3590654 2173081 1239758 1379668 1941850 2553249 2802151 1890146 423709
39582 423709 898596 4263218 7493393 7010860 3448010 622657 590652 2122242 3543553
39573 3543553 4580895 5329866 5537845 5372973 5456563 5834319 5967904 5731290 5453270
39564 5453270 5151992 4607261 3877894 3011898 1854792 884213 1241269 2892307 3922952
39555 3922952 3082457 1907476 2554977 4468093 5239134 4180112 2889120 2487139 2333507
39546 2333507 1600757 418231 -728170 -1378796 -944023 577151 2042541 2630358 3208913
39537 3208913 4589245 5218444 2966259 -1063339 -3072286 -1301172 1995100 3824273
39529C824273k04694j151010j221795o87926L20651P59971k20672j463011j092551
39520a136764P11707J973861J552740L0863j446042j843831n47415J605106K483083
39511C383308J210281n03304q65371m02616l44115l62058O6012j61907j709720
39502C10510k540105o75395K037837K186972M894j103884N9588J071677K00686
39493A552780j049794o60810J056993K305841J816783l77924k706193k772020
39485h34344l2647K715630K533385L17700q25315l27885j81393q09694o61015
39476A894422K2630r04219k977832k588726J312248M632985L625310k9219k174744
39467B812855j739438o06691J28319Q82334J622884J607298O38967q59951k339198
$$ plain form
39529 3824273 3619579 2468569 1246774 558848 879499 1639470 1418798 -44213 -1136764
39520 -1136764 -425057 1548804 3101544 3132407 1686365 -157466 -704881 900225 3383308
39511 3383308 4593589 4090285 3224914 2822298 2478183 2116125 2182137 2020230 310510
39502 310510 -2229595 -2904990 -867153 1319819 1324713 220829 280417 1352094 1552780
39493 1552780 502986 -157824 899169 3205010 5021793 4643869 1937676 -834344
39485 -834344 -866991 1848639 4382024 4699724 3874409 3546524 3365131 2555437 1894422
39476 1894422 1917052 1012833 -1964999 -4553725 -3241477 1391508 5016818 4987599 2812855
39467 2812855 1073417 466726 595045 1477379 3100263 4707561 5346528 4486577 2147379
39458B147379k858252j685898M0704J34744j161944q84903J957803M062284K525961
39449D277878o02256j469555q2128P00147L34716P03724J639161O50471k232567
39440C919591l252608k63235L670002M171810J101934j989082k721217j988627
39432B648568j556067j524105q57514N73047J544079J183988L64736N39645J418101
39423D334478J106286r63689k670885j981747L4913O86165m85906j317910m71010
39414a729305P56809P24080j01933j46648Q17284J489667R71373j84468r51429
39405A645430j105290j093051j036650n86368J46572L48794j90041l41049O57348
39396a554305J469999M31769j309600q74984J721189K871191O81432j836282j230786
$$ plain form
39458 2147379 -710873 -2396771 -2356067 -2221323 -3383267 -4268170 -2310367 1751917 4277878
39449 4277878 3675622 2206067 2123939 2824086 3158802 3862526 5501687 6152158 3919591
39440 3919591 666983 403748 4073750 8245560 9347494 7358412 4637195 2648568
39432 2648568 1092501 -431604 -1289118 -716071 828008 2011996 2376732 2916377 4334478
39423 4334478 5440764 4477075 1806190 -175557 -140644 545521 59615 -1258295 -1729305
39414 -1729305 -972496 -248416 -350349 -496997 320287 1809954 2781327 2596859 1645430
39405 1645430 540140 -552911 -1589561 -2175929 -2029357 -1680563 -1870604 -2211653 -1554305
39396 -1554305 -84306 347463 -962137 -1837121 -115932 2755259 3436691 1600409 369623
39387C69623J164633J643049k7230r25272j87346J66742m92553m18124N50965
39378A844487P5542k173302k873273j67770K811862K352542m44215j746296n94277
39369i14700P46566P81611O3460p76323j463331j057192Q90709K563172J809958
39360B643930m79129j485807o11383K53085L56097P75500J271539K7068k449173
39351C01727k722212M02577L296223K578697M8789m90183Q57549R61953q29626
39342D405494j946043j138733j84871m52382q42000k56345M17610J96090j32559
39333F6261M33149J155624O92585p69895j771050j335680L01138K010621K315295
39324C098048O44999j419594j408041Q35590K581496J753848m19992j501093j121895
$$ plain form
39387 369623 1534256 3177305 3150075 2224803 2037457 2204199 1711646 1293522 1844487
39378 1844487 1920029 -253273 -3126546 -3294316 -482454 1870088 1425873 -320423 -914700
39369 -914700 -168134 613477 676937 -99386 -1562717 -2619909 -1729200 833972 2643930
39360 2643930 2164801 678994 67611 320696 676793 1452293 2723832 2750900 301727
39351 301727 -2420485 -2017908 1278315 3857012 3905801 3415618 4273167 5235120 4405494
39342 4405494 2459451 1320718 1135847 683465 -158535 -414880 2730 198820 66261
39333 66261 499410 1655034 2347619 1577724 -193326 -1529006 -1227868 782753 3098048
39324 3098048 3743047 2323453 915412 1751002 4332498 6086346 5666354 4165261 3043366
39315C043366o06415n55139o40130q91796j331049j065397L67352J451405N30298
39306C02495j378985j824697n69237M08722L56090M99672J160261R78112k30672
39297b98239o37938L88322R08387j74553q92627M74190K105545J296115j199400
39288A969802k280290r88493P83271J476152J217990L20314j096234j978652j156608
39279a732748M82096P23184p29297j716413q04250Q57711J502497R44985J10703
39270c61532k82573J0734O44728N39386q58677k113735j258385J145525K396497
39261a38032J502678M00213N72226R21061L46634l0037P68009J157386m59457
39252E040681k360864j726340P28542J507958m14468k160442j362055O64012J352739
$$ plain form
39315 3043366 2436951 1881812 1241682 349886 -981163 -2046560 -1679208 -227803 302495
39306 302495 -1076490 -2901187 -3470424 -3061702 -2705612 -2205940 -1045679 -67567 -298239
39297 -298239 -936177 -547855 360532 185979 -706648 -232458 1873087 3169202 1969802
39288 1969802 -310488 -1298981 -515710 960442 2178432 2498746 1402512 -576140 -1732748
39279 -1732748 -1250652 -527468 -1256765 -2973178 -3777428 -2919717 -1417220 -472235 -361532
39270 -361532 -644105 -633371 11357 550743 -307934 -2421669 -3680054 -2534529 -138032
39261 -138032 1364646 1764859 2337085 3258146 3604780 3574743 4342752 5500138 5040681
39252 5040681 2679817 953477 1682019 3189977 2775509 615067 -746988 -82976 1269763
39243A269763M37325m55429l90346K19089P81043J033628P03561k92531j278603
39234B027500j169600K85460J853234J862176K00255j137577l69557J389361J271041
39225F212293j141630k781932j590568J25290o93558k617094j676208K089156
39217b074251M122027K060046r39243j238997L56666J090899P61779Q11500J067412
39208F017838N02748k55819j33880k0663j027715j673420j85624J513619J43128
39199D880212l088437l444167L9636K791731J752598k22702M22352K200587J618273
39190F950083q63451j943644q86844J27598J77243L71750P61372N1099j333330
39181C411876j187890P70988K104809J461288L94659K23878j52222j614443k516623
$$ plain form
39243 1269763 1707088 1251659 861313 1080402 1861445 2895073 3598634 3306103 2027500
39234 2027500 857900 1143360 2996594 4858770 5059025 3921448 3551891 4941252 6212293
39225 6212293 5070663 2288731 698163 823453 129895 -2487199 -4163407 -2074251
39217 -2074251 2047776 4107822 3168579 1929582 2286248 3377147 4138926 4950426 6017838
39208 6017838 6520586 6264767 6130887 6110224 5082509 3409089 3223465 4737084 4880212
39199 4880212 1791775 -1652392 -1612756 1178975 2931573 2708871 3131223 5331810 6950083
39190 6950083 6086632 4142988 3256144 3383742 3560985 3932735 4694107 4745206 3411876
39181 3411876 2223986 2994974 5099783 6561071 6955730 7179608 7027386 5412943 2896320
39172B896320j269525O94655J029095J45768J68204J153127J157967k07602j046945
39163D721064l43698N75861N01561J09167K11029J66448n39483p76894L54403
39154D979458J368726L15916j748870j659091J253892L737512K837755k77392
39146A0807906k273509k122328j571143j702311j397327K10221J772632J631076
39138E355217M29389R9412Q26997R10952k78095j087707j72890J209527R01687
39129H194489j023653k412331k014494p82890o1717N7070L6865j37805l74733
39120A480801J48489J803072L267998K782698N20905j478192j880048j414840
39112E230883j255207j149716j57550J324356J524984l81603k683921k668898
$$ plain form
39172 2896320 1626795 2321450 3350545 3496313 3664517 4817644 5975611 5768009 4721064
39163 4721064 4377366 4953227 5454788 5563955 5774984 5941432 5401949 4625055 4979458
39154 4979458 6348184 6664100 4915230 3256139 4510031 8247543 11085298 10807906
39146 10807906 8534397 6412069 4840926 3138615 1741288 1951509 3724141 5355217
39138 5355217 5784606 5884018 6711015 7621967 7343872 6256165 6083275 7292802 8194489
39129 8194489 7170836 4758505 2744011 1961121 1899404 1956474 1993339 1855534 1480801
39120 1480801 1629290 3432362 6700360 9483058 10003963 8525771 6645723 5230883
39112 5230883 3975676 2825960 2668410 3992766 5517750 5136147 2452226 -216672
39104b16672J83136L161020L101550M4267k725030k550257l75623R57665N12199
39095B092255j22843K66619P84350J78618j094465j606244q97539L00723J200278
39086A101752J445016R85046K91415K21005Q53581R77636l18371j994504k138055
39077A424521n28950R95361Q68492m14706j110349k30162J501470K395846J503560
39068F405083k99993j268904r24650m48340n87033l85033R87253K301623J787011
39059G567017j11437j284507r91648n47663r32150j432501j083259j07117N86397
39050A663132M87286q8668j01269J161567K421829J133745k593754m518000j473185
39041a907317L310143L900816R4920k408907p22731J411009M12975j482952p69249
$$ plain form
39104 -216672 -33536 3127484 6229034 6273301 3548271 998014 622391 1580056 2092255
39095 2092255 1969412 2236031 3020381 3198999 2104534 498290 -399249 -98526 1101752
39086 1101752 2546768 3531814 3823229 4044234 4897815 5875451 5557080 3562576 1424521
39077 1424521 895571 1890932 2759424 2344718 1234369 1004207 2505677 4901523 6405083
39068 6405083 6105090 4836186 3911536 3463196 2876163 2491130 3478383 5780006 7567017
39059 7567017 7455580 6171073 5179425 4631762 3699612 2267111 1183852 1076735 1663132
39050 1663132 2150418 2061750 1960481 3122048 5543877 6677622 4083868 -434132 -1907317
39041 -1907317 1402826 5303642 5398562 2989655 2266924 3677933 4090908 2607956 1838707
39032A838707J223466J084805o97756j094978O8581N38856P7355J06947k7447
39023C118536j893600l679391j880236K568938M603138K321192n42718q09421
39015C806438j07764q07308j726969q87909N29111K70767j039917j147533Q0092
39006a030992R39737Q85287O72891L06289p00593j447512l86117J989065L123647
38997D351702J527247j367594k885000j851821N36762K045791J497003j94995
38989C659095j153554o66146K83925N44701P4734m07931k59984O83983J749993
38980D508816J630158O038j366624p12901R07620Q45041j012246j854394l35605
38971B615903J322108R57269k76396k15518P92403R50677J08164n23959p13263
$$ plain form
39032 1838707 3062173 4146978 3449222 2354244 2422825 2961681 3039036 3145983 3118536
39023 3118536 1224936 -2454455 -4334691 -1765753 2837385 5158577 4615859 3806438
39015 3806438 3698674 2891366 1164397 276488 805599 1076366 36449 -1111084 -1030992
39006 -1030992 -91255 794032 1466923 1773212 1072619 -374893 -761010 1228055 4351702
38997 4351702 5878949 4511355 1626355 -225466 311296 2357087 3854090 3659095
38989 3659095 2505541 1839395 2123320 2668021 2742755 2334824 2074840 2758823 4508816
38980 4508816 6138974 6145012 4778388 4065487 4973107 5818148 4805902 2951508 2615903
38971 2615903 3938011 4895280 4618884 4403366 5195769 6146446 6254610 5730651 5017388
38962E017388j075788j336241p25091L80581R01644O46468P7974o95346j285868
38953A905721n13389J703509L096752J852764l00093l05359J562196K060855l9163
38944A1023793k199258k031884n03986M8437o67375j015580j10877R16152L77556
38935E836978j664366k893570j197420K282800L846471J729870j591846k865257
38927C483660k095057j146663j16101J860750L314935J735041j849370l284040
38919A903155j114773J384803J318741J12731M15347J765237J820302R7775j846138
38910E857180k765206k396651r31682O10078P55970j93210J19610K488879M099592
38901G644560K371084q94115k067029j024805n50775j232050q42136J057729J873993
$$ plain form
38962 5017388 3941600 2605359 1880268 2260849 3162493 3808961 3886935 3191589 1905721
38953 1905721 1392332 3095841 6192593 8045357 7745264 7439905 9002101 11062956 11023793
38944 11023793 8824535 6792651 6288665 6337102 5669727 4654147 4543270 5459422 5836978
38935 5836978 4172612 1279042 81622 2364422 6210893 7940763 6348917 3483660
38927 3483660 1388603 241940 125839 1986589 5301524 7036565 5187195 1903155
38919 1903155 788382 2173185 3491926 3604657 4020004 5785241 7605543 7703318 5857180
38910 5857180 3091974 695323 -236359 373719 1129689 936479 1056089 3544968 7644560
38901 7644560 10015644 9121529 7054500 6029695 5478920 4246870 3404734 4462463 6336456
38892F336456M65515p53018n9488M49391j431404l798580l343057n41098J271237
38883a404046J046640P42436J154007O60400j155059j947473k55788J874953J861011
38874B577081K40304o57934j97195N11302Q93419J098371O99619o46017j756055
38865B762895j233806J15380K82806p38774j009051L0298O86988K8085n67919
38856C56902Q8098R23990L95355j110067j987883j519942k44462R01610J132069
38847a064330M56188J44653J289968K699244K021143o15324k321419j637791n02469
38838D69863o79598q92643L84141J742570J197782k23760k99552N12420K72646
38829B483869n40915Q1473J501399R24092j745075l137094j401738J136278J585031
$$ plain form
38892 6336456 6801971 6048953 5989465 6438856 5007452 1208872 -2134185 -2675283 -1404046
38883 -1404046 -357406 385030 1539037 2199437 1044378 -903095 -1158883 716070 2577081
38874 2577081 2817385 2159451 1962256 2473558 3366977 4465348 5164967 4518950 2762895
38865 2762895 1529089 1644469 1927275 1188501 179450 209748 896736 924821 356902
38856 356902 445000 1368990 1764345 654278 -1333605 -2853547 -3098009 -2196399 -1064330
38847 -1064330 -608142 -463489 826479 3525723 5546866 4931542 2610123 972332 469863
38838 469863 -209735 -1102378 -718237 1024333 2222115 1998355 1698803 2211223 2483869
38829 2483869 1942954 2024427 3525826 4449918 2704843 -432251 -1833989 -697711 887320
38820H87320K34840p36906l70348O55088J332748J030957r4688r03514m94771
38811A540726M19568O76089P23713J585338K267244Q77872j726666k505310r50822
38802B907752K3988j014163j647258K6587J898239J359984l64032n43430M37026
38793C084693K76181p42709k18803J744336K064883m55659k871409k176369N13258
38784A218402J699009K35242j514173j041084J205937K631930J748515k35535
38776E948243j199217o89825N7737K04526J72255L69237L92036L2677j02705K19589
38766E404553Q0702j165397k474972k303467p90962L56403M2983j086934j723844
38757c660935j314362k19950R11311J499255J091852k55132j448458r05157J494078
$$ plain form
38820 887320 1122160 385254 14906 669994 2002742 3033699 2939011 2035497 1540726
38811 1540726 1960294 2636383 3360096 4945434 7212678 8090550 6363884 3858574 2907752
38802 2907752 2931740 1917577 270319 296906 2195145 3555129 3191097 2647667 3084693
38793 3084693 3360874 2618165 2399362 4143698 6208581 5752922 2881513 705144 1218402
38784 1218402 2917411 3152653 1638480 597396 1803333 4435263 6183778 5948243
38776 5948243 4749026 4059201 4116938 4321464 4493719 4862956 5254992 5287669 5184964 5404553
38766 5404553 5485255 4319858 1844886 -458581 -1249543 -893140 -850157 -1937091 -3660935
38757 -3660935 -4975297 -5195247 -4283936 -2784681 -1692829 -1947961 -3396419 -4301576 -2807498
38748b807498L398708K382861n45044j718882J28152J839802O04024j562049j038242
38739F81832J399708J733445p54598k416682j263140K18885j71390p03545O89391
38730e86094K410283J850266k96244j484723j381567j421367j579833o79908P77057
38721b392130J005623j5391m31115M25569J052284K68654j038587j243897L6579
38712b332411J695669K266428J268574k55918q90370o04400m94934p36689l37836
38703d21887O44812O14559q46315j768186p37740Q36406J094505N33263M69972
38694D19389M39777n39732j510297q64758Q78693J843277J461168M19651q80761
38685A666407j786715q08500J993754L580411J720444j245013j619536O4687M36399
$$ plain form
38748 -2807498 591210 2974071 2429027 710145 838297 2678099 3282123 1720074 681832
38739 681832 2081540 3814985 3060387 643705 -619435 -400550 -571940 -1275485 -586094
38730 -586094 1824189 3674455 3378211 1893488 511921 -909446 -2489279 -3169187 -2392130
38721 -2392130 -1386507 -1401898 -1833013 -1407444 -355160 -86506 -1125093 -2368990 -2332411
38712 -2332411 -636742 1629686 2898260 2642342 1751972 1147572 652638 -84051 -421887
38703 -421887 222925 837484 -8831 -1777017 -2514757 -1678351 -583846 -50583 419389
38694 419389 859166 319434 -1190863 -2055621 -1176928 666349 2127517 2547168 1666407
38685 1666407 -120308 -928808 1064946 4645357 6365801 5120788 3501252 3565939 4002338
38676D002338q35860r74240M25067O00847j026072j391569P47616K167449L63683
38667D079259k217974k042852J94382J241073L27832n84372m37003m9247Q3557
38658E94655M80713J065767P98817n79405j685657j055012R38997K286002J580019
38649D424896k36601r95475j94832L83218m57647j373560q18792J55217l64705
38640E21719j720438j668309j86399O08441J34681j02898K69881n2439r23698
38631c119459m42050J299848J600586k79191j332315L93052K370205J549020r26918
38622A112778j850069p10541O01524J201453J425263R42219n33103j618517r39562
38613c68555M52020P27115K89864N71754R58352j3446j199571j06886K504328
$$ plain form
38676 4002338 3166478 2192238 2617305 3218152 2192080 800511 1548127 3715576 4079259
38667 4079259 1861285 -181567 12815 1253888 1581720 997348 560345 511098 594655
38658 594655 1075368 2141135 2939952 2360547 674890 -380122 558875 2844877 4424896
38649 4424896 4188295 3192820 2997988 3381206 2923559 1549999 731207 886424 521719
38640 521719 -1198719 -2867028 -3053427 -2444986 -2310305 -2413203 -2143322 -2195761 -3119459
38631 -3119459 -3561509 -2261661 -661075 -940266 -2272581 -1879529 490676 2039696 1112778
38622 1112778 -737291 -1447832 -846308 355145 1780408 2722627 2189524 571007 -368555
38613 -368555 83465 810580 1100444 1672198 2630550 2617104 1417533 1310647 3814975
38604C814975K919950Q2916k515111j981193n8172O0224j428786j903558o67615
38595a676370M81073N55591O07679J259707J271208k75961j984911j980261p98207
38586b540452m89390j121184m70512K124693L917767K515697k76639q87671P77549
38577C549858J505009m3483j539273j067505R7584K45364J0286M12160M61782
38568C631782q55357k056562j286157M23719P78185M2926K78436J401442J218468
38559C576882n69922j549816n03171O66191J44461r89680p52339P07916J726037
38550B456559J561673P18215k47835q60974m72386P32798J107997n68014k885452
38541A542581l034337l97682K433906K762478Q59726q36250r04830k67384m02243
$$ plain form
38604 3814975 6734925 6817841 4302730 2321537 2263365 2323589 894803 -1008755 -1676370
38595 -1676370 -1195297 -639706 -32027 1227680 2498888 2222927 238016 -1742245 -2540452
38586 -2540452 -3029842 -4151026 -4621538 -2496845 1420922 3936619 3659980 2772309 3549858
38577 3549858 5054867 5011384 3472111 2404606 2502190 2747554 2757840 3170000 3631782
38568 3631782 2776425 719863 -566294 -142575 635610 678536 956972 2358414 3576882
38559 3576882 3006960 1457144 953973 1620164 1764625 774945 22606 730522 2456559
38550 2456559 4018232 4736447 4488612 3627638 3155252 3888050 4996047 4428033 1542581
38541 1542581 -1491756 -1889438 544468 3306946 4166672 3330422 2425592 2158208 1755965
38532A755965j229271j394504k83649J063309J353198Q23920Q79676J932349K486876
38523G387869J082420j385331k449336j267163K36288J07674r32399q27424N85481
38514B538079J451419P82724m07046j083249j416770j470947o16620P82935J027769
38505A588294k73875j096116j36825Q63301J5694j391916j133657K1347j38918
$$ plain form
38532 1755965 526694 -867810 -1151459 -88150 1265048 2088968 2968644 4900993 7387869
38523 7387869 8470289 7084958 4635622 3368459 3604747 3712421 2780022 1952598 2538079
38514 2538079 3989498 4772222 4365176 3281927 1865157 394210 -222410 560525 1588294
38505 1588294 1314419 218303 81478 944779 960473 -431443 -1565100 -1543753 -1682671
$$ [...]
##END NTUPLES=NMR SPECTRUM
##END=
