##TITLE=31Pdec_SR68-rm2
 , 24 sc
 7.06.2021
##JCAMPDX= 6.0         $$ Bruker NMR JCAMP-DX V2.0
##DATA TYPE= NMR SPECTRUM
##DATA CLASS= NTUPLES
##ORIGIN= UXNMR, Bruker Analytische Messtechnik GmbH
##OWNER= root
$$ XWIN-NMR		Version 3.5
$$ Mon Jun  7 11:54:46 2021 Russian Standard Time (UT+4h)  she@DPX200
##.OBSERVE FREQUENCY= 81.013821
##.OBSERVE NUCLEUS= ^31P
##.ACQUISITION MODE= SIMULTANEOUS
##.ACQUISITION SCHEME= undefined
##.AVERAGES= 24
##.DIGITISER RES= 16
##SPECTROMETER/DATA SYSTEM= spect
##.PULSE SEQUENCE= zgpg30
##.SOLVENT NAME= CDCl3
##.SHIFT REFERENCE= (INTERNAL, CDCl3, 0, 248.564)
##AUDIT TRAIL= $$ (NUMBER, WHEN, WHO, WHERE, WHAT)
$$ ##TITLE= Audit trail, XWIN-NMR		Version 3.5
$$ ##JCAMPDX= 5.01
$$ ##ORIGIN= Bruker BioSpin GmbH
$$ ##OWNER= she
$$ F:/spectra/data/she/nmr/P31/1/pdata/1/auditp.txt
$$ ##AUDIT TRAIL=  $$ (NUMBER, WHEN, WHO, WHERE, WHAT)
(   1,<2021-06-07 11:53:26.68 +0400>,<she>,<DPX200>,
      <created by zg, POWCHK disabled, PULCHK disabled
       configuration hash MD5:
       00 E9 B6 7A A2 85 ED C7 34 08 36 98 17 FE 4E 26
       data hash MD5: 32K
       F5 16 1A 66 EA 98 C3 FB B4 69 A6 E4 BE 2A 2A 36>)
(   2,<2021-06-07 11:53:43.15 +0400>,<she>,<DPX200>,
      <Start of raw data processing
       efp BC_mod = 2 LB = 1 FT_mod = 6 PKNL = 1 PHC0 = -5818.401 PHC1 = -25.12524 SI = 64K 
       data hash MD5: 64K
       EF A9 18 C1 3C A2 F8 7E B2 00 03 E1 30 97 E0 BA>)
(   3,<2021-06-07 11:54:13.18 +0400>,<she>,<DPX200>,
      <pk PHC0 = -82.47173 PHC1 = 149.2001 
       data hash MD5: 64K
       59 80 62 D5 09 47 A0 A6 E5 74 15 3C 23 C5 2A 40>)
(   4,<2021-06-07 11:54:16.67 +0400>,<she>,<DPX200>,
      <abs ABSG = 5 
       data hash MD5: 64K
       6B 7E BF 58 3C BF FA 6C 1E 32 D4 0C C6 78 E9 8E>)
$$ ##END=
$$ 
$$ hash MD5
$$ E6 2C AD 6D F6 7A A1 95 3D 13 89 FB 4E D2 62 C8
##$RELAX= 
##$RELAX= 
##$RELAX= 
##$RELAX= 
##$RELAX= 
##$RELAX= 
##$RELAX= 
##$RELAX= 
$$ Bruker specific parameters
$$ --------------------------
##$DU= <F:/spectra>
##$EXPNO= 1
##$NAME= <P31>
##$PROCNO= 1
##$TYPE= <nmr>
##$USER= <she>
##$AMP= (0..31)
100 100 100 100 100 100 100 100 100 100 100 100 100 100 100 100 100 100 
100 100 100 100 100 100 100 100 100 100 100 100 100 100 
##$AQSEQ= 0
##$AQ_mod= 1
##$AUNM= <au_zg>
##$AUTOPOS= <>
##$BF1= 81.014009
##$BF2= 200.13
##$BF3= 200.13
##$BF4= 200.13
##$BF5= 200.13
##$BF6= 200.13
##$BF7= 200.13
##$BF8= 200.13
##$BYTORDA= 1
##$CFDGTYP= 0
##$CFRGTYP= 5
##$CHEMSTR= <none>
##$CNST= (0..31)
1 1 145 1 1 1 1 1 1 1 1 1 1 1 1 1 1 1 1 1 1 1 1 1 1 1 1 1 1 1 1 1 
##$CPDPRG= <waltz16>
##$CPDPRG1= <>
##$CPDPRG2= <waltz16>
##$CPDPRG3= <>
##$CPDPRG4= <mlev>
##$CPDPRG5= <mlev>
##$CPDPRG6= <mlev>
##$CPDPRG7= <mlev>
##$CPDPRG8= <mlev>
##$CPDPRGB= <>
##$CPDPRGT= <>
##$D= (0..31)
0 1 0 0 0 0 0 0 0 0 0 0.03 2e-05 3e-06 0 0 0 0 0 0 0 0 0 0 0 0 0 0 0 0 
0 0 
##$DATE= 1623052406
##$DBL= (0..7)
120 120 120 11 120 120 24 19 
##$DBP= (0..7)
150 150 150 150 150 150 150 150 
##$DBP07= 0
##$DBPNAM0= <>
##$DBPNAM1= <>
##$DBPNAM2= <>
$$ [...]
##$SUBNAM3= <"">
##$SUBNAM4= <"">
##$SUBNAM5= <"">
##$SUBNAM6= <"">
##$SUBNAM7= <"">
##$SUBNAM8= <"">
##$SUBNAM9= <"">
##$SW= 501.771253377433
##$SWIBOX= (0..15)
0 1 3 0 0 0 0 0 0 0 0 0 0 0 0 0 
##$SW_h= 40650.406504065
##$TD= 32768
##$TD0= 1
##$TE= 0
##$TE2= 300
##$TE3= 300
##$TEG= 300
##$TL= (0..7)
0 120 53 12 22 120 120 120 
##$TP= (0..7)
150 150 150 150 150 150 150 150 
##$TP07= 0
##$TPNAME0= <>
##$TPNAME1= <>
##$TPNAME2= <>
##$TPNAME3= <>
##$TPNAME4= <>
##$TPNAME5= <>
##$TPNAME6= <>
##$TPNAME7= <>
##$TPOAL= (0..7)
0.5 0.5 0.5 0.5 0.5 0.5 0.5 0.5 
##$TPOFFS= (0..7)
0 0 0 0 0 0 0 0 
##$TUNHIN= 0
##$TUNHOUT= 0
##$TUNXOUT= 0
##$USERA1= <user>
##$USERA2= <user>
##$USERA3= <user>
##$USERA4= <user>
##$USERA5= <user>
##$V9= 5
##$VALIST= <valist>
##$VCLIST= <CCCCCCCCCCCCCCC>
##$VD= 0
##$VDLIST= <DDDDDDDDDDDDDDD>
##$VPLIST= <PPPPPPPPPPPPPPP>
##$VTLIST= <TTTTTTTTTTTTTTT>
##$WBST= 1024
##$WBSW= 4
##$XGAIN= (0..3)
0 0 0 0 
##$XL= 0
##$YL= 0
##$YMAX_a= 22089
##$YMIN_a= -27103
##$ZGOPTNS= <>
##$ZL1= 120
##$ZL2= 120
##$ZL3= 120
##$ZL4= 120
##$ABSF1= 248.5645
##$ABSF2= -253.2056
##$ABSG= 5
##$ABSL= 3
##$ALPHA= 0
##$AQORDER= 0
##$ASSFAC= 0
##$ASSFACI= 0
##$ASSFACX= 0
##$ASSWID= 0
##$AUNMP= <proc_1d>
##$AZFE= 0.1
##$AZFW= 0.5
##$BCFW= 0
##$BC_mod= 2
##$BYTORDP= 0
##$COROFFS= 0
##$CY= -3
##$DATMOD= 1
##$DC= 0
##$DFILT= <>
##$DTYPP= 0
##$F1P= 0
##$F2P= 0
##$FCOR= 1
##$FTSIZE= 65536
##$FT_mod= 6
##$GAMMA= 0
##$GB= 0
##$INTBC= 1
##$INTSCL= 5.30512e-09
##$ISEN= 30
##$LB= 1
##$LEV0= 0
##$LPBIN= 0
##$MAXI= 10000
##$MC2= 0
##$MEAN= 0
##$ME_mod= 0
##$MI= 50
##$NCOEF= 0
##$NC_proc= -7
##$NLEV= 6
##$NOISF1= 182.463
##$NOISF2= 159.3651
##$NSP= 0
##$NTH_PI= 0
##$NZP= 0
##$OFFSET= 248.5645
##$PC= 4
##$PHC0= -5900.873
##$PHC1= 124.0749
##$PH_mod= 1
##$PKNL= yes
##$PPARMOD= 0
##$PSCAL= 0
##$PSIGN= 0
##$REVERSE= no
##$SF= 81.014009
##$SI= 65536
##$SIGF1= 159.3651
##$SIGF2= -187.1042
##$SINO= 113.3802
##$SIOLD= 16384
##$SREGLST= <1H.CDCl3>
##$SSB= 0
##$STSI= 65536
##$STSR= 0
##$SW_p= 40650.406504065
##$SYMM= 0
##$S_DEV= 0
##$TDeff= 32768
##$TDoff= 0
##$TI= <>
##$TILT= no
##$TM1= 0
##$TM2= 0
##$TOPLEV= 0
##$USERP1= <user>
##$USERP2= <user>
##$USERP3= <user>
##$USERP4= <user>
##$USERP5= <user>
##$WDW= 1
##$XDIM= 65536
##$YMAX_p= 276743754
##$YMIN_p= -98414270
$$ End of Bruker specific parameters
$$ ---------------------------------
##NTUPLES= NMR SPECTRUM
##VAR_NAME=  FREQUENCY,     SPECTRUM/REAL,   SPECTRUM/IMAG
##SYMBOL=    X,             R,               I
##VAR_TYPE=  INDEPENDENT,   DEPENDENT,       DEPENDENT
##VAR_FORM=  AFFN,          ASDF,            ASDF
##VAR_DIM=   65536,         65536,           65536
##UNITS=     HZ,            ARBITRARY UNITS, ARBITRARY UNITS
##FACTOR=    0.620285442955139, 1,           1
##FIRST=     20137.2065510759, 0,            0
##LAST=      -20513.1999529892, 0,           0
##MIN=       -20513.1999529892, -98414270,   0
##MAX=       20137.2065510759, 276743754,    0
$$ Real data points
##PAGE= N=1
##DATA TABLE= (X++(R..R)), XYDATA
$$ [...]
42880h17699P07431j39357N27454N09794r82109j258209Q31100K107132K44362
$$ -817699 -110268 -249625 277829 787623 -194486 -1452695 -621595 1485537 1729899
42871A729899k020274j332057Q06928Q89103q29479j584793j214581j612599k236913
$$ 1729899 -290375 -1622432 -815504 73599 -755880 -2340673 -3555254 -5167853 -7404766
42862g404766o31433K805801M614914L204217O60950p36187q33649j65030Q84447
$$ -7404766 -8036199 -5230398 -615484 2588733 3249683 2513496 1679847 1514817 2399264
42853B399264J157893k07641j543435m14418K105928K208852r04929l463305k574623
$$ 2399264 3557157 3349516 1806081 1391663 3497591 5706443 4801514 1338209 -1236414
42844a236414j605J238893J043094P86127L04717j055341k195557j649412m9506
$$ -1236414 -1238019 874 1043968 1830095 2134812 1079471 -1116086 -2765498 -2815004
42835b815004R04150R17555P37956M44173r5079j67712N50278Q01180l32558j416403
$$ -2815004 -1910854 -993299 -255343 188830 93751 -73961 476317 1277497 944939 -471464
42825d71464o70677R81279J211468k7410n97550K82875J041890M88105o46269
$$ -471464 -1142141 -160862 1050606 1023196 425646 708521 1750411 2238516 1592247
42816A592247j317525j419214r68255J56733J142023O62381r48070j616218m25343
$$ 1592247 274722 -1144492 -2112747 -1956014 -813991 -151610 -1099680 -2715898 -3141241
42807c141241J020995J109355N03189O00190J100629Q32221O6931Q0468P44902
$$ -3141241 -2120246 -1010891 -507702 92488 1193117 2025338 2092269 2172737 2917639
42798B917639M71068j195416k549127j990857j46272J135844J086703L95429j62207
$$ 2917639 3388707 2193291 -355836 -2346693 -2492965 -1357121 -270418 125011 -37196
42789c7196m39919m64506k51855j55990n50091j012884p38911k1164j89830j393178
$$ -37196 -477115 -941621 -1193476 -1349466 -1899557 -2912441 -3651352 -3672516 -3862346 -5255524
42779e255524j667578M27801L126986L272723O01445j741380j318284Q04768K110709
$$ -5255524 -6923102 -6495301 -3368315 -95592 505853 -1235527 -2553811 -1749043 361666
42770C61666J759046N58401o86434j405226j012388J33381N13076m30344j091886
$$ 361666 2120712 2679113 1992679 587453 -424935 -291554 221522 -208822 -1300708
42761a300708k39538N66164o44316k493602j820029J292297L201020J924627l54000
$$ -1300708 -1540246 -974082 -1618398 -4112000 -5932029 -4639732 -1438712 485915 131915
42752A31915j075232o90812n92667l26996P69274J256164k96064k282513k029978
$$ 131915 -943317 -1634129 -2226796 -2553792 -1784518 -528354 -824418 -3106931 -5136909
42743e136909P3041J275146P80580L64627P29912M54361p41885q19433J008115
$$ -5136909 -5063868 -3788722 -3008142 -2643515 -1913603 -1459242 -2201127 -3020560 -2012445
42734b012445K268976R23246j143404r51186Q03964R05865j102641k086784k51099
$$ -2012445 256531 1179777 36373 -914813 -110849 795016 -307625 -2394409 -2645508
42725b645508K052079J898295m1168r46811j18412N21248k03152j067222o99003
$$ -2645508 -593429 1304866 1263698 316887 198475 719723 516571 -550651 -1249654
42716a249654J91309j9666j304708j841667m16992J886591K857655J733796O3122
$$ -1249654 -1058345 -1078011 -2382719 -4224386 -4641378 -2754787 102868 1836664 1899786
42707A899786k90272M31709L63378r77118j548981J76946K227658J427231j566711
$$ 1899786 1609514 2041223 2404601 1427483 -121498 55448 2283106 3710337 2143626
42698B143626k420708N70039L208268J040406l747505m847764p47831K998011
$$ 2143626 -277082 292957 3501225 4541631 794126 -4053638 -4801469 -1803458
42690a803458J625965k338193l105241K38928L064920J920860j312341k583703
$$ -1803458 -177493 -2515686 -5620927 -5381999 -2317079 -396219 -1708560 -4292263
42682d292263o97021K013137K802099J213897r07842j499815m10213O19472K67330
$$ -4292263 -4989284 -2976147 -174048 1039849 132007 -1367808 -1778021 -1158549 -891219
42673h91219o77683o56871K69345O50802J7943m83376q5759L90260J577p49653
$$ -891219 -1568902 -2225773 -1956428 -1305626 -1287683 -1771059 -1856818 -1466558 -1464981 -2214634
42663b214634p19196J93672J001396Q67005k22630j613784k252704j243859J130503
$$ -2214634 -2933830 -2740158 -1738762 -871757 -1094387 -2708171 -4960875 -6204734 -5074231
42654e074231L145922L064625Q98345j585912k558197j603980K06969J295176
$$ -5074231 -1928309 1136316 2034661 448749 -2109448 -3713428 -3506459 -2211283
42646b211283P95566o67016j429582m94122J173378J611692L61045p14120J65335
$$ -2211283 -1415717 -2082733 -3512315 -4006437 -2833059 -1221367 -860322 -1574442 -1409107
42637a409107J977456J933820n69967k595587j392809J717477L025325J402358
$$ -1409107 568349 2502169 1932202 -663385 -2056194 -338717 2686608 4088966
42629D088966o53297j018381m83097l90774k29172O42402R28496n30702k084066
$$ 4088966 3435669 2417288 1934191 1543417 1314245 1956647 2885143 2354441 270375
42620B70375j392232O87521J250640n2005o68636M25678J122904j02084j729402
$$ 270375 -1121857 -434336 816304 764299 95663 521341 1644245 1542161 -187241
42611a87241j829371p62461K41654J006927J339882K62103j757317j941777R78456
$$ -187241 -2016612 -2779073 -2537419 -1530492 -190610 71493 -1685824 -3627601 -2649145
42602b649145L847385K807871j238887l824870k831155k40508J640182K529987
$$ -2649145 1198240 4006111 2767224 -1057646 -3888801 -4129309 -2489127 40860
42594D0860K492738J053677r97091j567653l39353L86384o75420j534755j77796
$$ 40860 2533598 3587275 2590184 1022531 683178 1069562 394142 -1140613 -1318409
42585a318409J874959J714727m79233j748570o73090J096246J684542J130328
$$ -1318409 556550 2271277 1792044 43474 -629616 466630 2151172 3281500
42577C281500K16822q32613j678026j533132m88808J53132k28315o30162k66682
$$ 3281500 3498322 2665709 987683 -545449 -1034257 -881125 -1109440 -1739602 -2006284
42568b006284J25473p446L09715J501708J682577n49786k857122j880373J395213
$$ -2006284 -1880811 -1888257 -1578542 -76834 1605743 1055957 -1801165 -3681538 -2286325
42559b286325K643186P38350o97543N83203J943935P67926j009232o59422L02567
$$ -2286325 356861 1095211 397668 980871 2924806 3692732 2683500 2024078 2326645
42550B326645q95797k700842j582833J423922J847141q22725k181233j36099J985255
$$ 2326645 1430848 -1269994 -2852827 -1428905 418236 -404489 -2585722 -2721821 -736566
42541g36566J245346n79294q88377m93234j060983j605767o73050N72626N17158
$$ -736566 508780 -70514 -958891 -1452125 -2513108 -4118875 -4791925 -4219299 -3702141
42532c702141J45642R14505J604475M92118j019196l39305J835672K326201K48434
$$ -3702141 -3556499 -2641994 -1037519 -545401 -1564597 -1903902 -68230 2257971 2506405
42523B506405j981738k301729j145561J15153Q17595R70855J010845J412172J633779
$$ 2506405 524667 -1777062 -2922623 -2807470 -1989875 -1019020 -8175 1403997 3037776
42514C037776M14206j878356k819542j359304K33722j09441q49381L52036K290998
$$ 3037776 3451982 1573626 -1245916 -2605220 -2371498 -2480939 -3330320 -2978284 -687286
42505f87286K041576j66151j449862r26717l53201m77271j72998P98708J308864
$$ -687286 1354290 1188139 -261723 -1188440 -1541641 -2018912 -2191910 -1393202 -84338
42496h4338J188804J151203O26038j207163k588515j038993J955934K171087q44149
$$ -84338 1104466 2255669 2881707 1674544 -913971 -1952964 2970 2174057 1329908
42487A329908k665442p52197J758066J185549j266685k019718m67307J123109
$$ 1329908 -1335534 -2087731 -329665 855884 -410801 -2430519 -2897826 -1774717
42479a774717J417775J063562P86712M91443j04275j086200k163858k437335j224994
$$ -1774717 -356942 706620 1493332 1984775 1880500 794300 -1369558 -3806893 -5031887
42470e031887O93107J812359J824784J398327M79300j140087k012415m99807K025722
$$ -5031887 -4338780 -2526421 -701637 696690 1175990 35903 -1976512 -2476319 -450597
42461d50597K449654N92118o30139j29550m8638j317343j796426n18533J39116
$$ -450597 1999057 2591175 1961036 1831486 1782848 465505 -1330921 -1849454 -1710338
42452a710338j178947j940565m0247K334827K344704J074200R95561J416702K62025
$$ -1710338 -2889285 -4829850 -4870097 -2535270 -190566 883634 1879195 3295897 3557922
42443C557922j615012j830410p45585n19168r34822J8097J977090K329029N13955
$$ 3557922 1942910 112500 -633085 -1152253 -2087075 -2068978 -91888 2237141 2751096
42434B751096j053459p30835L82998O77542M1066p50679r91825l19446O84935
$$ 2751096 1697637 966802 1349800 2027342 2068408 1317729 325904 6458 691393
42425F91393O49607n87565j190394p2331J034062L18356r01424l93566R88493
$$ 691393 1341000 753435 -436959 -509290 524772 843128 -58296 -451862 536631
42416E36631P24303r55830j559717o90274k81867o21222Q8100J786838J959356
$$ 536631 1260934 305104 -1254613 -1944887 -2226754 -2847976 -2759876 -973038 986318
42407I86318m2408j593119j087948l31721q66780j049078Q11470K948142K587375
$$ 986318 943910 -649209 -1737157 -2068878 -2935658 -3984736 -3173266 -225124 2362251
42398B362251J82919j519297j466714p73807q3349Q62940J336957p162k439446
$$ 2362251 2545170 1025873 -440841 -1214648 -1297997 -435057 901900 894738 -1544708
42389a544708l112428p09379K537843L651856K444125Q87705j0091q58145j752514
$$ -1544708 -4657136 -5366515 -2828672 823184 3267309 4155014 4144923 3286778 1534264
42380A534264j607161k35200O77418p7752j213104q31431O26035J159771L70306
$$ 1534264 -72897 -308097 369321 291569 -921535 -1752966 -1126931 32840 403146
42371D03146k17194J30740M15327l874l41616l0993K45700j51812q80549j363285
$$ 403146 185952 316692 732019 728145 386529 355536 601236 449424 -431125 -1794410
42361a794410j148680L62501K726481L386873N06038l234125l144272O22191K777127
$$ -1794410 -2943090 -2580589 145892 3532765 4038803 804678 -2339594 -1717403 1059724
42352A059724Q09561j335024n3597K020812R75524j405712q60917J751287J843231
$$ 1059724 1869285 534261 480664 2501476 3477000 2071288 1210371 2961658 4804889
42343D804889j117760k904503j551363J70192O9650l69537L60922J039647M38835
$$ 4804889 3687129 782626 -768737 -598545 -528895 -898432 -537510 502137 940972
42334I40972l41987j03114L34861j48040j047768j290618o54243O05004K016404
$$ 940972 598985 495871 830732 682692 -365076 -1655694 -2309937 -1704933 311471
42325C11471K469560J252241l56777m27475P05644R95656O8008m20409P0188J22421
$$ 311471 2781031 4033272 3676495 3249020 3954664 4950320 5018328 4597919 4668107 4790528
42315D790528q54410j566085j239188p38154o20767l28394Q9046l00670j271122
$$ 4790528 3936118 2370033 1130845 392691 -228076 -556470 -467424 -768094 -2039216
42306b039216j359065l63292L32258L44249P23171J342074O07224j412346k293373
$$ -2039216 -3398281 -3761573 -3429315 -3085066 -2361895 -1019821 -412597 -1824943 -4118316
42297d118316q02806J309500K099476J640075N68852r54658j828972m06405K274002
$$ -4118316 -4921122 -3611622 -1512146 127929 696781 -257877 -2086849 -2493254 -219252
42288b19252K487088j063502m635932m100955j69488L130678L464762J609882
$$ -219252 2267836 1204334 -3431598 -7532553 -7702041 -4571363 -1106601 503281
42280E03281o74676k089622j964258o33621P75003J642755K177908K304936J652653
$$ 503281 -171395 -2261017 -4225275 -4858896 -4083893 -2441138 -263230 2041706 3694359
42271C694359P26838L14318k22626j815637l042496j625390J256855J785023n70027
$$ 3694359 4421197 4735515 4512889 2697252 -345244 -1970634 -713779 1071244 501217
42262E01217j907307k14499J324928j83213k427963j817489P63672J834650P26699
$$ 501217 -1406090 -1620589 -295661 -478874 -2906837 -4724326 -3960654 -2126004 -1399305
42253a399305m67162o70809k48011R46218K818167L523474J641461j105298j939369
$$ -1399305 -1866467 -2537276 -2785287 -1839069 979098 4502572 6144033 5038735 3099366
42244C099366q72049k2217j46046l08801j40645j39910m15204q49948j527711
$$ 3099366 2227317 2205100 2059054 1750253 1609608 1469698 1054494 204546 -1323165
42235a323165j709731j42266K220653K281694m52859k087397m0850K432968J066224
$$ -1323165 -3032896 -3175162 -954509 1327185 874326 -1213071 -1253921 1179047 2245271
42226B245271k637628l758838j335639J100610J329453N00510p5166l38310n3542
$$ 2245271 -392357 -4151195 -5486834 -4386224 -3056771 -2556261 -2631427 -2969737 -3023279
42217c023279P03430L73627j564554k256470N96423M020117L478920j6622j614237
$$ -3023279 -2319849 -1946222 -3510776 -5767246 -5170823 -1150706 2328214 2311592 697355
42208F97355m78175j80597j506258j202302J213112J755879r08928k554284m03617
$$ 697355 219180 38583 -1467675 -2669977 -1456865 299014 -609914 -3164198 -3567815
42199c567815K216280J587281o40577j093053j49379M2329k79820o1130k74767
$$ -3567815 -1351535 235746 -404831 -1497884 -1647263 -1604934 -1884754 -1945884 -2220651
42190b220651j609629k003863l4025J856107J204168L1811J391751L654543K840681
$$ -2220651 -3830280 -5834143 -5868168 -4012061 -2807893 -2776082 -1384331 2270212 5110893
42181E110893p89095l104100k363396p74971m7909N08245J207884J021292m3366
$$ 5110893 4321798 1217698 -1145698 -1920669 -1968578 -1460333 -252449 768843 725477
42172G25477o86552q44687j586289k332983j312990Q91011J533064J00396p52954
$$ 725477 38925 -805762 -2392051 -4725034 -6038024 -5147013 -3613949 -3513553 -4266507
42163d266507L84111J628766J479250J223181J809462J509534p39983k418009
$$ -4266507 -3882396 -2253630 -774380 448801 2258263 3767797 3027814 609805
42155F09805j019268J460179J185559j557881k744357o69892J853524J919476
$$ 609805 -409463 1050716 2236275 678394 -2065963 -2735855 -882331 1037145
42147A037145J39388j272320j585785j294699o26844J46158K50209l48334l70317
$$ 1037145 1176533 -95787 -1681572 -2976271 -3603115 -3456957 -3206748 -3555082 -3925399
42138c925399Q05910J741521R90548m78933o88055K92526P03418J27166o8023
$$ -3925399 -3119489 -1377968 -387420 -866353 -1554408 -1261882 -558464 -431298 -499321
42129d99321N51353O02586n15728j221735k60659J034363O73740r23479j644659
$$ -499321 52032 654618 138890 -1082845 -1343504 -309141 364599 -558880 -2203539
42120b203539q63185k6426j17493k72638N25601J646016J614185J83419j209976
$$ -2203539 -3066724 -3093150 -3210643 -3483281 -2957680 -1311664 302521 485940 -724036
42111g24036j130714J10725Q04321P5196p49388J66653K304537K957995P84601
$$ -724036 -1854750 -1744025 -939704 -864508 -1613896 -1447243 857294 3815289 4599890
42102D599890k097415k654500o83173J283134J275749k18348j449464j309550
$$ 4599890 2502475 -152025 -835198 447936 1723685 1505337 55873 -1253677
42094a253677l7399J118897J005363q6374o10679M8353M80749m91511j464638
$$ -1253677 -1291076 -172179 833184 746810 136131 184484 665233 173722 -1290916
42085a290916k96055K196656K761989K88311k418252k471751o54160K30261n15979
$$ -1290916 -1586971 609685 3371674 3659985 1241733 -1230018 -1884178 -1653917 -2169896
42076b169896r06317M91104K410546K549001N62399j392236j209653N50750J336676
$$ -2169896 -3076213 -2585109 -174563 2374438 2936837 1544601 334948 885698 2222374
42067B222374r287j610729j206649N49553J131360L8840n65989M15444R42699
$$ 2222374 2213087 602358 -604291 -54738 1076622 1115462 549473 964917 1907616
42058A907616r93017l758957l818237n12673K958752L557113J736437J00650N593
$$ 1907616 914599 -2844358 -6662595 -7175268 -4216516 -659403 1077034 1177684 1183277
42049A183277N79670M94702m32303j379141j440861k85589J442317K231794J020312
$$ 1183277 1762947 2257649 1825346 446205 -994656 -1280245 162072 2393866 3414178
42040C414178j207630k013682m42177J485152J329435m95806j622335j320746
$$ 3414178 2206548 192866 -249311 1235841 2565276 2069470 447135 -873611
42032h73611r85893j046887r3675J986152K714078P33149j456185r53030J089140
$$ -873611 -1859504 -2906391 -3000066 -1013914 1700164 2433313 977128 24098 1113238
42023A113238J357812m64347j679932j194034p46070j253571j192144L46001J747921
$$ 1113238 2471050 2006703 326771 -867263 -1613333 -2866904 -4059048 -3713047 -1965126
42014a965126J491172M90303L07433P60454Q10698M13575Q2699k11665m93997
$$ -1965126 -473954 16349 323782 1084236 1894934 2308509 2391208 2179543 1685546
42005A685546k50103M88004O99740M1350l71155J7139r9544j622763k900107j863258
$$ 1685546 1435443 1923447 2623187 2664537 2293382 2310521 2210977 588214 -2311893 -4175151
41995d175151O47025J928794J317638P08021J107342J044854o55275k408688j816743
$$ -4175151 -3528126 -1599332 -281694 426327 1533669 2578523 1923248 -485440 -2302183
41986b302183Q05050K523539J422250j154560k500284j738334j83601R01087J474571
$$ -2302183 -1497133 1026406 2448656 1294096 -1206188 -2944522 -3128123 -2227036 -752465
41977g52465J534700M43335j531934k362312o28641K018524K644865R25915o97868
$$ -752465 782235 1225570 -306364 -2668676 -3297317 -1278793 1366072 2291987 1594119
41968A594119o60297R1041L96717N64007R13767P21661k18864p55618l28011n8454
$$ 1594119 933822 1024863 1421580 1985587 2899354 3621015 3402151 2646533 2318522 2260068
41958B260068o10462p83306J54432O07652p38351k086243r30302J813599K954906
$$ 2260068 1649606 866300 1020732 1628384 890033 -1196210 -2126512 -312913 2641993
41949B641993J758481N62536O63678O00173p00913j771187j023506O75475J484770
$$ 2641993 4400474 4963010 5626688 6226861 5525948 3754761 2731255 3406730 4891500
41940D891500J245547J026011R31458L4382j739229k955047k242262m1317J514196
$$ 4891500 6137047 7163058 8094516 8128898 6389669 3434622 1192360 1151043 2665239
41931B665239O84764j721048k813026r81033J789414K282717L51389j054111l05313
$$ 2665239 3350003 1628955 -1184071 -2165104 -375690 1907027 2258416 1204305 898992
41922H98992P66439J73654j044544q50855L15634N68702J533K83086J222386P55335
$$ 898992 1665431 1839085 794541 -56314 259320 828022 829555 1112641 2335027 3090362
41912C090362j197631j840772K06440K314537J591716p25480j170933Q37776K532488
$$ 3090362 1892731 51959 258399 2572936 4164652 3439172 2268239 3106015 5638503
41903E638503K074973O65435N5920K58394N08997O60456O54178P9622q16310r86302
$$ 5638503 7713476 8378911 8434831 8693225 9202222 9862678 10516856 10596478 9780168 8793866
41893H793866l08233j13753j033925j706256q47713O63745J200566P56024L45889
$$ 8793866 8485633 8371880 7337955 5631699 4783986 5447731 6648297 7404321 7750210
41884G750210L8477o78390j344058j155623n50469l60460l7068J218377K133734
$$ 7750210 7788687 7110297 5766239 4610616 4060147 3699687 3662619 4880996 7014730
41875G014730P10642k176906l226821j283720J060108J328000K23994m01846m06451
$$ 7014730 7725372 5548466 2321645 1037925 2098033 3426033 3650027 3248181 2841730
41866B841730n06594m02818M10605J306957J618718J778674J893366P81704j683359
$$ 2841730 2335136 1932318 2342923 3649880 5268598 7047272 8940638 9722342 8038983
41857H038983k945897j023430J850826J823266r82783k659998j289102P96501
$$ 8038983 5093086 4069656 5920482 7743748 6760965 4100967 2811865 3608366
41849C608366J228451Q22488J020211R77940m56456j937430j478053J47461N26754
$$ 3608366 4836817 5659305 6679516 7657456 7201000 5263570 3785517 3932978 4459732
41840D459732n46631r80463J4885P65768j2149j406164k081363j966059j295498
$$ 4459732 3913101 2932638 2947523 3713291 3701142 2294978 213615 -1752444 -3047942
41831c047942K36746K218733K994192J800126J58132l09391k40545j034827k086342
$$ -3047942 -2811196 -592463 2401729 4201855 4359987 4050596 3810051 2775224 688882
41822F88882j619094K77585J604223J338605M18434j97549n44318n64581P1294
$$ 688882 -930212 -652627 951596 2290201 2708635 2511086 1966768 1402187 1473481
41813A473481P40893L63681n13579j67672J255832J453338l45881j777908q99558
$$ 1473481 2214374 2578055 2064476 1896804 3152636 4605974 4260093 2482185 1582627
41804A582627Q32291J015745r7954n92896m0396N41133Q18310J125888J107948
$$ 1582627 2414918 3430663 3332709 2739813 2699417 3240550 4058860 5184748 6292696
41795F292696K65823q26102j440150j915559k456632k000128p3073J625877J552504
$$ 6292696 6558519 5732417 4292267 2376708 -79924 -2080052 -2153125 -527248 1025256
41786A025256P46459O80906M43278j076346j977727n1202K587700J864361j743841
$$ 1025256 1771715 2452621 2895899 1819553 -158174 -209376 2378324 4242685 2498844
41777B498844l532176j607486Q41966J083717K73048K4966k51665p68102J2817
$$ 2498844 -1033332 -2640818 -1798852 -715135 -442087 -417121 -668786 -1436888 -1424071
41768a424071K001611K325645p7866k095189j234694M92777L71235n41894j07060
$$ -1424071 577540 2903185 2825319 730130 -504564 -11787 359448 -182446 -289506
41759b89506O36796k07100j194042P7902K127821J631130p39348j117583J151024
$$ -289506 347290 140190 -1053852 -975950 1151871 2783001 2043653 926070 2077094
41750B077094K443427Q18154j163411j021233j50698q61275k314140j998909K88586
$$ 2077094 4520521 5338675 4175264 3154031 3003333 2142058 -172082 -2170991 -1882405
41741a882405K367737K855716K332606J464434j13575k360738l664567k491015
$$ -1882405 485332 3341048 5673654 7138088 7024513 4663775 999208 -1491807
41733a491807K43515J938695J631165R65776J170116R94788p00381k232330j637364
$$ -1491807 -1248292 690403 2321568 3287344 4457460 5452248 4751867 2519537 882173
41724H82173m10997j171879k575316j019176K644727L326776j12661k367654n8671
$$ 882173 471176 -700703 -3276019 -4295195 -1650468 1676308 1563647 -804007 -862678
41715h62678K704196J225155j990417j745500J067036J413329j207238k446650
$$ -862678 1841518 3066673 1076256 -669244 397792 1811121 603883 -1842767
41707a842767p74811O43795R7636k06697J063697J978780J262017M05120L01571
$$ -1842767 -2617578 -1973783 -1876147 -2082844 -1019147 959633 2221650 2626770 2928341
41698B928341m15877k041613k395309n92295J018705O12379l27727P0524J004242
$$ 2928341 2512464 470851 -1924458 -2516753 -1498048 -885669 -1213396 -1142872 -138630
41689a38630Q64761p7478p16155q90382o22487M33647J492158P91695j404354
$$ -138630 726131 648653 -67502 -957884 -1580371 -1146724 345434 1137129 -267225
41680b67225k299165n40594J661763K005089J226238R16513O85486k38568p98058
$$ -267225 -2566390 -3106984 -1445221 559868 1786106 2702619 3388105 3149537 2351479
41671B351479l818P99039P2843j105052q37046M72421J233728J436081J695743
$$ 2351479 2347661 3146700 3219543 2114491 1277445 1749866 2983594 4419675 6115418
41662F115418R79144j730036m493231m298455j451032Q29007J002788N91532R18407
$$ 6115418 7094562 5364526 871295 -3427160 -4878192 -4049185 -3046397 -2454865 -1536458
41653a536458J266192Q19652R1576k75883k83242K29985J343133J842256L29879
$$ -1536458 -270266 549386 640962 365079 81837 311822 1654955 3497211 3827090
41644C827090k141835k779734r68104P80378O01096l41319m41139k39737o24451
$$ 3827090 1685255 -1094479 -2062583 -1282205 -681109 -1022428 -1463567 -1703304 -2327755
41635b327755n41761J092317K689067J921254m19036j287490K2994R31290k27313
$$ -2327755 -2869516 -1777199 911868 2833122 2414086 1126596 1149590 2080880 1853567
41626A853567j631860r73666R60158J598404L76811p13842m9761J715540K757698
$$ 1853567 221707 -751959 208199 1806603 2183414 1469572 1419811 3135351 5893049
41617E893049K012043j37952k299377l099055k348050j121587k99614M37016J463054
$$ 5893049 7905092 7767140 5467763 2368708 20658 -1100929 -1400543 -963527 499527
41608D99527J876521O72536j223412j773197o41532M79225N12214J84444J95951
$$ 499527 2376048 3048584 1825172 51975 -589557 -110332 401882 586326 782277
41599G82277J19213j60227J60653R75187Q06256n35406q73427J009723K936187
$$ 782277 901490 741263 901916 1877103 2683359 2147953 1274526 2284249 5220436
41590E220436K435820N16484l28993l49009j509867l213916k782464k17969J176017
$$ 5220436 7656256 8172740 7843747 7494738 5984871 2770955 -11509 -229478 946539
41581I46539k49340k126897j896104j60713J236609J922820K052405R74738j111601
$$ 946539 697199 -1429698 -3325802 -3486515 -2249906 -327086 1725319 2700057 1588456
41572A588456k052341m57599J908565K512089J510348P08166L14137p21287j909759
$$ 1588456 -463885 -921484 987081 3499170 5009518 5717684 6031821 5310534 3400775
41563C400775j571693M6114O41833n70357j500855m89476R94762N84661j373525
$$ 3400775 1829082 1875196 2517029 1946672 445817 -43659 951103 1535764 162239
41554A62239k373984j373079P7703M58932K38390M14821O60460L51304L53948
$$ 162239 -2211745 -3584824 -3507121 -3048189 -2809799 -2394978 -1734518 -1383214 -1029266
41545a029266J782939L394304K578863o27465k894774k083348j36621K33941l99667
$$ -1029266 753673 4147977 6726840 6099375 3204601 1121253 984632 1218573 818906
41536H18906K1445R60636L68200j058793n18597J875499K576772J85385k060660
$$ 818906 840351 1800987 2169187 1110394 591797 2467296 5044068 5229453 3168793
41527C168793j295617O17393L93847j447520j869998l64038O39994k8222p00047
$$ 3168793 1873176 2490569 2884416 1436896 -433102 -797140 -157146 -185368 -885415
41518h85415J12810J510456J880073J137523L43908J00166J67163J66839M3835
$$ -885415 -772605 737851 2617924 3755447 4099355 4199521 4366684 4533523 4577358
41509D577358o2084j75909o19893j540678k313736j990708n92528O59700Q06655
$$ 4577358 4515274 4339365 3719472 2178794 -134942 -2125650 -2718178 -2058478 -1251823
41500a251823K71127Q8080N83543J267445J498125Q65447m81409j536777j199115
$$ -1251823 -980696 -892616 -309073 958372 2456497 3321944 2840535 1303758 104643
41491A04643K60005J269762R28423Q690m79445o47459q93154p68299K48813J567583
$$ 104643 364648 1634410 2562833 2571523 2092078 1444619 551465 -216834 31979 1599562
41481A599562K081290J462554J69645j176505j804936j109754K53491N98515m96608
$$ 1599562 3680852 5143406 5313051 4136546 2331610 1221856 1475347 2073862 1577254
41472A577254j183873J77151K547702L592045K616860O52054j435257l074893
$$ 1577254 393381 570532 3118234 6710279 9327139 9979193 8543936 5469043
41464E469043l061247p73659J894679K108929j52406j951811j404470J79673Q01998
$$ 5469043 2407796 1634137 3528816 5637745 5485339 3533528 2129058 2308731 3110729
41455C110729L75273k48065r59222j594386r90019J285659L253148K591529l9480
$$ 3110729 3486002 3237937 2278715 684329 -305690 979969 4233117 6824646 6785166
41446F785166j671460r91651K31259R7131q16321q18863J87157P64999J69960
$$ 6785166 5113706 4122055 4353314 4450445 3634124 2815261 3002418 3767417 3937377
41437C937377p72646j020936o15904l57487o63934r99230m04133J223455K449570
$$ 3937377 3164731 2143795 1527891 1170404 506470 -492760 -896893 326562 2776132
41428B776132J657526o22962j831814o90084Q06148K69541j259120p91384J690772
$$ 2776132 4433658 3810696 1978882 1288798 2094946 2364487 1105367 313983 2004755
41419B004755K789614Q32409j530280j469886q1927r193j055970j049017K31906
$$ 2004755 4794369 5626778 4096498 2626612 2544685 2535492 1479522 430505 662411
41410F62411R64067N01553l2429o1142r568K34471Q76510O47556j558391l720839
$$ 662411 1626478 2128031 2095602 2034460 2024892 2259363 3135873 3783429 2225038 -1495801
41400a495801k537473J449027L815582K236507n78428j197780J96488J463519
$$ -1495801 -4033274 -2584247 1231335 3467842 2889414 1691634 1888122 3351641
41392C351641J829109J493155J48419j833382k484981p68839J359966J512434
$$ 3351641 5180750 6673905 6822324 4988942 2503961 1735122 3095088 4607522
41384D607522K15022m22092j96620n44449j463653j232112O85358K452638K163593
$$ 4607522 4822544 4400452 4203832 3659383 2195730 963618 1648976 4101614 6265207
41375F265207J13490j748506j990467r99591l12680p17432j307733q93604J80133
$$ 6265207 6378697 4630191 2639724 1640133 1327453 610021 -697712 -1591316 -1411183
41366a411183P32182P83032J222736J686069R03930o70866j025548M3190L17244
$$ -1411183 -679001 104031 1326767 3012836 3916766 3245900 2220352 2263542 2580786
41357B580786j077824j982662p80553R21858J100058M37218N05159J017935J206993
$$ 2580786 1502962 -479700 -1260253 -338395 761663 1198881 1704040 2721975 3928968
41348C928968J780563K920714K450855q93574m136092l511276n6912J870756R61194
$$ 3928968 5709531 8630245 11081100 10187526 6051434 2540158 2483246 4354002 5315196
41339E315196M2054Q37707J426532p4240k325530k837313j324112L65944O03052
$$ 5315196 5357250 6194957 7621489 7547249 5221719 2384406 1060294 1426238 2029290
41330B029290n32087j459659o64437J414304K545076J472182m24276j245628j059212
$$ 2029290 1497203 37544 -626893 787411 3332487 4804669 4380393 3134765 2075553
41321B075553q52888n21442J67542J14010j175274j572061Q06283L760498L432794
$$ 2075553 1222665 701223 868765 982775 -192499 -1764560 -958277 2802221 6235015
41312F235015J24987j870899m90123J540286J267409m67695j100651j13302R49622
$$ 6235015 6360002 4489103 3998980 5539266 6806675 6338980 5238329 5125027 6074649
41303F074649Q04756n04597j970540k348227j206767N78089J932874K647187K578803
$$ 6074649 6879405 6374808 4404268 2056041 849274 1427363 3360237 6007424 8586227
41294H586227J060694j474551k773180j662372j21073q6243j24110J491095K468760
$$ 8586227 9646921 8172370 5399190 3736818 3615745 3529502 3405392 4896487 7365247
41285G365247j64594l834892l156431J281183L004588k81919k972179n78676L304116
$$ 7365247 7200653 3365761 209330 1490513 4495101 4213182 1241003 662327 3966443
41276C966443L147888p2608j560014n24375p9288j198005j733004p41609L60718
$$ 3966443 7114331 7041723 5481709 4957334 4878046 3680041 1947037 1205428 1566146
41267A566146P38840Q54190M91303q96053k092769j232318J091330K390425J823201
$$ 1566146 2304986 3159176 3650479 2754426 661657 -570661 520669 2911094 4734295
41258D734295P40448k5801q16079j230991l45946R34561M86399j495071k229482
$$ 4734295 5474743 5448942 4632863 3401872 3055926 3990487 4476886 2981815 752333
41249G52333n70365J070851M85092r03681m30088J557081K268898P08000j027216
$$ 752333 181968 1252819 1737911 834230 404142 1961223 4230121 4938121 3910905
41240C910905r92558m8484k02056j463235j862300m20579J312872J339104r0306
$$ 3910905 2918347 2869863 2667807 1204572 -657728 -1078307 234565 1573669 1483363
41231A483363r18874q3745J315742J804762J382366R76062Q52027M81637k99452
$$ 1483363 564489 480744 1796486 3601248 4983614 5959676 6811703 7293340 6993888
41222F993888q78267p70000l34309j73115j39771L79666J120749P80288j041518
$$ 6993888 6115621 5345621 5011312 4838197 4698426 5078092 6198841 6979129 5937611
41213E937611k535663j765526L25901R32768m57698j303103k12025P91895m3562
$$ 5937611 3401948 1636422 1962323 2895091 2437393 1134290 922265 1714160 1670598
41204A670598r40481K47856J914226J294233m86940j52537J840817J791013q45897
$$ 1670598 730117 977973 2892199 4186432 3699492 3546955 5387772 7178785 6332888
41195F332888k323150q42034P31128J62750n41711O17225J757833P28509p36195
$$ 6332888 4009738 3167704 3898832 4061582 3519871 4137096 5894929 6623438 5887243
41186E887243j56293J060533J22163j971161j962367P0511Q21050q08442k173273
$$ 5887243 5730950 6791483 6913646 4942485 2980118 3050629 3871679 3063237 889964
41177H89964j228201P73374J753421J483871Q43276K93709l036J33173M83440
$$ 889964 -338237 435137 2188558 3672429 4515705 4809414 4806378 4939551 5422991
41168E422991N85671M44854K93361o8296p54448j128730p44700l14470n19359
$$ 5422991 6008662 6453516 6746877 6678581 5924133 4795403 4050703 3736233 3216874
41159C216874o32556K22600J262616J203589M77873L63369N66165j15855j171547
$$ 3216874 2584318 2806918 4069534 5273123 5750996 6114365 6680530 6564675 5393128
41150E393128r16120M10136P20230l53127o56623P87870J882139Q12053r19338
$$ 5393128 4477008 4887144 5607374 5254247 4597624 5385494 7267633 8079686 7160348
41141G160348r23233L05429N96074M8898P89454K765124K876977l29317l594789
$$ 7160348 6237115 6542544 7138618 7187516 7976970 10742094 13619071 13289754 9694965
41132I694965l006029L25765J712098k84556j914211k21247K390351K142984j65254
$$ 9694965 6688936 7014701 8726799 8442243 6528032 6306785 8697136 10840120 10674866
41123A0674866q85435K92622K48089j663665k235614j23569J419955j07656k099625
$$ 10674866 9789431 10082053 10330142 8666477 6430863 6307294 7727249 7619593 5519968
41114E519968j079957J576985K015155O8014j080685m70502l71224j566756j603033
$$ 5519968 4440011 6016996 8032151 8100165 7019480 6548978 6177754 4610998 3007965
41105C007965R45191L548712L078741K04232j604117n74015J601393K332629J121385
$$ 3007965 3953156 7501868 10580609 10784841 9180724 8606709 10208102 12540731 13662116
41096A3662116n07113j264059j232786p21371O26623K466663K725025P0654l146558
$$ 13662116 13155003 11890944 10658158 9936787 10563410 13030073 15755098 15825752 12679194
41087A2679194l167789k16882J454867j81473j967962o70541K150434L054862
$$ 12679194 9511405 9294523 10749390 10567917 8599955 7929414 10079848 13134710
41079A3134710J793844L48418p70797j803756j385031J166745K854731O68644
$$ 13134710 14928554 15276972 14506175 12702419 11317388 12484133 15338864 16007508
41071A6007508k863992k555551J417330L428187Q57035k443749k650467j138407
$$ 16007508 13143516 10587965 12005295 15433482 16290517 13846768 11196301 10057894
41063A0057894o41041m17432J284059K959499J946907q49859j939389l24950J415553
$$ 10057894 9416853 8999421 10283480 13242979 15189886 14340027 12400638 12075688 13491241
41054A3491241J151658j76461n70809J24402L83819o24615j773863j364484N50764
$$ 13491241 14642899 14466438 13895629 14020031 14403850 13779235 12005372 10640888 11191652
41045A1191652J958160J331426m60558j394763p29996O60570J605765J316719
$$ 11191652 13149812 14481238 14020680 12625917 11895921 12556491 14162256 15478975
41037A5478975k34195j464159j22832L265498M628384J492598k749668l057409
$$ 15478975 15244780 13780621 13657789 16923287 21551671 23044269 20294601 17237192
41029A7237192M2411J590408j8079j205698K33125J730170R58216k32724L78945
$$ 17237192 17279603 18870011 18851932 17646234 17879359 19609529 20567745 20335021 20713966
41020B0713966J401856Q47576M2123J013728K363024J413635j124620k150073
$$ 20713966 22115822 22963398 23005521 24019249 26382273 27795908 26671288 24521215
41012B4521215q31611Q54969J571539J734830J581874P03096n36928j116696q29823
$$ 24521215 23689604 24544573 26116112 27850942 29432816 30135912 29598984 28482288 27652465
41003B7652465k00845N66859J245370J065652j7804n84388K32268J197644J036197
$$ 27652465 27451620 28018479 29263849 30329501 30311697 29727309 29959577 31157221 32193418
40994C2193418N56678Q49999J042193J85042k84370J143901K700034J659007r15239
$$ 32193418 32750096 33600095 34642288 34827330 34542960 35686861 38386895 40045902 39130663
40985C9130663j399027P86858K547320K242734J643320J972036J724895J6603
$$ 39130663 37731636 38518494 41065814 43308548 44951868 46923904 48648799 48665402
40977D8665402j127511L3052J912686K006726N53571l50108J0212N92269N98808
$$ 48665402 47537891 47570943 49483629 51490355 52043926 51693818 51704030 52296299 52895107
40968E2895107J89902k28281k00244O87098J962044K296168J271947K11051K50708
$$ 52895107 53085009 52856728 52656484 53343582 55305626 57601794 58873741 59084792 59335500
40959E9335500N69142k20795j664199j880236j46954K064729K700497J175164
$$ 59335500 59904642 59683847 58019648 56139412 55992458 58057187 60757684 61932848
40951F1932848j068598j770853p5403K202530K256447l71812l017435l042775
$$ 61932848 60864250 59093397 59017994 61220524 63476971 63105159 60087724 57044949
40943E7044949q02045J368939K143530J943908J359305L81216p44207j192007
$$ 57044949 56242904 57611843 59755373 61699281 63058586 63439802 62695595 61503588
40935F1503588o34240K8615l90773j810534k673423j641560N18649J412055n8475
$$ 61503588 60869348 60897963 60507190 58696656 56023233 54381673 54900322 56312377 56253902
40926E6253902j969031j786458L1519P00015o67505j883101j519264j294232k753657
$$ 56253902 54284871 52498413 52529932 53229947 52562442 50679341 49160077 47865845 45112188
40917D5112188l909021k117479J150487J937195k22907j613965k36958J164950
$$ 45112188 41203167 39085688 40236175 42173370 41950463 40336498 40099540 41264490
40909D1264490k91544k954841l206157q60415R05831K75294j218712j471721m20425
$$ 41264490 40972946 38018105 34811948 33951533 34857364 35132658 33913946 32442225 32021800
40900C2021800O77011J041283P25144R2192m38098n65619l10077J39864N69918
$$ 32021800 32698811 33740094 34465238 34557430 34119332 33553713 33243636 33383500 33953418
40891C3953418M87987o39654k297390k840963j480520M01485J140061J175826
$$ 33953418 34441405 33801751 31504361 28663398 27182878 27584363 28724424 29900250
40883B9900250J844648K501710J284065j297699k307402p43995P37088j2347j270797
$$ 29900250 31744898 34246608 35530673 34232974 31925572 31181577 31918665 31906318 30635521
40874C0635521n52372J016127N17762j752358k577311r32045O03753K17634n40878
$$ 30635521 30083149 31099276 31617038 29864680 27287369 26355324 26959077 27176711 26635833
40865B6635833M376O31584l38527j676571j060062R59787J688857N80977k1670
$$ 26635833 26640209 27271793 26933266 25256695 24196633 25156420 26845277 27426254 27404584
40856B7404584J230262K660619K410847J145718M37053J33653p94845j901002
$$ 27404584 28634846 31295465 33706312 34852030 35289083 35422736 34627891 32726889
40848C2726889j830785q06942n20654j439225k024313j117259M44151J319648
$$ 32726889 30896104 30089162 29568508 28129283 26104970 24987711 25431862 26751510
40840B6751510J468335J556253J632276J391950R20879K23017j160868l003051
$$ 26751510 28219845 29776098 31408374 32800324 33721203 33944220 32783352 29780301
40832B9780301l682803j990931Q44917K276108J303978r02400k793230l471403
$$ 29780301 26097498 24106567 24951484 27227592 28531570 27629170 24835940 21364537
40824B1364537k405150J01085K159242J832461k10752j172354K79892K393098
$$ 21364537 18959387 19060472 21219714 23052175 22841423 21669069 21948961 24342059
40816B4342059K809850J177249j259260l084637l084055r09297J689579K005103
$$ 24342059 27151909 28329158 27069898 23985261 20901206 19991909 21681488 23686591
40808B3686591j09537j588282m06130J370330P76888j423997j962925l9660J788270
$$ 23686591 23577054 21988772 21582642 22952972 23729860 22305863 20342938 20303278 22091548
40799B2091548J687919Q74771J130030K085645K164982R34080o07448j373613
$$ 22091548 23779467 24654238 25784268 27869913 30034895 30968975 30361527 28987914
40791B8987914j023092Q3232J115950J203488J16424j371599j929690p57896J432375
$$ 28987914 27964822 28048054 29164004 30367492 30483916 29112317 27182627 26424731 27857106
40782B7857106K747174K074465N56376J45704Q64357J002915J89307K09141J884480
$$ 27857106 30604280 32678745 33235121 33380825 34245182 35248097 35437404 35646545 37531025
40773C7531025L276524K638297J297578J406783K239214J334617j372987l154023
$$ 37531025 40807549 43445846 44743424 46150207 48389421 49724038 48351051 45197028
40765D5197028k158420N57963K702166K759184N54376k473035l771368k150926
$$ 45197028 43038608 43596571 46298737 49057921 49612297 47139262 43367894 41216968
40757D1216968M59269J324036N02820K82543J482032K530909K180090J015586
$$ 41216968 41676237 43000273 43503093 43785636 45267668 47798577 49978667 50994253
40749E0994253N1420m04748l23535Q3439O9400o01759q67052j25508K95118n42245
$$ 50994253 51045673 50640925 50317390 50400829 50470229 49868470 49001418 48875910 49171028 48628783
40739D8628783q23258J190776L307745K125821j166900k063082K28346J716656
$$ 48628783 47805525 48996301 52304046 54429867 53262967 51199885 51428231 53144887
40731E3144887L98901p61186N60594K031081R80431j073072j370059l54470l8779
$$ 53144887 53543788 52782602 53343196 55374277 56354708 55281636 53911577 53557107 53518328
40722E3518328m47511o92637j338158k744986l133572j256080Q70530Q09846m98465
$$ 53518328 53070817 52378180 51040022 48295036 45161464 43905384 44775914 45585760 45087295
40713D5087295p21970j57283n88267j610914j458822m68479m58473j335551j359652
$$ 45087295 44365325 44208042 43619775 42008861 40550039 40081560 39623087 38287536 36927884
40704C6927884k91846N29470P74957J108999J121075J708j165043n75044J096373
$$ 36927884 36636038 37165508 37940465 39049464 40170539 40172247 39007204 38432160 39528533
40695C9528533J424096N1065r54622o34329l08006p90790r44259K15448J897055
$$ 39528533 40952629 41003694 40049072 39414743 39106737 38315947 37371688 37587136 39484191
40686C9484191K754971K340642J031126k57826l80351P15422J320480M4952j971688
$$ 39484191 42239162 44579804 45610930 45353104 44972753 45688175 47008655 47053607 45081919
40677D5081919k524754j375729n4711O44256R84416Q14009m2759n33142K56679
$$ 45081919 42557165 41181436 41126725 41770981 42755397 43569406 43526647 42993505 43250184
40668D3250184J163332P47482J54121J289547K907995K026107r41424k256112
$$ 43250184 44413516 45160998 45315119 46604666 49512661 51538768 50597344 48341232
40660D8341232n71568J188356P65450k50110J10677Q45603M12648j56961P84478
$$ 48341232 47769664 48958020 49723470 49473360 49584037 50429640 50842288 50685327 51469805
40651E1469805K328916K407288J139155M55048J097955J951431J967239J279055
$$ 51469805 53798721 56206009 57345164 57800212 58898167 60849598 62816837 64095892
40643F4095892O42334P42778J694058K607496K318020J050140M58341J427055
$$ 64095892 64738226 65481004 67175062 69782558 72100578 73150718 73609059 75036114
40635G5036114K843959L276968K895938K898106L794511N030947N757904N478370
$$ 75036114 77880073 81157041 84052979 86951085 90745596 95776543 101534447 107012817
40627A07012817M423104L467334L121608K790354J857677J003731J074424J175246
$$ 107012817 111435921 114903255 118024863 120815217 122672894 123676625 124751049 125926295
40619A25926295j33447j955122j793113M83911J964390R04451q03940p34280O95429
$$ 125926295 125792848 123837726 122044613 122528524 124492914 125397365 124593425 123859145 124554574
40610A24554574J654181J829179J939868J781337Q73929R7716O53988J989084
$$ 124554574 126208755 128037934 129977802 131759139 132633068 132730784 133384772 135373856
40602A35373856K573008K357113K728340M094994N057154M324315K509915J624921
$$ 135373856 137946864 140303977 143032317 147127311 152184465 156508780 159018695 160643616
40594A60643616L074456O118917Q296020P862022N842239M843607N797082P144532
$$ 160643616 163718072 169836989 178133009 185995031 191837270 196680877 202477959 209622491
40586B09622491P568861P827401Q821136R440610Q141523N766847M724252N395290
$$ 209622491 217191352 225018753 233839889 243280499 251422022 257188869 261913121 267308411
40578B67308411N224919K102649k586803n439535n151111l973828m683241p089619
$$ 267308411 272533330 274635979 272049176 266609641 261458530 257484702 252801461 245711842
40570B45711842q738417q563255p947227p794058o842898m421642k765014m021715
$$ 245711842 236973425 228410170 220462943 212668885 205825987 201404345 198639331 194617616
40562A94617616o395692o430293m370757l661017n137235n712458l894116k670920
$$ 194617616 188221924 181791631 177420874 173759857 168622622 162910164 159016048 156345128
40554A56345128m629144p380118o938103l642017j511803k612066m829721n159517
$$ 156345128 151715984 144335866 137397763 133755746 132243943 129631877 124802156 119642639
40546A19642639l216835j208193j365231l395979m386309k175216J219142J468461
$$ 119642639 116425804 115217611 113852380 110456401 106070092 103894876 105114018 106582479
40538A06582479k278872n945804o105407m345411l929560m587798l762860j471313
$$ 106582479 104303607 98357803 92252396 87906985 83977425 79389627 75626767 74155454
40530G4155454l82338j475417k763614k569843j498534p04434m00003o68370j846696
$$ 74155454 73773116 72297699 69534085 66964242 65465708 64761274 64361271 63692901 61846205
40521F1846205l327829l509576j816992K49470P79308n39670k472307l588798
$$ 61846205 58518376 55008800 53191808 53441278 54220586 53680916 51208609 47619811
40513D7619811l180803j460019N71604J615688R27766r61642k395952k037238
$$ 47619811 44439008 42978989 43550593 45166281 46094047 45132405 42736453 40699215
40505D0699215n47322j00533j451935k474937j092037J288629J553802l77616
$$ 40699215 40151893 40051360 38599425 36124488 35032451 36321080 37874882 37497266
40497C7497266j459392l69569O68899j40937j463809j630015j266385j214761
$$ 37497266 36037874 35668305 36337204 36196267 34732458 33102443 31836058 30621297
40489C0621297n25895J182833J843920L7193k124529j919329k2343J058518Q08141
$$ 30621297 30095402 31278235 33122155 33159348 31034819 29115490 29093147 30151665 30959806
40480C0959806K78956m18584j375760j331555J90675R06997q86418k730840j368436
$$ 30959806 31238762 30820178 29444418 28112863 28303538 29210535 28324117 25593277 24224841
40471B4224841J818768K723981Q09587o59322o8514R70705J245833J180898N48059
$$ 24224841 26043609 28767590 29577177 28917855 28849341 29820046 31065879 32246777 32794836
40462C2794836j195253k362699p80180J945356K028721m88681j723692l65848
$$ 32794836 31599583 29236884 28456704 30402060 32430781 31942100 30218408 29852560
40454B9852560N69728o04588j561259n65570O27416N06241M12229J262909J462257
$$ 29852560 30422288 29817700 28256441 27690871 28318287 28824528 29236757 30499666 31961923
40445C1961923L21355j17201R99893J303972l39506j104521R99330L137109K006741
$$ 31961923 32283278 32166077 33165970 34469942 34130436 33025915 34025245 37162354 39169095
40436C9169095q38840j790869p59344r0159j4429Q67304K046677J800434M66379
$$ 39169095 38330255 36539386 35780042 35689883 35675454 36542758 38589435 40389869 40856248
40427D0856248j73906O4948R7836o6071J98850M34043J50917J36771N98692N8467
$$ 40856248 40682342 40747290 40845126 40779055 40977905 41411948 41562865 41699636 42298328 42356795
40417D2356795j545625j361700J632054L370987M09796l807967l586045J32383
$$ 42356795 40811170 39449470 41081524 44452511 44862307 41054340 37468295 37600678
40409C7600678J504707o18739j464612Q97834K218611m58348l736903l376366
$$ 37600678 39105385 38486646 37022034 37919868 40138479 39680131 35943228 32566862
40401C2566862m35863J342468Q93650m05835j475433j372618R06533L943735L954240
$$ 32566862 32130999 33473467 34367117 33961282 32485849 31113231 32019764 35963499 39917739
40392C9917739M6363l262509j910657J750755K483498j99530j972310m27459K122360
$$ 39917739 39964102 36701593 34790936 36541691 39025189 38825659 36853349 36425890 38548250
40383C8548250K780676J619164K03225q64002j693519k034719j553185l99196
$$ 38548250 41328926 42948090 43151315 42287313 40593794 38559075 37005890 36606694
40375C6606694R39885J775017J360600k20888j541374j201252M03795J580192
$$ 36606694 37546579 39321596 40682196 40461308 38919934 37718682 38122477 39702669
40367C9702669J382150L06182o91629r05491j2270J417485J908047P37916p45165
$$ 39702669 41084819 41391001 40699372 39793881 39781611 41199096 43107143 43845059 43099894
40358D3099894p39270M38160R22055K68005R819R08989J502769L86840j460223
$$ 43099894 42360624 42798784 43720839 43988844 43998663 44907652 46410421 46797261 45337038
40349D5337038j953591o81508Q81570J525218J447199J264349R31831R5329r88418
$$ 45337038 43383447 42701939 43583509 45108727 46555926 47820275 48752106 48847435 47859017
40340D7859017j400127m94742J211575K258168J599922j97652j403570r22500
$$ 47859017 46458890 45964148 47175723 49433891 51033813 50836161 49432591 48510091
40332D8510091N88585J582830J326231M45118p800L72184J148867J539119J026582
$$ 48510091 49098676 50681506 52007737 52452855 52445055 52817239 53966106 55505225 56531807
40323E6531807k02746j290120j377469l73358J100236K482821L591296M069968
$$ 56531807 56329061 55038941 53661472 53288114 54388350 56871171 60462467 64532435
40315F4532435L196380Q71887j560771k327741j074563R32783K392581K947526
$$ 64532435 67728815 68600702 67039931 64712190 63637627 64570410 66962991 69910517
40307F9910517K618464J453844K01587J61850J525592K820824K959723K800088
$$ 69910517 72528981 73982825 74184412 74346262 75871854 78692678 81652401 84452489
40299H4452489L391965L782486K558890R26492J682474M839877O818173N140259
$$ 84452489 87844454 91626940 94185830 95112322 96794796 101634673 108452846 113593105
40291A13593105J877299Q04368K641123M936147N670062N113334M615926N177721
$$ 113593105 115470404 116274772 118915895 123852042 129522104 134635438 139251364 144429085
40283A44429085O953223Q867875R110955P291319N593404O330917Q852069J0555006
$$ 144429085 151382308 160250183 169361138 176652457 182245861 188576778 197428847 207983853
40275B07983853J0534889J0186063J0331246J0099748R037420P939729O731050
$$ 207983853 218518742 228704805 239036051 249135799 258173219 266112948 272843998
40268B72843998L899756n28782l657057l414865j965946l040922o867928j0200174
$$ 272843998 276743754 276214972 272557915 269143050 267177104 264136182 257268254 247068080
40260B47068080j0940889j0332414j0378900j1159829j1354487j0107542p892622
$$ 247068080 236127191 225794777 215415877 204256048 192901561 182794019 174901397
40253A74901397o337741p012824r339843j0253180p573788l341585j753200l810351
$$ 174901397 168563656 161550832 152210989 141957809 134384021 131042436 129289236 125478885
40245A25478885o275738o304282m676108l527756l268347l259332l573973m264639
$$ 125478885 119203147 112898865 108222757 104695001 101426654 98167322 94593349 90328710
40237I0328710m352906l283906k167725k043329k228829j947440k035676l117987
$$ 90328710 85975804 82691898 80524173 78480844 76252015 74304575 72268899 69150912
40229F9150912l673843k333014p37022j290726l055300l040286j076238K708q64051
$$ 69150912 65477069 63144055 62407033 61116307 58061007 55020721 53944483 53947191 53083140
40220E3083140j469292m24848M62806o78177k865388m010424l521675j901892
$$ 53083140 51613848 51189000 51651806 50973629 48108241 44097817 40576142 38674250
40212C8674250J99116J361982O8174k625140l339802r02305J626306J229094j066750
$$ 38674250 38873366 40235348 40303522 37678382 34338580 33436275 35062581 36291675 35224925
40203C5224925k567859k904589k969660k073609M87367K584383J639592r88399
$$ 35224925 32657066 29752477 26782817 24709208 25196575 27780958 29420550 28432151
40195B8432151j608635K16988J311866J39849j252313j177647o74759p44468m35832
$$ 28432151 26823516 27040504 28352370 28492219 27239906 26062259 25387500 24643032 24207200
40186B4207200O62212Q54693p00921j839125n08466J771700K034693J88035j255333
$$ 24207200 24869412 25724105 25023184 23184059 22675593 24447293 26481986 26670021 25414688
40177B5414688j057980m87534p70297j386571j352384p55124l91235o86778j397354
$$ 25414688 24356708 23869174 23098877 21712306 20359922 19604798 19213563 18526785 17129431
40168A7129431j890603j546173k99989J062430J467954O00832o73861j050053
$$ 17129431 15238828 13692655 13392666 14455096 15923050 16523882 15850021 14799968
40160A4799968j39690Q72130L79624j514886k646540j319343J329840K580886
$$ 14799968 14660278 15532408 15912032 14397146 11750606 10431263 11761103 14341989
40152A4341989J461749l90392j117950n76248K98704P91531O58342L7753n53736
$$ 14341989 15803738 15413346 14295396 13719148 14017852 14809383 15467725 15505478 14951742
40143A4951742q35093j267400k099510k405838j422395k53848l55412q04577M07711
$$ 14951742 14116649 12849249 10749739 8343901 6921506 6667658 6312246 5507669 5915380
40134E915380K495011K390716k25834j756234m9139K192755J572087j130843k824528
$$ 5915380 8410391 10801107 10575273 8819039 8769900 10962655 12534742 11403899 8579371
40125H579371k564349j391361K37287J876002J784776n58313k221281n73440K122836
$$ 8579371 6015022 4623661 4860948 6736950 8521726 7963413 5742132 5168692 7291528
40116G291528J740167j179937k267838k31424J705872J515502P89886N06182q89152
$$ 7291528 9031695 7851758 5583920 5352496 7058368 8573870 9363756 9869938 8980786
40107H980786l346287l619627m14208K697196K448005N93200K82992R32528M46561
$$ 8980786 5634499 2014872 1600664 4297860 6745865 7339065 7622057 8554585 9001146
40098I001146k42817P47294J687248m09562l923830m090819l33017K574443J570698
$$ 9001146 8758329 9505623 11192871 10783309 6859479 2768660 2435643 5010086 6580784
40089F580784p23387p73442P88675J220152J30238p14909m51340K47889O53226
$$ 6580784 5857397 5083955 5872630 7092782 7223020 6508111 6056771 6304660 6957886
40080F957886M66441l72105j170517p13892R32395J914050J001264n85241r82877
$$ 6957886 7424327 7052222 5881705 5167813 6100208 8014258 9015522 8430281 7447404
40071G447404k28126M17544O66655J037345J201950M08525o62989l40157J431468
$$ 7447404 7219278 7636822 8303477 9340822 10542772 10951297 10288308 9948151 11379619
40062A1379619K497501J238393j187680k239953j069633O51740Q98869l64759
$$ 11379619 13877120 15115513 13927833 11687880 10618247 11269987 12168856 11804097
40054A1804097j385866r43447J79694M44027l10264r17514q11828n77796m01361
$$ 11804097 10418231 9474784 9654478 10098505 9788241 8870727 8058899 7481103 7079742
40045G079742M75107J986622K449757Q81205j049896j071081M41603J090109m6065
$$ 7079742 7554849 9541471 11991228 12872433 11822537 10751456 11193059 12283168 12237103
40036A2237103j440354j659861j009732k54169N83389J408956J458771M33213
$$ 12237103 10796749 9136888 8127156 7872987 8456376 9865332 11324103 11757316
40028A1757316p70249j254760j223095j209261j037504k70865R44536K052563
$$ 11757316 10987067 9732307 8509212 7299951 6262447 5991582 6936118 8988681
40020H988681K500483J673191o11451l007483l180042m64723K773003L548609
$$ 8988681 11489164 13162355 12550904 9543421 6363379 5898656 8671659 12220268
40012A2220268J636711m05026l70217J252739K101596O66649j886609k728907
$$ 12220268 13856979 13451953 13081736 14334475 16436071 17102720 15216111 12487204
40004A2487204n32687K701769L812594K176687p116r64223j116625j324024j354908
$$ 12487204 11954517 14656286 18468880 20645567 20638451 19674228 18557603 17233579 15878671
39995A5878671r87457q34430j013107o94458K0725k20842j277004q68030J561333
$$ 15878671 14891214 14056784 13043677 12349219 12369944 12149102 10872098 10004068 11565401
39986A1565401L023158J570288Q695J570105M233354L742254O62262o16150P74979
$$ 11565401 14588559 16158847 16167542 17737647 21971001 25713255 26375517 25759367 26534346
39977B6534346J244896n24631j438621J6494R22849n76641j742801k78611J322217
$$ 26534346 27779242 27254611 25815990 25832484 26755333 26178692 24435891 24157280 25479497
39968B5479497J34553k008187j725883K54840Q04071l18626r28569o49117q40192
$$ 25479497 25614050 23605863 21879980 22134820 22938891 22620265 21691696 21042579 20202387
39959B0202387j443646j432495j354764k082345k202116j64450K119582J627012
$$ 20202387 18758741 17326246 15971482 13889137 11687021 11522571 13642153 15269165
39951A5269165p55725j574129m96620l44006j643157j738463J01829J147298K5835
$$ 15269165 14513440 12939311 12442691 12098685 10455528 8717065 8818894 9966192 9992027
39942I992027r40511O3175J296392O17624j144013j928364j314378q7294J045118
$$ 9992027 9051516 9114691 10411083 11028707 9884694 7956330 6641952 6554658 7599776
39933G599776J166655k88029j782764q55700K055577L507129J745065j109888
$$ 7599776 8766431 8478402 6695638 5839938 7895515 11402644 13147709 12037821
39925A2037821k537244k445485j484731L30256J919215J252506j175577k135895
$$ 12037821 9500577 7055092 5570361 5900617 7819832 9072338 7896761 5760866
39917E760866n88153O25979j37727n25706R81942J684081l40875j903547J01705
$$ 5760866 5172713 5798692 5660965 5135259 6117201 7801282 7460407 5556860 5658565
39908E658565K699573J391426k029323k236279P58189J881560l39911j783798
$$ 5658565 8358138 9749564 7720241 5483962 6242151 8123711 7783800 6000002
39900F000002j55600J508923O07333q10428j02940J653880K076791J171170K32676
$$ 6000002 5844402 7353325 7960658 7150230 7047290 8701170 10777961 11949131 12181807
39891A2181807m92681j018569o71514L04838K68324j107410j702086j45370J822814
$$ 12181807 11689126 10670557 9999043 10303881 10572205 9464795 7762709 7617339 9440153
39882I440153J886435L47838q35108p45412J98232J321830J841435J158566o1587
$$ 9440153 11326588 11674426 10839318 10093906 10292138 11613968 13455403 14613969 14552382
39873A4552382m08853Q9670j2879q90901r66756R6126M49082o40280j171454J44987
$$ 14552382 14143529 14233199 14220320 13329419 12362663 12458789 12907871 12267591 11096137 11241124
39863A1241124J378859N84880p71344l06400J217974J358318K09888k6874R69226
$$ 11241124 12619983 13204863 12433519 12127119 13345093 14703411 14913299 14886425 15855651
39854A5855651J211668p2460j270651j134918l92194j7735J79586N35360O09656
$$ 15855651 17067319 16994859 15724208 14589290 14197096 14179361 14358947 14894307 15503963
39845A5503963L4229p54667j125613q36502J03105J325813J909121J239117N4112
$$ 15503963 15538192 14783525 13657912 12821410 12924515 14250328 16159449 17398566 17452678
39836A7452678l28986K07399N93049L64586L02251R62815J591006J131750k22713
$$ 17452678 17123692 17331091 17924140 18288726 18590977 19553792 21144798 22276548 22053835
39827B2053835j140737p30539L74771P59550J7710o71796j95177Q09424R06618
$$ 22053835 20913098 20182559 20557330 21316880 21334590 20662794 20467617 21277041 22183659
39818B2183659J72759Q5288J004063J483761P14628r5864J45700N29375j48936
$$ 22183659 22356418 22441706 23445769 24929530 25644158 25548294 25693994 26223369 26074433
39809B6074433j160683j074507j80273J70793q8429O8529P17347R78741P73091
$$ 26074433 24913750 23839243 23658970 23829763 23741334 23809863 24527210 25505951 26279042
39800B6279042Q04857R69164N45323p2802L29176J580786K017889J003585j78939
$$ 26279042 27083899 28053063 28598386 28525584 28854760 30435546 32453435 33457020 33278081
39791C3278081o31661j323057l069025m388763l115112L06457K820688K442796
$$ 33278081 32646420 31323363 28254338 23865575 20750463 21056920 23877608 26320404
39783B6320404O45144P1465P09354J31875k234738l302070n80630L344926L594106
$$ 26320404 26965548 27037013 27746367 27878242 25643504 22341434 21760804 25105730 28699836
39774B8699836j31557k883175j464019J412597J881779N66250L64602J094213
$$ 28699836 28568279 25685104 24221085 25633682 27515461 28081711 28446313 29540526
39766B9540526K92283j868818k509420p51089J045908J115298K54467n43670j451416
$$ 29540526 29832809 27963991 25454571 24703482 25749390 26864688 27119155 26575485 25124069
39757B5124069k042982j058182R51379J400457m77669j936098n85798K035131
$$ 25124069 23081087 22022905 22974284 24374741 23897072 21960974 21375176 23410307
39749B3410307K696049P98934j446933k139024j178475O55278K421030L020327
$$ 23410307 26106356 26905290 25458357 23319333 22140858 22796136 25217166 28237493
39741B8237493J883750r7360j086400j13600J732692K140404O6006k508953k339719
$$ 28237493 30121243 30023883 28937483 28823883 30556575 32696979 32762985 30254032 27914313
39732B7914313Q44775L233475J656879j844168k625748J06613K499068J815283
$$ 27914313 28759088 31992563 33649442 31805274 29179526 29286139 31785207 33600490
39724C3600490k09916p87651O8274P90956J074718J440887J540517P64029l78684
$$ 33600490 33390574 32602923 32671197 33462153 34536871 35977758 37518275 38282304 37903620
39715C7903620q30856k36611J064215K298797K231454L66188j587623j388268
$$ 37903620 37072764 36836153 37900368 40199165 42430619 42796807 41209184 39820916
39707C9820916L18555O88954p27174j149742N48276J585284J4112j604813l17026
$$ 39820916 40139471 40828425 40101251 38951509 39499785 41085069 41099181 39494368 39177342
39698C9177342K165928K138181l32896k129281k255401k370335k800485j934955
$$ 39177342 41343270 43481451 43148555 41019274 38763873 36393538 33593053 31658098
39690C1658098K19739J347320M29562p23311m29912N98944Q37329M6079r85224
$$ 31658098 31877837 33225157 33654719 32931408 32501496 33100440 33937769 33983848 32998624
39681C2998624j530626j254799l72312L51356L91512l8721p09844j629983k071183
$$ 32998624 31467998 30213199 29840887 30192243 30583755 30545034 29835190 28205207 26134024
39672B6134024j002316O41412L96158j614111j868740R51945K850649N71162k427327
$$ 26134024 25131708 25773120 26169278 24555167 22686427 23638372 26489021 27060183 24632856
39663B4632856j068486K716150K698856j427669l465400q04692J873538R50059
$$ 24632856 23564370 26280520 28979376 27551707 24086307 23281615 25155153 26105212
39655B6105212o52102L78886J882332Q11714r76247l12123J488924J326969O2205
$$ 26105212 25453110 25831996 27714328 28526042 27549795 27237672 28726596 30053565 30115770
39646C0115770O02766K228810J765027p29641k086236j314574n62667r54901j324633
$$ 30115770 30718536 32947346 34712373 33982732 31896496 30581922 30019255 29064354 27739721
39637B7739721j187977j407084j608662l26877J782393K094228J55354j308691
$$ 27739721 26551744 25144660 23535998 23209121 24991514 27085742 27241096 25932405
39629B5932405n50587P46332M50952r34962j666390j367762p93111m02257m29563
$$ 25932405 25381818 26128150 26579102 25644140 23977750 22609988 21816877 21414620 20985057
39620B0985057j138746j923913j383362N66404J805280N96031j786875k512027
$$ 20985057 19846311 17922398 16539036 17105440 18910720 19506751 17719876 15207849
39612A5207849q92131Q57761P11139o59790j259237p73058p77767j898801k374841
$$ 15207849 14315718 15173479 15884618 15224828 13965591 13192533 12414766 10515965 8141124
39603H141124o37924J828992K188007L94500p19135J50813Q82657l37647j855878
$$ 8141124 7503200 9332192 11520199 11914699 11195564 11346377 12229034 11891387 10035509
39594A0035509j221586Q57646J790054J106261N10132O21667L83626m43148p42156
$$ 10035509 8813923 9671569 11461623 12567884 13078016 13699683 14083309 13640161 12898005
39585A2898005k64061j90183j032939j820201j760681j071200M3210J460151K038835
$$ 12898005 12633944 12443761 11410822 9590621 7829940 6758740 6801950 8262101 10300936
39576A0300936N16389k004972k609398n46136J332766M95991j573748j485489
$$ 10300936 10817325 8812353 6202955 5656819 6989585 7485576 5911828 4426339
39568D426339J202227L301282K241021o68096k102336r95057M18786m788j319378
$$ 4426339 5628566 8929848 11170869 10502773 8400437 7405380 7824166 7819378 6500000
39559F500000j219025J61008M57699q49116j266254O65450K671886K051320l53013
$$ 6500000 5280975 5441983 5899682 5050566 3784312 4449762 7121648 9172968 8819955
39550H819955j763216j355924j87693J084768J847241O90407k088882l026183
$$ 8819955 7056739 5700815 5513122 6597890 8445131 9135538 7046656 4020473
39542D020473j01012L057117J936952j530183j771419J305668K340669j36446
$$ 4020473 3919461 6976578 8913530 7383347 5611928 6917596 9258265 9121819
39534I121819j364144Q73438K107567p81736l725101k308460Q77699J164136k94905
$$ 9121819 7757675 8631113 10738680 9956944 6231843 3923383 4801082 5965218 5670313
39525E670313M05807K243497J154116k319225l556098j257878J277166J948121
$$ 5670313 6076120 8319617 9473733 7154508 3598410 2340532 3617698 5565819
39517E565819J809329J390125M619j132602J23281K408842K038814q75651k244583
$$ 5565819 7375148 8765273 8769892 7637290 7760571 10169413 12208227 11332576 9087993
39508I087993p13593M09296o90231j330336K67705J408391q6170j517943J22706
$$ 9087993 8374400 8783696 8093465 6763129 7030834 8439225 8353055 6835112 6957818
39499F957818K531584J515379k053319l310500o13004K527900K906384J420159
$$ 6957818 9489402 11004781 8951462 5640962 5027958 7555858 10462242 11882401
39491A1882401M35723K17635l09038r88440o54693N40263P64194r32276k779058
$$ 11882401 12318124 12535759 12226721 11238281 10583588 11123851 11888045 10955769 8176711
39482H176711k307238J04104J410421J45066j423426p71223J092324J609170R48313
$$ 8176711 5869473 5973577 7383998 7529064 6105638 5334415 6426739 8035909 8984222
39473H984222J160081J858204N46906k442951l286395m19562K479946J583959
$$ 8984222 10144303 12002507 12549413 10106462 6820067 6400505 8880451 10464410
39465A0464410j659366k911523r69378J389626J673969L22974p07756k58458J179039
$$ 10464410 8805044 5893521 4924143 6313769 7987738 8310712 7602956 7344498 8523537
39456H523537J996432J124931m55236p62484K59093L45911j730327m032926l992117
$$ 8523537 10519969 11644900 11189664 10427180 10686273 11032184 9301857 5268931 1276814
39447A276814j732525N67903J546225J409514O95735k30101q80010r16609m48619
$$ 1276814 -455711 112192 1658417 3067931 3763666 3533565 2653555 1736946 1288327
39438A288327L59514J287687J558123N62465p46636p69121K49427O02081J99517
$$ 1288327 1647841 2935528 4493651 5056116 4309480 3540359 3789786 4391867 4591384
39429D591384O57957J735815R34241j919912l149297o44287K406730K243563Q5053
$$ 4591384 5249341 6985156 7919397 5999485 2850188 2205901 4612631 6856194 6941247
39420F941247o89331l30009j267302k692993j590001J483078K578951O53560q53440
$$ 6941247 6251916 5921907 4654605 1961612 371611 1854689 4433640 5087200 4233760
39411D233760L01184J982496J687795K46650l54371o5909J78085L07412L45861
$$ 4233760 4534944 6517440 8205235 8451885 8097514 8031605 8209690 8517102 8862963
39402H862963l41607j587884j880880n42824J087437J706232J718759J882452
$$ 8862963 8521356 6933472 5052592 4509768 5597205 7303437 9022196 10904648
39394A0904648J872022J251548M69731j9177l06279j03329J143297K635797K567968
$$ 10904648 12776670 14028218 14497949 14478772 14172493 14069164 15212461 17848258 20416226
39385B0416226Q38214n04443l51388O4380j22887K19739J487516J441499j435428
$$ 20416226 21254440 20749997 20398609 20462989 20340102 20559841 22047357 23488856 22053428
39376B2053428m497233l833917K32433L373395K818339K25155j311869r97591
$$ 22053428 17556195 13722278 13954711 17328106 20146445 20371600 19059731 18062140
39368A8062140k59970l76684j188630j608150q28182P72336J817449J247682n92870
$$ 18062140 17802170 17425486 16236856 14628706 13800524 14572860 16390309 17637991 17045121
39359A7045121k313041k722439j699754k46482K80419m45032j091473j94907J689313
$$ 17045121 14732080 12009641 10309887 10063405 10343824 9898792 8807319 8612412 10301725
39350A0301725K430029J134433p11662j406534j066194p29724o43564n18296n71072
$$ 10301725 12731754 13866187 13154525 11747991 10681797 9952073 9308509 8790213 8219141
39341H219141j101417j574649j192576p7050Q72779J000244K81301p91227j289297
$$ 8219141 7117724 5543075 4350499 4273449 5146228 6146472 6427773 5636546 4347249
39332D347249n35927P80369J013373k67511j379342o34049J399886K653959K020471
$$ 4347249 3811322 4591691 5605064 5337553 3958211 3324162 4724048 7378007 9398478
39323I398478K37865j210994j381510m76703K95185o8620j036490j186992l51326
$$ 9398478 9636343 8425349 7043839 6567136 6862321 6793701 5757211 4570219 4218893
39314D218893J02992m61563r25822m64233K1204k23320j18970J270610K437581
$$ 4218893 4321885 3860322 2934500 2470267 2491471 2268151 2149181 3419791 5857372
39305E857372J358803j068645j924552l73226J418672J638083R10720M55178J66167
$$ 5857372 7216175 6147530 4222978 3849752 5268424 6906507 7817227 8272405 8438572
39296H438572l90075o08348J75754J247619J314676K95927o90637q69782m73791
$$ 8438572 8048497 7440149 7615903 8863522 10178198 10474125 9783488 8913706 8439915
39287H439915K5052N11303Q75193P48002N6302n50364m27133O8504M5386l80678
$$ 8439915 8464967 8976270 9851463 10599465 10655767 10105403 9678270 9746774 9792160 9411482
39277I411482J4519J579316K701593J801627l18438j526216j280571q08902n78434
$$ 9411482 9426001 11005317 13706910 15508537 15190099 13663883 12383312 11574410 10995976
39268A0995976L29460J917759K467994J094746o15311q23876P7035N58034L26309
$$ 10995976 11325436 13243195 15711189 16805935 16190624 15366748 15443783 16001817 16328126
39259A6328126J34430J50645p621k69238l96164o37533r88207n91252Q80691K039983
$$ 16328126 16462556 16613201 16605580 16336342 15940178 15302645 14314438 13723186 14603877 16643860
39249A6643860J402478l73623j261067m97850P88139J256485N44870q94809k151114
$$ 16643860 18046338 17672715 16411648 15913798 16701937 17958422 18503292 17608483 15457369
39240A5457369k338504j509863o99428n65649p52006r96248j584743k051195j114324
$$ 15457369 13118865 11609002 10909574 10343925 9591919 8595671 7010928 4959733 3845409
39231C845409R80068J921516P14452l41176Q28545K422485J426119j435418k600124
$$ 3845409 4825477 6746993 7461445 7120269 7948814 10371299 11797418 10362000 7761876
39222G761876q97383J226049J567924M40071r73875j928813j674865j29701R83725
$$ 7761876 6864493 8090542 9658466 10098537 9124662 7195849 5520984 5391283 6375008
39213F375008N4177j555875j209742P09607J327669Q3604n59852K80177M38302
$$ 6375008 6429185 4873310 3663568 4373175 5700844 5784448 5224596 5504773 5943075
39204E943075r23643j305204P21022K520028J468024q10824j244237j05809J46817
$$ 5943075 5019432 3714228 4435250 6955278 8423302 7612478 6368241 6262432 6409249
39195F409249p78527j007221N0553J103944J383815J231585O29581o88715j888106
$$ 6409249 5630722 4623501 4674054 5777998 7161813 8393398 9022979 8334264 6446158
39186F446158j747915n98179J61853K64027N95318J182906R34245l97249j497865
$$ 6446158 4698243 4100064 4261917 4525944 5121262 6304168 7238413 6841164 5343299
39177E343299j210705O3522J072735J104622L93587l81269p59064p27716k86856
$$ 5343299 4132594 4196116 5268851 6373473 6767060 6385791 5626727 4899011 4612155
39168D612155Q60013K557930L537188K680435Q12036k25434k29895n59227j321670
$$ 4612155 5472168 8030098 11567286 14247721 15059757 14834323 14604428 14045201 12723531
39159A2723531j021023M24939J018474J64590q5891J025663R64572j534534l053760
$$ 12723531 11702508 12127447 13145921 13310511 13224620 14250283 15214855 13680321 10626561
39150A0626561m51192L243501K633740j720209l964263j728029J041699R95860
$$ 10626561 10175369 13418870 16052610 14332401 10368138 8640109 9681808 10677668
39142A0677668L0132P59641J718317M17637j838406j856808M12853J992822J191368
$$ 10677668 10707800 11467441 13185758 13603395 11764989 9908181 10321034 12313856 13505224
39133A3505224p46786j772460q75341J555060L557065K698416r03834l684440
$$ 13505224 12758438 10985978 10110637 11665697 15222762 17921178 17017344 13332904
39125A3332904k740389J31724Q40450j267174k777573j249243J773892L308975
$$ 13332904 10592515 10724239 11564689 10297515 7519942 6270699 8044591 11353566
39117A1353566K241652n69515l397189m081827j493026K331392L484518R78262
$$ 11353566 13595218 13025703 9628514 5546687 4053661 6385053 9869571 10847833
39109A0847833j659830j182529R48195J176511p90962k216712j976148j589740
$$ 10847833 9188003 8005474 8953669 10130180 9339218 7122506 5146358 3556618
39101C556618j630418n57795J855602L000735J132961j706443k482540j124617
$$ 3556618 1926200 1368405 3224007 6224742 7357703 5651260 3168720 2044103
39093B044103L00779Q17840P71274J34115j034033j385819K2824J559519J056108
$$ 2044103 2344882 3162722 3933996 4068111 3034078 1648259 1671083 3230602 4286710
39084D286710n50084m28826J499642K214136K96644k021450k435688j413687k61223
$$ 4286710 3736626 3307800 4807442 7021578 7318222 5296772 2861084 1447397 1186174
39075A186174R71782K062981J598554n98719k098962j090125P79133R95985Q96
$$ 1186174 2157956 4220937 5819491 5220772 3121810 2031685 2810818 3806803 3807699
39066C807699p4381Q03286P68698o18269j789446j698139q68893j06193J47185
$$ 3807699 3733318 4536604 5305302 4687033 2897587 1199448 330555 224362 371547
39057C71547l96535j127979m15148J945816L260993J326093j730326j989097M69977
$$ 371547 -24988 -1152967 -1568115 377701 3638694 4964787 3234461 1245364 1715341
39048A715341J753445J39199j813543j897765j291820j384567j017455P41536
$$ 1715341 3468786 3607985 1794442 -103323 -1395143 -2779710 -3797165 -3055629
39040c055629J937258P42167j006332m31347J702429K244114P70401k0478R28080
$$ -3055629 -1118371 -376204 -1382536 -1813883 -111454 2132660 2903061 2882583 3810663
39031C810663J251827p68746l120226k894405m54294J326357J114558L47300N06703
$$ 3810663 5062490 4293744 1173518 -1720887 -2175181 -848824 265734 613034 1119737
39022A119737J080506R81690N76877R01887J528663R43370p98390j569794k94080
$$ 1119737 2200243 3181933 3758810 4660697 6189360 7132730 6334340 4764546 4470466
39013D470466R95537k0597k117459j973754P00963K274454M36359k184993j724057
$$ 4470466 5466003 5445406 3327947 1354193 2055156 4329610 4765969 2580976 856919
39004H56919J296304K757466Q17386j776268j817293K02376J458156Q11143l78110
$$ 856919 2153223 4910689 5728075 3951807 2134514 2336890 3795046 4606189 4228079
38995D228079q64388j029993j435728j427222k61480J267828J670677R09614L28237
$$ 4228079 3363691 2333698 897970 -529252 -790732 477096 2147773 3057387 3385624
38986C385624L87228K8631j123325j561423k06029J395296J063436n85012r34051
$$ 3385624 3772852 3801483 2678158 1116735 910706 2306002 3369438 2784426 1850375
38977A850375N57679J496823L73804j078635p28881O12226O73962n78763j005866
$$ 1850375 2408054 3904877 4278681 3200046 2471165 3083391 3757353 3178590 2172724
38968B172724J99682J249708O23361n35305k19808J145319R78614j612923l798831
$$ 2172724 2372406 3622114 4245475 3710170 3490362 4635681 5614295 4001372 202541
38959B02541k259195K109565M630208K549678j461631k946572j375361K6872n19365
$$ 202541 -2056654 52911 4683119 7232797 5771166 2824594 1449233 1476105 956740
38950I56740j155808N7208J971141K268654Q51766m43141n64918j21533k3452
$$ 956740 -199068 -141860 1829281 4097935 4949701 4506560 3941642 3820109 3796657
38941C796657m59508r71428q40595J71440J089270O21263p66836r99519N59883
$$ 3796657 3337149 2365721 1525126 1696566 2785836 3407099 2640263 1640744 2200627
38932B200627J753449P30081j041253q83401R13604J449181m02726k303077j781496
$$ 2200627 3954076 4684157 3642904 2759503 3673107 5122288 4719562 2416485 634989
38923F34989N01466J873953J047157o23542j012019K33362J275089M03541j510854
$$ 634989 1136455 3010408 4057565 3434023 2422004 2655366 3930455 4333996 2823142
38914B823142j868161J12981K065111J616262m37798j530543q44783K83514P22883
$$ 2823142 954981 1067962 3133073 4749335 4311537 2780994 1936211 2219725 2942608
38905B942608M42829m51459j663375j970532m69402J574037K010260Q63486J47274
$$ 2942608 3385437 2933978 1270603 -699929 -1169331 404706 2414966 3278452 3425726
38896C425726O55701J089129O01509J2875j8490M1173J9180L68142N57649o15600
$$ 3425726 4081427 5170556 5772065 5784940 5766450 5807623 5826803 6194945 6752594 6136994
38886F136994k432335k436784k42683J382111O13247p71805n46171O57772J297899
$$ 6136994 3704659 1267875 1025192 2407303 3020550 2248745 1702574 2360346 3658245
38877C658245J758393K665116K564346L24460j930918j623428m5551k95934j970038
$$ 3658245 5416638 8081754 10646100 10970560 9039642 7416214 7370663 7074729 5104691
38868E104691j958268j11554L06827j595352k441099r7936K662503K405736M5678
$$ 5104691 3146423 3034869 3341696 1746344 -694755 -792691 1869812 4275548 4321226
38859D321226j104532k60267O05593K37727o50279r88661l74426R91936K008013
$$ 4321226 3216694 2956427 3562020 3799747 3149468 2160807 1786381 2778317 4786330
38850D786330J116822j526344l244063j838030J309483K837460J609419l82365
$$ 4786330 5903152 4376808 1132745 -705285 604198 3441658 5051077 4668712
38842D668712j009029j89285R27997J421874R56673j49466r27809o66642J35246
$$ 4668712 3659683 3470398 4398395 5820269 6776942 6627476 5699667 5033025 5168271
38833E168271M63304K08683r642j11504m78055q23052m68677K79050M19646K4309
$$ 5168271 5631575 5840258 5830616 5719112 5241057 4418005 3949328 4228378 4648024 4672333
38823D672333J79864Q33006M30894j405093k517144j072121J367446J610530p07818
$$ 4672333 4852197 5685203 6116097 4711004 2193860 1121739 2489185 4099715 3391897
38814C391897k457727j184069J765518L231337K136038J25715r36715o58883M56928
$$ 3391897 934170 -249899 1515619 4746956 6882994 7008709 6071994 5413111 5870039
38805E870039J735162K173906J001395q77298j238713N65075K158938J096792
$$ 5870039 7605201 9779107 10780502 9903204 8664491 9229566 11388504 12485296
38797A2485296j554518k553791j110203J53598o42603j842444j013611J252232
$$ 12485296 10930778 8376987 7266784 7420382 6777779 4935335 3921724 5173956
38789E173956K209938P10054j697339k942684k227866k2758K267895K860703J207982
$$ 5173956 7383894 8093948 6396609 3453925 1226059 1203301 3471196 6331899 7539881
38780G539881j023612j782023j192566r52800j468736j367891l6055J204659J163963
$$ 7539881 6516269 4734246 3541680 2588880 1120144 -247747 -283802 920857 2084820
38771B084820M92072L31771M63132l6078j038807j409577m79446J266498K697669
$$ 2084820 2576892 2908663 3371795 3335717 2296910 887333 407887 1674385 4372054
38762D372054K763021J189053r99096k113086j535056m33948k37526q37107r65107
$$ 4372054 7135075 8324128 7325032 5211946 3676890 3242942 3005416 2168309 1203202
38753A203202l8564J121059J401885O97596o0831L0999Q11327J139281K51609
$$ 1203202 1164638 2285697 3687582 4385178 4324347 4355346 5166673 6305954 6557563
38744F557563j084637j351805l10891N47372R5141o69124k0398J645691J826282
$$ 6557563 5472926 4121121 3810230 4357602 4452743 3783619 3763221 5408912 7235194
38735G235194o09142l156540k407852J265125L631221J952872j351917k171043
$$ 7235194 6626052 3469512 1061660 2326785 5958006 7910878 6558961 4387918
38727D387918m77182K01263j255844j786675L76822K117360L18692k426823j245800
$$ 4387918 3910736 4111999 2856155 1069480 1446302 3563662 3882354 1455531 209731
38718B09731L222887N226150K233159j778764k719498j743961j741044k143374
$$ 209731 3432618 8658768 10891927 9113163 6393665 4649704 2908660 765286
38710G65286p75842J528390K012853N37677m31313J28689Q34576Q13455P16102
$$ 765286 -10556 1517834 3530687 4068364 3637051 3765740 4600316 5413771 6129873
38701F129873O66190j33573j311923j310350j06362L47701p25573j533276o42945
$$ 6129873 6796063 6662490 5350567 4040217 3933855 4281556 3555983 2022707 1379762
38692A379762O82782N98831m97910r67938n12598L1293N38162J328342J665136
$$ 1379762 2062544 2661375 2163465 1195527 682929 714222 1252384 2580726 4245862
38683D245862N59190j076642j129214N45641J631910P83301l74167j4454Q12259
$$ 4245862 4805052 3728410 2599196 3144837 4776747 5560048 5185881 5171427 5983686
38674E983686l7243j985862k305377l78946J285532J016765L69229J016482J574635
$$ 5983686 5946443 3960581 1655204 1276258 2561790 3578555 3947784 4964266 6538901
38665F538901p750k429516k431927K75028K435501J870226K1834q52027o41688
$$ 6538901 6531151 4101635 1669708 1944736 4380237 6250463 6272297 5420270 4778582
38656D778582m17691m97596p73102j351198j676953n59116J734296K961934J813250
$$ 4778582 4360891 3863295 3090193 1738995 62042 -497074 1237222 4199156 6012406
38647F012406j52926q44337l90636m4696Q7209L72178J55284r49418j487278j58103
$$ 6012406 5859480 5015143 4624507 4579811 4667020 5039198 5194482 4245064 2757786 2599683
38637B599683J615764J526091j1878o51757L8390K90796m42794o22398M35713
$$ 2599683 4215447 5741538 5729660 5077903 5116293 5407089 4964295 4341897 4777610
38628D777610J331600J022008K53622k12652p02655j081884j88727J964254L176835
$$ 4777610 6109210 7131218 7384840 7172188 6469533 5387649 5198922 7163176 10340011
38619A0340011J698977j305014l160715k661882p48433Q72214R72909m42278j898766
$$ 10340011 12038988 10733974 7573259 4911377 4162944 5035158 6008067 5565789 3667023
38610C667023j749265k19039P80321L16293k89239M32596J883655K320176J194044
$$ 3667023 1917758 1698719 2479040 2795333 2506094 2938690 4822345 7142521 8336565
38601H336565m29740j328772j198676n31492M4949L58394O49674Q01213J61985
$$ 8336565 7906825 6578053 5379377 4847885 4892834 5251228 5900902 6702115 6864100
38592F864100j175330j682384l00635J542161J573451K6558p21413J26203P91585
$$ 6864100 5688770 4006386 3705751 5247912 6821363 6847921 6126508 6252711 7044296
38583G044296J53248n16188j15014L35517j52282n09083L41872J148043K55709
$$ 7044296 7197544 6681356 6566342 6901859 6749577 6240494 6582366 7730409 7986118
38574G986118j390034j522337q6666P75408j6835j288453j676712j104272N459
$$ 7986118 6596084 5073747 4987081 5762489 5745654 4457201 2780489 1676217 1681676
38565A681676J386961K370825J955154R4875j821839k282328j089432O04131J352489
$$ 1681676 3068637 5439462 7394616 7489491 5667652 3385324 2295892 2900023 4252512
38556D252512N81868r13432j719369j290714m37792j14821k12873j1988N72556
$$ 4252512 4834380 3920948 2201579 910865 473073 358252 145379 133391 705947
38547G05947Q06568J62121q13841q64364M80788J815097J151572j140290j973865
$$ 705947 1512515 1674636 860795 -3569 477219 2292316 3443888 2303598 329733
38538C29733M24991L344253K820919o48812k673605j257897R21906J339561R98136
$$ 329733 754724 4098977 6919896 6271084 3597479 2339582 3261488 4601049 5599185
38529E599185J206329O50187j491404k700175r93137R09969n26282l461285l074364
$$ 5599185 6805514 7455701 5964297 3264122 2270985 3180954 2654672 -806613 -3880977
38520c880977P86712L309884K163258L45190N17220J090860N9123j165581n85289
$$ -3880977 -3094265 215619 2378877 2724067 3241287 4332147 4391270 3225689 2640400
38511B640400N66110j07690k129794k991174j854751l4227J370219K216544K308929
$$ 2640400 3206510 3098820 969026 -2022148 -3876899 -3911126 -2540907 -324363 1984566
38502A984566J475892L43064k66575k69004J96222J240377K212731J576051p91872
$$ 1984566 3460458 3803522 3536947 3267943 3464165 4704542 6917273 8493324 7701452
38493G701452k551707j928767m62098n70306j591958j013998J073349J968344
$$ 7701452 5149745 3220978 2758880 2188574 596616 -417382 655967 2624311
38485B624311Q68321O5961P82690J054539n18848j840630o91518J206429O99984
$$ 2624311 3492632 3558593 4341283 5395822 4876974 3036344 2344826 3551255 4251239
38476D251239j559164j954316L08679J854746L92352j900576j954633k14443Q59197
$$ 4251239 2692075 737759 1046438 2901184 3293536 1392960 -561673 -776116 83081
38467H3081Q66994J265255J998255J301909r73429k437473j481705L89063P59205
$$ 83081 950075 2215330 4213585 5515494 4542065 2104592 622887 1011950 1771155
38458A771155n27019j710245j712910j028152m36984m2423M12470J043272J712436
$$ 1771155 1244136 -466109 -2179019 -3207171 -3644155 -3686578 -3274108 -2230836 -518400
38449e18400K001435J443451J79250q57329q55556k6561Q04656J204598J219271
$$ -518400 1483035 2926486 3105736 2248407 1392851 1366290 2170946 3375544 4594815
38440D594815P61591l25944j564556j919746r56144N04949J294338J211252R60957
$$ 4594815 5356406 5030462 3465906 1546160 590016 1094965 2389303 3600555 4561512
38431D561512R18032O59049k4403m26672j870M42136k12177j423636j544205m22207
$$ 4561512 5479544 6138593 6114190 5687518 5685648 6127784 5915607 4491971 2947766 2525559
38421B525559K99926j5452M6648J120837J436342q8314j311925j64468J392223
$$ 2525559 2825485 2810033 2856681 3977518 5413860 5325546 4013621 3849153 5241376
38412E241376K61964k222545j984559R41621K162275L02720n55857K006267M150940
$$ 5241376 5503340 3280795 1296236 2237857 4400132 4702852 4146995 6153262 10304202
38403A0304202J927570k049233k707471m31830L12731j368524j962395j06300
$$ 10304202 12231772 10182539 7475068 7043238 7355969 5987445 4025050 3918750
38395C918750J202734K2696j272091q1163K320099L003152J520318k47571r39981
$$ 3918750 5121484 5144180 3872089 3790926 6111025 9114177 10634495 10386924 9446943
38386I446943o81982j06204K64032J44994k60478n37920o92728q07505l04236
$$ 9446943 8764961 8658757 8922789 9067783 8807305 8269385 7576657 6769152 6464916
38377F464916J217633K503436J588961j401567l824608l506973j100071J079755
$$ 6464916 7682549 10185985 11774946 10373379 6548771 3041798 1941727 3021482
38369C021482J627914R43702K56953K51027M14047j75865j265725j387157o519
$$ 3021482 4649396 5593098 5850051 6101078 6515125 6339260 5073535 3686378 3679859
38360C679859J345678J210423L66868L40810Q14896M85827l50523l65234J70952
$$ 3679859 5025537 6235960 6602828 6943638 7758534 8244361 7893838 7528604 7699556
38351G699556k43449j523599j959312j025105P4421P28339J467187K112501J783846
$$ 7699556 7456107 5932508 3973196 2948091 3022512 3750851 5218038 7330539 9114385
38342I114385Q77414N80579L93234j093302k882779k302800M60497K026981R41187
$$ 9114385 9991799 10572378 10965612 9872310 6989531 4686731 5147228 7174209 8115396
38333H115396m25355l29648k40629j184188j365866J02164P98191o77054j488915
$$ 8115396 7690041 7360393 7119764 5935576 4569710 4671874 5470065 4793011 3304096
38324C304096O78223K887538J344023k056401k490024K02526J839745R22182P3808
$$ 3304096 3982319 6869857 8213880 6157479 3667455 3869981 5709726 6631908 6705716
38315F705716M72153M7559j738858k073703L53929K576487J747438o93959j581443
$$ 6705716 7177869 7225428 5486570 3412867 3766796 6343283 8090721 7396762 5815319
38306E815319l80122J201634K022488J846754M34013j726405k899670k001711
$$ 5815319 5435197 6636831 8659319 10506073 10940086 9213681 6314011 4312300
38298D312300j57375Q47889O91576Q2334n71671r35165m32839N96457O42603p26530
$$ 4312300 4154925 5002814 5694390 5776724 5205053 4269888 3837049 4433506 5076109 4349579
38288D349579j541578K3998K688238L419405J350232j246462j828217k44262J482367
$$ 4349579 2808001 2831999 5520237 8939642 10289874 9043412 7215195 6970933 8453300
38279H453300J254078j062266l222893k797245k18085J399006K50269j738574
$$ 8453300 9707378 8645112 5422219 2624974 2406889 3805895 4056164 2317590
38271B317590j873322o05667k55380q23117o8277K184852K981178P31674j849683
$$ 2317590 444268 -161399 -416779 -1239896 -1308173 876679 3857857 4589531 2739848
38262B739848j412596J175211K150336K41997j792475j199182J268363K699581
$$ 2739848 1327252 2502463 4652799 4894796 3102321 1903139 3171502 5871083
38254E871083J571370r93132k805326k675029j179933J81051O43269Q36442J431643
$$ 5871083 7442453 6449321 3643995 968966 -210967 -29916 613353 1449795 2881438
38245B881438J651202K95936j840280k224318J5115K396608K109962l17485k011134
$$ 2881438 4532640 4828576 2988296 763978 779093 3175701 5285663 4968178 2957044
38236B957044j720046q08755l99631K17222J513386K048551N22963j650243j759698
$$ 2957044 1236998 428243 28612 245834 1759220 3807771 4330734 2680491 920793
38227I20793N02285K479872J982195j12203j319790o08133Q74422J519647P84252
$$ 920793 1423078 3902950 5885145 5772942 4453152 3845019 4719441 6239088 7023340
38218G023340p72459k094318k174613p40491J210230J985175P94289j319013k426288
$$ 7023340 6250881 4156563 1981950 1241459 2451689 4436864 5231153 3912140 1485852
38209A485852j560418M92206K037113J901415K86923j379579j528601J48574K201902
$$ 1485852 -74566 417640 2454753 4356168 4643091 3263512 1734911 1883485 4085387
38200D085387K583137N57722k443878l863085k175460J461825L776792K455839
$$ 4085387 6668524 7226246 4782368 919283 -1256177 205648 3982440 6438279
38192F438279j030225k699534q34443J760945J556282r31910k269270j160709
$$ 6438279 5408054 2708520 1874077 3635022 5191304 4259394 1990124 829415
38184H29415L90530Q70704J063914J330179L15307j945636k606316j34257K596427
$$ 829415 1219945 2090649 3154563 4484742 4800049 2854413 248097 113840 2710267
38175B710267K251562Q3064l12566J198031J508347l55649j961568j755063j065371
$$ 2710267 4961829 5044893 4732327 5930358 7438705 7083056 5121488 3366425 2301054
38166B301054j095632j019424r8908R23522J486402J865689J518357n31265k871036
$$ 2301054 1205422 185998 87090 1010612 2497014 4362703 5881060 5349795 2478759
38157B478759k338742J153712L453414J727854j536027k350730o09666R50941
$$ 2478759 140017 1293729 4747143 6474997 4938970 2588240 1978574 2929515
38149B929515J152703Q70013N22239j48414o59126m87214l74273r13092r57351
$$ 2929515 4082218 4952231 5474470 5326056 4666930 4179716 3805443 2892351 1935000
38140A935000L79361J427106K70474j752608j824552j52567N29690l72127o13619
$$ 1935000 2314361 3741467 4011941 2259333 434781 282214 811904 439777 -173842
38131a73842O22536J260115J77850o74538L10944J542565Q71571r49504j678609
$$ -173842 448694 1708809 1886659 1212121 1523065 3065630 3937201 2987697 1309088
38122A309088r49570n70Q24841J975845K764065J907536q4005j205944q87118
$$ 1309088 359518 358948 1183789 3159634 5923699 7831235 7747230 6541286 5654168
38113E654168o39662j277237j520812m57640M83800k28807j394260p34965J323091
$$ 5654168 5014506 3737269 2216457 1758817 2242617 2013810 619550 -115415 1207676
38104A207676K086853P90787l89664k22040m04946j989569k591220k4128L298855
$$ 1207676 3294529 4085316 3695652 3473612 3068666 1079097 -1512123 -1536251 1762604
38095A762604L228657J34751j638689m54157O26731n77732j902762r71312P42446
$$ 1762604 4991261 5126012 3487323 3033166 3659897 3082165 1179403 208091 950537
38086I50537Q07886M7888N96751J725262J113231q44685j474148k06537O06168
$$ 950537 1758423 1806311 2403062 4128324 5241555 4396870 2922722 2716185 3322353
38077C322353n15883k191121k501247j272066M47680J587631J520268P27219Q28959
$$ 3322353 2806470 615349 -1885898 -3157964 -2710284 -1122653 397615 1124834 1953793
38068A953793K392295L202147Q77970l045230m328292j752766J119006J055889
$$ 1953793 4346088 7548235 8426205 5380975 1052683 -700083 418923 1474812
38060A474812n67883n63890J075453J712280O26430L7850J197973K054373L43941
$$ 1474812 906929 343039 1418492 3130772 3757202 3795052 4993025 7047398 7391339
38051G391339k617529l416664j332907O73316L30535q03952k01917J402691J259557
$$ 7391339 4773810 1357146 24239 697555 1028090 224138 22221 1424912 2684469
38042B684469p03220j504565K47911K249155K087520M16405q41759j159443p26135
$$ 2684469 1981249 476684 724595 2973750 5061270 5477675 4635916 3476473 2750338
38033B750338O06136J913286J099169j631483k650970J300K814544J600711j943772
$$ 2750338 3356474 5269760 6368929 4737446 2086476 2087776 4902320 6503031 4559259
38024D559259k750717j77270J517031K39530j311657r05660n2704l56301o07174
$$ 4559259 1808542 1631272 3148303 3387833 2076176 1170516 1117812 761511 154337
38015A54337L17587J050950N54066K97223J158142J073406j261696k986984j012402
$$ 154337 471924 1522874 2076940 2374163 3532305 4605711 3344015 357031 -655371
38006f55371K507935K740820n86102k695970q70069J870245J749610k48805m83409
$$ -655371 1852564 4593384 4007282 1311312 441243 2311488 4061098 3812293 3328884
37997C328884J527884K481621L38679k653080l093533q83778J141254J209605
$$ 3328884 4856768 7338389 7677068 5023988 1930455 1046677 2187931 3397536
37989C397536L01699j34744j84915m27359n42346j39104K92329M72376J120425
$$ 3397536 3699235 3564491 3379576 2952217 2409871 2270767 2563096 3035472 4155897
37980D155897K287494K300842J89165k137275k322265j010554l11530L4888J672973
$$ 4155897 6443391 8744233 8933398 6796123 4473858 3463304 3151774 3186662 4859635
37971D859635L481753K405487j174321k945256q93104J678069J325581p11522
$$ 4859635 8341388 10746875 9572554 6627298 5734194 7412263 8737844 8026322
37963H026322j420930p66404l97790J0322J534605K688327J137068j920299k724588
$$ 8026322 6605392 5838988 5441198 5451520 6986125 9674452 10811520 8891221 6166633
37954F166633m15510J760802J341236k20830n26036J70289J44767o85141r20155
$$ 6166633 5751123 7511925 8853161 8632331 8106295 8276584 8421351 7736210 6816055
37945F816055k30431J55149m16776q90279j82288R12837O26068j087460j961089
$$ 6816055 6585624 6740773 6323997 5433718 5251430 6164267 6790335 5702875 3741786
37936C741786k85712K441364L071775Q72277j448063j279205O45821J580711M47529
$$ 3741786 3456074 5897438 8969213 9841490 8393427 7114222 7760043 9340754 9788283
37927I788283j145412j322877j81223O89701K22177j039306j666314q80382P29143
$$ 9788283 8642871 7319994 7138771 7828472 8050649 7011343 5345029 4464647 5193790
37918E193790J942243K095936J372573K57888q07816j405619j314824p53817j34357
$$ 5193790 7136033 9231969 10604542 10862430 10054614 8648995 7334171 6580354 6445997
37909F445997L08013M17920P8152l30574j5224J020443J477948M09055j170225
$$ 6445997 6754010 7171930 7250082 6919508 6904284 7924727 9402675 9811730 8641505
37900H641505j446254k61961P72002M76920o57248j358475q09026P79870K026301
$$ 8641505 7195251 6933290 7705292 8182212 7524964 6166489 5357463 6137333 8163634
37891H163634J325547j093420k744632j715691Q06504K172365J569871J42357
$$ 8163634 9489181 8395761 5651129 3935438 4741942 6914307 8484178 8626535
37883H626535j152405j835040j084919R74497K020311K66928k228500k003613
$$ 8626535 7474130 5639090 4554171 5528668 7548979 7815907 5587407 3583794
37875C583794O12549K141047J461969P65638Q64129k3020j848593j702805R48493
$$ 3583794 4196343 6337390 7799359 8564997 9429126 9406106 7557513 5854708 6803201
37866F803201K384051N26156j414114l50399J498147P68413j053762m99075J455006
$$ 6803201 9187252 9713408 8299294 7948895 9447042 10215455 9161693 8662618 10117624
37857A0117624J002988j674029k417812R3156K270497J331465q39420j152102
$$ 10117624 11120612 9446583 7028771 7121927 9392424 10723889 9884469 8732367
37849H732367L42870J468724J294235O27825J85947k18053q80384j437473j170918
$$ 8732367 9075237 10543961 11838196 12466021 12651968 12433915 11553531 10116058 8945140
37840H945140j10310N30992j82276j196812o47602J105955J573538n0488j419666
$$ 8945140 8834830 9365822 9183546 7986734 7339132 8445087 10018625 9968137 8548471
37831H548471o94750O40175N36516k13056J98698J163555R11245j12987j23432
$$ 8548471 7853721 8493896 9030412 8817356 9016054 10179609 11090854 10977867 10854435
37822A0854435O05444K51326j027624j043990P68024K223827J470518o99354k134866
$$ 10854435 11459879 11711205 10683581 9639591 10407615 12631442 14101960 13402606 11267740
37813A1267740j628619K54420J759178J627133P65484J200102K784266K938883
$$ 11267740 9639121 9893541 11652719 13279852 14045336 15245438 18029704 20968587
37805B0968587R21529k46163J580597L709258K585461m34054j273557M53973J665289
$$ 20968587 21890116 21643953 23224550 26933808 29519269 29085215 27811658 28265631 29930920
37796B9930920J492139J948311L101462K574191N56778M11058K760167L641885
$$ 29930920 31423059 33371370 36472832 39047023 39603801 40014859 42775026 46416911
37788D6416911R30886j552835M31025N087497P282543N645209L403714L192043
$$ 46416911 47347797 45794962 46225987 51313484 58596027 64241236 67644950 70836993
37780G0836993M324501N165111N544819O062078O504028N938836M068603K012216
$$ 70836993 75161494 80326605 85871424 91933502 98437530 104376366 108444969 110457185
37772A10457185J335686K068189K290706M70011k404383m133857m175476l774785
$$ 110457185 111792871 113861060 116151766 116621777 114217394 110083537 105908061 102133276
37764A02133276l755574l903843m281877n307829o480658o647563n614640m196552
$$ 102133276 98377702 94473859 90191982 84884153 78403495 71755932 66141292 61944740
37756F1944740k997858k451109l215696m810938m969847k600650j88899m93822
$$ 61944740 58946882 56495773 53280077 48469139 43499292 40898642 40709743 40215921
37748D0215921k133091j932657n25667j199530l622060l809860r79228P74548
$$ 40215921 38082830 36150173 35624506 34424976 30802916 26993056 26013828 26788376
37740B6788376p59943k467617j602814k32794q81776j941049j131845R211q31471
$$ 26788376 26028433 23560816 21958002 21725208 20843432 18902383 17770538 17779749 16948278
37731A6948278k135150j252293N54563J45493j988741k528387p31605Q84136Q23668
$$ 16948278 14813128 13560835 14115398 14260891 12272150 9743763 9012158 9896294 10719962
37722A0719962J19969k10628k20909K25149J152909J395391K69040n11845P15272
$$ 10719962 10839931 10629303 10408394 10633543 11786452 13181843 13450883 12939038 13654310
37713A3654310K239574J293293j178762j739745o7351O63620o65617j297041L91718
$$ 13654310 15893884 17187177 16008415 14268670 14201319 14864939 14199322 12902281 13293999
37704A3293999J821289L82990k165718k205442M79693K549848J698418n95877
$$ 13293999 15115288 15498278 13332560 11127118 11606811 14156659 15855077 15259200
37696A5259200j199172P64281K746635J796911j475915l240301j487783R91229
$$ 15259200 14060028 14824309 17570944 19367855 17891940 14651639 13163856 14155085
37688A4155085O29813j485215j369057J362307K684175N42232j858155j100214
$$ 14155085 14784898 13299683 11930626 13292933 15977108 16519340 14661185 13560971
37680A3560971J356199J940414M69153l90694K05923N19242k31909o32529J97520
$$ 13560971 14917170 16857584 17326737 16936043 17141966 17661208 17429299 16796770 16994290
37671A6994290J093278Q70317K8728l58370K3600J144431K847564L924150K644664
$$ 16994290 18087568 18957885 18986613 18628243 18651843 19796274 22643838 26567988 29212652
37662B9212652n96382k694933j512363J106865J958566J098274J237172K896890
$$ 29212652 28616270 25921337 24408974 25515839 27474405 28572679 29809851 32706741
37654C2706741L356607J292874o24780J90760K052921J776612J0755K77029L167729
$$ 32706741 36063348 37356222 36731442 36922202 38975123 40751735 40762490 41039519 44207248
$$ [...]
##END NTUPLES=NMR SPECTRUM
##END=
