##TITLE=31Pdec_SR64_kw2
 CDCl3, 24 sc
 6.07.2021
##JCAMPDX= 6.0         $$ Bruker NMR JCAMP-DX V2.0
##DATA TYPE= NMR SPECTRUM
##DATA CLASS= NTUPLES
##ORIGIN= UXNMR, Bruker Analytische Messtechnik GmbH
##OWNER= root
$$ XWIN-NMR		Version 3.5
$$ Tue Jul  6 13:14:57 2021 Russian Standard Time (UT+4h)  she@DPX200
##.OBSERVE FREQUENCY= 81.013821
##.OBSERVE NUCLEUS= ^31P
##.ACQUISITION MODE= SIMULTANEOUS
##.ACQUISITION SCHEME= undefined
##.AVERAGES= 24
##.DIGITISER RES= 16
##SPECTROMETER/DATA SYSTEM= spect
##.PULSE SEQUENCE= zgpg30
##.SOLVENT NAME= CDCl3
##.SHIFT REFERENCE= (INTERNAL, CDCl3, 0, 248.564)
##AUDIT TRAIL= $$ (NUMBER, WHEN, WHO, WHERE, WHAT)
$$ ##TITLE= Audit trail, XWIN-NMR		Version 3.5
$$ ##JCAMPDX= 5.01
$$ ##ORIGIN= Bruker BioSpin GmbH
$$ ##OWNER= she
$$ F:/spectra/data/she/nmr/P31/1/pdata/1/auditp.txt
$$ ##AUDIT TRAIL=  $$ (NUMBER, WHEN, WHO, WHERE, WHAT)
(   1,<2021-07-06 13:13:55.87 +0400>,<she>,<DPX200>,
      <created by zg, POWCHK disabled, PULCHK disabled
       configuration hash MD5:
       00 E9 B6 7A A2 85 ED C7 34 08 36 98 17 FE 4E 26
       data hash MD5: 32K
       ED C5 A7 CE AD CD 1F 3E A3 81 48 AC D7 08 5E C0>)
(   2,<2021-07-06 13:13:59.25 +0400>,<she>,<DPX200>,
      <Start of raw data processing
       efp BC_mod = 2 LB = 1 FT_mod = 6 PKNL = 1 PHC0 = -7028.002 PHC1 = -750.314 SI = 64K 
       data hash MD5: 64K
       22 E7 08 73 C0 81 44 22 5B D0 D5 CF 4F D5 20 39>)
(   3,<2021-07-06 13:14:28.04 +0400>,<she>,<DPX200>,
      <pk PHC0 = -159.3269 PHC1 = 334.9998 
       data hash MD5: 64K
       65 07 76 DE FE 7D EA 14 A6 3A 14 21 FC 85 7B 9E>)
(   4,<2021-07-06 13:14:31.71 +0400>,<she>,<DPX200>,
      <abs ABSG = 5 
       data hash MD5: 64K
       5D 3E 66 74 2C 22 09 33 DD A1 9A AA 9B 60 A1 61>)
$$ ##END=
$$ 
$$ hash MD5
$$ FB EC 85 83 97 36 51 06 2D 80 D5 C7 70 44 75 F7
##$RELAX= 
##$RELAX= 
##$RELAX= 
##$RELAX= 
##$RELAX= 
##$RELAX= 
##$RELAX= 
##$RELAX= 
$$ Bruker specific parameters
$$ --------------------------
##$DU= <F:/spectra>
##$EXPNO= 1
##$NAME= <P31>
##$PROCNO= 1
##$TYPE= <nmr>
##$USER= <she>
##$AMP= (0..31)
100 100 100 100 100 100 100 100 100 100 100 100 100 100 100 100 100 100 
100 100 100 100 100 100 100 100 100 100 100 100 100 100 
##$AQSEQ= 0
##$AQ_mod= 1
##$AUNM= <au_zg>
##$AUTOPOS= <>
##$BF1= 81.014009
##$BF2= 200.13
##$BF3= 200.13
##$BF4= 200.13
##$BF5= 200.13
##$BF6= 200.13
##$BF7= 200.13
##$BF8= 200.13
##$BYTORDA= 1
##$CFDGTYP= 0
##$CFRGTYP= 5
##$CHEMSTR= <none>
##$CNST= (0..31)
1 1 145 1 1 1 1 1 1 1 1 1 1 1 1 1 1 1 1 1 1 1 1 1 1 1 1 1 1 1 1 1 
##$CPDPRG= <waltz16>
##$CPDPRG1= <>
##$CPDPRG2= <waltz16>
##$CPDPRG3= <>
##$CPDPRG4= <mlev>
##$CPDPRG5= <mlev>
##$CPDPRG6= <mlev>
##$CPDPRG7= <mlev>
##$CPDPRG8= <mlev>
##$CPDPRGB= <>
##$CPDPRGT= <>
##$D= (0..31)
0 1 0 0 0 0 0 0 0 0 0 0.03 2e-05 3e-06 0 0 0 0 0 0 0 0 0 0 0 0 0 0 0 0 
0 0 
##$DATE= 1625562835
##$DBL= (0..7)
120 120 120 11 120 120 24 19 
##$DBP= (0..7)
150 150 150 150 150 150 150 150 
##$DBP07= 0
##$DBPNAM0= <>
##$DBPNAM1= <>
##$DBPNAM2= <>
$$ [...]
##$SUBNAM3= <"">
##$SUBNAM4= <"">
##$SUBNAM5= <"">
##$SUBNAM6= <"">
##$SUBNAM7= <"">
##$SUBNAM8= <"">
##$SUBNAM9= <"">
##$SW= 501.771253377433
##$SWIBOX= (0..15)
0 1 3 0 0 0 0 0 0 0 0 0 0 0 0 0 
##$SW_h= 40650.406504065
##$TD= 32768
##$TD0= 1
##$TE= 0
##$TE2= 300
##$TE3= 300
##$TEG= 300
##$TL= (0..7)
0 120 53 12 22 120 120 120 
##$TP= (0..7)
150 150 150 150 150 150 150 150 
##$TP07= 0
##$TPNAME0= <>
##$TPNAME1= <>
##$TPNAME2= <>
##$TPNAME3= <>
##$TPNAME4= <>
##$TPNAME5= <>
##$TPNAME6= <>
##$TPNAME7= <>
##$TPOAL= (0..7)
0.5 0.5 0.5 0.5 0.5 0.5 0.5 0.5 
##$TPOFFS= (0..7)
0 0 0 0 0 0 0 0 
##$TUNHIN= 0
##$TUNHOUT= 0
##$TUNXOUT= 0
##$USERA1= <user>
##$USERA2= <user>
##$USERA3= <user>
##$USERA4= <user>
##$USERA5= <user>
##$V9= 5
##$VALIST= <valist>
##$VCLIST= <CCCCCCCCCCCCCCC>
##$VD= 0
##$VDLIST= <DDDDDDDDDDDDDDD>
##$VPLIST= <PPPPPPPPPPPPPPP>
##$VTLIST= <TTTTTTTTTTTTTTT>
##$WBST= 1024
##$WBSW= 4
##$XGAIN= (0..3)
0 0 0 0 
##$XL= 0
##$YL= 0
##$YMAX_a= 1152
##$YMIN_a= -1648
##$ZGOPTNS= <>
##$ZL1= 120
##$ZL2= 120
##$ZL3= 120
##$ZL4= 120
##$ABSF1= 248.5645
##$ABSF2= -253.2056
##$ABSG= 5
##$ABSL= 3
##$ALPHA= 0
##$AQORDER= 0
##$ASSFAC= 0
##$ASSFACI= 0
##$ASSFACX= 0
##$ASSWID= 0
##$AUNMP= <proc_1d>
##$AZFE= 0.1
##$AZFW= 0.5
##$BCFW= 0
##$BC_mod= 2
##$BYTORDP= 0
##$COROFFS= 0
##$CY= -3
##$DATMOD= 1
##$DC= 0
##$DFILT= <>
##$DTYPP= 0
##$F1P= 0
##$F2P= 0
##$FCOR= 1
##$FTSIZE= 65536
##$FT_mod= 6
##$GAMMA= 0
##$GB= 0
##$INTBC= 1
##$INTSCL= 5.30512e-09
##$ISEN= 30
##$LB= 1
##$LEV0= 0
##$LPBIN= 0
##$MAXI= 10000
##$MC2= 0
##$MEAN= 0
##$ME_mod= 0
##$MI= 50
##$NCOEF= 0
##$NC_proc= -8
##$NLEV= 6
##$NOISF1= 182.463
##$NOISF2= 159.3651
##$NSP= 0
##$NTH_PI= 0
##$NZP= 0
##$OFFSET= 248.5645
##$PC= 4
##$PHC0= -7187.329
##$PHC1= -415.3142
##$PH_mod= 1
##$PKNL= yes
##$PPARMOD= 0
##$PSCAL= 0
##$PSIGN= 0
##$REVERSE= no
##$SF= 81.014009
##$SI= 65536
##$SIGF1= 159.3651
##$SIGF2= -187.1042
##$SINO= 113.3802
##$SIOLD= 16384
##$SREGLST= <1H.CDCl3>
##$SSB= 0
##$STSI= 65536
##$STSR= 0
##$SW_p= 40650.406504065
##$SYMM= 0
##$S_DEV= 0
##$TDeff= 32768
##$TDoff= 0
##$TI= <>
##$TILT= no
##$TM1= 0
##$TM2= 0
##$TOPLEV= 0
##$USERP1= <user>
##$USERP2= <user>
##$USERP3= <user>
##$USERP4= <user>
##$USERP5= <user>
##$WDW= 1
##$XDIM= 65536
##$YMAX_p= 432308458
##$YMIN_p= -132592952
$$ End of Bruker specific parameters
$$ ---------------------------------
##NTUPLES= NMR SPECTRUM
##VAR_NAME=  FREQUENCY,     SPECTRUM/REAL,   SPECTRUM/IMAG
##SYMBOL=    X,             R,               I
##VAR_TYPE=  INDEPENDENT,   DEPENDENT,       DEPENDENT
##VAR_FORM=  AFFN,          ASDF,            ASDF
##VAR_DIM=   65536,         65536,           65536
##UNITS=     HZ,            ARBITRARY UNITS, ARBITRARY UNITS
##FACTOR=    0.620285442955139, 1,           1
##FIRST=     20137.2065510759, 0,            0
##LAST=      -20513.1999529892, 0,           0
##MIN=       -20513.1999529892, -132592952,  0
##MAX=       20137.2065510759, 432308458,    0
$$ Real data points
##PAGE= N=1
##DATA TABLE= (X++(R..R)), XYDATA
$$ [...]
13040b308483K556544L146889J860507k71640k034795j917196Q15563L741697
$$ -2308483 248061 3394950 5255457 4983817 2949022 1031826 1847389 5589086
13032E589086K976782j145984l547113j633585Q31099j18686k685687l090326
$$ 5589086 8565868 7419884 3872771 2239186 3070285 2951599 265912 -2824414
13024b824414j492280p2366J183847K435224J395417k330660l987312l16112M031387
$$ -2824414 -4316694 -4389060 -3205213 -769989 625428 -1705232 -5692544 -6008656 -1977269
13015a977269L110591m48002L19598M749782N230534m94120n887427n704412k303748
$$ -1977269 1133322 685320 1004918 5754700 10985234 10491114 4603687 -1100725 -3404473
13006c404473Q3135J080833J745355J711430J195998J530969J951277J6734l511159
$$ -3404473 -3321338 -2240505 -495150 1216280 2412278 3943247 5894524 5911258 2400099
12997B400099m661878k353858N7715N17176P53394J725788J644221J48940o15730
$$ 2400099 -2261779 -4615637 -4557922 -4040746 -3287352 -1561564 82657 231597 -384133
12988c84133o99179k565419m835798k339605M575810P710887K695333l407710
$$ -384133 -1083312 -3648731 -8484529 -10824134 -6248324 1462563 4157896 750186
12980G50186k321869L100890M178186p6831l191089k807318l094797n435666n149821
$$ 750186 -1571683 1529207 5707393 5630562 2439473 -367845 -3462642 -8898308 -14048129
12971a4048129N7696N244158N503711K959336K316455L257641K049657j378695
$$ -14048129 -13990433 -8746275 -3242564 -283228 2033227 5290868 7340525 5961830
12963E961830k898365o57657J884560P65382l132719n386908l533832M60045L000972
$$ 5961830 3063465 2405808 4290368 5055750 1923031 -3463877 -6997709 -6537664 -3536692
12954c536692K758623J313750P24470J203753J218506m19750k856551l932471
$$ -3536692 -778069 535681 1260151 2463904 3682410 3262660 406109 -3526362
12946c526362k621713j7696K436463M486437N811425M836774J105765k320251
$$ -3526362 -6148075 -6165771 -3729308 757129 6568554 11405328 12511093 10190842
12938A0190842k059464M54677P91592j566016k710457j297889m14736p29729J500460
$$ 10190842 8131378 8586055 9377647 7811631 5101174 3803285 3388549 2658820 4159280
12929D159280N953003N144069l823258j1118419o686148M027805P308158J096084
$$ 4159280 10112283 15256352 11433094 314675 -6371473 -2343668 4964490 6060574
12921F060574l908113k076284P26510K11469O44991M331246N392521L75366m499602
$$ 6060574 2152461 76177 802687 1014156 1659147 5990393 11382914 11758280 7258678
12912G258678l715634j526678l025925m253607j94760M336685K081207l577738
$$ 7258678 3543044 2016366 -1009559 -5263166 -5457926 -1121241 959966 -2617772
12904b617772l742775J156513K668396j102241l101897N4950L075846J723801
$$ -2617772 -6360547 -5204034 -2535638 -3637879 -6739776 -6684826 -3608980 -1885179
12896a885179q71535o84684J100052J614583P95319k81266j404146j787909m29184
$$ -1885179 -2756714 -3441398 -2341346 -726763 68556 -212710 -1616856 -3404765 -3833949
12887c833949J099032K21904j686221m92025L711954N654125K393062k695573
$$ -3833949 -2734917 -2513013 -4199234 -4691259 -979305 4674820 7067882 4372309
12879D372309n153376m530203k453498L91408L086692L549723J122589k054066
$$ 4372309 -781067 -5311270 -7764768 -7373360 -4286668 -736945 385644 -1668422
12871a668422l636712l145269j087604J500950K574799R99335j084826q47164
$$ -1668422 -5305134 -8450403 -9538007 -8037057 -5462258 -4462923 -5547749 -6394913
12863f394913P23023N17434j043968n51509K215321L507743J704712m46905o12937
$$ -6394913 -5671890 -5154456 -6198424 -6749933 -4534612 -1026869 677843 230938 -381999
12854c81999M73278J780091K832510J510898l596598q135215n629582K455423
$$ -381999 91279 1871370 4703880 6214778 2618180 -5517035 -11146617 -8691194
12846h691194P132776M551042Q77598J244180J801137j758321n158027k604807
$$ -8691194 -1558418 2992624 3870222 5114402 6915539 5157218 -809 -2605616
12838b605616K584199K910081j200040k754596J01045K059697K63785j579678
$$ -2605616 -21417 2888664 1688624 -1065972 -964927 1094770 1358555 -221123
12830b21123j40908K463158K678913L66133k174104l022333j520118J165648K203911
$$ -221123 -362031 2101127 4780040 5146173 2972069 -50264 -1570382 -404734 1799177
12821A799177L53786j436035K93521L879437M246693J08440m343112n315110l304522
$$ 1799177 2152963 716928 1010449 4889886 9136579 9245019 4901907 -413203 -3717725
12812c717725l89068K634561M834097M073951j65879m630734n246388j813711
$$ -3717725 -4106793 -1472232 3361865 7435816 7269937 2639203 -2607185 -4420896
12804d420896J648864J470864j342479k159393J324299N353325M653428J52929
$$ -4420896 -2772032 -1301168 -2643647 -4803040 -3478741 1874584 6528012 6680941
12796F680941j751975J311360L672918K44851n241654n702917j367839J139262
$$ 6680941 4928966 6240326 9913244 10158095 4916441 -786476 -2154315 -1015053
12788a015053r62654l532469k805467l8122K249711L659011L928827J942522j388026
$$ -1015053 -1977707 -5510176 -8315643 -8353765 -6104054 -2445043 1483784 3426306 2038280
12779B038280k923212j715676k86000j21529L64136J729447J470391j344099l170918
$$ 2038280 -884932 -2600608 -2886608 -3008137 -2644001 -914554 555837 -788262 -3959180
12770c959180j072618K353690K918852J357296J580727L686009L404106r32470
$$ -3959180 -5031798 -2678108 240744 1598040 3178767 6864776 10268882 9336412
12762I336412m848275l276384K510835O031334L267058k760674n840023l730454
$$ 9336412 4488137 1211753 3722588 9753922 13020980 10260306 4420283 689829
12754F89829J20946J624964N38165r76846j982289k777922k788897j197087Q73472
$$ 689829 810775 2435739 2973904 1997058 14769 -2763153 -5552050 -6749137 -5875665
12745e875665J361872L23457k32551O40459K053974L059537K968963P38680l137056
$$ -5875665 -4513793 -4190336 -4422887 -3782428 -1728454 1331083 4300046 5038726 1901670
12736A901670n012738k019103K827157L636204p5163k725409j136552J320006
$$ 1901670 -3111068 -5130171 -2303014 1333190 1258027 -1467382 -2603934 -1283928
12728a283928R04655j104854k076639k527009l281419k159724K046958N468518
$$ -1283928 -379273 -1484127 -3560766 -6087775 -9369194 -11528918 -9481960 -4013442
12720d013442L927184l88295j878663M31546K660684K713213K078442J412903
$$ -4013442 -86258 -474553 -2353216 -1921670 739014 3452227 5530669 6943572
12712F943572n28955l037027l251130r48884O33644l79o70006k51404r78263l548498
$$ 6943572 6414617 3377590 126460 -822424 -188780 -189159 -859165 -1110569 -2088832 -5637330
12702e637330m068550M05026O242511P365650L281281j035504k261184j657434
$$ -5637330 -9705880 -9300854 -3058343 4307307 7588588 6553084 4291900 2634466
12694B634466j135166m87246N67109J003562O21014Q68078K038473K043980l45110
$$ 2634466 1499300 1012054 1579163 2582725 3203739 4071817 6110290 8154270 7809160
12685G809160l229949m349946l968355l032783r33947K123430K967243l91500
$$ 7809160 4579211 229265 -3739090 -6771873 -7705820 -5582390 -2615147 -3006647
12677c006647m164908l057363J675132L713826J354804k51522J908521L786660
$$ -3006647 -7171555 -10228918 -8553786 -4839960 -3485156 -3736678 -1828157 1958503
12669A958503J807683n08037J195892L760723J165512n007038o934153j971721
$$ 1958503 3766186 3258149 4454041 8214764 9380276 4373238 -2560915 -4532636
12661d532636L766550M273540Q08608j496003j88269L002211M410425J452732
$$ -4532636 -766086 3507454 4316062 2820059 2631790 5634001 10044426 11497158
12653A1497158m143862o587433k662782K931280L194545j223046l233400k33586
$$ 11497158 7353296 765863 -1896919 1034361 4228906 3005860 -227540 -461126
12645d61126K720371J805198k69236l65970M8589n68148j57349J983843K039247
$$ -461126 2259245 4064443 3795207 3429237 3477826 2909678 2752329 4736172 6775419
12636F775419j785796m587551k022373K194884J995232j600491l130273j745936
$$ 6775419 4989623 402072 -1620301 574583 2569815 969324 -2160949 -3906885
12628c906885q11529o06337J415711M008954K812288j983124m810807k658787
$$ -3906885 -4718414 -5324751 -3909040 99914 2912202 929078 -3881729 -6540516
12620f540516J251689K775954J493010p01491j705981L34572M712705O543705
$$ -6540516 -5288827 -2512873 -1019863 -1721354 -3427335 -3092763 1619942 8163647
12612H163647K040447m854379o420515j939572J467629j51700k304193m35137
$$ 8163647 10204094 5349715 -1070800 -3010372 -1542743 -1694443 -3998636 -4433773
12604d433773K698753K429981P5684J48059K723972L744227J377998k201567m503886
$$ -4433773 -1735020 694961 770645 918704 3642676 7386903 8764901 6563334 2059448
12595B059448m658065k431910J386008L954971K657034j427879m419948m002784
$$ 2059448 -2598617 -5030527 -3644519 310452 2967486 1539607 -2880341 -6883125
12587f883125j216616J690342L262976K899181J001584n28524K92499K745857
$$ -6883125 -8099741 -6409399 -3146423 -247242 754342 225818 518317 3264174
12579C264174L282139n36285o391958q908081n511375M44268L567748K657977
$$ 3264174 6546313 6010028 -381930 -9290011 -14801386 -14357118 -10789370 -8131393
12571h131393J095747J334738K018480J601153J420804K564271K693891j50885
$$ -8131393 -7035646 -5700908 -3682428 -2081275 -660471 1903800 4597691 4446806
12563D446806k879327j292966K643323L039417n84433k272240P65759L629802
$$ 4446806 1567479 274513 2917836 5957253 5372820 3100580 3866339 7496141
12555G496141J694146k373976l697413k780104k951380l604991j770699J488092
$$ 7496141 9190287 6816311 3118898 338794 -2612586 -6217577 -7988276 -6500184
12547f500184K177541K85172j44008J671368J522059k258013m688383j202987
$$ -6500184 -4322643 -4037471 -4181479 -2510111 -988052 -3246065 -7934448 -9137435
12539i137435M820347O167333J635621k914871l106123j023070l02024m26378
$$ -9137435 -4317088 1850245 3485866 570995 -2535128 -3558198 -3860222 -4286600
12531d286600R15498K606743J589716j359990j858823J404780M239657K886159
$$ -4286600 -3371102 -764359 825357 -534633 -2393456 -988676 3250981 6137140
12523F137140j055916l805416m307365l297932o56378K763942L488122l1991l430734
$$ 6137140 5081224 1275808 -3031557 -6329489 -6985867 -4221925 -733803 -765794 -4196528
12514d196528j885907K197972K597912p58720j827949J340815L518514J339143
$$ -4196528 -6082435 -3884463 -1286551 -2045271 -3873220 -2532405 986109 2325252
12506B325252j366910o97907Q62485l10300k133771n51641L201758M290477J210005
$$ 2325252 958342 260435 1122920 812620 -1321151 -1872792 1328966 5619443 6829448
12497F829448l220484n971471n399112j148585L872141M259687q83544m671798
$$ 6829448 3608964 -2362507 -7761619 -8910204 -5038063 -778376 -1661920 -6333718
12489f333718j188962N409603O738645K718447O20857K493688K313021k626767
$$ -6333718 -7522680 -2113077 4625568 7344015 7964872 10458560 12771581 10144814
12481A0144814o003146k457891L460848M136502J0600k415143r36041L66292j295646
$$ 10144814 4141668 1683777 5144625 9281127 9291727 6876584 5940543 6306835 5011189
12472E011189l534178l360798j391035J03817M82312M70276N02084O96883J249688
$$ 5011189 1477011 -1883787 -3274822 -3171005 -2688693 -2218417 -1716333 -1019450 230238
12463B30238J786160J236914p24375k669595k622343k36038K471176K711159k47746
$$ 230238 2016398 3253312 2528937 -140658 -2763001 -2999039 -527863 2183296 1935550
12454A935550l628665l471371O92517M479613L590774n98833k755025q83675J125827
$$ 1935550 -1693115 -5164486 -4471969 7644 3598418 2999585 244560 -639115 486712
12445D86712m00475l319996l130004l131J617386p3103j921700j188990O92721
$$ 486712 86237 -3233759 -6363763 -6366894 -4749508 -4822611 -6744311 -7933301 -7240580
12436g240580J487931J714026K291043J851467k96952j314189R62472L186671
$$ -7240580 -5752649 -4038623 -1747580 103887 -193065 -1507254 -544782 2641889
12428B641889Q61632l824604m338117L1175K633608j80098l325854j259914L129100
$$ 2641889 3503521 -321083 -4659200 -4628025 -1994417 -2174515 -5500369 -6760283 -3631183
12419c631183L105095j645078n010854l451476K51301K349648K741284K972352
$$ -3631183 -526088 -2171166 -7182020 -10633496 -10382195 -8032547 -5291263 -2318911
12411b318911K928180J438531j384092l740991l596994m95646L396885M656485
$$ -2318911 609269 2047800 663708 -3077283 -6674277 -7169923 -3773038 883447
12403H83447K148796j412969k650720j365229K46087J018436J330959J100171
$$ 883447 3032243 1619274 -1031446 -2396675 -2150588 -1132152 198807 1298978
12395A298978j02034j188372m43899J525723K169969P05741r29978j344911j302841
$$ 1298978 1196944 8572 -435327 1090396 3260365 3966106 3036128 1691217 388376
12386C88376j152324M78956L566371M893422K260843j280647r84589K456018L347493
$$ 388376 -763948 -284992 3281379 8174801 10435644 9154997 8170408 10626426 13973919
12377A3973919o20105m436170k795705K066041L614861N06702k080015q94362
$$ 13973919 13353814 8917644 6121939 8187980 11802841 12309543 10229528 9335166
12369I335166P34414r22266l589729k949511p0341L17011k208018l018062k41166
$$ 9335166 10069580 9147314 5557585 2608074 2537733 2854744 646726 -2371336 -2612502
12360b612502J918249n1398l008278j542937L890487O962024L414255l507928
$$ -2612502 -694253 -745651 -3753929 -5296866 -1406379 5555645 8969900 5461972
12352E461972o552189k659324L324027M093025j143745n438109l196631K398319
$$ 5461972 -1090217 -3749541 -425514 3667511 2523766 -2914343 -6110974 -3712655
12344c712655M318974J512571j145862j282644j321965k259968j598181R64163
$$ -3712655 606319 2118890 973028 -309616 -1631581 -3891549 -5489730 -4525567
12336d525567J947991N26187M62427K731354K635432j699596m478957j292453
$$ -4525567 -2577576 -2051389 -1588962 1142392 3777824 2078228 -2400729 -3693182
12328c693182L097433K642632O6589J010744K942582k86767n730120m236775M055281
$$ -3693182 -595749 2046883 2113472 3124216 6066798 5780031 49911 -4186864 -131583
12319a31583Q015247J870681o340345p090728k162832O82791j57234j16285K682398
$$ -131583 7883664 9754345 3414000 -3676728 -5839560 -5156769 -5314003 -5430288 -2747890
12310b747890M989291M163227J649835J29603J1967j59699r31242p61567J528442
$$ -2747890 2241401 6404628 8054463 8184066 8196033 8036334 7105092 6343525 7871967
12301G871967L548972J183212m978775q295066m443748J826086L007830n50186
$$ 7871967 11420939 12604151 7625376 -669690 -5113438 -3287352 -279522 -829708
12293h29708k314513k25111J468131P92501P01894J821770M03598l671448m400390
$$ -829708 -3144221 -3369332 -1901201 -1108700 -406806 1414964 1818562 -1852886 -6253276
12284f253276O73972N171242L423411q25614j355231L40811q56259l438514j521791
$$ -6253276 -5579304 -408062 3015349 2189735 834504 1175315 319056 -3119458 -4641249
12275d641249M275440O385738J441917m796085n631971j603575J959596K149229
$$ -4641249 -365809 6019929 7461846 2665761 -2966210 -4569785 -2610189 -460960
12267d60960O90979N61331K230638L197638J183226k347756l371418o96103K021984
$$ -460960 230019 791350 3021988 6219626 7402852 5055096 1683678 987575 3009559
12258C009559J239736j705124k947520j254044J494453L142880K322451j256327
$$ 3009559 4249295 2544171 -403349 -1657393 -162940 2979940 5302391 4046064
12250D046064n123201m994905k52103L966025L350532L90594k04670Q07030n60823
$$ 4046064 -1077137 -6072042 -6324145 -2358120 992412 1383006 1178336 1985366 1424543
12241A424543l536209l175976J256604M564995L327193Q0728j745977k326008
$$ 1424543 -2111666 -5287642 -4031038 533957 3861150 3941878 2195901 -130107
12233a30107k776414k170280J55599K347339K531281J402580N84162L50799K13658
$$ -130107 -2906521 -5076801 -4921202 -2573863 -42582 1359998 1944160 2294959 2508617
12224B508617j25479j123731k661926k827605j30695L029108K526122j424150
$$ 2508617 2383138 1259407 -1402519 -4230124 -4360819 -1331711 1194411 -229739
12216b29739m050015k572293Q92219L611107M885413L565460j458856o360931
$$ -229739 -4279754 -6852047 -5959828 -2348721 2536692 6102152 4643296 -1717635
12208a717635m326525M039269Q569796K903109n868920p378116k487658M65129
$$ -1717635 -6044160 -2004891 6564905 9468014 3599094 -3779022 -6266680 -5801551
12200e801551k95824M35536L203157K436049k645330n513884l036074J93879J117118
$$ -5801551 -6097375 -5661839 -2458682 -22633 -2667963 -8181847 -11217921 -11024042 -9906924
12191i906924K909199O410075N895161o94965n549899k419480K932606K238773
$$ -9906924 -6997725 -587650 5307511 4612546 -937353 -3356833 -424227 1814546
12183A814546j652612p29377L570829L269149j437609k702155L50856K35949m077410
$$ 1814546 161934 -567443 3003386 6272535 4834926 2132771 2483627 2719576 -1357834
12174a357834l890895L446078P900274K797388l646366k051972K400452m25853
$$ -1357834 -5248729 -1802651 6097623 8895011 5248645 3196673 5597125 5171272
12166E171272p302575o480616K386238P070116K083344l578719j584441L615801
$$ 5171272 -2131303 -8611919 -6225681 844435 2927779 -650940 -2235381 1380420
12158A380420L632351j006968l710447k210031N38345K530277L831390L461399
$$ 1380420 5012771 4005803 295356 -1914675 -1376330 1153947 4985337 8446736
12150H446736L96046l130196l504462n83066K541215M035737M476975L958421
$$ 8446736 8842782 5712586 2208124 1625058 4166273 8202010 12678985 16637406
12142A6637406J419893k608676n309475m719014j923304O01210J457074O31991
$$ 16637406 18057299 15448623 10139148 5420134 3496830 4098040 5555114 6187105
12134F187105j129611k379661j712140L16034J011481j142660l663520k679195
$$ 6187105 5057494 2677833 965693 1281727 2293208 1150548 -2512972 -5192167
12126e192167J552486M265819K503193p51109j111741Q13389J230754j61380k25441
$$ -5192167 -3639681 626138 3129331 2378222 1266481 2079870 3310624 3149244 2923803
12117B923803J030470l20347m587410n960118j162041M396115M062894l79771
$$ 2923803 3954273 3633926 -953484 -6913602 -8075643 -3679528 383366 3595
12109C595k243108k13415J345093O87731M64892J423288Q69690j573836k386309
$$ 3595 -2239513 -2452928 -1107835 -420104 44788 1468076 2337766 763930 -1622379
12100a622379J06939L172991M264538L817728K416963k70086k624753j890529
$$ -1622379 -1515440 1657551 5922089 9739817 12156780 11886694 9261941 7371412
12092G371412Q66394J413310q16903j844343n09971o19855l372323m145200m60938
$$ 7371412 8237806 9651116 8834213 6989870 6479899 5860044 2487721 -1657479 -2118417
12083b118417L089484K413325M58564Q82290J040721k094847m307291n11052N070788
$$ -2118417 971067 3384392 3842956 4725246 5765967 3671120 -636171 -1147223 3923565
12074C923565M079010k644014n949711k176355K709564L549724K138766R84285
$$ 3923565 8002575 5358561 -591150 -2767505 -57941 3491783 5630549 6614834
12066F614834j019877l441315k160304L209275O007600J896400l565397k625081
$$ 6614834 5594957 2153642 -6662 3202613 9210213 11106613 7541216 4916135
12058D916135L203735N758782K042133k907645m219041k534909o97245J41820
$$ 4916135 8119870 13878652 15920785 13013140 8794099 6259190 5561945 5703765
12050E703765q5060j235102k035923j057878P31332J050087J64416M47310J682773
$$ 5703765 5618705 4383603 2347680 1289802 2021134 3071221 3235637 3682947 5365720
12041E365720P32795k788850m603800j953768J954034K817717J333258O82772
$$ 5365720 6098515 3309665 -1294135 -3247903 -1293869 1523848 2857106 3539878
12033C539878Q10636k33495j392026k12225J887376J338639j204292j806361l60031
$$ 3539878 4350514 4117019 2724993 2512768 4400144 5738783 4534491 2728130 2368099
12024B368099n77351k422030j529240K119112K462153k304873n082112o79027
$$ 2368099 1790748 -631282 -2160522 -41410 2420743 115870 -4966242 -5645269
12016e645269N359093N147837Q6452l113346l279475l691012l865630j005111
$$ -5645269 -286176 4861661 4948113 1834767 -1444708 -5135720 -9001350 -10006461
12008a0006461K783162L139348J532007K373956L867603Q74174m273438l955700
$$ -10006461 -7223299 -4083951 -2551944 -177988 3689615 4563789 290351 -3665349
12000c665349J578316L712086l63754l446872j078301J762936P43487q02320N3930
$$ -3665349 -2087033 1625053 1261299 -2185573 -3263874 -1500938 -757451 -1559771 -1505841
11991a505841r8382l053687l675261Q98141M586520K017009k335013k147868K73243
$$ -1505841 -1604223 -4657910 -8333171 -7435030 -2848510 -831501 -3166514 -5314382 -5041139
11982e041139m20391k528399j322217J846415K932460L184452N236755N582356
$$ -5041139 -5461530 -7989929 -9312146 -7465731 -4533271 -1348819 3887936 9470292
11974I470292J50929o193388n465955N35879K796301r26305m122850k929826l72045
$$ 9470292 9621221 3427833 -2038122 -1502243 1294058 367753 -3755097 -6684923 -7056968
11965g056968J006455K256734L058043J439090p40193N53794L623720K270104
$$ -7056968 -6050513 -3793779 -735736 703354 -36839 516955 4140675 6410779
11957F410779l870891p575104m551541R12393L066049J674043k59805p27458J023211
$$ 6410779 2539888 -5035216 -9586757 -8674364 -5608315 -3934272 -4194077 -4921535 -3898324
11948c898324M047686M756324R13821l529517k900204J337464K503310o57749
$$ -3898324 149362 4905686 5819507 2289990 -610214 727250 3230560 2572811
11940B572811k580302r30440j19587k475501l595697k69654L548739L196490M95219
$$ 2572811 -7491 -937931 -1057518 -3533019 -7128716 -7398370 -3849631 -653141 -157922
11931a57922j01469J479143K106015P48318j043241k004889k004014j532541j531798
$$ -157922 -259391 1219752 3325767 4074085 3030844 1025955 -978059 -2510600 -4042398
11922d042398k106379j596767P10595K185712P40029o47188J712930N019955L548437
$$ -4042398 -6148777 -7745544 -7034949 -4849237 -4109208 -4756396 -3043466 1976489 5524926
11913E524926j566318l469319n02295J837270O86679n12377K39650K58148r91891
$$ 5524926 3958608 489289 -13006 1824264 2510943 1998566 2238216 2496364 1504473
11904A504473M7076L282358L405254o85620l149087j491594q67759l724080m350340
$$ 1504473 1551549 4833907 8239161 7553541 4404454 2912860 2045101 -1678979 -6029319
11895f029319M87048M497604K441626p10345Q66539L253504N60096l670560k665480
$$ -6029319 -5542271 -1044667 1396959 686614 1553153 4806657 5366753 1696193 -969287
11886i69287J626413K724143R60014P26182P99728k219394m655845r70159M634677
$$ -969287 657126 3381269 4341283 5067465 5867193 3647799 -1008046 -1978205 2656472
11877B656472L282768l576008n900877j347405J923482k72442k352114l44128
$$ 2656472 5939240 2363232 -3537645 -4885050 -2961568 -3234010 -5586124 -5930252
11869e930252J460119o73194l239102k169131Q29713K558031K934949K301928
$$ -5930252 -4470133 -5143327 -8382429 -10551560 -9721847 -7163816 -4228867 -1926939
11861a926939l4592k184049o95793K768535K441688j813922l233929O23443L392132
$$ -1926939 -1961531 -4145580 -4841373 -2072838 368850 -1445072 -4679001 -4055558 -663426
11852f63426O19218l002290k379869n31176j884500l580810r14010L580331M168967
$$ -663426 -44208 -3046498 -5426367 -5957543 -7842043 -11422853 -12336863 -8756532 -4587565
11843d587565J358077r9711K74491o13533k422866k181832o18234q49252j738974
$$ -4587565 -3229488 -3329199 -3054708 -3668241 -6091107 -8272939 -8891173 -9740425 -11479399
11834a1479399O62417N413770P095201M301472J377698P51595k37372l075944
$$ -11479399 -10816982 -5403212 1691989 5993461 7371159 8122754 7885382 4809438
11826D809438m522663k193710J029149J472688j6732m03553O87758J439142J056652
$$ 4809438 286775 -1906935 -877786 594902 578170 174617 862375 2301517 3358169
11817C358169l0684j430574k144736n51476K814757M346936J715857k361452l385479
$$ 3358169 3327485 1896911 -247825 -799301 2015456 6362392 8078249 5716797 2331318
11808B331318j115549M55584j097520l535139l344145l63555K210118J804565
$$ 2331318 1215769 1671353 573833 -2961306 -6305451 -6669006 -4458888 -2654323
11800b654323n39199j580741p8896J556190R04382l77112J128367M295641L463682
$$ -2654323 -3193522 -4774263 -4853159 -3296969 -2392587 -2769699 -1641332 2654309 6117991
11791F117991l138561q687581n744886L091881P725506L602995l090463m846424
$$ 6117991 2979430 -5708151 -11453037 -8361156 -635650 2967345 -123118 -4969542
11783d969542k352211r76526j520978J39810N191770Q817275O392657n26339o270771
$$ -4969542 -7321753 -8298279 -9819257 -9679447 -4487677 4329598 10722255 10195916 3925145
11774C925145p177898m122199m36169J113456J78237j005879J62349L423653N454306
$$ 3925145 -3252753 -7374952 -7811121 -6697665 -6519428 -7525307 -7362958 -3939305 1515001
11765A515001L774852j26336k741317k586038q09527J098901K003829M42196l545435
$$ 1515001 5289853 5163517 2422200 -163838 -973365 125536 2129365 2571561 -973874
11756i73874n905817j922633O298402R802816L740581m978314o066456J34540
$$ -973874 -6879691 -8802324 -2503922 7298894 11039475 6061161 -5295 129245
11748A29245L556715o27683n330131k896583L450751N176200J018987k784593
$$ 129245 3685960 3058277 -2271854 -5168437 -1717686 3458514 4477501 1692908
11740A692908k647338r93542J34433K032387M552740M299462J86861l756761l931956
$$ 1692908 -954430 -1947972 -1813539 218848 4771588 9071050 9257911 5501150 1569194
11731A569194j845264o29896l59248K24044L41942j114438k660478k087160K36990
$$ 1569194 -276070 -905966 -1265214 -1041170 -699228 -1813666 -4474144 -6561304 -6324314
11722f324314K298283L074451K272682n09776m145231n546902l235615M71669
$$ -6324314 -4026031 -951580 1321102 811326 -3333905 -8880807 -12116422 -11644753
11714a1644753K746253L410339K980902Q10218k073392j868034K303901M856211
$$ -11644753 -8898500 -5488161 -2507259 -1697041 -3770433 -5638467 -3334566 1521645
11706A521645Q81374n648641o548481q82697M278373M274813J912784J115907
$$ 1521645 2403019 -3245622 -9794103 -10676800 -6398427 -2123614 -210830 905077
11698I05077J291255M52634n73904k30777M85772j31141j216939o02752J500787
$$ 905077 2196332 2648966 2075062 1844285 2330057 2198916 981977 379225 1880012
11689A880012K313507J47576l008975l451907l20076K857305K388377p67805k757450
$$ 1880012 4193519 4341095 1332120 -2119787 -2439863 417442 2805819 2038014 -719436
11680g19436k581318k321064j869122J127254M814713L269716l556691o999987
$$ -719436 -3300754 -5621818 -7490940 -6363686 -1548973 1720743 -1835948 -8835935
11672h835935k207001L364638J491896l213667j316637M808761M822958j339615
$$ -8835935 -11042936 -7678298 -6186402 -9400069 -10716706 -5907945 -1084987 -2424602
11664b424602k849025L356129P069804K171619l294036j266545L078329J141981
$$ -2424602 -5273627 -1917498 5152306 7323925 4029889 2763344 5841673 6983654
11656F983654m610505o011437k952865j443600j778264R63457O060249O538690
$$ 6983654 2373149 -3638288 -6591153 -8034753 -9813017 -8849560 -2789311 3749379
11648C749379L73200n629605n412648j131095J694866J889621K128605L498079
$$ 3749379 4122579 -1507026 -6919674 -8050769 -6355903 -4466282 -2337677 1160402
11640A160402M066848K376622j04207r43551j02137K75952m74998k69628J852005
$$ 1160402 5227250 7603872 7499665 6556114 6453977 6729929 6254931 5985303 7837308
11631G837308K894733k4998m427595n215340j919693R65488P18944p73026j136585
$$ 7837308 10732041 10707043 6279448 1064108 -855585 109903 828847 55821 -1080764
11622a080764l48258R21471K000901J369213r79497j347259K538652N724275K025815
$$ -1080764 -1429022 -507551 1493350 2862563 1883066 535807 3074459 8798734 10824549
11613A0824549n190682o433801m39436M131370K782519Q10926J675080N34239
$$ 10824549 5633867 -799934 -1239370 2892000 5674519 6485445 8160525 8694764
11605H694764m942777p530516k065677M481794L528125j595655k211818J357021
$$ 8694764 3751987 -3778529 -5844206 -1362412 2165713 570058 -1641760 -284739
11597b84739K182571n90881j629270L95535J836547J862338K704379L149784j12198
$$ -284739 1897832 1306951 -322319 73216 1909763 3772101 6476480 9626264 9514066
11588I514066n096496o030522k346986N48461l04094k301791k732460j745217
$$ 9514066 4417570 -1612952 -3959938 -3411477 -3715571 -6017362 -8749822 -10495039
11580a0495039K85993L271510N185156L861339Q64138l88764L34058N77484n32540
$$ -10495039 -10209046 -6937536 -1752380 2108959 2973097 2584333 2918391 3495875 2963335
11571B963335k031963l284094l110895L46931N256324N609399n7828m009341K53516
$$ 2963335 931372 -2352722 -5463617 -5116686 139638 5749037 5691209 1681868 1935384
11562A935384P138637O386361j743217p363280n536649j363896m52036j954267
$$ 1935384 9074021 15460382 13717165 6353885 817236 -546660 -998696 -2952963
11554b952963k312560k02846L174816M847802J988952l457924m912656r6795M473661
$$ -2952963 -5265523 -5468369 -2293553 2554249 4543201 1085277 -3827379 -3924174 549487
11545E49487L332595Q41014K694890M722001K61319o337800n746887J16756J172188
$$ 549487 3882082 4723096 7417986 12139987 12401306 6063506 316619 433375 1605563
11536A605563l124042l362758K078688L630239k027403n253767K27575O683681
$$ 1605563 -1518479 -4881237 -2802549 827690 -1199713 -6453480 -6225905 457776
11528D57776N147185j331268m600561l233636m15276K803305N504113M388533
$$ 457776 5604961 4273693 -326868 -3560504 -3975780 -1172475 4331638 8720171
11520H720171o59920l976761k239068L14617n35968k068131l38968K635131K710460
$$ 8720171 8060251 4083490 1844422 2159039 1623071 -445060 -784028 1851103 4561563
11511D561563J73709k055529k788413j741663J305539L919525K602185r09821
$$ 4561563 4735272 2679743 -108670 -1850333 -544794 3374731 5976916 5067095
11503E067095r13129K716492L482826o32226l291953q51196J380832q63426l023355
$$ 5067095 4153966 6870458 10353284 9721058 6429105 5577909 6958741 6095315 3071960
11494C071960m34964K914333J824049o99209M85780K861485R35967l670300n042967
$$ 3071960 2636996 5551329 7375378 6676169 7161949 10023434 10959401 7289101 2246134
11485B246134k715479j070989j327312p71988J622336M102511N066680L432918
$$ 2246134 -469345 -1540334 -2867646 -3639634 -2017298 2085213 7151893 10584811
11477A0584811j226378o054226o469122l032003j326696k240359J82270O960912
$$ 10584811 9358433 3304207 -3164915 -6196918 -7523614 -9763973 -9581703 -2620791
11469b620791R229966K074332n341180k944332M117304L641793m418125q823396
$$ -2620791 6609175 8683507 3342327 397995 4515299 8157092 3738967 -5084429
11461e084429m555803J910229M223760L004653O44115k115448l474191j525649
$$ -5084429 -9640232 -7730003 -3506243 -501590 142525 -1972923 -5447114 -6972763
11453f972763J458012J542734m39864n63550J265962J935487J296707J638162
$$ -6972763 -5514751 -3972017 -4411881 -4975431 -3709469 -1773982 -477275 1160887
11445A160887K295044P78113j942997k813290j716379r2210K637363N795063M595392
$$ 1160887 3455931 4234044 2291047 -522243 -2238622 -2330832 306531 6101594 10696986
11436A0696986k546817q027843m625042K706359L869045q34632k601364P31992
$$ 10696986 8150169 122326 -4502716 -1796357 2072688 1238056 -1363308 -631316
11428f31316K737914Q24388o84972l30721j493585l566932j888475K020771J055068
$$ -631316 2106598 2930986 2246014 1915293 421708 -3145224 -5033699 -3012928 -1957860
11419a957860m445481n392643J022869O016728L468127r72214p00912J513078
$$ -1957860 -6403341 -11795984 -10773115 -4756387 -1288260 -2260474 -2961386 -1448308
11411a448308O95247j114032J7003K242631K196589J314441J816707J610622j072473
$$ -1448308 -753061 -1867093 -1850090 392541 2589130 3903571 5720278 7330900 6258427
11402F258427k893325p80224K413081K685123J021502J92197k07675j275526j798060
$$ 6258427 3365102 2584878 4997959 7683082 8704584 8896781 8689106 7413580 5615520
11393E615520j490505k406174l836660j723783L243907L948069k040087p056972
$$ 5615520 4125015 1718841 -2117819 -3841602 -597695 3350374 1310287 -5746685
11385e746685m937901n09871l36290j356659K296935P323751O260101J98131l552366
$$ -5746685 -10684586 -11194457 -11530747 -12887406 -10590471 -3266720 2993381 3191512 -360854
11376c60854l410945l335306l195349N38684N765978O254442J993932q73004l97114
$$ -360854 -3771799 -7107105 -10302454 -9763770 -3997792 2256650 4250582 3377578 2980464
11367B980464m19734j810684j060251J633977J657990j280592k072481N60078
$$ 2980464 2560730 750046 -310205 1323772 2981762 1701170 -371311 188767
11359A88767J966682M19004k95698Q99637K76206k092883r04646L720124L856207
$$ 188767 2155449 2574453 2278755 3178392 3454598 1361715 457069 4177193 8033400
11350H033400k979641p805019l968192K089889J951998j200599R6903L652713
$$ 8033400 5053759 -2751260 -6719452 -4629563 -2677565 -3878164 -3781261 -128548
11342a28548K316104k265985k703196J61498j080437n496659l610375N784233
$$ -128548 2187556 -78429 -2781625 -2620127 -3700564 -9197223 -12807598 -7023365
11334g023365J1036631M873701m351531n550839n59631J376436j365266k517730
$$ -7023365 4013266 8886967 4535436 -1015403 -1575034 -198598 -1563864 -4081594
11326d081594M10966L050514K347876O14590L44756N20304k36742r60722o80526
$$ -4081594 -3670628 -620114 1727762 2342352 2687108 3207412 2970670 2009948 1329422
11317A329422m93807j459253k413050j556774Q36538K474460J496705j398925
$$ 1329422 835615 -623638 -3036688 -4593462 -3756924 -1282464 214241 -1184684
11309a184684l173753j426632K376953L845346R23204l083682l444570N3402L149077
$$ -1184684 -4358437 -5785069 -3408116 437230 1360434 -1723248 -5167818 -5114416 -1965339
11300a965339K530905q37377l579893l187196M71502N049398O997862M608787
$$ -1965339 565566 -271811 -3851704 -7038900 -6567398 -1518000 5479862 10088649
11292A0088649R8883k586426k107878p05175r78287k979094m516896l405357L28098
$$ 10088649 10187532 7601106 5493228 4788053 3809766 830672 -3686224 -7091581 -6763483
11283f763483L748736L449585k71822l020103j638916J650245K606682P68883
$$ -6763483 -3014747 434838 163016 -2857087 -4496003 -2845758 -239076 529807
11275E29807j045790j545887j553007p56886J769779L998046K551102j454049
$$ 529807 -515983 -2061870 -3614877 -4371763 -2601984 1396062 3947164 2493115
11267B493115k847131k213K687271J869584k9472k415K77314j550976l162415
$$ 2493115 -354016 -356229 2331042 4200626 4171154 4168739 4446053 2895077 -267338
11258b67338j104825K888117M150996J975623m75811j809879l122241l973411
$$ -267338 -1372163 1515954 5666950 7642573 7166762 5356883 2234642 -1738769
11250a738769k719711o93864r99926k717676j440485L245079N981128L521657
$$ -1738769 -4458480 -5152344 -6152270 -8869946 -10310431 -7065352 -1084224 2437433
11242B437433l39385p47678J427457K448028J809656J166697n7053l050364n391920
$$ 2437433 2098048 1350370 2777827 5225855 7035511 8202208 8145155 5094791 -297129
11233b97129l682071L80599J795074N498o72749J029155J194700j452123k146291
$$ -297129 -3979200 -3598601 -1803527 -1798029 -2470778 -1441623 -246923 -1699046 -3845337
11224c845337J441270L509207r24882o404807m410681K838182N352881J149931
$$ -3845337 -2404067 1105140 180258 -6224549 -10635230 -7797048 -2444167 -1294236
11216a294236j259997K191235M275483o56543o368343m681578J514810L859344
$$ -1294236 -2554233 -362998 3912485 3255942 -3112401 -7793979 -6279169 -2419825
11208b419825J894851J505644L386852K835984m00665j592265l69353j524055
$$ -2419825 -524974 980670 4367522 7203506 6802841 5210576 4841223 3317168
11200C317168n239097n245320O20011N794482M552286k67589k854330k168635
$$ 3317168 -1921929 -7167249 -6547238 -752756 3799530 3531941 677611 -1491024
11192a491024l98304J298024J849788l39864l576254k873241K703100P005706
$$ -1491024 -1889328 -591304 1258484 918620 -2657634 -5530875 -2827775 4177931
11184D177931M868068p84127l707177k574951n64895Q8505o12554j964673k421551
$$ 4177931 9045999 8261872 4554695 1979744 1414849 1503354 890800 -1073873 -3495424
11175c495424n45811J877294J233053j680076j628148K477619M724565J475313
$$ -3495424 -4041235 -2163941 -930888 -2610964 -4239112 -1761493 2963072 4438385
11167D438385k463425j682150J476355J993261M09834k14208q20823l083927l895551
$$ 4438385 1974960 292810 1769165 3762426 4172260 3958052 3137229 53302 -3842249
11158c842249l65367L360762J848445k257584k493238N86714J264829o96915k23848
$$ -3842249 -4207616 -846854 1001591 -1255993 -3749231 -3162517 -1897688 -2594603 -2818451
11149b818451L085150L969642Q14782k165096k761956l143468l534441j186648
$$ -2818451 266699 4236341 5051123 2886027 124071 -3019397 -6553838 -7740486
11141g740486K890355L514489l56015l583935l111974j765802j689285n40056
$$ -7740486 -4850131 -1335642 -1691657 -5275592 -8387566 -10153368 -11842653 -12382709
11133a2382709K891363N170961L658495O96266n10956o2237P72243J741758J869105
$$ -12382709 -9491346 -4320385 -661890 34376 -476580 -538817 233426 1975184 3844289
11124C844289l74297l605929m254651j821157O51274J760664K748153L293583
$$ 3844289 3469992 -135937 -4390588 -6211745 -5560471 -3799807 -1051654 2241929
11116B241929J761203k76487K31712J575171m68419m249717m090468p57427o73001
$$ 2241929 4003132 3726645 3958357 5533528 5065109 815392 -3275076 -4032503 -4705504
11107d705504l457860j260580O277838Q318923L1036p947981n502804J770937
$$ -4705504 -8163364 -9423944 -3146106 5172817 5203853 -2744128 -8246932 -6475995
11099f475995L277701K89586N96339L535987K935707j09137j0360J500324j009207
$$ -6475995 -3198294 -2908708 -2312369 1223618 4159325 4050188 4039828 5540152 4530945
11090D530945m139048k29130O954549N524339m514862r079714j626526O682304
$$ 4530945 391897 162767 7117316 12641655 8126793 -952921 -2579447 4102857
11082D102857M771161k342845l809516K79847K163174k2179j700907j136540o72628
$$ 4102857 8874018 6531173 2721657 3001504 5164678 5142499 3441592 2305052 1632424
11073A632424q08757j44000K55164j490280l347735j819097J950577L556684J922426
$$ 1632424 823667 679667 934831 -555449 -3903184 -5722281 -3771704 -215020 1707406
11064A707406j32075r40776j077844l79574J467387K234556p1936k448077k95046
$$ 1707406 1575331 634555 -443289 -822863 644524 2879080 2807144 359067 64021
11055F4021M561150N208044j5130m584942l481416o5914L37945j244768m87212
$$ 64021 4625171 9833215 9818085 5233143 1751727 1685813 2023758 778990 291778
11046B91778K338715L070745O40003j780940k135657j542146r72012K8332Q31855
$$ 291778 2630493 5701238 6341241 4560301 2424644 882498 -89514 -61182 770673
11037G70673j87979k153964j903679R61284K756168J298094n70998L36274K326906
$$ 770673 582694 -1571270 -3474949 -2513665 242503 1540597 969599 1305873 3632779
11028C632779J761528q67060j833946k90898O20953q79905k410255j342499J239352
$$ 3632779 5394307 4527247 2693301 2402403 3023356 2143451 -266804 -1609303 -369951
11019c69951K389012J287979n29668j796970k442039k366399j110112Q86336J868342
$$ -369951 2019061 3307040 2777372 980402 -1461637 -3828036 -4938148 -4051812 -2183470
11010b183470M73918k424256m277187l497643j090599Q43024J752212K641401
$$ -2183470 -1709552 -4133808 -8410995 -11908638 -12999237 -12156213 -10404001 -7762600
11002g762600L497420K528659r06569m108266l746805j84897K861418K846714
$$ -7762600 -4265180 -1736521 -2643090 -6751356 -10498161 -10683058 -7821640 -4974926
10994d974926P00154j424389k512308k185519j52189K329286K378082p91347l254133
$$ -4974926 -4274772 -5699161 -8211469 -10396988 -10549177 -8219891 -5841809 -6633156 -9887289
10985i887289m44934O085261R045861M103858m066082o975677k451613L395845
$$ -9887289 -10332223 -4246962 4798899 8902757 4836675 -2139002 -4590615 -1194770
10977a194770M344173J032907j653957j473423l26414k05119p56609r84399q79423
$$ -1194770 3149403 4182310 2528353 1054930 728516 523397 -233212 -1217611 -2097034
10968b097034o41979q6419M26246n8473j436680k109066j026617P70494J407008
$$ -2097034 -2739013 -2825432 -2399186 -2457659 -3894339 -6003405 -7030022 -6259528 -4852520
10959d852520L34544j258043j790637q96881J31899k1584m75420R59519L843750
$$ -4852520 -4517976 -5776019 -7566656 -8463537 -8331638 -8353222 -8828642 -7869123 -4025373
10950d025373M446396J276988j238376J435656O182861N612781r48826n727369
$$ -4025373 421023 1698011 459635 1895291 8078152 13690933 12742107 7014738
10942G014738l413763J695340K580061j031388m078309l738480j330593J219862
$$ 7014738 3600975 5296315 7876376 6844988 2766679 -971801 -2302394 -1082532
10934a082532K881288K736863Q94097p44845r07250p93300j587146k134742j251154
$$ -1082532 1798756 4535619 5429716 4684871 3777621 2984321 1397175 -737567 -1988721
10925a988721k3646N89306J813509L869731L706121k83783l968005k618123J498796
$$ -1988721 -2012367 -1423061 390448 4260179 7966300 7682517 3714512 1096389 2595185
10916B595185J916453k358010n321870k772309K123879L844627J579202j054618
$$ 2595185 4511638 2153628 -3168242 -5940551 -3816672 27955 1607157 552539
10908E52539j325753j62063m8792j474353k202596m59465J972428J761503r40243
$$ 552539 -773214 -935277 -984069 -2458422 -4661018 -5120483 -3148055 -1386552 -2326795
10899b326795k280282m19276J704788J183961l87348L1712J951985K596945J356027
$$ -2326795 -4607077 -5026353 -3321565 -2137604 -2524952 -2493240 -541255 2055690 3411717
10890C411717P71l64276j29492P2140k48810j177331j663786q03286P9041m78952
$$ 3411717 3412488 3048212 2918720 2990860 2742050 1564719 -99067 -902353 -823312 -1302264
10880a302264l53187L083390O337114L078973m642990o807241n17617M299914
$$ -1302264 -1655451 1427939 7765053 10844026 6201036 -606205 -1123822 3176092
10872C176092K17751n590059l139154M138826N690199Q59131k161460j141445
$$ 3176092 3393843 -2196216 -5335370 -1196544 4493655 5352786 3191326 2049881
10864B049881j531370m429315m353468R3868L402855K643811J119627R94260K60527
$$ 2049881 518511 -3910804 -8264272 -8170404 -4767549 -2123738 -1004111 -9851 250676
10855B50676j395536j110805J305001K704784K596549L324718M218186K395474
$$ 250676 -1144860 -2255665 -950664 1754120 4350669 7675387 11893573 14289047
10847A4289047r66400k349716k830610n245271o125523m17513O845080N304148
$$ 14289047 13322647 10972931 8142321 2897050 -3228473 -3645986 3199094 8503242
10839H503242l745331p664972j944972L591529J943338r35880P48898K052846
$$ 8503242 4757911 -2907061 -4852033 -1260504 682834 -253046 495852 2548698
10831B548698j849977n226861j862695L410880L179015j11642j14920J566868
$$ 2548698 698721 -4528140 -6390835 -2979955 199060 87418 -27502 1539366
10823A539366k33613l313577j968451J989416K095865j391542k299098P92458
$$ 1539366 1305753 -2007824 -3976275 -1986859 109006 -1282536 -3581634 -2789176
10815b789176L083026J932268n89304k787347m487156m009087j09261M007063
$$ -2789176 293850 2226118 1636814 -1150533 -5637689 -9646776 -9756037 -5748974
10807e748974M289202K171419J675661K003444l80175l534499j526472N267920
$$ -5748974 -1459772 711647 2387308 4390752 4010577 476078 -1050394 4217526
10799D217526Q582791L421349m882077p980405m718203m19015J220622J381752
$$ 4217526 12800317 16221666 11339589 3359184 -1359019 -1778034 -557412 824340
10791H24340J940562J900633j90615k396937j248430K464063L379363r20046n445837
$$ 824340 2764902 4665535 4474920 2077983 829553 3293616 6672979 5752933 307096
10782C07096m389867O49359L657853L081060K007804J217963j123472l433861
$$ 307096 -4082771 -3433412 224441 3305501 5313305 6531268 5407796 1973935
10774A973935j805676K293317K877523p36147k628996o70971o253l059358m387636
$$ 1973935 168259 2461576 5339099 4602952 1973956 1302985 1296732 -1762626 -6150262
10765f150262k41605M183268K873715j627181k964808l84774K137273K398043
$$ -6150262 -6391867 -2208599 665116 -962065 -3926873 -4311647 -2174374 223669
10757B23669R36162j153640j863047O22927L929971L195178j141391l051878o97811
$$ 223669 1159831 6191 -1856856 -1233929 2696042 5891220 4749829 1697951 1000140
10748A000140N45213k048011l568500q08788J446962p82162l089465m53141M081188
$$ 1000140 1545353 -502658 -4071158 -4879946 -3432984 -4215146 -7304611 -7757752 -3676564
10739c676564N131468L201848R14535k378752n794437m014489L450210P548443
$$ -3676564 1454904 4656752 5571287 3192535 -2601902 -6616391 -3166181 4382262
10731D382262K595270l582424j936560K769899O33507n886863o201927M50387
$$ 4382262 6977532 3395108 1458548 4228447 4861954 -1024909 -7226836 -6776449
10723f776449M533592K166963q68262r64784j065424k268176j399371J429012
$$ -6776449 -2242857 -75894 -944156 -1908940 -2974364 -5242540 -6641911 -5212899
10715e212899J887548m14341j042274Q45077J253708l25307M53518M049107M827032
$$ -5212899 -3325351 -3739692 -4781966 -3936889 -2683181 -3008488 -2554970 1494137 6321169
10706F321169K73197m478424m414199j248161P16220O43725K84659N33710J055604
$$ 6321169 6594366 2115942 -2298257 -3546418 -2830198 -2186473 -1901814 -1368104 -312500
10697c12500J064143k72641k301692k557149l33289J240250j89374j933183n56562
$$ -312500 751643 479002 -1822690 -4379839 -4713128 -3472878 -3662252 -5595435 -6151997
10688f151997K214134K658469J573492K076970L023531P84429l535978m713720
$$ -6151997 -3937863 -1279394 294098 2371068 5394599 6179028 2643050 -2070670
10680b070670j052183L610052N344012L458065p27036m511621m626760j181053
$$ -2070670 -3122853 487199 5831211 9289276 8562240 4050619 -576141 -1757194
10672a757194J203135j43841j451249J051570M003926K145191k601545m044825
$$ -1757194 -554059 -697900 -2149149 -1097579 2906347 5051538 2449993 -1594832
10664a594832j356907J057896J502613J916140K183993L80434j948957j164905
$$ -1594832 -2951739 -1893843 -391230 1524910 3708903 4089337 2140380 975475
10656I75475J999776L049376O49970k044887k580581j348759M90374J334367p75561
$$ 975475 2975251 6024627 6674597 4629710 2049129 700370 1190744 2525111 1749550
10647A749550m540825m684572Q06282O148949N446312J056568j322824j590959
$$ 1749550 -2791275 -7475847 -6669565 -520616 4925696 5982264 4659440 3068481
10639C068481k491292k237361J926973O057487M180645j445731l377422q22420
$$ 3068481 577189 -1660172 266801 6324288 10504933 9059202 5681780 4859360
10631D859360K40093k003616k956371p67730M56302j755221m171898l425762o04434
$$ 4859360 5099453 3095837 139466 -628264 -171962 -1927183 -6099081 -9524843 -10129277
10622a0129277J315354J055140n01465r36082J651311N173519M841205L06182
$$ -10129277 -8813923 -7758783 -8260248 -9196330 -7545019 -2371500 2469705 2775887
10614B775887k628771o86346J644930p9267k803909j862708J059847J976596J512324
$$ 2775887 147116 -539230 1105700 1026433 -1777476 -3640184 -2580337 -603741 908583
10605I08583J585883M13336k873495m103498r30431K072384J444561J017651L363923
$$ 908583 2494466 2907802 34307 -4069191 -4999622 -2927238 -1482677 -465026 2898897
10596B898897L385719j427589l464642K269659P042946J920551o139844n218788
$$ 2898897 6284616 4857027 1392385 3662044 10704990 12625541 6485697 1266909
10588A266909J982710M117237N65659n65879R41432j375400n934022m970996O65838
$$ 1266909 3249619 7366856 7932515 7366636 8308068 6932668 998646 -3972350 -3306512
10579c306512K859882P92516O47533K565185J289811j912959j203366J714418
$$ -3306512 -446630 345886 993419 3558604 4848415 2935456 1732090 3446508
10571C446508L36046l756514l502821M38595J710892N84752J545342K271981j598669
$$ 3446508 3782554 26040 -3476781 -3038186 -1327294 -742542 802800 3074781 1476112
10562A476112n019947j182928M034511P77278o221248m591726M025409O895204
$$ 1476112 -3543835 -4726763 -692252 85026 -6136222 -10727948 -6702539 192665
10554A92665J820120j861205j449088k283627l236531J237744O574759L528269
$$ 192665 2012785 151580 -1297508 -3581135 -6817666 -5579922 994837 4523106
10546D523106m043734m672900L46235N72861l155411j618724L113086J652435
$$ 4523106 479372 -4193528 -3847293 -3274432 -6429843 -8048567 -4935481 -3283046
10538c283046k720626K76462O227347L022686m558185k141180O174923L908184
$$ -3283046 -6003672 -5727210 500137 3522823 -1035362 -3176542 2998381 6906565
10530F906565o521295p234258J875376L333191m466015m940071L948410O002936
$$ 6906565 385270 -6848988 -4973612 -1640421 -6106436 -11046507 -7098097 -1095161
10522a095161j326500k788876L617916L222913m317852l305105N328388L689323
$$ -1095161 -2421661 -5210537 -1592621 1630292 -2687560 -5992665 -664277 3025046
10514C025046p255845p290250M029801N762672l366206k778805P294317M948325
$$ 3025046 -4230799 -11521049 -7491248 -1728576 -5094782 -7873587 -579270 4369055
10506D369055p222012l373419J2572562Q664662j2522751j2535616J0472175J3926678
$$ 4369055 -2852957 -6226376 6346186 15010848 2488097 -10047519 424656 14351334
10498A4351334q474932j1814760J1823260J2739894j6808856j5698442K6763765
$$ 14351334 5876402 -5938358 5884902 18624796 1815940 -13882502 12881263
10491A2881263L0308085k5408586k3336056J04241292K12222813J21399647r9928746
$$ 12881263 43189348 17780762 -5555294 98685998 310908811 432308458 332379712
10484C32379712k07250261j15871127R377361K0754892k7550506k4811895J4885800
$$ 332379712 125129451 9258324 18635685 39390577 11840071 -12971824 1913976
10477A913976J7229662j0888262j3301740O642283O097417j0553919p818376Q499297
$$ 1913976 19143638 8255376 -5046364 1595919 7693336 -2860583 -10678959 -2179662
10469b179662O651266p329370m539921Q678762N265091p849803l713909J1132255
$$ -2179662 4471604 -2857766 -7397687 1281075 6546166 -1303637 -5017546 6114709
10461F114709Q619254p521358r479023K712763L885767p562045q424636M142704
$$ 6114709 14733963 7212605 -2266418 446345 4332112 -3229933 -11654569 -7511865
10453g511865Q055417j922040n958734L354287R280757K638695m215649j973608
$$ -7511865 543552 -1378488 -7337222 -3982935 5297822 7936517 3720868 1747260
10445A747260J941171R10658n29438M96233m50912l870560m159981p67730J237864
$$ 1747260 3688431 4599089 4069651 4565884 4114972 244412 -3915569 -4683299 -3445435
10436c445435J437609L056496M061524Q83207k776065k153456r89797l500375
$$ -3445435 -2007826 1048670 5110194 5993401 3217336 1063880 74083 -3426292
10428c426292m117283K156200P487661L426012l113361j410187L908060J959204
$$ -3426292 -7543575 -5387375 2100286 5526298 2412937 1002750 4910810 6870014
10420F870014l949531l020322K301558J096966n168886n327933R53297L436503
$$ 6870014 2920483 -99839 2201719 3298685 -1870201 -7198134 -6244837 -2808334
10412b808334K67260o49684J852262J012471k866222k224662K544550K863988
$$ -2808334 -2541074 -3190758 -1338496 -326025 -3192247 -5416909 -2872359 -8371
10404h371k064927l456855J258495M279033J398553j949965j257150R82887K172537
$$ -8371 -2073298 -5530153 -4271658 7375 1405928 -544037 -1801187 -818300 1354237
10395A354237L426679M511893K831470j199771m116449m545699k998372R90796
$$ 1354237 4780916 9292809 12124279 10924508 6808059 2262360 -736012 254784
10387B54784N569548M607668l558201j0048323o643260J558034M025869P21656
$$ 254784 5824332 10432000 6873799 -3174524 -9817784 -8259750 -4233881 -3512225
10379c512225l28137K511491L674890J546505l68235j658449m314599n560917
$$ -3512225 -3840362 -1328871 2346019 3892524 3524289 1865840 -2448759 -8009676
10371h009676j279576M881016N440801R18956j429756M90917J931194N80658r19468
$$ -8009676 -9289252 -4408236 1032565 1951521 521765 1012682 2943876 3524534 2605066
10362B605066j160896j271133r62332L85187O46139j286167k028069J77943P93817
$$ 2605066 1444170 173037 -789295 -404108 242031 -1044136 -3072205 -2894262 -2100445
10353b100445k800205m469020Q97506O946148N103991j350116l299331q59905
$$ -2100445 -4900650 -9369670 -8472164 -1526016 3577975 2227859 -1071472 -1931377
10345a931377p61224k832689j463851K296839K335889o94437p57716J904384J772411
$$ -1931377 -2692601 -5525290 -6989141 -4692302 -2356413 -3050850 -3808566 -1904182 -131771
10336a31771o90696K0302L314325L241668m34448k344618j662828j934049k280628
$$ -131771 -822467 -802165 2512160 5753828 5319380 2974762 1311934 -622115 -2902743
10327b902743O72971L836173J632673k870799k337271J348473N48938k910137
$$ -2902743 -2229772 1606401 3239074 368275 -1968996 -620523 -71585 -2981722
10319b981722j02217P707747R043667J213617n194932l898107j056599j804637
$$ -2981722 -3083939 4623808 13667475 14881092 9686160 5788053 4731454 2926817
10311B926817k207539J27118K51669l178372l155126K723478N916649J136045
$$ 2926817 719278 846396 1098065 -2080307 -5235433 -2511955 3404694 4540739
10303D540739l811856j007730M372651L522765j356126k329289L92641N19157
$$ 4540739 728883 -278847 4093804 7616569 6260443 3931154 4323795 4842952
10295D842952k193135k086354J758683L928078J644570j824107l253769l118391
$$ 4842952 2649817 563463 2322146 6250224 7894794 6070687 2816918 -301473
10287c01473k304398j59755K628913L021625l92010m646551n647378l056507j47281
$$ -301473 -2605871 -2765626 -136713 2884912 2492902 -2153649 -7801027 -10857534 -11004815
10278a1004815Q17198R46084J682232J786356o2260j510880M11504L347222K246115
$$ -11004815 -10187617 -9241533 -7559301 -5772945 -5835205 -7346085 -6934581 -3587359 -1341244
10269a341244j725765j714162L349714N507256L27049m960310k437894M083997
$$ -1341244 -3067009 -4781171 -1431457 4075799 4402848 -557462 -2995356 1088641
10261A088641N751481K337354R8053P4498j628081m388283l706431j32656J496839
$$ 1088641 6840122 9177476 9275529 9350027 7721946 3333663 -372768 -505424 991415
10252I91415R11475J721900K779777l68120n452170m728778K293379O583822K649537
$$ 991415 1902890 3624790 6404567 6036447 584277 -4144501 -1851122 4732700 7382237
10243G382237m132130o245224l256994O86510K800252K387688K46936r63116L44888
$$ 7382237 3250107 -2995117 -6252111 -5565601 -2765349 -377661 -130725 -1093841 -748953
10234g48953J422237p22524l321979j775099K053796K569241J23635j23826J893167
$$ -748953 673284 -49240 -3371219 -5146318 -3092522 -523281 -399646 -523472 1369695
10225A369695J388458j393157j349584Q40907j048776o053137m982708L888623
$$ 1369695 2758153 1364996 15412 856319 -192457 -6245594 -11228302 -7339679
10217g339679R434855M226415l634285l214188K958832M398594j377158p422255
$$ -7339679 2095176 6321591 2687306 -526882 2431950 6830544 5453386 -1968869
10209a968869q285582m511867J200805N613359N019884j59980l100901J125402
$$ -1968869 -10254451 -14766318 -13565513 -7952154 -2932270 -3092250 -6193151 -5067749
10201e067749P158167N808806k417713p316896k956208M845004P127005K713319
$$ -5067749 2090418 7899224 5481511 -1835385 -4791593 53411 7180416 9893735
10193I893735k680217m655325l551902j407846N61548J344773J37509j898245
$$ 9893735 7213518 2558193 -993709 -2401555 -1840007 -495234 -357725 -2255970
10185b255970k215109o67522l55785k529309l365218L85858M884319L923031r77717
$$ -2255970 -4471079 -5138601 -5494386 -8023695 -11388913 -11003055 -6118736 -2195705 -3173422
10176c173422k225344J580014L147607j058928m397461j198501L558161K851459
$$ -3173422 -5398766 -3818752 -671145 -1730073 -6127534 -7326035 -3767874 -916415
10168i16415p96576q46403J557841R51730j356480J85389M081575L474107j619294
$$ -916415 -1712991 -2559394 -1001553 -49823 -1406303 -1220914 2860661 6334768 4715474
10159D715474l884332j038883J059853q04233k381530n18997J550960Q51472k04451
$$ 4715474 831142 -207741 852112 47879 -2333651 -2852648 -1301688 -450216 -654667
10150f54667J123848L205481L584507K702357J568312k93760k624237l641124
$$ -654667 469181 3674662 7259169 9961526 11529838 11236078 8611841 4970717
10142D970717k729685r93710Q46310K034689O01851l417372n571687k640699J716840
$$ 4970717 2241032 1247322 2093632 4128321 4730172 1312800 -4258887 -6899586 -5182746
10133e182746K536349J579628K747759L097422k147970q218190n764278L320742
$$ -5182746 -2646397 -1066769 1680990 4778412 2630442 -5587748 -11352026 -8031284
10125h031284P080820J910441k417215N89600M531997K574442j543681k044089
$$ -8031284 -950464 959977 -1457238 -867638 3664359 6238801 4695120 2651031
10117B651031j205533k874098l746750J63550M462556K656187k774984m036240
$$ 2651031 1445498 -1428600 -5175350 -5011800 -549244 2106943 -668041 -4704281
10109d704281m4275K918992J259213j834893k242192M8592K149468J597048j435686
$$ -4704281 -4748556 -1829564 -570351 -2405244 -4647436 -4598844 -2449376 -852328 -2288014
10100b288014l838818k668996Q46980K780901K212299J833838K444374J686378
$$ -2288014 -6126832 -8795828 -7948848 -5167947 -2955648 -1121810 1322564 3008942
10092C008942m77785n68018J810852J865887k448987n821996l445934J142627
$$ 3008942 2531157 1963139 3773991 5639878 3190891 -2631105 -6077039 -4934412
10084d934412J505311j766743k455559J502907N145129L740247j023322l594003
$$ -4934412 -3429101 -5195844 -7651403 -6148496 -1003367 2736880 1713558 -1880445
10076a880445j501074J841612J637139j789163l261347m28454K247345L06513
$$ -1880445 -3381519 -1539907 97232 -1691931 -4953278 -5381732 -3134387 -2827874
10068b827874l351177l097622J20244Q73801q06052M46031M941827O104205J354837
$$ -2827874 -6179051 -9276673 -9156429 -8282628 -9088680 -8642649 -3700822 2403383 3758220
10059C758220l045007j925964R00374k57326l534515l172960R23863L341659J532554
$$ 3758220 713213 -1212751 -312377 -569703 -4104218 -7277178 -6353315 -3011656 -1479102
10050a479102r58480q7829L067401L857748M00753l397419k850053N23441J060314
$$ -1479102 -2437582 -2525411 541990 4399738 4800491 1403072 -1446981 -923540 136774
10041A36774j536406r61497M356682O206873n80761p497295m345832L817646M062697
$$ 136774 -1399632 -2361129 1995553 8202426 7621665 124370 -4221462 -403816 3658881
10032C658881l509093o341424l79460M373923J791322j275108R51080L060537
$$ 3658881 149788 -6191636 -6571096 -2197173 -405851 -1680959 -729879 2330658
10024B330658l36753m314158k722558J391049K473066J794457K397316J940457
$$ 2330658 1993905 -2320253 -5042811 -3651762 -1178696 615761 3013077 4953534
10016D953534j570111l438197L15835M804665L391002j794383l875893j597106
$$ 4953534 3383423 -54774 261061 5065726 8456728 6662345 2786452 1189346
10008A189346J245749K838908L304419J315031l055523n555929l446806l26347
$$ 1189346 2435095 5274003 8578422 9893453 6837930 1282001 -2164805 -2491152
10000b491152j13631n92018J452512L368150J405281j826921j575593Q32436Q83738
$$ -2491152 -2604783 -3196801 -1744289 1623861 3029142 1202221 -373372 459064 1342802
9991A342802r23924p05491J232903J192791j017035k122859j261888l86165J32545
$$ 1342802 418878 -286613 946290 2139081 1122046 -1000813 -2262701 -2648866 -2516321
9982b516321J270319J821694j5054k341837j414542K619553N698585N220320K293229
$$ -2516321 -1246002 575692 560638 -1781199 -3195741 -576188 5122397 10342717 12635946
9973A2635946q16894k713206k845359j652655l70252L31394N47847r7648j802135
$$ 12635946 11819052 9105846 6260487 4607832 4237580 4568974 5116821 5019173 3217038
9964C217038k872431j651512J17611m30315k084952j247224J618706K715988J754513
$$ 3217038 344607 -1306905 -1189294 -1619609 -3704561 -4951785 -3333079 -617091 1137422
9955A137422J617499J443159k128392o310286l935926M149219Q139418M028361
$$ 1137422 2754921 4198080 2069688 -4240598 -8176524 -4027305 4112113 8140474
9947H140474o32710k75948j51829m966263q641363m362834L034051M422541K55509
$$ 8140474 7507764 7231816 7079987 2113724 -6527639 -10890473 -7856422 -3433881 -3178372
9938c178372k304119j434530o58788l21520K106856N300610N242570J809858j595202
$$ -3178372 -5482491 -6917021 -7575809 -7897329 -5790473 -489863 4752707 6562565 4967363
9929D967363l180196k877290k55004L114136K802591k141600n822069l341675
$$ 4967363 1787167 -1090123 -1345127 1769009 4571600 2430000 -3392069 -6733744
9921f733744J942891L934493K385250Q41551J58190o04320n61152P41716J037697
$$ -6733744 -4790853 -856360 1528890 2370441 2528631 1924311 1363159 2104875 3142572
9912C142572m82349q16263J236908K062864k62463k035499p21729K89389j697371
$$ 3142572 2660223 1843960 3080868 5143732 4881269 2845770 2124041 2413430 716059
9903G16059l498732k330672r94976j845923j942254Q31668L183740K514457J005509
$$ 716059 -2782673 -5113345 -6108321 -7954244 -9896498 -9064830 -5881090 -3366633 -2361124
9894b361124o5507k414047m147393o34249M898236L228695m548835o243473Q26954
$$ -2361124 -2426631 -4840678 -8988071 -9622320 -4724084 -1495389 -6044224 -12287697 -11460743
9885a1460743M321868r46279l294918L316594O455564j502126p190963m12801
$$ -11460743 -7138875 -8085154 -11380072 -8063478 -1607914 -3110040 -10301003 -10713804
9877a0713804N775374l24150n661141L85926k498805l1598127n6248721l1709504
$$ -10713804 -4938430 -5262580 -10923721 -10537795 -13036600 -44634727 -100883448 -132592952
9869a32592952K8179720N9744786L6228247K41676m535566R431963R127386l269542
$$ -132592952 -104413232 -44668446 -8440199 -8198523 -12734089 -3302126 5825260 2555718
9861B555718m247820N759860O839153l111319p432154j726234J326839k966846
$$ 2555718 -1692102 4067758 10906911 7795592 363438 -1362796 -35957 -3002803
9853c002803m525498J276487N555578K096710l147236l364646n49704O43152M58122
$$ -3002803 -7528301 -6251814 -696236 1400474 -1746762 -5111408 -5661112 -5017960 -4559838
9844d559838J276661K765384L034574J635203k05352r12475k55644j48875j922035
$$ -4559838 -3283177 -517793 2516781 4151984 3946632 3034157 2778513 2629638 707603
9835G07603k978279j542M423790L913204j880923n843947l947182n70057j82050
$$ 707603 -2270676 -2272218 2151572 6064776 4183853 -1660094 -5607276 -6177333 -6359383
9826f359383m73471J810745M143537K648614r70049j865418J232332N102158N787554
$$ -6359383 -6832854 -5022109 -878572 1770042 799993 -1065425 166907 5269065 11056619
9817A1056619J838877l704712m907505k43338L395046k99570o373824n181469
$$ 11056619 12895496 9190784 4283279 4039941 7434987 7135417 761593 -4419876
9809d419876K077735M869961L53986k919154l01122K293806Q72100J19964K092922
$$ -4419876 -2342141 2527820 2881806 -37348 -338470 1955336 2827436 2947400 5040322
9800E040322L66580o990484j0083347k302592P064241O046223k015285m920968
$$ 5040322 5406902 -1583582 -11666929 -13969521 -6905280 -859057 -2874342 -7795310
9792g795310k60548L708385K360712n12491r05443O22380J962148J712374m28824
$$ -7795310 -8055858 -4347473 -1986761 -2499252 -3404695 -2782315 -820167 892207 463383
9783D63383j960688P01621N756934O176035R3267m944684l006505J303939J039640
$$ 463383 -1497305 -795684 4961250 11137285 11230552 6285868 3279363 4583302 5622942
9774E622942k116535k330166N8270M74742j352246k122223j448342j282200j389275
$$ 5622942 3506407 1176241 1234511 1709253 357007 -1765216 -3213558 -4495758 -5885033
9765e885033p20127m56400j169615n59088J812788K146931q55865k355814N54367
$$ -5885033 -6605160 -7061560 -8231175 -8790263 -6977475 -4830544 -5686409 -8042223 -7487856
9756g487856L193511J495845n27302J627625M202454J905217k274112k470705
$$ -7487856 -4294345 -2798500 -3325802 -1698177 2504277 4409494 2135382 -335323
9748c35323j46723q2381p69496J894705N244654L784257o27960j999031q20150
$$ -335323 -482046 -564427 -1333923 560782 5805436 9589693 8961733 6962702 6142552
9739F142552j831584l670678j075341L958727L757410k186701n737229k549458
$$ 6142552 4310968 640290 -435051 3523676 7281086 5094385 -642844 -3192302
9731c192302K708552M862777M043145J668464j964270m624701l431479m19156
$$ -3192302 -483750 4379027 8422172 10090636 8126366 3501665 70186 -348970
9723c48970m98018l109013k576178K209825N292516K646429k445919n134455m842596
$$ -348970 -846988 -3956001 -6532179 -4322354 970162 3616591 1170672 -3963783 -8806379
9714h806379l310062j320633O70705K017055K961998L619831K621096j00980j204203
$$ -8806379 -12116441 -13437074 -12766369 -10749314 -7787316 -4167485 -1546389 -1647369 -2851572
9705b851572J112020K712655l31774m080132k369784K240782J927275l015636
$$ -2851572 -1739552 973103 641329 -3438803 -5808587 -3567805 -1640530 -4656166
9697d656166m029396J521047N910198L734592j57685K957J620753k85872l864638
$$ -4656166 -8685562 -7164515 -1254317 2480275 2322590 2325547 3946300 3660428 -204210
9688b04210l666821O19238M287637M201777J021981l220586o274355n934300j998052
$$ -204210 -3871031 -3251793 1035844 5237621 6259602 3039016 -3235339 -9169639 -11167691
9679a1167691K914660N808354N335810J483858l932173o475801k767604M170874
$$ -11167691 -8253031 -2444677 2891133 4374991 442818 -6032983 -8800587 -4629713
9671d629713P262535M191006k96871k045619k424544l440673l245244l01955K278205
$$ -4629713 2632822 6823828 6526957 4481338 2056794 -1383879 -4629123 -4931078 -2652873
9662b652873J139730j606685j616500R27252K246012J207952K38434N75847P21818
$$ -2652873 -1513143 -3119828 -4736328 -3809076 -1563064 -355112 -116678 459169 1180987
9653A180987q0423l22117Q33340J766993R58475m65169l24053J323253K003592
$$ 1180987 1100564 778447 1611787 3378780 4337255 3872086 3548033 4871286 6874878
9644F874878M3473l099418m463594l055204n82646J218467K367204L020620J994142
$$ 6874878 6918351 3818933 -644661 -3699865 -4282511 -3064044 -696840 2323780 4317922
9635D317922j168532l959631l361949j52176J873887J160548K21678J345497K989779
$$ 4317922 3149390 -810241 -4172190 -4324366 -2450479 -1289931 -1068253 277244 3267023
9626C267023K284090n34798k489623k127337j193432j537562k196339j158541
$$ 3267023 5551113 5016315 2526692 399355 -794077 -2331639 -4527978 -5686519
9618e686519R05613J100297j045915j971369R11578M674152M501224P33504j634610
$$ -5686519 -4780906 -3680609 -4726524 -6697893 -5786315 -1112163 3389061 4122565 2487955
9609B487955m52931R16456l90349k364645k187893r51376r89238j315230M65787
$$ 2487955 2035024 2951480 2561131 196486 -1991407 -2942783 -3932021 -5247251 -4781464
9600d781464L442173M350888K438435J31749q37149j262162k339487l699487l811355
$$ -4781464 -1339291 3011597 5450032 5581781 4744632 3482470 1142983 -2556504 -6367859
9591f367859j483060K531770N037149L070580k114064n627736m548839r03016
$$ -6367859 -7850919 -5319149 -282000 2788580 674516 -4953220 -9502059 -10405075
9583a0405075J908342L004949K974211J906863M82095K54533Q71031k7554k151346
$$ -10405075 -8496733 -5491784 -2517573 -610710 -128615 125918 996949 969395 -1181951
9574a181951j578874K705535N365292K008890l473613l971978O78513L877692
$$ -1181951 -2760825 -55290 5310002 7318892 3845279 -126699 551814 4429506
9566D429506J625142l016281m757224j893134K699585M208600N04751m400424
$$ 4429506 6054648 3038367 -1718857 -3611991 -912406 3296194 3800945 -599479
9558e99479l994033J900112N848842L198501j236787j450928J20871j888655n063589
$$ -599479 -4593512 -2693400 3155442 6353943 5117156 3666228 3787099 1898444 -3165145
9549c165145k889940L132959M738013K86601k455209J086154N401109M152309
$$ -3165145 -6055085 -2922126 1815887 2102488 -352721 733433 6134542 10286851
9541A0286851o92667l419836k914007j817989j156643j46514R90197J396659J211068
$$ 10286851 9594184 6174348 3260341 1442352 285709 139195 1129392 2526051 3737119
9532C737119P45992k54153j169267m34617J786873K970562J497287j253741k889399
$$ 3737119 4483111 4228958 3059691 2625074 4411947 7382509 8879796 7626055 4736656
9523D736656k422818m96616J037429J48054k643667l537755k77955L640981L411454
$$ 4736656 2313838 1817222 2854651 3002705 359038 -3178717 -3456672 184309 3595763
9514C595763L03226l28304K131455K563739j264732n001420m682940k104450m76672
$$ 3595763 3898989 3570685 5702140 8265879 7001147 1999727 -2683213 -4787663 -5264335
9505e264335N11390J931290K016078p30989l752813l581109p86528J458163K123262
$$ -5264335 -4752945 -2821655 -805577 -1536566 -5289379 -8870488 -9657016 -8198853 -6075591
9496f075591K606729L441182L504575K134813J44263j146075j033186o5608K77923
$$ -6075591 -3468862 -27680 3476895 5611708 5755971 4609896 3576710 3511102 3789025
9487C789025n18684q11416Q66720K878931K354071l88767k244632k065725j683894
$$ 3789025 3270341 2458925 3325645 6204576 8558647 8169880 5925248 3859523 2175629
9478B175629j999198j726269o95457n93350j387124q75973R52908J254718l72466
$$ 2175629 176431 -1549838 -2245295 -2838645 -4225769 -5101742 -4148834 -2894116 -3266582
9469c266582m37407K174783L143344m77475m508083l306470J827678M853882L585636
$$ -3266582 -3703989 -1529206 1614138 1136663 -3371420 -6677890 -4850212 3670 3589306
9460C589306J079762l98604j681380k976195k573157l55121J146756O48117P3132
$$ 3589306 4669068 4270464 2589084 -387111 -2960268 -3315389 -2168633 -1520516 -1447384
9451a447384J114030K449171K208997J058382O72826P23994k11001j697896k020119
$$ -1447384 -333354 2115817 4324814 5383196 6056022 6780016 6569015 4871119 2851000
9442B851000j394035j758698k897250j978443J321257K544600j166318m894611
$$ 2851000 1456965 -301733 -3198983 -5177426 -3856169 -1311569 -2477887 -7372498
9434g372498j496444P166244J0709032L854366o145660r380872n586607j433481
$$ -7372498 -8868942 -1702698 9006334 12860700 6715040 -2665832 -8252439 -9685920
9426i685920L63959K310102M541920L659731k75761k304235j78187K056619O97248
$$ -9685920 -9321961 -7011859 -2469939 1189792 914031 -1390204 -1568391 488228 1185476
9417A185476k060493k305228l28995J059806J209353J158943P02581p13099j715249
$$ 1185476 -875017 -3180245 -3509240 -2449434 -1240081 -81138 621443 -91656 -1806905
9408a806905p86601P88595P33652l16603J28339J704310R39478l231525o524059
$$ -1806905 -2593506 -1804911 -1071259 -1387862 -1259523 444787 1384265 -1847260 -8371319
9399h371319m181101K554439P436029O631900K703268K47670J7157k71537j049350
$$ -8371319 -12552420 -9997981 -2561952 4069948 6773216 7020886 7038043 6766506 5717156
9390E717156n38745R33860L53888k906676n001484k856346J293031L068891J332632
$$ 5717156 5178411 6112271 6466159 3559483 -1442001 -4298347 -3005316 63575 1396207
9381A396207j900456m500297m767407j628626K843418L816435r5857l675134j822153
$$ 1396207 -504249 -5004546 -9771953 -11400579 -8557161 -4740726 -4836583 -8511717 -10333870
9372a0333870L238917N638691M069616J518091o62168k777871k908719O87358
$$ -10333870 -7094953 -1456262 2613354 4131445 3469277 691406 -2217313 -1529955
9364a529955M402603L003432j925621l757004r09877J680889J549019J723900
$$ -1529955 2872648 5876080 3950459 193455 -716422 964467 2513486 4237386
9356D237386L333917K779464r36640l146112j440348j41568k519220m610874k066334
$$ 4237386 7571303 10350767 9414127 6268015 4827667 4686099 2166879 -2443995 -4510329
9347d510329K065232K386270q4954n73856R15201L38065k533149l381418o32924
$$ -4510329 -2445097 -58827 -143781 -717637 197564 535629 -1997520 -5378938 -6011862
9338f011862J966402J348671n05967k36339J620382J503676j862431n054206l780047
$$ -6011862 -4045460 -2696789 -3202756 -3439095 -1818713 -315037 -2177468 -7231674 -11011721
9329a1011721J425334N131434L708783J48114m27604J590573J447260j567764
$$ -11011721 -9586387 -4454953 -746170 -598056 -1025660 564913 2012173 444409
9321D44409k342150J601449N062584K403402l789149n964894j777810L478940
$$ 444409 -1897741 -296292 4766292 7169694 3380545 -2584349 -4362159 -883219
9313h83219M352537J432909q57992k17648J480681J397700m96808j845487j661255
$$ -883219 3469318 4902227 4044235 3826587 5307268 6704968 6208160 4362673 2701418
9304B701418j639224k747854k932136o58272J480336M38866j631818k74832L358662
$$ 2701418 1062194 -1685660 -4617796 -5276068 -3795732 -3356866 -4988684 -5263516 -1904854
9295a904854L248971j802035n055510j322992N139397O310542J091744l820211
$$ -1904854 1344117 -457918 -5513428 -6836420 -1697023 4613519 5705263 1885052
9287A885052k656121K977852O505414L776031k347247n195110k379327J301435
$$ 1885052 -771069 2206783 8712197 12488228 10140981 4945871 2566544 3867979
9279C867979Q75373j756055j768163K06582l44359l123903l042956O86997K813635
$$ 3867979 4743352 2987297 1219134 1425716 1081357 -2042546 -5085502 -4398505 -1584870
9270a584870J022780o29034J93756n864k851117l564328P17958M620323K701072
$$ -1584870 -562090 -1191124 -997368 -1003232 -3854349 -7418677 -6700719 -2080396 620676
9261F20676j501773j395568K081839L031190N87421r59330j83460J89938p96804
$$ 620676 -881097 -2276665 -194826 2836364 3423785 2464455 2280995 2470933 1674129
9252A674129j154118m30260k70127o70294p1950J180228J426821J044540J417527
$$ 1674129 520011 89751 -180376 -850670 -922620 257608 1684429 2728969 4146496
9243D146496J574740j93011k376175j956493P75008K914577L349175K635470J28626
$$ 4146496 5721236 5528225 3152050 1195557 1970565 4885142 8234317 10869787 10998413
9234A0998413m103383o033375k070824L808696L549428l497562q616621n461444
$$ 10998413 6895030 861655 -1209169 2599527 6148955 2651393 -5965228 -11426672
9226a1426672J664304M708444K688949R26373J965397K638810L79209k141163
$$ -11426672 -9762368 -5053924 -2364975 -1438602 526795 3165605 3544814 1403651
9218A403651j251845J436750R06986l287514n183531q67479M884078M917514L69525
$$ 1403651 151806 1588556 2495542 -791972 -5975503 -6842982 -1958904 2958610 3328135
9209C328135j113897K540819M693742J039408l284605k196891J524285J161285
$$ 3328135 2214238 4755057 9448799 10488207 7203602 5006711 6530996 7692281
9201G692281l126914n295857l252588r94522j230794j779427k40166K355345L932873
$$ 7692281 4565367 -730490 -3983078 -4977600 -6208394 -7987821 -8227987 -5872642 -1939769
9192a939769M092256L253062J513100p26510k526635l089391j934036O34486K428756
$$ -1939769 2152487 5405549 6918649 6192139 3665504 576113 -1357923 -723437 1705319
9183A705319Q25473l186949m951577k260909J275335J679031L39808P37618K387194
$$ 1705319 2530792 -656157 -5607734 -7868643 -6593308 -4914277 -4574469 -3836851 -1449657
9174a449657K521938J505627J606381J956600r8011l428646l972403j074963J593808
$$ -1449657 1072281 2577908 4184289 6140889 6042878 2614232 -1358171 -2433134 -839326
9165h39326J722395Q25669O26254P32860N01610K6171j071203l010055m081453
$$ -839326 883069 1708738 2334992 3067852 3569462 3595633 2524430 -485625 -4567078
9156d567078k330375J209510L622924L910738L097100J620400m31495j725535
$$ -4567078 -6897453 -5687943 -2065019 1845719 4942819 6563219 6131724 4406189
9148D406189j474964j338146k248672j576254K306140N154323K278164l025121
$$ 4406189 2931225 1593079 -655593 -2231847 74293 5228616 7506780 4481659
9140D481659l298415J552051M100310J358114j134108M45717J756592j407638
$$ 4481659 1183244 2735295 6835605 8193719 7059611 7505328 9261920 7854282
9132G854282n025087l180775K056688L747246N66958k212974j368770N45894P53450
$$ 7854282 2829195 -351580 1705108 5452354 6019312 3806338 2437568 2983462 3736912
9123C736912M69178J507945K367960O81020k433009l587900k058741n27929o36423
$$ 3736912 4206090 5714035 8081995 8763015 6330006 2742106 683365 155436 -480987
9114d80987q72020k69337r11216l673634m416359N71083O947538O607822j82766
$$ -480987 -1353007 -1622344 -2533560 -6207194 -10623553 -10052470 -3104932 3502890 3320124
9105C320124m193457r60265K560257l72584n270729m098058J596471L761179O87424
$$ 3320124 -873333 -1833598 726659 354075 -4916654 -9014712 -7418241 -3657062 -2969638
9096b969638j973608j327399M8596P88805K028999K176770j418328n113337j894856
$$ -2969638 -4943246 -6270645 -6222049 -5433244 -3404245 -1227475 -2645803 -7759140 -9653996
9087i653996O658378R959478L228741n106136n324029Q53149M684630K521492
$$ -9653996 -2995618 6963860 10192601 5086465 -237564 615585 5300215 7821707
9079G821707j951202m309769l569259j606624j215733k993042l352742J042748
$$ 7821707 5870505 1560736 -2008523 -3615147 -4830880 -7823922 -11176664 -10133916
9071a0133916O742294O693187Q18976l228716j907037o57700l177209m171164
$$ -10133916 -3391622 3301565 4120541 891825 -1015212 -1672912 -4850121 -9021285
9063i021285P58668N529144K625168l818400l970742K097657N337575K802111
$$ -9021285 -8262617 -2733473 -108305 -3926705 -7897447 -5799790 -462215 2339896
9055B339896Q37927K307600J565557m008013p133548j747647O064038O060541
$$ 2339896 3177823 5485423 7050980 3042967 -4090581 -5838228 225810 6286351
9047F286351j353038o260668l571253J313873J976446l08839l81549K494266M259662
$$ 6286351 4933313 -1327355 -4898608 -3584735 -1608289 -1917128 -2298677 195589 4455251
9038D455251K463297o28633j694565o62488K002q60618j706490r20757N68514
$$ 4455251 6918548 6289915 4595350 3932862 3934864 3074246 1367756 446999 1015513
9029A015513O09470p53651j066822O80210J931103J73476k807507l264736j406714
$$ 1015513 1624983 871332 -195490 484720 2415823 2589299 -218208 -3482944 -4889658
9020d889658r48280k177497n95115M691482O594083j12191q481999p149951K865316
$$ -4889658 -5837938 -8015435 -8610550 -3919068 2675015 2562824 -5919175 -13069126 -10203810
9011a0203810Q425347K967490m545232l958769J485196K424852j321237k304359
$$ -10203810 -1778463 1189027 -3356205 -7314974 -5829778 -3404926 -4726163 -7030522
9003g030522J149015L058940Q04281j064230M50593J949089L48529j665978m22273
$$ -7030522 -5881507 -2822567 -2018286 -3082516 -2631923 -682834 -334305 -2000283 -2422556
8994b422556K857248M305925K623852m60844k613294k051824J410741N005895
$$ -2422556 434692 4740617 7364469 6903625 4290331 2238507 3649248 8655143
8986H655143M766557n8547n869282q492917o590746j619593L430679N519582L969417
$$ 8655143 13421700 13363153 7493871 -999046 -7589792 -9209385 -5778706 -259124 3710293
8977C710293J081998j224329l643263o046517m852697J735881Q333122P993927
$$ 3710293 4792291 3567962 -75301 -6121818 -10974515 -9238634 -905512 7088415
8969G088415J950547k317447j898317o79147j001075n55969J247628J258117q62663
$$ 7088415 9038962 6721515 4823198 4144051 3142976 2587007 3834635 5092752 4230089
8960D230089j079176J297217J367522k390335m018185L28411N220212M215490
$$ 4230089 3150913 4448130 5815652 3425317 -592868 -264457 4955755 9171245
8952I171245k95421k098420j446832k890783n708291m365667J898925O632879
$$ 9171245 8875824 6777404 5330572 2439789 -3268502 -7634169 -5735244 897635
8944H97635M669156j320666m402742j213823M675113O458423J585371m614205
$$ 897635 5566791 4246125 -156617 -1370440 3304673 9763096 11348467 6734262
8936F734262n032346k80762K176393p25502l105826q360M191431K848078k141154
$$ 6734262 1701916 1421154 3597547 2872045 -233781 -242141 3949290 6797368 4656214
8927D656214l652380p33390Q54359j302601k950196r40685J928253K184836J021115
$$ 4656214 1003834 270444 1124803 -177798 -3127994 -4068679 -2140426 44410 1065525
8918A065525J391338K970671L029166O57989k283961l711055l110338j062757
$$ 1065525 2456863 5427534 8456700 9114689 6830728 3119673 9335 -1053422
8910a053422J677793M097304M627055K286586j339150k691010m02262K221113
$$ -1053422 624371 4721675 9348730 11635316 10296166 7605156 7202894 9424007
8902I424007J110653l002272n623207m443518j185855J796223L072252J057064
$$ 9424007 10534660 7532388 1909181 -2534337 -3720192 -1923969 1148283 2205347
8894B205347l893981o698325k645633M321518N154785r98077m648339k46684N417217
$$ 2205347 -1688634 -8386959 -11032592 -6711074 -1556289 -2554366 -7202705 -7449389 -2032172
8885b032172M346720o26798k179510p24815j592831m134677k995036J600089L630748
$$ -2032172 2314548 1687750 -491760 -1216575 -2809406 -6944083 -9939119 -8339030 -4708282
8876d708282J167680j153415j74828J776016J949293Q36146k19408p13542N2566
$$ -4708282 -3540602 -4694017 -4868845 -3092829 -1143536 -307390 -526798 -1240340 -1187774
8867a187774J869918K070129r01382l620236k025146J874096K938494J064688
$$ -1187774 682144 2752273 1850891 -1769345 -3794491 -1920395 1018099 2082787
8859B082787L56097J322230P37244j199102r13666R75441j60325l901716l857277
$$ 2082787 2438884 3761114 4498358 3299256 2385590 3361031 3200706 -701010 -4558287
8850d558287J558793N149449J804732l525377l893936o80439J54685k010560k637453
$$ -4558287 -2999494 2149955 3954687 429310 -3464626 -4145065 -3990380 -6000940 -8638393
8841h638393Q3403L145382L753313K216119J77044r89746m54625J176060J937509
$$ -8638393 -8554990 -5409608 -1656295 559824 736868 -252878 -707503 468557 2406066
8832B406066R59524m65844j354475k307521k887251p34460M160309P143862M377685
$$ 2406066 3365590 2899746 1545271 -762250 -3649501 -4383961 -223652 6920210 11297895
8823A1297895j264345l524852r72647J755063O76163k892983m950743l529332
$$ 11297895 10033550 6508698 5536051 7291114 7967277 5074294 123551 -3405781
8815c405781J3751K690365K241392q95967l582450l031548n0796J909323J098646
$$ -3405781 -3392030 -701665 1539727 643760 -2938690 -5970238 -6021034 -4111711 -3013065
8806c013065n13346j71689J966756L263091K047013p59343l266034m266273l024318
$$ -3013065 -3526411 -3698100 -1731344 1531747 3578760 2819417 -446617 -4712890 -7737208
8797g737208N11635M042460L657090j210644n198636k947381L212677N812560
$$ -7737208 -7225573 -3183113 473977 -736667 -5935303 -8882684 -5670007 142553
8789A42553K521730j179593q28122J140529J186062P74950K155750K793438k08206
$$ 142553 2664283 1484690 656568 1797097 2983159 3758109 5913859 8707297 8499091
8780H499091l745910l117512r6764N7705k338084k453261J19207R96119n94262
$$ 8499091 4753181 1635669 1538905 1596610 -741474 -3194735 -3075528 -2079409 -2673671
8771b673671o26826J747645K493509M52107m85014Q99414M80887l241908n496636
$$ -2673671 -3300497 -1552852 940657 1392764 907750 1807164 2288051 -953857 -6450493
8762f450493l183810P6755R06481J766376M835175O413739L134945j466077k589261
$$ -6450493 -9634303 -9557548 -8651067 -6884691 -2049516 4364223 7499168 6033091 3443830
8753C443830j795230k817089l981076j594500K429249L288440J216520O0296M4528
$$ 3443830 1648600 -1168489 -5149565 -6744065 -4314816 -1026376 190144 250440 294968
8744B94968j350776k983435j439686K056301K762561J23199j753916j006127M86066
$$ 294968 -1055808 -4039243 -5478929 -3422628 -660067 -536868 -2290784 -3296911 -2810845
8735b810845J949371L849697L763180r44426o329976n256881J541156N431704
$$ -2810845 -861474 2988223 6751403 5806977 -522999 -5779880 -4238724 1192980
8727A192980K589875j159970q50038M87345n50556p63129K943044O192817L476659
$$ 1192980 3782855 2622885 1772847 2260192 1709636 946507 3889551 10082368 13559027
8718A3559027k692141n742221m573070k578680m87270K708650M230987O73109
$$ 13559027 10866886 5124665 551595 -2027085 -2514355 194295 4425282 5098391
8710E098391m483298m190038J309516M341484J478570j918290j023410J454153
$$ 5098391 615093 -3574945 -2265429 2076055 3554625 1636335 612925 2067078
8702B067078J212838n18136n42531m2591j959556m630253l516803J435726M869039
$$ 2067078 3279916 2761780 2219249 2176658 217102 -4413151 -7929954 -6494228 -1625189
8693a625189L116226j158499k800531n44116K164716K031749l8820p01047O91284
$$ -1625189 1491037 332538 -2467993 -3012109 -847393 1184356 1145536 444489 1135773
8684A135773Q87601k152247n265930m150329Q5076K522447K090817K555051M933019
$$ 1135773 2023374 -128873 -5394803 -9545132 -9460056 -6937609 -4846792 -2291741 2641278
8675B641278M675070m54337m843352k449865L732181N533034J192881k955995
$$ 2641278 7316348 6862011 2018659 -431206 3300975 8834009 10026890 7070895
8667G070895k261661M84539M93938k354829m651849m292771j928380O54447J973995
$$ 7070895 4809234 5293773 5787711 3432882 -1218967 -5511738 -7440118 -6785671 -4811676
8658d811676J750390J146917J248413J419026M55228j191988k113378k126540
$$ -4811676 -3061286 -1914369 -665956 753070 1208298 16310 -2097068 -4223608
8650d223608j652809N8112L266862N295732L320975q93811k976737k348105k101242
$$ -4223608 -5876417 -5818305 -2551443 2744289 6065264 5171453 2194716 -153389 -2254631
8641b254631k491495k41939M253386N214592K70459m529140l164386J307706J745477
$$ -2254631 -4746126 -4988065 -734679 4479913 4750372 221232 -2943154 -1635448 110029
8632A10029k181415m277581j488001K736250M594764M121986K518716m021k288735
$$ 110029 -2071386 -6348967 -7836968 -5100718 -505954 3616032 6134748 6130727 3841992
8623C841992j991526Q33630K718107J134455k198924l829640k650676j55811J876676
$$ 3841992 1850466 2684096 5402203 6536658 4337734 508094 -2142582 -2298393 -421717
8614d21717K532500J564860n33205k345870k195744M54385L833700M511894P53964
$$ -421717 2110783 3675643 3142438 796568 -1399176 -944791 2888909 7400803 8154767
8605H154767m347150n153904l70858M354570L111227k551146n714464l162232
$$ 8154767 3807617 -1346287 -1717145 2637425 5748652 3197506 -2516958 -5679190
8597e679190J224641K540038Q43495o00946n05182m03418j290454j875015p49577
$$ -5679190 -4454549 -1914511 -1071016 -1671962 -2177144 -2580562 -3871016 -5746031 -6495608
8588f495608J143719J595488M49041J39248J867819K920480L58489l523169l264070
$$ -6495608 -5351889 -3756401 -3307360 -3168112 -1300293 1620187 1978676 -1544493 -4808563
8579d808563J633861M959388K412279k125119k604954L91974J890416J166110
$$ -4808563 -3174702 1784686 4196965 2071846 -533108 -141134 1749282 2915392
8571B915392J991618M706862M442516r71476o545597o645316k427451N36297j32828
$$ 2915392 4907010 9613872 14056388 13084912 6539315 -106001 -2533452 -1997155 -2129983
8562b129983j598450n62120K446210L849097J247880l325733m914157j272189
$$ -2129983 -3728433 -4290553 -1844343 2004754 3252634 -73099 -4987256 -6259445
8554f259445L880409N063872J705189j958603l056408k672268k026030k06521
$$ -6259445 -2379036 2684836 4390025 2431422 -624986 -3297254 -5323284 -5529805
8546e529805K596975L409321Q39972j778753r25475J647092J698339p10857j409272
$$ -5529805 -2932830 476491 1316463 -462290 -1387765 259327 1957666 1246809 -162463
8537a62463J147128L488006K513026l15478k155532l285882n441086p289826n218842
$$ -162463 984665 4472671 6985697 6670219 4514687 1228805 -4212281 -11502107 -16720949
8528a6720949J093771O868987P459405L555801m96263k187016k434986k343674
$$ -16720949 -15627178 -8758191 -1298786 2257015 1760752 -426264 -2861250 -5204924
8520e204924j173218J492202L661474L063842P14741L16878L421309O518243M664249
$$ -5204924 -6378142 -4885940 -1224466 1839376 2554117 2870995 6292304 12810547 17474796
8511A7474796j915777o838197m921332Q15643K657661j451025n276030l675239
$$ 17474796 15559019 8720822 3799490 4615133 7272794 5821769 545739 -3129500
8503c129500P1219K83337j777378o41025L576114N222134K583782M4616k78075
$$ -3129500 -3058281 -2774944 -4552322 -5193347 -1617233 3604901 6188683 6233299 5955224
8494E955224j718078n388352o451462k116188K780250L045527P82318N90104J793590
$$ 5955224 4237146 -1151206 -7602668 -9718856 -6938606 -3893079 -3110761 -2520657 -727067
8485g27067J142909o27836q11069j44346o31677r26271N93681J217917j739131
$$ -727067 415842 -211994 -1023063 -1167409 -1799086 -2725357 -2131676 -913759 -2652890
8476b652890m886662l296793J496288M327969M535452M544286L219019j534652
$$ -2652890 -7539552 -10836345 -9340057 -5012088 -476636 4067650 7286669 5752017
8468E752017n753926l671247K113091L461347o74474l332071j520511K2799j603778
$$ 5752017 -1909 -3673156 -1560065 1901282 1226808 -2105263 -3625774 -3602975 -5206753
8459e206753k960295j463964Q81768K853972N242572N370445o99281q674881q725809
$$ -5206753 -8167048 -9631012 -8749244 -5895272 -652700 4717745 4018464 -4656417 -13382226
8450a3382226o35289M308496Q41279k129020K687797Q268706N535584j282933
$$ -13382226 -14017515 -9709019 -8867740 -10996760 -8308963 -40257 5495327 4212394
8442D212394k533334R69442J680641m08360N35304L472809J708394m125886n645069
$$ 4212394 1679060 2648502 4329143 3920783 4456087 7928896 9637290 5511404 -133665
8433a33665j77107N141539M551441N98356k218059l327940l228213j213338J410823
$$ -133665 -310772 4830767 9382208 9980564 7762505 4434565 1206352 -6986 1403837
8424A403837J273948j510364k503603K60290L090082K356248o00407k384476j977859
$$ 1403837 2677785 1167421 -1336182 -1075892 2014190 4370438 3770031 1385555 -592304
8415e92304m02881J152811J453670L8977j253202k56680J713186J237549j644187
$$ -592304 -995185 157626 1611296 1650273 397071 140391 1853577 3091126 1446939
8406A446939k985135j025934J030858R2335k194729k168935O42252L160398K528172
$$ 1446939 -1538196 -2564130 -1533272 -1440937 -3635666 -5804601 -5162349 -2001951 526221
8397E26221q51733l309948j152409M596107P535855K758838n963179r401282l988761
$$ 526221 -325512 -3635460 -4787869 -191762 7344093 10102931 4139752 -5261530 -9250291
8388i250291L794465N734248J410595l008587l095235j20771K373279K902619
$$ -9250291 -5455826 278422 1689017 -1319570 -4414805 -4535576 -2162297 740322
8380G40322K291698J483463N02339p50818j755809j958387j590475j126408k64317
$$ 740322 3032020 4515483 5017822 4267004 2511195 552808 -1037667 -2164075 -2428392
8371b428392J391237K775997K125630l22254k048044j388594N74569J941508K113811
$$ -2428392 -1037155 1738842 3864472 3542218 1494174 105580 680149 2621657 4735468
8362D735468J285859j86157j001836K34570K200562J450750k466571n141874k971112
$$ 4735468 6021327 5835170 4833334 5067904 7268466 8719216 6252645 1110771 -1860341
8353a860341J569858L178909O52558k324197k381267J1630J809670O86189k334563
$$ -1860341 -290483 2888426 3540984 1216787 -1164480 -1152850 656820 1343009 -991554
8344i91554l124609Q57011N930715N530432q16852n935297m525966J01676J930367
$$ -991554 -4116163 -3259152 2671563 8201995 7385143 1449846 -3076120 -2974444 -1044077
8335a044077M82484j040056j890494k893952k508798P20642L976091L698334J404447
$$ -1044077 -561593 -1601649 -3492143 -6386095 -8894893 -8174251 -4198160 -499826 904621
8326I04621R22259J914741J551574M71490J006005J293270k067970o588448o270956
$$ 904621 1826880 3741621 5293195 5764685 6770690 8063960 5995990 -592458 -6863414
8317f863414j210945K327381J821533J186692K435856K175621j080820l054886
$$ -6863414 -8074359 -5746978 -3925445 -2738753 -302897 1872724 791904 -2262982
8309b262982p56615K375188K331675P12256R24557K117971J193285j714086l498581
$$ -2262982 -3019597 -644409 1687266 2399522 3324079 5442050 6635335 4921249 1422668
8300A422668k459499l3609R03004j262981m387832l456279L033205Q679048O014415
$$ 1422668 -1036831 -1070440 -167436 -1430417 -5818249 -9274528 -6241323 2437725 8452140
8291H452140k551739o627762j751159M927364N309777N85931k956661l183646
$$ 8452140 5900401 -727361 -2478520 2448844 7758621 8344552 5387891 2204245
8283B204245k540778k750057l309319l115887j006902K882691N119682K362211
$$ 2204245 -336533 -3086590 -6395909 -9511796 -10518698 -7636007 -2516325 -154114
8275a54114k145422j260859M642389O063434j416581q605390n380626L994149
$$ -154114 -2299536 -3560395 1081994 7145428 5728847 -2876543 -8257169 -4263020
8267d263020P075162J180996m376885k929904J750657L470219J868645J34555
$$ -4263020 2812142 3993138 -383747 -3313651 -1562994 1907225 3775870 3910425
8259C910425p8092J058145K538757K304130p15034l788975l211666o2588J076100
$$ 3910425 3832333 4890478 7429235 9733365 9018331 5229356 2017690 1955102 3031202
8250C031202n63989q85414J610978K567837j327018o535912p349091l427066Q32340
$$ 3031202 2467213 1581799 3192777 5760614 4433596 -2102316 -9451407 -12878473 -12046133
8241a2046133K490220K359680K188018K311061J931925L08389j938879k416743
$$ -12046133 -9555913 -7196233 -5008215 -2697154 -765229 -456840 -2395719 -4812462
8233d812462M59557M081426L648977j055525m110469j271880L697148M325451
$$ -4812462 -4352905 -271479 3377498 2321973 -1788496 -3060376 636772 4962223
8225D962223O45380j873311j332850j380106l587646m087334n73507K720642J423445
$$ 4962223 5607603 3734292 2401442 1021336 -2566310 -6653644 -7227151 -4506509 -3083064
8216c083064j666549j011097K662498L747743Q20432j819791j535461k30438Q27529
$$ -3083064 -4749613 -5760710 -3098212 649531 1469963 -349828 -1885289 -2115727 -1288198
8207a288198K842031M569615K084277l683088n680418j230544K509905o64108
$$ -1288198 1553833 6123448 8207725 4524637 -1155781 -2386325 123580 -540528
8199e40528n569514l603982L261541N622569J581898j203277J355982L982669
$$ -540528 -6110042 -9714024 -6452483 -829914 751984 -451293 904689 4887358
8191D887358J788187k207470l107636j419282k05581J50431M53454q2426j654331
$$ 4887358 6675545 4468075 1360439 -58843 -264424 -113993 339461 257035 -1397296
8182a397296k228338q95243L23778K58607N70019J789519J467668j131228k683586
$$ -1397296 -3625634 -4520877 -4197099 -3938492 -3368473 -1578954 -111286 -1242514 -3926100
8173c926100j207573K97627r21343k461206j066126J649276K121488O87896K29098
$$ -3926100 -5133673 -4836046 -5757389 -8218595 -9284721 -7635445 -5513957 -4826061 -4596963
8164d596963J180255J893029K143469K681039K873995J826923J99442j370473
$$ -4596963 -3416708 -1523679 619790 3300829 6174824 8001747 8201189 6830716
8156F830716l303189m589775k743171J314717K547078p67552l553822j955054
$$ 6830716 3527527 -1062248 -3805419 -2490702 56376 -711176 -4264998 -6220052
8148f220052L22575r02151k100793J756186O993352N951125m47725l899072j665677
$$ -6220052 -5897477 -6799628 -8900421 -7144235 -150883 5800242 5352517 1453445 -212232
8139b12232O43130l00160r75724R51654K126484K13206j692578r31807K46958
$$ -212232 430898 130738 -844986 106668 2233152 2446358 753780 -178027 68931
8130F8931l21980n44555J256013K202739l17716l486729l057952K50778K384849
$$ 68931 -253049 -797604 458409 2661148 2343432 -1143297 -4201249 -3950471 -1565622
8121a565622J921353Q08202N38970O43269K45425q94163k231434k445011r31093
$$ -1565622 355731 1163933 1702903 2346172 2591597 1697434 -534000 -2979011 -3910104
8112c910104M26041o85018k811266j827248K726361N934374M013069p34700l748259
$$ -3910104 -3484063 -4169081 -6980347 -8807595 -6081234 -146860 3866209 3131509 -616750
8103f16750l963946l068837j719925K69142J757190J396952K1698l83609O63790
$$ -616750 -4580696 -7649533 -9369458 -9100316 -7343126 -5946174 -5924476 -6308085 -5644295
8094e644295K127686L043848K811664J213766o46455r24855L37587Q71185n09210
$$ -5644295 -3516609 -472761 2338903 3552669 2906214 1981359 2318946 3190131 2680921
8085B680921k247117k798244k732971k725281j905483O5530J639391J932800K282239
$$ 2680921 433804 -2364440 -5097411 -7822692 -9728175 -9662645 -8023254 -6090454 -3808215
8076c808215L333010L136201N47848j848895j046918J916307L445892J960278
$$ -3808215 -475205 2660996 3208844 1359949 313031 2229338 5675230 7635508
8068G635508j194484l879250m339949k123519M38272M7401k469752k142886K542599
$$ 7635508 6441024 2561774 -1778175 -3901694 -3463422 -3416021 -5885773 -8028659 -5486060
8059e486060N939000L087191k416439l652639n30941J535059J107010J633305
$$ -5486060 452940 3540131 1123692 -2528947 -3059888 -1524829 -417819 1215486
8051A215486L287400J662851l560946n723497o57164O295165P186951J750790
$$ 1215486 4502886 6165737 2604791 -3118706 -3775870 2519295 9706246 11457036
8043A1457036l599175m571889k531068n01429M24872N55141J09231r47225k471421
$$ 11457036 7857861 3285972 754904 253475 678347 1233488 1342719 395494 -2075927
8034b075927l664582l109348l46997K552390K710572J74375j902935j388454N29580
$$ -2075927 -5740509 -8849857 -9196854 -6644464 -3933892 -3759517 -5662452 -7050906 -6521326
8025f521326J881554K460539K655887K015485O38125J60501J566939L363720L419150
$$ -6521326 -4639772 -2179233 476654 2492139 3130264 3290765 4857704 8221424 11640574
8016A1640574J448036j350651l635430m029140j840578J168153J814588l67382
$$ 11640574 13088610 11737959 8102529 4073389 2232811 3400964 5215552 4848170
8008D848170k190346j431937R9484m2025j091055j011250N9659R03582J578891
$$ 4848170 2657824 1225887 1325371 1283346 192291 -818959 -759300 144282 1723173
7999A723173K079345J042381j290336j536763J743955M142538J184816m163184
$$ 1723173 3802518 4844899 3554563 2017800 3761755 7904293 9089109 4925925
7991D925925n146113j030784K454284J943046j73102j336764j879387j622448
$$ 4925925 -220188 -1250972 1203312 3146358 2973256 1636492 -242895 -1865343
7983a865343P53697L559067K988137k30351r76066J579286K019897j754325m199279
$$ -1865343 -1111646 2447421 5435558 5205207 4229141 5808427 7828324 6073999 1874720
7974A874720j769702K93029k939157o659904l947183K324249M333373K427319
$$ 1874720 105018 398047 -2541110 -9201014 -13148197 -10823948 -6490575 -4063256
7966d063256L200813O337457M507098k840896o571413k068356L440365K790567
$$ -4063256 -862443 5475014 9982112 7141216 569803 -1498553 1941812 4732379
7958D732379m97958j23221J713168p07317n163248m258677K194938O157827L178733
$$ 4732379 4234421 4111200 5824368 5117051 -46197 -4304874 -2109936 4047891 7226624
7949G226624j964767l226894j021338P56676R53864R65355J088351M69266n20761
$$ 7226624 5261857 2034963 1013625 1770301 2724165 3689520 4777871 5247137 4726376
7940D726376n37926M18163Q01836k54910j728271k080034j204328m20391n07200
$$ 4726376 4188450 4606613 5408449 5153539 3425268 1345234 140906 -279485 -786685
7931g86685l97079J271247L489404L376111J48229l008894k745853m0548J464701
$$ -786685 -1183764 87483 3576887 6952998 7101227 4092333 1346480 1305932 2770633
7922B770633R67555J219350L174559L391962p53417n681686n217405Q80807N764850
$$ 2770633 3738188 4957538 8132097 11524059 10770642 5088956 -128449 752358 6517208
7913F517208L996109j853766n164154l492160n6872J479600M00798k348667n347467
$$ 6517208 10513317 8659551 3495397 3237 -53635 1425965 1826763 -521904 -5869371
7904e869371o204247l192642J582552L682171K240323J141676K622101L499631
$$ -5869371 -12073618 -15266260 -13683708 -10001537 -7761214 -6619538 -3997437 -497806
7896d97806Q01534k484188j805265J339774J594478j562700l011208k16417L098153
$$ -497806 303728 -2180460 -3985725 -2645951 -1051473 -2614173 -5625381 -5841798 -2743645
7887b743645L045419P71045o46054p48853o35258k44989P77177J625265J716820
$$ -2743645 301774 1072819 426765 -322088 -957346 -1202335 -425158 1200107 2916927
7878B916927J658633J482205K42435j318806n83866K605877M379726K068056j702958
$$ 2916927 4575560 6057765 6300200 4981394 4397528 7003405 11383131 13451187 11748229
$$ [...]
##END NTUPLES=NMR SPECTRUM
##END=
