##TITLE=31Pdec_SR63_k
 d2o, 124 sc
 2.06.2021
##JCAMPDX= 6.0         $$ Bruker NMR JCAMP-DX V2.0
##DATA TYPE= NMR SPECTRUM
##DATA CLASS= NTUPLES
##ORIGIN= UXNMR, Bruker Analytische Messtechnik GmbH
##OWNER= root
$$ XWIN-NMR		Version 3.5
$$ Wed Jun  2 12:42:45 2021 Russian Standard Time (UT+4h)  she@DPX200
##.OBSERVE FREQUENCY= 81.013821
##.OBSERVE NUCLEUS= ^31P
##.ACQUISITION MODE= SIMULTANEOUS
##.ACQUISITION SCHEME= undefined
##.AVERAGES= 124
##.DIGITISER RES= 16
##SPECTROMETER/DATA SYSTEM= spect
##.PULSE SEQUENCE= zgpg30
##.SOLVENT NAME= DMSO
##.SHIFT REFERENCE= (INTERNAL, DMSO, 0, 248.564)
##AUDIT TRAIL= $$ (NUMBER, WHEN, WHO, WHERE, WHAT)
$$ ##TITLE= Audit trail, XWIN-NMR		Version 3.5
$$ ##JCAMPDX= 5.01
$$ ##ORIGIN= Bruker BioSpin GmbH
$$ ##OWNER= she
$$ F:/spectra/data/she/nmr/P31/1/pdata/1/auditp.txt
$$ ##AUDIT TRAIL=  $$ (NUMBER, WHEN, WHO, WHERE, WHAT)
(   1,<2021-06-02 12:41:20.48 +0400>,<she>,<DPX200>,
      <continue with go, POWCHK disabled, PULCHK disabled
       configuration hash MD5:
       00 E9 B6 7A A2 85 ED C7 34 08 36 98 17 FE 4E 26
       data hash MD5: 32K
       E1 60 D5 57 ED 96 5E 7E A8 7C B6 19 E8 1A A7 F3>)
(   2,<2021-06-02 12:41:53.14 +0400>,<she>,<DPX200>,
      <Start of raw data processing
       efp BC_mod = 2 LB = 1 FT_mod = 6 PKNL = 1 PHC0 = -6026.688 PHC1 = 395.67 SI = 64K 
       data hash MD5: 64K
       15 D9 35 90 58 9F 18 1E 99 00 81 1F 45 B9 F7 FD>)
(   3,<2021-06-02 12:42:15.87 +0400>,<she>,<DPX200>,
      <pk PHC0 = -24.27734 PHC1 = 10.4 
       data hash MD5: 64K
       AF E3 19 90 98 6C 94 7B 97 5F F0 48 50 8B 7A CD>)
(   4,<2021-06-02 12:42:19.03 +0400>,<she>,<DPX200>,
      <abs ABSG = 5 
       data hash MD5: 64K
       1E 42 61 83 BD A3 CA 98 D4 A8 0B 7E 47 07 EC 80>)
$$ ##END=
$$ 
$$ hash MD5
$$ A3 49 4A 6F 38 6A AB 17 50 0E A3 AE 04 D7 0D E6
##$RELAX= 
##$RELAX= 
##$RELAX= 
##$RELAX= 
##$RELAX= 
##$RELAX= 
##$RELAX= 
##$RELAX= 
$$ Bruker specific parameters
$$ --------------------------
##$DU= <F:/spectra>
##$EXPNO= 1
##$NAME= <P31>
##$PROCNO= 1
##$TYPE= <nmr>
##$USER= <she>
##$AMP= (0..31)
100 100 100 100 100 100 100 100 100 100 100 100 100 100 100 100 100 100 
100 100 100 100 100 100 100 100 100 100 100 100 100 100 
##$AQSEQ= 0
##$AQ_mod= 1
##$AUNM= <au_zg>
##$AUTOPOS= <>
##$BF1= 81.014009
##$BF2= 200.13
##$BF3= 200.13
##$BF4= 200.13
##$BF5= 200.13
##$BF6= 200.13
##$BF7= 200.13
##$BF8= 200.13
##$BYTORDA= 1
##$CFDGTYP= 0
##$CFRGTYP= 5
##$CHEMSTR= <none>
##$CNST= (0..31)
1 1 145 1 1 1 1 1 1 1 1 1 1 1 1 1 1 1 1 1 1 1 1 1 1 1 1 1 1 1 1 1 
##$CPDPRG= <waltz16>
##$CPDPRG1= <>
##$CPDPRG2= <waltz16>
##$CPDPRG3= <>
##$CPDPRG4= <mlev>
##$CPDPRG5= <mlev>
##$CPDPRG6= <mlev>
##$CPDPRG7= <mlev>
##$CPDPRG8= <mlev>
##$CPDPRGB= <>
##$CPDPRGT= <>
##$D= (0..31)
0 1 0 0 0 0 0 0 0 0 0 0.03 2e-05 3e-06 0 0 0 0 0 0 0 0 0 0 0 0 0 0 0 0 
0 0 
##$DATE= 1622623107
##$DBL= (0..7)
120 120 120 11 120 120 24 19 
##$DBP= (0..7)
150 150 150 150 150 150 150 150 
##$DBP07= 0
##$DBPNAM0= <>
##$DBPNAM1= <>
##$DBPNAM2= <>
$$ [...]
##$SUBNAM3= <"">
##$SUBNAM4= <"">
##$SUBNAM5= <"">
##$SUBNAM6= <"">
##$SUBNAM7= <"">
##$SUBNAM8= <"">
##$SUBNAM9= <"">
##$SW= 501.771253377433
##$SWIBOX= (0..15)
0 1 3 0 0 0 0 0 0 0 0 0 0 0 0 0 
##$SW_h= 40650.406504065
##$TD= 32768
##$TD0= 1
##$TE= 0
##$TE2= 300
##$TE3= 300
##$TEG= 300
##$TL= (0..7)
0 120 53 12 22 120 120 120 
##$TP= (0..7)
150 150 150 150 150 150 150 150 
##$TP07= 0
##$TPNAME0= <>
##$TPNAME1= <>
##$TPNAME2= <>
##$TPNAME3= <>
##$TPNAME4= <>
##$TPNAME5= <>
##$TPNAME6= <>
##$TPNAME7= <>
##$TPOAL= (0..7)
0.5 0.5 0.5 0.5 0.5 0.5 0.5 0.5 
##$TPOFFS= (0..7)
0 0 0 0 0 0 0 0 
##$TUNHIN= 0
##$TUNHOUT= 0
##$TUNXOUT= 0
##$USERA1= <user>
##$USERA2= <user>
##$USERA3= <user>
##$USERA4= <user>
##$USERA5= <user>
##$V9= 5
##$VALIST= <valist>
##$VCLIST= <CCCCCCCCCCCCCCC>
##$VD= 0
##$VDLIST= <DDDDDDDDDDDDDDD>
##$VPLIST= <PPPPPPPPPPPPPPP>
##$VTLIST= <TTTTTTTTTTTTTTT>
##$WBST= 1024
##$WBSW= 4
##$XGAIN= (0..3)
0 0 0 0 
##$XL= 0
##$YL= 0
##$YMAX_a= 5509
##$YMIN_a= -5637
##$ZGOPTNS= <>
##$ZL1= 120
##$ZL2= 120
##$ZL3= 120
##$ZL4= 120
##$ABSF1= 248.5645
##$ABSF2= -253.2056
##$ABSG= 5
##$ABSL= 3
##$ALPHA= 0
##$AQORDER= 0
##$ASSFAC= 0
##$ASSFACI= 0
##$ASSFACX= 0
##$ASSWID= 0
##$AUNMP= <proc_1d>
##$AZFE= 0.1
##$AZFW= 0.5
##$BCFW= 0
##$BC_mod= 2
##$BYTORDP= 0
##$COROFFS= 0
##$CY= -3
##$DATMOD= 1
##$DC= 0
##$DFILT= <>
##$DTYPP= 0
##$F1P= 0
##$F2P= 0
##$FCOR= 1
##$FTSIZE= 65536
##$FT_mod= 6
##$GAMMA= 0
##$GB= 0
##$INTBC= 1
##$INTSCL= 5.30512e-09
##$ISEN= 30
##$LB= 1
##$LEV0= 0
##$LPBIN= 0
##$MAXI= 10000
##$MC2= 0
##$MEAN= 0
##$ME_mod= 0
##$MI= 50
##$NCOEF= 0
##$NC_proc= -6
##$NLEV= 6
##$NOISF1= 182.463
##$NOISF2= 159.3651
##$NSP= 0
##$NTH_PI= 0
##$NZP= 0
##$OFFSET= 248.5645
##$PC= 4
##$PHC0= -6050.965
##$PHC1= 406.07
##$PH_mod= 1
##$PKNL= yes
##$PPARMOD= 0
##$PSCAL= 0
##$PSIGN= 0
##$REVERSE= no
##$SF= 81.014009
##$SI= 65536
##$SIGF1= 159.3651
##$SIGF2= -187.1042
##$SINO= 113.3802
##$SIOLD= 16384
##$SREGLST= <1H.CDCl3>
##$SSB= 0
##$STSI= 65536
##$STSR= 0
##$SW_p= 40650.406504065
##$SYMM= 0
##$S_DEV= 0
##$TDeff= 32768
##$TDoff= 0
##$TI= <>
##$TILT= no
##$TM1= 0
##$TM2= 0
##$TOPLEV= 0
##$USERP1= <user>
##$USERP2= <user>
##$USERP3= <user>
##$USERP4= <user>
##$USERP5= <user>
##$WDW= 1
##$XDIM= 65536
##$YMAX_p= 363389852
##$YMIN_p= -28135986
$$ End of Bruker specific parameters
$$ ---------------------------------
##NTUPLES= NMR SPECTRUM
##VAR_NAME=  FREQUENCY,     SPECTRUM/REAL,   SPECTRUM/IMAG
##SYMBOL=    X,             R,               I
##VAR_TYPE=  INDEPENDENT,   DEPENDENT,       DEPENDENT
##VAR_FORM=  AFFN,          ASDF,            ASDF
##VAR_DIM=   65536,         65536,           65536
##UNITS=     HZ,            ARBITRARY UNITS, ARBITRARY UNITS
##FACTOR=    0.620285442955139, 1,           1
##FIRST=     20137.2065510759, 0,            0
##LAST=      -20513.1999529892, 0,           0
##MIN=       -20513.1999529892, -28135986,   0
##MAX=       20137.2065510759, 363389852,    0
$$ Real data points
##PAGE= N=1
##DATA TABLE= (X++(R..R)), XYDATA
$$ [...]
12995G345319q708184n502842k130724j243361j811301o64030K546245M530689
$$ 7345319 -1362865 -6865707 -8996431 -10239792 -12051093 -12715123 -10168878 -5638189
12987e638189K979165l74862k157239j176860J025274K498378K861557K860979
$$ -5638189 -2659024 -3033886 -5191125 -6367985 -5342711 -2844333 17224 2878203
12979B878203K391104K53019l201167m827651k415338J544987K866231J556941
$$ 2878203 5269307 5522326 2321159 -2506492 -4921830 -3376843 -510612 1046329
12971A046329J060753K285682K808072J850579J068043R5219l033810o101918
$$ 1046329 2107082 4392764 7200836 9051415 10119458 10214677 7180867 1078949
12963A078949l799022L166259O616869K144238m297638n460627k702003j345290
$$ 1078949 -2720073 446186 7063055 9207293 4909655 -550972 -3252975 -4598265
12955d598265j306023Q28202L818223L120679j189359m121882l060011k46340
$$ -4598265 -5904288 -5076086 -1257863 1862816 673457 -3448425 -6508436 -6754776
12947f754776J881891L304676M067086L180573P37140j439911j901903q89788
$$ -6754776 -4872885 -1568209 2498877 5679450 6416590 4976679 3074776 2184988
12939B184988L23514M46720p46682j774402j159529J33520J66238k15256J492763
$$ 2184988 2508502 2955222 2208540 434138 -725391 -591871 -425633 -640889 851874
12930H51874M236303L701617q35367m562757m141880k113385j689314j699544
$$ 851874 5088177 8789794 7954427 3391670 -750210 -2863595 -4552909 -6252453
12922f252453n943K159102K769970K328858J541554n28992l141453l110967m72108
$$ -6252453 -6258396 -4099294 -1329324 999534 2541088 2012096 -1129357 -4240324 -4712432
12913d712432M2778l183504m871552j482952K133723P44456j924431P95438P123141
$$ -4712432 -4669654 -7853158 -12724710 -14207662 -12073939 -11329483 -13253914 -12458476 -5335335
12904e335335R349629N280954k72978l633468m754935l122842J529651N117595
$$ -5335335 4014294 9295248 9022270 5388802 633867 -2488975 -959324 4158271
12896D158271K911008k628158m244834m01453K938792J726477j181546j927502
$$ 4158271 7069279 4441121 196287 -205166 2733626 4460103 3278557 1351055
12888A351055r51773k07930L54315J080507Q38069p29709j619106j29724K362011
$$ 1351055 399282 191352 545667 1626174 2464243 1734534 115428 -14296 2347715
12879B347715K775844J7053l308095l335637J71649K488564l8352l864626k808924
$$ 2347715 5123559 5140612 1832517 -1503120 -1331471 1157093 1118741 -2745885 -5554809
12870e554809J736363J979984l438247n982380o11545N702625N253955J676813
$$ -5554809 -3818446 -1838462 -5276709 -11259089 -11870634 -6168009 -914054 762759
12862G62759K352846N394436M289671M93792K70122K330221K22132m846051n466941
$$ 762759 3115605 8510041 12799712 13293504 13563626 15893847 16115979 11269928 5802987
12853E802987j789496j687415o203810p047075j365153K842173O26127j558997
$$ 5802987 4013491 2326076 -3877734 -10924809 -12289962 -9447789 -8821662 -10380659
12845a0380659K379750P488187O209599J09306m263062n276036m842244k363158
$$ -10380659 -8000909 -512722 5696877 5806183 1543121 -3732915 -8575159 -10938317
12837a0938317K473795M863296N30171o139957o707340l69544N141586M207810
$$ -10938317 -8464522 -3601226 -3071055 -9211012 -15918352 -16287896 -11146310 -6938500
12829f938500m61256k989587j437531J825036M114256M784359M275479K321379
$$ -6938500 -7399756 -10389343 -11826874 -10001838 -5887582 -1103223 3172256 5493635
12821E493635j561223n539281n612902o21810M575913M354521l11959l627945
$$ 5493635 3932412 -1606869 -7219771 -7841581 -3265668 1088853 776894 -2851051
12813b851051l119205j183602P96335L762965N834257K665194m679830q540171
$$ -2851051 -5970256 -7153858 -6357523 -2594558 3239699 5904893 1225063 -7315108
12805g315108m813860J225706L079846J628535J023646J055801o31609k555145
$$ -7315108 -12128968 -10903262 -7823416 -6194881 -5171235 -4115434 -4747043 -7302188
12797g302188j802572J16252k49803j774843m81639L383729N590141M622963K772440
$$ -7302188 -9104760 -8988508 -9238311 -11013154 -11494793 -8111064 -2520923 2102040 4874480
12788D874480Q47063k520124n762110m442080J584940O136429M723253N00503
$$ 4874480 5721543 3201419 -2560691 -7002771 -5417831 718598 5441851 5942354
12780E942354j157812m89957j421652m128086m635054j575445J314264P23004
$$ 5942354 4784542 4294585 2872933 -1255153 -5890207 -7465652 -6151388 -5428384
12772e428384j792253k835731j863515m71783Q30181K339182L160565K462191
$$ -5428384 -7220637 -10056368 -11919883 -12391666 -11561485 -9222303 -6061738 -3599547
12764c599547J633695K035667J611261k243659o752697n584164K154348R359304
$$ -3599547 -1965852 69815 1681076 -562583 -7315280 -12899444 -10745096 -1385792
12756a385792R623635M394643j163477n100726p617313p043528k312277K722674
$$ -1385792 8237843 12632486 11469009 6368283 -1249030 -8292558 -10604835 -7882161
12748g882161K987113m79395j762114J399055M805689M190271N09634k474551
$$ -7882161 -4895048 -5374443 -7136557 -5737502 -931813 3258458 3768092 1293541
12740A293541k995957k086252j337938j238118j170246n20480M45558J291845
$$ 1293541 -1702416 -3788668 -5126606 -6364724 -7534970 -8055450 -7609892 -6318047
12732f318047K292097L022553J260711l471824o349469k412463M755508O214785
$$ -6318047 -4025950 -1003397 257314 -3214510 -9563979 -11976442 -7220934 -1006149
12724a006149Q57783k573620L10735K621711p97378l157512K347059Q868219N976926
$$ -1006149 -148366 -2721986 -2411251 210460 -586918 -3744430 -1397371 7470848 13447774
12715A3447774k874524o272224l851436m632624q420279n004740O480781J3016215
$$ 13447774 10573250 4301026 449590 -4183034 -12603313 -17608053 -11127272 1888943
12707A888943P237858j997512m577471k554170j747934j076174J672796K919344
$$ 1888943 9126801 7129289 2551818 -2352 -1750286 -2826460 -1153664 1765680
12699A765680N15997l74851L211841M702958j036367p024890m490716K530402
$$ 1765680 2281677 1906826 5118667 9821625 8785258 1760368 -2730348 -199946
12691a99946L838245n09925j916932J514936L078226J34867k125681q25161J35921
$$ -199946 3638299 3128374 1211442 2726378 5804604 5939471 3813790 2988629 3124550
12682C124550j772279k983739n94312K307059J693256j404971l170333k132558
$$ 3124550 1352271 -1631468 -2225780 81279 1774535 369564 -2800769 -4933327
12674d933327M94874L124770M300777K797288q08485l642297l020832O76517L954651
$$ -4933327 -4438453 -1313683 2987094 5784382 4975897 1333600 -1687232 -1010715 2943936
12665B943936L152142j847169o632864o200172m81933N239630O030787K174052
$$ 2943936 6096078 4248909 -2383955 -8584127 -9066060 -3826430 2204357 4378409
12657D378409j982859k492427J109776N427904N841546J416813l221529l313938
$$ 4378409 2395550 -96877 1012899 6440803 12282349 13699162 10477633 7163695
12649G163695l27592N53074j627152k824667j073709Q36035M88692j354396l841102
$$ 7163695 6836103 7389177 5762025 2937358 1863649 2699684 3188376 1833980 -2007122
12640b007122o641614o850940j497649N679907O943773K020499p15195K589480
$$ -2007122 -8648736 -15499676 -16997325 -11317418 -4373645 -2353146 -3068341 -478861
12632d78861N246959J788367k631280j285598K797739K588485j202024k481038
$$ -478861 4768098 6556465 3925185 2639587 5437326 8025811 6823787 4342749
12624D342749k58214J141207P5380j045492q00473K49457J711686K231310p14650
$$ 4342749 4084535 5225742 5301122 4255630 3455157 3704614 5416300 7647610 6932960
12615F932960n789511o824794j558534L627498L059909J88231K67004R40150j674666
$$ 6932960 1143449 -5681345 -7239879 -3612381 -552472 -364241 -97237 842913 -831753
12606h31753l553615M66493N265847K229691n482980o463957J063159O603257
$$ -831753 -4385368 -3918875 1346972 3576663 -1906317 -8370274 -7307115 -703858
12598g03858L556728k587524m317490j280919K936611N581676M509654j30853
$$ -703858 2852870 265346 -4052144 -5333063 -2396452 3185224 7694878 7564025
12590G564025l403185j323569J801783n24042n316046m328871J261081K141964
$$ 7564025 4160840 2837271 4639054 4115012 -1201034 -5529905 -4268824 -2126860
12582b126860k674732l591391K614205O680217K820436j648294K64364L389343
$$ -2126860 -4801592 -8392983 -5778778 901439 3721875 2073581 2337945 5727288
12574E727288P20312l904693l151944J199509K700721J379950J097988P52268
$$ 5727288 6447600 2542907 -609037 590472 3291193 4671143 5769131 6521399
12566F521399k581740n708014l624023J200320K415610J27972p11689L606j712534
$$ 6521399 3939659 -1768355 -5392378 -4192058 -1776448 -1648476 -2360165 -2356559 -4069093
12557d069093m630979k736424M321479R052262O285380n62995n204989n530982
$$ -4069093 -8700072 -11436496 -7115017 1937245 8222625 7659630 2454641 -3076341
12549c076341l396088j452855j421963k393472q30252M433261Q209851M672436
$$ -3076341 -6472429 -7925284 -9347247 -11740719 -12570971 -8137710 72141 4744577
12541D744577l415215o789467j987626L875867K960743l226557o967188m438500
$$ 4744577 1329362 -5460105 -7447731 -3571864 -611121 -3837678 -10804866 -15243366
12533a5243366J038280M377536L898784J106536j976765l860973l268301Q5278
$$ -15243366 -14205086 -9827550 -5928766 -4822230 -6798995 -10659968 -13928269 -13842991
12525a3842991L928274M634127J711669n35104J428991M562849L155363k014195
$$ -13842991 -9914717 -5280590 -3568921 -4104025 -2675034 1887815 5043178 3028983
12517C028983l900485K76233M619970L547494l97288j889806r76086p17250r83759
$$ 3028983 -871502 -595269 4024701 7572195 7174907 5285101 4309015 3591765 2608006
12508B608006m21211r37728l911166n184595q63571M623768M049307j047439k886183
$$ 2608006 2186795 1249067 -2662099 -7846694 -8710265 -4086497 -37190 -1084629 -3970812
12499c970812m25036k81722m221652n741901j592669K845333L512845L925312
$$ -3970812 -4395848 -4677570 -8899222 -14641123 -16233792 -13388459 -9875614 -5950302
12491e950302O501765O464062J022204l338355r32757K515270j065187p564013
$$ -5950302 551463 7015525 8037729 4699374 3766617 6281887 5216700 -2347313
12483b347313o254206K595361P090693J311159o667971p201456j324138L382284
$$ -2347313 -8601519 -6006158 1084535 2395694 -4272277 -11473733 -12797871 -9415587
12475i415587L087257k25436k792472j833692K644916O670152N847722J243296
$$ -9415587 -6328330 -6553766 -9346238 -11179930 -8535014 -1864862 3982860 5226156
12467E226156j762400j164543l37875j257021j196355J317323K631971j59941
$$ 5226156 3463756 2299213 1961338 704317 -492038 825285 3457256 3297315
12459C297315l887110m116204j778611o16330r40653m57953Q70444J155884K29429
$$ 3297315 -589795 -4705999 -6484610 -7100940 -8041593 -8499546 -7629102 -6473218 -6243789
12450f243789p97828k083893l725794l723202r22141J887654J756750O18894K150836
$$ -6243789 -7041617 -9125510 -12851304 -16574506 -17496647 -15608993 -13852243 -13233349 -11082513
12441a1082513N150270N070148J501877j004593J0296J647225N84852k342925
$$ -11082513 -5932243 -862095 639782 -364811 -354515 1292710 1877562 -465363
12433d65363l887607k243973J600089M549953L635025n35967l416742j857272
$$ -465363 -4352970 -6596943 -4996854 -446901 3188124 2652157 -764585 -2621857
12425b621857J543243K152756j69210j551867J84360L556872N775314M210958
$$ -2621857 -1078614 1074142 904932 -646935 -462575 3094297 8869611 13080569
12417A3080569k029229q670850q146358K17164O180962J588159o900760p205518
$$ 13080569 11051340 2380490 -5765868 -5548704 632258 2220417 -4680343 -11885861
12409a1885861n04873J321369m076957n589760K159332R125103N807162k391854
$$ -11885861 -12390734 -11069365 -15146322 -20736082 -18576750 -9451647 -3644485 -6036339
12401f036339n085435k128164J66753Q32750K715236M313015K324330j170905
$$ -6036339 -11121774 -13249938 -13083185 -12250435 -9535199 -5222184 -2897854 -4068759
12393d068759j969054j028177j527988k192408m55555J458229P08843J37103K870416
$$ -4068759 -6037813 -7065990 -8593978 -10786386 -11241941 -9783712 -9074869 -8937766 -6067350
12384f067350M855800J357751k999933n32400N979841O714360L81856m527214
$$ -6067350 -1211550 146201 -2853732 -3386132 2593709 9308069 9689925 5162711
12376E162711l983232k801104l400305j384396M130774N995192K56186o173568
$$ 5162711 1179479 -1621625 -5021930 -6406326 -2275552 3719640 3975826 -2197742
12368b197742n073283J865936O805971N868328P08140n553361r308019p224652
$$ -2197742 -7271025 -5405089 1400882 7269210 7977350 2423989 -6884030 -14108682
12360a4108682n86428M147254K984343k86045k2254L018527L549958r6499l876404
$$ -14108682 -14695110 -10547856 -7563513 -7849558 -7871812 -4853285 -1303327 -1399826 -5276230
12351e276230l659241r2067K486009R89048k566517k933254J290157M382305R63861
$$ -5276230 -8935471 -9027538 -6541529 -5552481 -8118998 -11052252 -9762095 -5379790 -4415929
12342d415929m875561l869003M665555J0262538N387077m133116p477320k915072
$$ -4415929 -9291490 -13160493 -8494938 1767600 7154677 3021561 -4455759 -7370831
12334g370831K224055K729835N55667n03990J27338R53776J132791P97027L75890
$$ -7370831 -5146776 -2416941 -1861274 -2365264 -2237926 -1284150 -151359 645668 1021558
12325A021558J42335l16414j600572k810554j938464P50451J777947p96711l537150
$$ 1021558 1163893 847479 -753093 -3563647 -5502111 -4751660 -2973713 -3770424 -7307574
12316g307574j877867K795091M451762J254701j379260R48459M128958J148533
$$ -7307574 -9185441 -6390350 -1938588 -683887 -2063147 -1114688 3014270 4162803
12308D162803o487013r098512k066909P003178Q346965K824483j154334n37718
$$ 4162803 -2324210 -11422722 -13489631 -6486453 1860512 4684995 3530661 2992943
12300B992943l6383k286256l694237j955905k91426q41518n42133K210308L206932
$$ 2992943 2956560 670304 -3023933 -4979838 -5271264 -6112782 -6654915 -4444607 -1237675
12291a237675j5282k334220Q25300M940828L462174j122568j753159J103187J101082
$$ -1237675 -1252957 -3587177 -2761877 2178951 5641125 4518557 2765398 3868585 4969667
12282D969667k172329k706414Q00580K630849J72153k059602p88454R74393O4050
$$ 4969667 2797338 90924 891504 3522353 3694506 1634904 846450 1820843 1884893
12273A884893j775345j742638P7566K633215N155697N268947P98064n430272p633924
$$ 1884893 109548 -1633090 -1555524 1077691 6233388 11502335 12300399 6870127 -763797
12264g63797m854794j578751j32720J535499L656265K985503n87494k163598N86982
$$ -763797 -5618591 -7197342 -7330062 -5794563 -2138298 847205 259711 -1903887 -1316905
12255a316905L506869K582239l75535j581699o43979M75245M44872j094894l098734
$$ -1316905 2189964 4772203 4396668 2814969 2170990 2646235 3091107 1996213 -1102521
12246a102521k821462M64282K610993L86729j904228J376239O227499L588352
$$ -1102521 -3923983 -3459701 -848708 -461979 -2366207 -989968 5237531 8825883
12238H825883n389672r433744m415176O84047q66397l210927O42620O611327O899253
$$ 8825883 3436211 -5997533 -10412709 -9728662 -10595059 -13805986 -13163366 -6552039 347214
12229C47214K414699l95895N2491O77804L26149k43107j624493l761148l980446
$$ 347214 2761913 2366018 2418509 3096313 3422462 3179355 1554862 -2206286 -6186732
12220f186732j316257R17451N25295O6007J669764L124689K566518J774400J433154
$$ -6186732 -7502989 -6585538 -6060243 -5994236 -4324472 -1199783 1366735 3141135 4574289
12211D574289r88048n087151n773646j720211J176116p59791l016934j247052
$$ 4574289 3586241 -1500910 -7274556 -8994767 -7818651 -8578442 -11595376 -12842428
12203a2842428J500996J276014J23338J024337K510717L245348M939983O404171
$$ -12842428 -11341432 -10065418 -9942080 -8917743 -6407026 -3161678 1778305 8182476
12195H182476L121901k850306k830523L296151L971103m619149r634992k441676
$$ 8182476 11304377 8454071 5623548 8919699 12890802 8271653 -1363339 -3805015
12187c805015N630154K143362n031895k276345N061276K553562o779298p593778
$$ -3805015 1825139 3968501 -1063394 -3339739 1721537 4275099 -2504199 -10097977
12179a0097977N56756L233769k743939m767585K065988P214173M585293J632312
$$ -10097977 -9541221 -6307452 -9051391 -13818976 -11752988 -4538815 46478 1678790
12171A678790L092132K728416k172097l781221J426222M974978J148549l477174
$$ 1678790 4770922 7499338 5327241 1546020 2972242 7947220 9095769 5618595
12163E618595k724158p03973j475224q48735L424811M839512J04862l056138Q17316
$$ 5618595 2894437 2190464 715240 -133495 3291316 8130828 8235690 5179552 5996868
12154E996868M394403K37229n805905m842717l0517K33698k777656k088536J311092
$$ 5996868 10391271 10628500 4822595 -20122 -50639 183059 -2594597 -4683133 -3372041
12145c372041P99143l111123l642517J58881K300846M96317p48601J612612M650558
$$ -3372041 -2572898 -5684021 -9326538 -9167657 -6866811 -6370494 -7119095 -5506483 -855925
12136h55925M299177J63696m777223o396904k648982L206819N341178L173745
$$ -855925 3443252 3606948 -1170275 -7567179 -10216161 -7009342 -1668164 1505581
12128A505581J913163L073929J217570n511021r276841m074333L508435M073740
$$ 1505581 3418744 6492673 7710243 2199222 -7077619 -11151952 -7643517 -3569777
12120c569777L29572J487989O635400O132056j146514m754204L38159N156538
$$ -3569777 -3240205 -1752216 4883184 11015240 9868726 5114522 5452681 10609219
12112A0609219R78322o733764o652852J531368P191478M058684k284883l637791
$$ 10609219 11587541 4853777 -1799075 -267707 6923771 10982455 8697572 5059781
12104E059781j27819J780255o93176l236762j320177L213657M735858J179540
$$ 5059781 4931962 6712217 6019041 2782279 1462102 4675759 9411617 10591157
12096A0591157l818509n522409k727476J841710L995584J553106k955382m127559
$$ 10591157 6772648 1250239 -1477237 364473 4360057 5913163 2957781 -1169778
12088a169778j22603M410594M327264P51847j606716j614510j582186j826052
$$ -1169778 -1292381 3118213 7445477 8197324 6590608 4976098 3393912 1567860
12080A567860p96576M89832j67470j178479M63961K715258J184175k205063j017259
$$ 1567860 771284 1261116 1093646 -84833 379128 3094386 4278561 2073498 1056239
12071A056239M739841P586316L902744j748398n321460p759896q505808l888546
$$ 1056239 5796080 13382396 17285140 15536742 10215282 2455386 -6050422 -9938968
12063i938968M222576P254008K232276l206554k989854q83416j015020J72991
$$ -9938968 -5716392 1537616 3769892 563338 -2426516 -3309932 -4324952 -4151961
12055d151961M931128O449417l41784p906811o535631M52059K709939q24084k737151
$$ -4151961 779167 7228584 6886800 -1020011 -7555642 -7103583 -4393644 -5217728 -7954879
12046g954879p88320L41332r62813j720472j666740k791089k738135K151589Q116334
$$ -7954879 -8743199 -8401867 -9364680 -11085152 -12751892 -15542981 -18281116 -16129527 -8013193
12037h013193P539647R64199l414212k298861l71028k89817J142344M924326O506247
$$ -8013193 -473546 490653 -2923559 -5222420 -5593448 -5883265 -4740921 183405 6689652
12028F689652L527456j14597j014072j104863k796771m404552l431009n97644
$$ 6689652 10217108 10102511 9088439 7983576 5186805 782253 -2648756 -3246400
12020c246400J637242J805248j02448k219069j442943K285390L979322J89819
$$ -3246400 -1609158 196090 93642 -2125427 -3568370 -1282980 2696342 2886161
12012B886161m481739l129418K844585N541463K310003j389204j306664K53229
$$ 2886161 -1595578 -4724996 -1880411 3661052 5971055 4581851 3275187 3528416
12004C528416o9641j686350k505344k040180q66974k39583j710561l750964j254731
$$ 3528416 3458775 1772425 -732919 -2773099 -3640073 -3879656 -5590217 -9341181 -10595912
11995a0595912O527357J1050061N000527n156475o778541K50049L623298j724669
$$ -10595912 -4068555 6981506 11982033 6825558 47017 297066 3920364 2195695
11987B195695o102502j293898O621242P408305J388323l534322l895458k565299
$$ 2195695 -3906807 -5200705 1420537 8828842 10217165 6682843 2787385 222086
11979B22086k157000k493540k657303j689720Q45748K928256J686361j638429
$$ 222086 -1934914 -4428454 -7085757 -8775477 -7929729 -5001473 -3315112 -4953541
11971d953541k352659N81073K738041J257719j305241k103496j756466q63666
$$ -4953541 -7306200 -6725127 -3987086 -2729367 -4034608 -6138104 -7894570 -8758236
11963h758236J717254M596576L549303j432469m229231j153146L626314M668797
$$ -8758236 -7040982 -2444406 1104897 -327572 -4556803 -5709949 -2083635 2585162
11955B585162K514441Q51554P07717P37874k08156k858885o275276o435962j099539
$$ 2585162 5099603 5951157 6658874 7396748 7188592 4329707 -1945569 -8381531 -9481070
11946i481070M394151L239359j438244o33287M852424M671491k698605n608793
$$ -9481070 -5086919 -1847560 -3285804 -3919091 933333 5604824 2906219 -2702574
11938b702574J046698N991858N35449o134396k836200M270676L063080l206932
$$ -2702574 -1655876 4335982 4871431 -1262965 -4099165 171511 3234591 27659
11930B7659k543367M242915N851297O70419k422528j747697m292985r253300p149213
$$ 27659 -2515708 1727207 7578504 8248923 5826395 4078698 -214287 -9467587 -16616800
11921a6616800J937266N635145l05925m176357K172696R860534Q045420P62155
$$ -16616800 -14679534 -9044389 -9350314 -13526671 -11353975 -1493441 6551979 7314134
11913G314134j814736N0737r57836n188235o245175k261929K138341L810966L832113
$$ 7314134 5499398 5550135 4592299 -595936 -6841111 -9103040 -6964699 -3153733 678380
11904F78380L016869O53066k279388l098536j106846J359579J703854k73152j900520
$$ 678380 3695249 4348315 2068927 -1029609 -2136455 -776876 926978 653826 -1246694
11895a246694J26547N341936Q183196M189937l333388o946063m532960k78894
$$ -1246694 -1120147 4221789 12404985 16594922 13261534 6315471 1782511 1503617
11887A503617K671146M250219L095805j928072n723399j627763O495868O999831
$$ 1503617 4174763 8424982 11520787 9592715 3869316 2241553 8737421 15737252
11879A5737252j735606p324737k420995L737881Q83112n835708n676313Q6541
$$ 15737252 14001646 6676909 4255914 7993795 8876907 3041199 -2635114 -2548573
11871b548573K768363K029140L618171N619330J071224p245425q486864j032799
$$ -2548573 219790 2248930 5867101 11486431 12557655 5312230 -3174634 -4207433
11863d207433M631468K582251q95020J1767J392440j488283n191026m338242j11524
$$ -4207433 424035 3006286 2111266 2123033 3515473 2027190 -3163836 -7502078 -7613602
11854g613602L074108L920106K849126k76095l129813j414507L746824N160186
$$ -7613602 -4539494 -619388 2229738 1953643 -1176170 -2590677 1156147 6316333
11846F316333N13209k940978N2707L777828J194662m138170m510661r57405K46420
$$ 6316333 6829542 3888564 3941271 7719099 8913761 4775591 264930 -692475 -446055
11837d46055j63798L018409O946848L280265o102490q668319k69539P205685L733998
$$ -446055 -609853 2408556 9355404 12635669 6533179 -2135140 -2404679 4801006 8535004
11828H535004l714450l254798K785027K753870m438954p348592n16797O765671
$$ 8535004 4820554 1565756 4350783 7104653 2665699 -4682893 -5199690 1565981
11820A565981M666535l123340o115024k003882K471010K680491P59485m40342
$$ 1565981 6232516 3109176 -3005848 -5009730 -2538720 141771 901256 460914
11812D60914j433769k529652j516160K019501L876551P13996l911138l495559
$$ 460914 -972855 -3502507 -5018667 -2999166 877385 1591381 -2319757 -5815316
11804e815316J968176N190524J639122l758965l364116K367770N613665K340047
$$ -5815316 -3847140 1343384 2982506 -776459 -4140575 -1772805 3840860 6180907
11796F180907k367341k147427J693935K949759l11474l948104m256652j797453
$$ 6180907 3813566 1666139 3360074 6309833 5998359 2050255 -2206397 -4003850
11788d003850J393909M092482M679459K044060j074952l09801L007724K208900
$$ -4003850 -2609941 1482541 6162000 8206060 7131108 6821307 9829031 12037931
11780A2037931l912302o839032m46747Q108736P498702j415202p442546n495408
$$ 12037931 8125629 1286597 839850 8948586 16447288 15032086 7589540 2094132
11772B094132j210229R17943L274284O368599M905949k146903o708225l448979
$$ 2094132 883903 1801846 5076130 11444729 16350678 14203775 7495550 4046571
11764D046571J380767M79597k510605n49732L572922K299102k697973l243048
$$ 4046571 5427338 5906935 3396330 2846598 6419520 8718622 6020649 2777601
11756B777601P23813J269671k802518l437351K069357N355158O02272n875077
$$ 2777601 3501414 4771085 1968567 -1468784 600573 5955731 6558003 682926
11748F82926n851555j193435J252315P63662J512637M230015N771396M671397
$$ 682926 -5168629 -6362064 -5109749 -4346087 -2833450 1396565 7167961 11839358
11740A1839358J969328j450546m314473m342404j911433j229344l954231n332442
$$ 11839358 13808686 12358140 8043667 3701263 1789830 560486 -3393745 -8726187
11732h726187j511436L048205J729279l326662l730395K401991P367118M907850
$$ -8726187 -10237623 -7189418 -5460139 -8786801 -12517196 -10115205 -2748087 2159763
11724B159763j558753m370138j158758L985454O392488N029529J718767j709981
$$ 2159763 601010 -3769128 -4927886 -942432 5450056 10479585 12198352 10488371
11716A0488371m652714o375295m902708M75202N806193N154658j678674p524119
$$ 10488371 5835657 -539638 -5442346 -4967144 839049 5993707 4315033 -3209086
11708c209086o612615j812809M11967o91873o68959K180184M718308M605297L097893
$$ -3209086 -9821701 -11634510 -11222543 -11914416 -12583375 -10403191 -5684883 -1079586 2018307
11699B018307J485434r86414m102941n010504j796946L113095N143727K701245
$$ 2018307 3503741 2517327 -1585614 -6596118 -8393064 -5279969 -136242 2565003
11691B565003r44940j309304J858743L956087J690278j922530k178023p00065
$$ 2565003 1620063 310759 2169502 6125589 7815867 5893337 3715314 3015249
11683C015249k758783o629397m128244N101550R285742J418383q101898n903152
$$ 3015249 256466 -6372931 -10501175 -5399625 3886117 5304500 -2797398 -8700550
11675h700550L903581O452415n14736m599973N9109M526584J776499k057532q3419
$$ -8700550 -4796969 1655446 1140710 -3459263 -3400154 1126430 2902929 845397 761978
11666G61978L065239L14023m972403m911262j88558K130337K68697j313483n92598
$$ 761978 3827217 4141240 -831163 -5742425 -5930983 -3800646 -3531949 -4845432 -5438030
11657e438030r9724j121370j779228q01497R97869K565233L090165K013658O48943
$$ -5438030 -5537754 -6659124 -8438352 -9239849 -8241980 -5676747 -2586582 -572924 76019
11648G6019J365494L420052L224010N05247p90349M1751j339235n136194m309608
$$ 76019 1441513 4861565 8085575 8590822 7800473 7842224 6502989 1366795 -2942813
11639b942813L435328Q558284K968366o537871q149630k534346R69477Q95107
$$ -2942813 492515 9050799 12019165 5481294 -2668336 -5202682 -4233205 -3338098
11631c338098L075225O180149K591897n728596o886493K030737R065090N600348
$$ -3338098 -262873 5917276 8509173 2780577 -4105916 -2075179 6989911 12590259
11623A2590259j722321l762647k194254j986348p26953M674779Q498459M062914
$$ 12590259 10867938 7105291 4911037 2924689 2197736 6872515 15370974 19433888
11615A9433888m324827p382002m819435l558228n019609m217782l23567J404400
$$ 19433888 15109061 7727059 2907624 -650604 -5670213 -9887995 -10211562 -8807162
11607h807162j080995l344919k037183O33812J718795J770699K579756M287058
$$ -8807162 -9888157 -13233076 -15270259 -14636447 -12917652 -11146953 -8567197 -4280139
11599d280139N765791N449779K268979j942297k874608M35903K950822O21769
$$ -4280139 1485652 6935431 9204410 7262113 4387505 4823408 7774230 8395999
11591H395999l292526l822449k500269l525176n085933k490917K309663L181496
$$ 8395999 5103473 1281024 -1219245 -4744421 -9830354 -12321271 -10011608 -6830112
11583f830112N97191N57004L058920J990388k409265k161456M219868P287778
$$ -6830112 -6232921 -5675917 -2616997 -626609 -3035874 -5197330 -977462 6310316
11575F310316J731449m602984l763422j04210r50610l440709j277256K129328
$$ 6310316 8041765 3438781 -324641 -428851 -1379461 -4820170 -6097426 -3968098
11567c968098n63175n849397l347072O379225J0434160K235302q879349j0724944
$$ -3968098 -4531273 -10380670 -13727742 -7348517 3085643 5320945 -3558404 -14283348
11559a4283348l065269N119175P221854L417743k308362n414477l441894J806860
$$ -14283348 -17348617 -12229442 -5007588 -1589845 -3898207 -9312684 -12754578 -10947718
11551a0947718N945016O515212M144382Q3345m122818n376341j853708K950219
$$ -10947718 -5002702 1512510 5656892 5740237 1617419 -3758922 -5612630 -2662411
11543b662411L434180o63787m398589m989991l856084j334000M076353R716830
$$ -2662411 771769 107982 -4290607 -9280598 -13136682 -14470682 -10394329 -677499
11535f77499Q905630M97399p377912p275988j553545K611993K995880K215092
$$ -677499 8228131 8725530 1347618 -5928370 -7481915 -4869922 -1874042 341050
11527C41050J264858j118804m012437m244988j025671K616975L511636J647360
$$ 341050 1605908 487104 -3525333 -7770321 -8795992 -6179017 -2667381 -1020021
11519a020021l44614j26825J831928K894854K019006J301276J826361O60633l816772
$$ -1020021 -1364635 -1491460 340468 3235322 5254328 6555604 8381965 9042598 5225826
11510E225826o425469j894258M653230L185895m780815o292125K786061R398139
$$ 5225826 -1199643 -3093901 1559329 4745224 -35591 -6327716 -3541655 5856484
11502E856484K877666p764487p478359J820091N770613Q62118j962701K794328
$$ 5856484 8734150 969663 -6508696 -4688605 1082008 1944126 -18575 2775753
11494B775753O249356O93667p564686q088815j240673M245855L865119P66805
$$ 2775753 9025109 9718776 2154090 -5934725 -7175398 -2929543 935576 1702381
11486A702381r06284n17190N39460J134960J128969J292168K027180K078850K57833
$$ 1702381 796097 278907 818367 1953327 3082296 4374464 6401644 8480494 8738327
11477H738327j779576j288564R24870J088051j624655l553428k356576n41568
$$ 8738327 6958751 5670187 6595057 7683108 6058453 2505025 148449 -393119
11469c93119r10502j932870q49673J200101J046452p30512N045M337414P264968
$$ -393119 -1303621 -3236491 -4086164 -2886063 -1839611 -2570123 -2565078 1772336 9037304
11460I037304L669371m202326q358489m747523J586601L351148O00444p62760
$$ 9037304 12706675 8504349 145860 -4601663 -3015062 336086 936530 173770
11452A73770R49237O49869m199720p633066l177744O021392J0617455O910640
$$ 173770 1123007 1772876 -2426844 -10059910 -13237654 -7216262 3401193 10311833
11444A0311833L13342k513223q04856J383025N88679k292097k873214J119404
$$ 10311833 10625175 8111952 7307096 8690121 9278800 6986703 4113489 5232893
11436E232893N420299L951643j683741l264263J260761L357936k622499q982111
$$ 5232893 10653192 14604835 12921094 9656831 10917592 14275528 11653029 2670918
11428B670918n891041K686875M589443k200601p691580n561308k08156K918478
$$ 2670918 -3220123 -533248 4056195 1855594 -5835986 -11397294 -11605450 -8686972
11420h686972M402123N680159M853817J103722k523217l306864j522291J628300
$$ -8686972 -4284849 1395310 6249127 7352849 4829632 1522768 477 1628777
11412A628777M228596K867758k688877o064296k628708J427311k194644q594939
$$ 1628777 5857373 8725131 6036254 -28042 -2656750 -1229439 -3424083 -12019022
11404a2019022n469765O063450J0826310K945757m798436j637004M805235K674788
$$ -12019022 -17488787 -11425337 -599027 2346730 -2451706 -4088710 716525 3391313
11396C391313m697926n695474P43785N599414M940418L259991L355236K651082
$$ 3391313 -1306613 -7002087 -6258302 -658888 4281530 7541521 10896757 13547839
11388A3547839k13628k654323k935975k460922k505263k208218k61924L198590
$$ 13547839 13334211 10679888 7743913 5282991 2777728 569510 307586 3506176
11380C506176N999315N020941p5202m670114m216508o84715O87459k48869M3993
$$ 3506176 9505491 14526432 14451230 9781116 5564608 4879893 5567352 5318483 5362476
11371E362476M22893l079304p291433m384204M147643P336143J610014l983062
$$ 5362476 5785369 2706065 -4585368 -8969572 -4821929 2514214 4124228 141166
11363A41166l524438k450632m281702k726971M680699Q361164K474411l575084
$$ 141166 -3383272 -5833904 -10115606 -12842577 -8161878 199286 2673697 -901387
11355i01387j208454K134591k169149n916742J761732J1917936P648936p110608
$$ -901387 -2109841 24750 -2144399 -8061141 -6299409 5618527 13267463 6156855
11347F156855j1704348m28604J0047219P302097j049169l519064j251431q98786
$$ 6156855 -5547493 -5976097 4071122 11373219 10324050 6804986 5553555 4654769
11339D654769k531561k416267l36429J712717L004172L080299J734180Q98704
$$ 4654769 2123208 -293059 -629488 1083229 4087401 7167700 8901880 9800584
11331I800584J935405K024754j284492m308265k790444j56676k002153n486084
$$ 9800584 11735989 13760743 12476251 8167986 5377542 5220866 3218713 -2267371
11323b267371l738880J834120L951041J891385P65499N61114k429899n180472
$$ -2267371 -6006251 -4172131 -221090 1670295 2435794 2996908 567009 -4613463
11315d613463j679091M112178K765036l435669k539345O621383J1317910N377556
$$ -4613463 -6292554 -2180376 584660 -2851009 -5390354 1231029 12548939 17926495
11307A7926495k252411l938571l727719n368884m153184J680396M278735m27331
$$ 17926495 15674084 11735513 8007794 2638910 -1514274 166122 4444857 4017526
11299D017526m053939L81515O100077L709963l811542o962184l871007J44066
$$ 4017526 -36413 345102 6445179 10155142 6343600 -618584 -4489591 -4345525
11291d345525J820792J436395k51619j044215J639975M951626K646098l701441
$$ -4345525 -2524733 -1088338 -1339957 -2384172 -744197 4207429 6853527 3152086
11283C152086m386884K949726P558803J826062o514105o651025n64709K556025
$$ 3152086 -1234798 1714928 9273731 11099793 4585688 -2065337 -2630046 -74021
11275g4021P06064j418404j820084j563286o6806K797353L883185J579525j144803
$$ -74021 632043 -786361 -2606445 -4169731 -4236537 -1439184 2444001 4023526 2878723
11266B878723k529409m543270o118108k409470M843026O436306Q36373j427825
$$ 2878723 349314 -4193956 -10312064 -12721534 -7878508 -1442202 -605829 -2033654
11258b033654M095168O347564j993731r205733k925911P635365N512442o226229
$$ -2033654 2061514 8409078 6415347 -2790386 -5716297 1919068 7431510 1205281
11250A205281r852039j690084M224992O22256l480150n66997M166102M387648
$$ 1205281 -8646758 -10336842 -6111850 -5489594 -8969744 -9536741 -5370639 -982991
11242i82991K491240K393458K542195R47785p29050j466898k416281k574098N1026
$$ -982991 1508249 3901707 6443902 7391687 6662637 5195739 2779458 205360 256386
11233B56386K584439M86588l408343j935915L990985N654970M20048m467012m039482
$$ 256386 2840825 3327413 -80930 -2016845 1974140 7629110 8049158 3582146 -457336
11224d57336j910480j557265o90689J929662K660264J27855j470101j33932L68829
$$ -457336 -2367816 -3925081 -4615770 -2686108 -25844 102011 -1368090 -1502022 -1133193
11215a133193j428075q33557M126825P455509M343607r77857k410110j137145
$$ -1133193 -2561268 -3394825 732000 8187509 12531116 11553259 9143149 8006004
11207H006004j371311k117582p9371K937986K411444j303336l773394l413676
$$ 8006004 6634693 4517111 4437740 7375726 9787170 8483834 4710440 1296764
11199A296764k291615j187686Q42396K232338n92633p045216j0496896n265929
$$ 1296764 -994851 -2182537 -1340141 892197 299564 -6745652 -17242548 -22508477
11191b2508477N812209J3095883J0063717N41236n472691l178652K139191K934477
$$ -22508477 -16696268 -3600385 6463332 7004568 1531877 -1646775 492416 3426893
11183C426893p52938k797640o25617J575574j19393l482311l489902R68885N975172
$$ 3426893 2673955 -123685 -749302 826272 706879 -2775432 -6265334 -5296449 678723
11174F78723P039593L283036k240694n570059n225232k707184k41796P44261m74063
$$ 678723 7718316 11001352 8760658 3190599 -2034633 -4741817 -4983613 -4239352 -4713415
11165d713415k897097k750251K671504R214199Q802891N11354o583091n361171
$$ -4713415 -7610512 -10360763 -7689259 1524940 10327831 10839185 4256094 -1105077
11157a105077r5574J262067j065110j551048J74153J09249j507307j073576L85532
$$ -1105077 -1200651 61416 -1003694 -2554742 -2380589 -2271340 -3778647 -4852223 -4466691
11148d466691j038310l194678j98301N907611O001668j283910n690569p04085
$$ -4466691 -5505001 -8699679 -8897980 -2990369 3011299 1727389 -3963180 -4667265
11140d667265O395131O044350K11586k918340k189765k685123m992884m171266
$$ -4667265 1727866 7772216 7983802 5065462 2875697 190574 -4802310 -8973576
11132h973576R21424M827262L669854N00329j19522J160119N17495k540192m440229
$$ -8973576 -8052152 -3224890 444964 945293 825771 1985890 2503385 -36807 -4477036
11123d477036l022444m03193Q50677J502452K994468L450520O08159k603899j187090
$$ -4477036 -7499480 -7902673 -7051996 -5549544 -2555076 895444 1503603 -1100296 -2287386
11114b287386K993872K295640m441981q252243l292234L625227L703467k13270
$$ -2287386 706486 3002126 -1439855 -9692098 -12984332 -9359105 -5655638 -5868908
11106e868908J24248L604238K471945k680734k821559M025416Q629921M788567
$$ -5868908 -5744660 -2140422 331523 -2349211 -5170770 -1145354 7484567 12273134
11098A2273134k084804m443728k322499M64128K349636K215629j470150n781216
$$ 12273134 10188330 5744602 3422103 3886231 6235867 8451496 6981346 1200130
11090A200130m458501K101872N112579K00748n387994m007842J077680K501566
$$ 1200130 -3258371 -1156499 3956080 4156828 -1231166 -5239008 -4161328 -1659762
11082a659762O27375N49509K145012J728270K90459J437125L207597O40293m297058
$$ -1659762 -1032387 -482878 1662134 3390404 3680863 5117988 8325585 8965878 4668820
11073D668820m052569K287889O232354K094274m762143n998920j695776J339398
$$ 4668820 616251 2904140 9136494 11230768 6468625 469705 -1226071 113327
11065A13327m2994j860745J02932L972875M425647m3150n011193n598041k100871
$$ 113327 70333 -1790412 -1687480 2285395 6711042 6667892 1656699 -3941342 -6042213
11056f042213J263569J958181J312066J580847L118253M630036M316768Q07574
$$ -6042213 -4778644 -2820463 -1508397 72450 3190703 7820739 12137507 12945081
11048A2945081m918113q718069p076548j913175J243890L31777j086654M75025
$$ 12945081 8026968 -691101 -7767649 -9680824 -8436934 -8105157 -9191811 -8716786
11040h716786L877260N948766N566480L299187k99108l877402m966103k724888
$$ -8716786 -4839526 1109240 6675720 9974907 9675799 5798397 832294 -1892594
11032a892594M39836J704293R78865j3623l52472l45901m64330p37237m58711
$$ -1892594 -1452758 251535 1230400 1216777 864305 518404 54074 -683163 -1141874
11023a141874J389192M205368N115596K417712j235604k010878m61518l43957
$$ -1141874 247318 4452686 9568282 11985994 10750390 8739512 8277994 7934037
11015G934037k342683l168910j176863J287636J825573N07585j812233l746330
$$ 7934037 5591354 2422444 1245581 2533217 4358790 4866375 3054142 -692188
11007f92188k276942L567163Q251846N322409k104422l993537J682481N211721
$$ -692188 -2969130 598033 8849879 14172288 12067866 8074329 9756810 14968531
10999A4968531K53686o006360m363033K115526L854451k45826k993469j454889
$$ 14968531 15222217 9215857 4852824 6968350 10822801 10576975 7583506 6128617
10991F128617p3580j552619k774974j267845O12173J83677j263557q26564J897455
$$ 6128617 6055037 4502418 1727444 459599 1071772 1255449 -8108 -834672 1062783
10982A062783M255899K954638k383460p225085o156878m58790K311370q24577
$$ 1062783 5318682 8273320 5889860 -1335225 -7492103 -7950893 -5639523 -6464100
10974f464100l002134J731284P754658N948358j429674l996208P8662J811463
$$ -6464100 -9466234 -7734950 19708 5968066 4538392 542184 620846 2432309
10966B432309k735160n618853p45168N385404L892268k723469n274912j658292
$$ 2432309 -302851 -5921704 -6666872 -1281468 2610800 -112669 -5387581 -7045873
10958g045873K289593K940335K050425R54044j299386l854259l979367j661463
$$ -7045873 -4756280 -1815945 234480 1188524 -110862 -3965121 -7944488 -9605951
10950i605951M72296J809138L539882M137834P01837m757080o335077k827990
$$ -9605951 -9133655 -7324517 -3784635 353199 1055036 -3702044 -10037121 -12865111
10942a2865111N92825R85007J445941L615641L432065j025015m110577j270204
$$ -12865111 -12272286 -11287279 -9841338 -6225697 -2793632 -3818647 -7929224 -9199428
10934i199428K738565J801081o60981J847611N564069J270061q672220j0761202
$$ -9199428 -6460863 -4659782 -5320763 -3473152 2090917 3360978 -5311242 -16072444
10926a6072444m13695J0080549Q890648M0254n261560m333707k008316l24356
$$ -16072444 -16486139 -6405590 2485058 2525312 -2736248 -7069955 -9078271 -9402627
10918i402627J910539L239558J453897j018058m93066J416724R09124p76634K49804
$$ -9402627 -7492088 -4252530 -2798633 -3816691 -4309757 -2893033 -1983909 -2760543 -2510739
10909b510739K918222K626385r02392l274351k187914N93799K892678L220633
$$ -2510739 407483 3033868 2131476 -1142875 -3330789 -2736990 155688 3376321
10901C376321K85699m077289m530197J71276L307469J57316l170147O89097O744837
$$ 3376321 3662020 -415269 -4945466 -4774190 -1466721 -1309405 -4479552 -3790455 2954382
10892B954382M624161l855738o697166p98307L930707J293766k928828l152952
$$ 2954382 7578543 3722805 -2974361 -3772668 158039 1451805 -1477023 -4629975
10884d629975k682151m835576n657906j823232K697489L917430M071707N017733
$$ -4629975 -7312126 -12147702 -17805608 -19628840 -16931351 -13013921 -8942214 -3924481
10876c924481L367216j694264l658103J180433O141690M461973M92754J856624
$$ -3924481 -557265 -2251529 -5909632 -4729199 1412491 5874464 6367218 8223842
10868H223842N949615M110006l937192r364973p039674j042496K807885L532677
$$ 8223842 14173457 18283463 14346271 4981298 -2058376 -3100872 -292987 3239690
10860C239690L128553K676256J581969j220089n072429o351084k288898L389912
$$ 3239690 6368243 9044499 10626468 9406379 4333950 -2017134 -4306032 -916120
10852i16120L404578k760226p012626l888551K362746N510296N606566M675404
$$ -916120 2488458 -271768 -7284394 -11172945 -8810199 -3299903 2306663 6982067
10844F982067R14898o088802j0006294n351987L431400P573656N366240J523519
$$ 6982067 7896965 1808163 -8198131 -13550118 -10118718 -2545062 2821178 4344697
10836D344697j134952k624031k099193k01594j321245o226952o878880K420634
$$ 4344697 3209745 585714 -1513479 -1715073 -3036318 -9263270 -16142150 -13721516
10828a3721516J2687028J0155782l225085j1094707n383474L807841M520124j087981
$$ -13721516 -1034488 9121294 5896209 -5198498 -10581972 -6774131 -2254007 -3341988
10820c341988l070014J260237N569675M211017j827715p322264p900007l449853
$$ -3341988 -6412002 -5151765 417910 4628927 2801212 -4521052 -12421059 -15870912
10812a5870912K052681M635111L935304J747105r67684l009451j534036L921177
$$ -15870912 -13818231 -9183120 -5247816 -3500711 -4468395 -7477846 -9011882 -5090705
10804e090705Q064128N760507r8592k384331l47269R5007l419226o245712m871693
$$ -5090705 2973423 8733930 8635338 6251007 5903738 5998745 2579519 -3666193 -8537886
10795h537886j918718o51119j80433J140180K431985K973586L727344M079571
$$ -8537886 -10456604 -11107723 -11288156 -10147976 -7715991 -4742405 -1015061 3064510
10787C064510J788465j789503j881049J623672K361770k228466n126439k37875
$$ 3064510 4852975 3063472 1182423 2806095 5167865 2939399 -2187040 -2424915
10779b424915O769095O188385n97932l105083J812779N260396O11518o160225
$$ -2424915 4344180 10532565 9934633 6829550 8642329 13902725 14514243 8354018
10771H354018n919179J36318L479607J173166j842851k279339k670180m534748
$$ 8354018 2434839 2571157 6050764 7223930 5381079 3101740 431560 -4103188
10763d103188m137196J087367O553711N827156n06346n706808n474792j857663
$$ -4103188 -8240384 -7153017 -599306 5227850 4721504 -985304 -6460096 -8317759
10755h317759R69595J444909Q38566J069992K704286M105902L285416J147109
$$ -8317759 -7348164 -5903255 -5064689 -3994697 -1290411 2815491 6100907 7248016
10747G248016O86681J830230N19368m605525q513714o629326j657167J235866
$$ 7248016 7934697 9764927 10284295 5678770 -2834944 -9464270 -11121437 -9885571
10739i885571K351926M525141N684140K001086l622659m547545j037711M91954
$$ -9885571 -7533645 -3008504 2675636 4676722 1054063 -3493482 -4531193 -4039239
10731d039239j327087j277194K011960L366599Q97659m94814J484094K229028
$$ -4039239 -5366326 -6643520 -4631560 -1264961 -367302 -862116 621978 2851006
10723B851006q79011l461545k378291j239118k822330l252708P99698N412511
$$ 2851006 1971995 -1489550 -3867841 -5106959 -7929289 -11181997 -10382299 -4969788
10715d969788N331149J352970k610548m683654l899761J09744L510302J439600
$$ -4969788 361361 1714331 -896217 -5579871 -9479632 -9369888 -5859586 -4419986
10707d419986k684382P1271Q794755J0971375J623609p305464m816761K870292
$$ -4419986 -7104368 -7033097 1761658 12733033 14356642 7051178 2234417 5104709
10699E104709M079033k18052j936885j083614k297521k881123J896139O481349
$$ 5104709 9183742 8965690 7028805 5945191 3647670 766547 2662686 9144035
10691I144035K221778o328136o590951J846780O280042Q71296n588188m758702
$$ 9144035 11365813 5037677 -1553274 293506 6573548 7444844 1856656 -2902046
10683b902046k21731O43663k266493l713848q88615M104438O586406L450477k658551
$$ -2902046 -3123777 -2480114 -4746607 -8460455 -9349070 -5244632 1341774 4792251 2133700
10674B133700n059053j727645J447726l8369k099565J36041L189613J578097j974717
$$ 2133700 -2925353 -4652998 -3205272 -3243641 -5343206 -5207165 -2017552 -439455 -2414172
10665b414172j408760K113121L560093L576603N158509N211319j40834n817744
$$ -2414172 -3822932 -1709811 1850282 5426885 10585394 15796713 15655879 9838135
10657I838135m466419O89776J327919j149262P95626N083921K244988p114916
$$ 9838135 5371716 6061492 7389411 6240149 7035775 12119696 14364684 7249768
10649G249768j1458975o364029l8114J465987J786536L898561M272322J418207
$$ 7249768 -4209207 -10573236 -10611350 -9145363 -7358827 -3460266 812056 2230263
10641B230263k88317P94528O20576j831228k219308K06554Q46627o77343Q20778
$$ 2230263 1941946 2736474 3357050 1525822 -693486 -486932 359695 -317648 503130
10632E03130N190794N040472j765228p613026p076618m021992k868242j826182
$$ 503130 5693924 10734396 8969168 1356142 -5720476 -9742468 -12610710 -14436892
10624a4436892R44120K824619K421316K192505K502135Q55792j034504J530989
$$ -14436892 -13492772 -10668153 -8246837 -6054332 -3552197 -2696405 -3730909 -2199920
10616b199920O061164M229709l799607p412756j928285M148318L385361O704j09631
$$ -2199920 3861244 8090953 4291346 -3121410 -5049695 -901377 2483984 2490688 2381057
10607B381057M40224j852422k877433J500705O527255N460524k64453m760900
$$ 2381057 2821281 968859 -1908574 -407869 6119386 11579910 11315457 6554557
10599F554557o192213n297470j079495N468559Q406117M240422j796224k771930
$$ 6554557 362344 -4935126 -6014621 -546062 7860055 12100477 10304253 7532323
10591G532323L73373J794008q1861j768369r02711J278977K427323J270693j636462
$$ 7532323 7905696 9699704 9617843 7849474 6946763 8225740 10653063 11923756 10287294
10582A0287294m297281n647273o628610o716185k426952O074364J0707939N269930
$$ 10287294 5990013 342740 -6285870 -13002055 -15429007 -9354643 1353296 6623226
10574F623226l482449l853039L419495O470469Q64394m674303l183482R45201
$$ 6623226 3140777 -712262 2707233 9177702 10042096 5367793 2184311 3129512
10566C129512J273609j263677k950817l622255m003789k874282k37245J736226
$$ 3129512 4403121 3139444 188627 -3433628 -7437417 -10311699 -10548944 -8812718
10558h812718K557023L332745L057440N48641j536316j091077j892518o520207
$$ -8812718 -6255695 -2922950 134490 683131 -853185 -1944262 -3836780 -10356987
10550a0356987q219079l99793R793362J0141272K546821n05086L330603M350171
$$ -10356987 -18576066 -18975859 -9182497 958775 3505596 3000510 6331113 10681284
10542A0681284q70915m825605l659473j570158K65480M507726P116947J432504
$$ 10681284 9810369 4984764 1325291 -244867 20613 4528339 11645286 13077790
10534A3077790p105294o656946O10755J454922m950561n819558J574543N404938
$$ 13077790 5972496 -684450 -73695 1381227 -3569334 -9388892 -7814349 -2409411
10526b409411J320672j432767N83309J0873l229220J185P979570P837783o08186
$$ -2409411 -1088739 -2521506 -1938197 -1927324 -5156544 -5155359 2824211 10661994 10053808
10517A0053808l248378K261724K731898m356627o433386j849036l006604r080148
$$ 10053808 6805430 9067154 11799052 7442425 1009039 -839997 -3846601 -12926749
10509a2926749n191082O309591O108134m913651m411153Q740959J0027980l673447
$$ -12926749 -18117831 -11808240 -5700106 -10613757 -15024910 -6283951 3744029 70582
10501G0582o418013O083688O640472p923711o043216J4559259J4133441j1566294
$$ 70582 -6347431 -263743 6376729 -1546982 -7590198 6969061 21102502 9536208
10493I536208j2357440K0239828K1053577k5568929k2066634Q7803328J81003375
$$ 9536208 -2821232 17418596 38472173 12903244 -9163390 78639938 259643313
10486B59643313J03746539q7220882j80081059r7849716J5696920K5891308k1665131
$$ 259643313 363389852 276168970 96087911 -1761805 13935115 39826423 18161292
10479A8161292k3540686J2052109J4427056j4927437k0204445L096106J1713564
$$ 18161292 -5379394 6672715 21099771 6172334 -14032111 -10936005 777559
10472G77559j849735n948743N109094P072570k641426l884226L116921Q01304
$$ 777559 -1072176 -7020919 -1911825 5160745 2519319 -1364907 1752014 2553318
10464B553318p011746k289212Q937609N920261o343010n172325P141560P136460
$$ 2553318 -4458428 -6747640 2189969 8110230 1767220 -3405105 3736455 10872915
10456A0872915o826314j2318835k971732L659941J0782j386711M773946P478499
$$ 10872915 4046601 -8272234 -11243966 -7584025 -7573243 -8959954 -4186008 3292491
10448C292491K219541j663530n18980j309144m070478k69170Q423908R265925
$$ 3292491 5512032 3848502 3329522 2020378 -2050100 -2319270 6104638 15370563
10440A5370563l15006q009021o103533k73170L000956L665355J756853l138628
$$ 15370563 15055557 7046536 943003 669833 3670789 7336144 9092997 5954369
10432E954369o012170j885277M216091L972830o10010j823702k02429j513231
$$ 5954369 -57801 -1943078 2273013 6245843 5635833 3812131 3609702 2096471
10424B096471m394316l679113j364112j814013j535192L587955P310696K779611
$$ 2096471 -2297845 -5976958 -7341070 -9155083 -10690275 -7102320 208376 2987987
10416B987987l682207k783446J268928j30570k501087K729465R188409M766996
$$ 2987987 -694220 -3477666 -2208738 -2339308 -4840395 -2110930 7077479 11844475
10408A1844475n800029p480297o4987L136248j129841l595670j777732k173862
$$ 11844475 6044446 -1435851 -1500838 1635410 505569 -3090101 -4867833 -7041695
10400g041695m067167l12377N971232M267654l720228n757119l21112K514900
$$ -7041695 -11108862 -11421239 -5450007 -1182353 -4902581 -10659700 -10980812 -8465912
10392h465912J200507L832046Q637025M515242o485264q756291M85431N752666
$$ -8465912 -7265405 -3433359 5203666 9718908 3233644 -5522647 -5037216 715450
10384G15450J66515l642164K223919O641129N59925o367202l423044K760291J365548
$$ 715450 881965 -2760199 -536280 6104849 6664774 297572 -3125472 -365181 1000367
10375A000367m078033m184844j93679J124569M61599J972842L545093J698786
$$ 1000367 -3077666 -7262510 -7456189 -6331620 -5870021 -3897179 -352086 1346700
10367A346700k53879J652383M003926K560024L15895R19645R08488l037724n945397
$$ 1346700 1092821 2745204 6749130 9309154 9625049 10544694 11453182 8415458 2470061
10358B470061k815653J247568q55184n220687k898314M531065O648830P56025
$$ 2470061 -345592 901976 46792 -5173895 -8072209 -3541144 3107686 3863711
10350C863711m013736j252008L256796J545946l564138k920187L823971O106117
$$ 3863711 -150025 -1402033 1854763 3400709 -163429 -3083616 740355 6846472
10342F846472j481483q661279l383373Q140562Q014816o009619j4741705n761339
$$ 6846472 5364989 -3296290 -6679663 1460899 9475715 3466096 -11275609 -17036948
10334a7036948P466070O973322k252150l371642L434640M176031j851426j085140
$$ -17036948 -9570878 -2597556 -4849706 -8221348 -4786708 -610677 -2462103 -3547243
10326c547243Q008833J0385835O75468p273894m544676r64921m835343p427748
$$ -3547243 4461590 14847425 15522893 8248999 3704323 2739402 -2095941 -9523689
10318i523689m96126O994991M439495j627758q7218M666929J930917m776328l955316
$$ -9523689 -10019815 -3024824 1414671 -213087 -300305 4366624 6297541 1521213 -2434103
10309b434103K798666L464619l261387o059939m30602M815608K943570j385568
$$ -2434103 364563 3829182 567795 -5492144 -5922746 -1107138 1836432 450864
10301D50864k000077k65705L13700Q07886L366553O067304N256652L67657n558414
$$ 450864 -1549213 -1814918 -1501218 -693332 2673221 8740525 13997177 14364834 8806420
10292H806420q378403n856262j96101L364920K507890M30814M00044J049448K89807
$$ 8806420 428017 -5428245 -5624346 -2259426 248464 679278 1079322 2128770 2418577
10283B418577j63081J252498J517505j606463l526231O52098O332658M695179
$$ 2418577 2255496 3507994 5025499 3419036 -107195 544903 6877561 11572740
10275A1572740l272519p183645k873845J473478j499168p013760o132671N49303
$$ 11572740 8300221 1116576 -1757269 -283791 -1782959 -8796719 -14929390 -14380087
10267a4380087M721922L250962J470235L246966M862581J978538k590874l193395
$$ -14380087 -9658165 -6407203 -4936968 -1690002 3172579 5151117 2560243 -633152
10259f33152m79914j86126l460377m783207j103847K956953K518330l3142K23086
$$ -633152 -1113066 -1299192 -4759569 -9542776 -10646623 -7689670 -5171340 -5204482 -4981396
10250d981396K443994K260865k98956j218962N62540K260142K336220J297243
$$ -4981396 -2537402 -276537 -575493 -1794455 -1231915 1028227 3364447 4661690
10242D661690j297477n145556o154151j441949M054106L255854j717544k160859
$$ 4661690 3364213 -1781343 -7935494 -9377443 -5323337 -2067483 -3785027 -5945886
10234e945886L258464O312986K633897j918688j632230P58674N20889j705830
$$ -5945886 -2687422 3625564 6259461 4340773 2708543 3467217 3988106 2282276
10226B282276l657828n919418p919618n752481J036320O305283N905669L772143
$$ 2282276 -1375552 -7294970 -15214588 -20967069 -19930749 -13625466 -7719797 -3947654
10218c947654M446885N374148K453846k019946l326346j924576j011523l55576
$$ -3947654 499231 5873379 8327225 6307279 2980933 1056357 44834 -310742
10210c10742J509135K592575R23638o17689J108509L169402R24495l872568n464517
$$ -310742 1198393 3790968 4714606 4096917 5205426 8374828 9299323 5426755 -37762
10201c7762k669488O42592K082400K398376J888065J51262j446402j270878m16316
$$ -37762 -2707250 -2064658 17742 2416118 4304183 4455445 3009043 1738165 1321849
10192A321849p46629j474482r17333L00410R04623J500313K526003K540884J365899
$$ 1321849 575220 -899262 -1816595 -1516185 -611562 888751 3414754 5955638 7321537
10183G321537J287596K144385n8123n693210q109159l103915L453984M103496
$$ 7321537 8609133 10753518 10695395 5002185 -3106974 -6210889 -2756905 1346591
10175A346591J028708R72918L044239R00603n066482p323538k953337K517774
$$ 1346591 2375299 3348217 6392456 7293059 2226577 -5096961 -8050298 -5532524
10167e532524L869748J700408j445301l820539k846420K652819P900689O368688
$$ -5532524 -1662776 37632 -1407669 -5228208 -8074628 -5421809 2478880 8847568
10159H847568o36494n058223l603533j194360j453448j284002J984588N003024
$$ 8847568 8211074 3152851 -450682 -1645042 -3098490 -4382492 -2397904 2605120
10151B605120M377901K588902K900043K863048j380903p178689p775693k024293
$$ 2605120 6983021 9571923 12471966 15335014 13954111 6775422 -1000271 -3024564
10143c024564L470708L058957q33499j761116J494708L279918n48423n888325
$$ -3024564 446144 3505101 2671602 910486 2405194 5685112 5136689 -751636
10135g51636n564953K86776M046758J455204k746812k484106J367083M020159
$$ -751636 -6316589 -6029813 -1983055 -527851 -3274663 -5758769 -4391686 -371527
10127c71527L640892R82130l454508p130368m992607K868675P689632L221514
$$ -371527 3269365 4251495 796987 -6333381 -11325988 -8457313 -767681 2453833
10119B453833l872816l213587L518587O089190K469800M39667K685162K583695
$$ 2453833 -1418983 -4632570 -1113983 4975207 7445007 7884674 10569836 13153531
10111A3153531k676773o318170l784037k31472p83227k218700m27297J815790
$$ 13153531 10476758 4158588 374551 143079 -640148 -2858848 -3286145 -1470355
10103a470355J026107n0493J678343L143052J191535p43344R94292K823382J90167
$$ -1470355 -444248 -494741 1183602 4326654 5518189 4774845 5769137 8592519 8782686
10094H782686l795666l734297j343353j329291k006892J042807N111770L584964
$$ 8782686 4987020 1252723 -90630 -1419921 -3426813 -2384006 2727764 6312728
10086F312728k719298o458311n036180k337828l8045L706162O898548M598319
$$ 6312728 3593430 -2864881 -7901061 -10238889 -10276934 -6570772 327776 4926095
10078D926095j369322k749631K497828O404492L276881k163413l294388j193325
$$ 4926095 3556773 807142 3304970 9709462 12986343 10822930 7528542 6335217
10070F335217n28284j544547j569481l60898O78059J244558P25933k089106n111848
$$ 6335217 5806933 4262386 2692905 2332007 3010066 4254624 4980557 2891451 -2220397
10061b220397l714394J391924K853663k371828o864134l402473L895117O284064
$$ -2220397 -5934791 -4542867 -1689204 -4061032 -10925166 -14327639 -10432522 -4148458
10053d148458L415610J337984J193172p18922l593886k658347J106084J318882
$$ -4148458 -732848 605136 1798308 1079386 -2514500 -5172847 -4066763 -2747881
10045b747881k453052k931815K607026P035828M545368n88627j775053j20113
$$ -2747881 -5200933 -8132748 -5525722 1510106 6055474 5466847 3691794 3571681
10037C571681l03527j525061K03452L728576L906753J27839k540822j161551J121912
$$ 3571681 3268154 1743093 1946545 5675121 9581874 9709713 7168891 6007340 7129252
10028G129252L00304k865944m237775j555682K991824N027393K661570j200557
$$ 7129252 7429556 4563612 325837 -1229845 1761979 6789372 9450942 8250385
10020H250385k247347l14955O48497j320997l166476j654429J539530K306696
$$ 8250385 6003038 5688083 6336580 5015583 1849107 194678 1734208 4040904
10012D040904k55249l465105n004104m676101l170671j303320J58030J418173
$$ 4040904 3785655 320550 -4683554 -9359655 -12530326 -13833646 -13675616 -12257443
10004a2257443L375706N363193N085798K289689J55977R39500K494598J647057
$$ -12257443 -8881737 -3518544 1567254 3856943 4012920 4952420 7447018 9094075
9996I094075j079449k852652k710314j468000O56574L115379L396799m3313m158863
$$ 9094075 8014626 5161974 2451660 983660 1640234 4755613 8152412 8109099 3950236
9987C950236m133611L99288M756534M762978Q56093l100529l709095j383387k84579
$$ 3950236 -183375 215913 4972447 9735425 10591518 7490989 3781894 2398507 2113928
9978B113928l072053n784219k033256O577652R951480K959314o267408p121038
$$ 2113928 -958125 -6742344 -8775600 -2197948 7753532 10712846 4445438 -2675600
9970b675600q24266L148998J419674q93544n51589k37504j462822j148221K346700
$$ -2675600 -3499866 -350868 1068806 175262 -376327 -613831 -2076653 -3224874 -878174
9961h78174N588612N030007J455691k255700m297347l849862j177064J483941
$$ -878174 4710438 9740445 11196136 8940436 4643089 793227 -383837 1100104
9953A100104J938965Q89448K98113J87515n8240N14195J745843O23095l263564
$$ 1100104 3039069 3928517 4226630 4414145 4355905 4870100 6615943 7239038 3975474
9944C975474m578047o01048J979922l010746q966902n154025N110600P929310
$$ 3975474 -602573 -1203621 776301 -2234445 -11201347 -16355372 -11244772 -3315462
9936c315462L68653n299505j609691L560838J975554k002594j314710J323656
$$ -3315462 -2946809 -8246314 -9856005 -6295167 -4319613 -6322207 -7636917 -6313261
9928f313261J4655l080080k178983K112666N168130N954144N508453K641621k395345
$$ -6313261 -6298606 -9378686 -11557669 -9445003 -4276873 1677271 7185724 9827345 7432000
9919G432000m726680j615777K217213J970537M00927J752644L240515L9285n224666
$$ 7432000 2705320 1089543 3306756 5277293 5678220 7430864 10671379 10710664 5485998
9910E485998n684953o44276L826214L371302m60503l276807k036440J904587K914569
$$ 5485998 -198955 -843231 2982983 6354285 5893782 2616975 580535 2485122 5399691
9901E399691j852311n929950j333422P181724O485461m001404r062953j222642
$$ 5399691 3547380 -2382570 -3715992 3465732 9951193 5949789 -3113164 -4335806
9893d335806O689151K260948o608673n670141K982413P103931M429584J351606
$$ -4335806 2353345 4614293 -1994380 -7664521 -4682108 2421823 6851407 8203013
9885H203013j100723m587973l855787M155312Q835101J176954p044489l73953
$$ 8203013 7102290 2514317 -1341470 2813842 11648943 12825897 5781408 5407455
9877E407455J0583545K425404j9954570k4827114j770706K0195329J5071817m398501
$$ 5407455 15991000 18416404 -1538166 -26365280 -28135986 -7940657 7131160 2732659
9869B732659j0694140j173456O534142M666351o964l175332n774683m676264L237081
$$ 2732659 -7961481 -9134937 -2600795 2065556 2058592 -1116740 -6891423 -11567687 -8330606
9860h330606J0838346Q438103q81665n809807l907511k325361l821443l978241
$$ -8330606 2507740 10945843 10064178 4254371 346860 -1978501 -5799944 -9778185
9852i778185j361710N03573J118839L274485N592522L953367Q4570k71544K389439
$$ -9778185 -11139895 -10636322 -9517483 -6242998 -650476 3302891 3387461 3115917 5505356
9843E505356K091739j293022j139595L773208N713688K34335o290486o399167
$$ 5505356 7597095 6304073 5164478 8937686 14651374 14885709 8595223 2196056
9835B196056k375302j413619m183181m509111Q78703P375401Q190192K377416
$$ 2196056 -179246 -1592865 -5776046 -10285157 -9406454 -2031053 6159139 8536555
9827H536555m235450n553059j638070K021643J235006k382534l992345j120348
$$ 8536555 4301105 -1251954 -2890024 -868381 366625 -2015909 -6008254 -7128602
9819g128602L996934O450262L052042l592072o124275o18751O955940P065115
$$ -7128602 -3131668 3318594 6370636 2778564 -3345711 -3964462 2991478 10056593
9811A0056593m74800n831195l040141K102027J716103k857400m940320k891047
$$ 10056593 9581793 3750598 710457 2812484 4528587 1671187 -3269133 -6160180
9803f160180l43527P66081J512747K353132K967402L753235L836762P82411m083706
$$ -6160180 -6503707 -5737626 -4224879 -1871747 1095655 4848890 8685652 9468063 5384357
9794E384357m762847R1148K472757l405121j0175339p114882L028227P761059
$$ 5384357 621510 712658 3185415 -219706 -10395045 -17509927 -14481700 -6720641
9786f720641L590095n01780J147779L295096J208047j045566P03341K441992o67173
$$ -6720641 -3130546 -3632326 -2484547 810549 2018596 973030 1676371 4118363 3451190
9777C451190n038303m171487Q05123L332898J810554R26512K976228L830928n49862
$$ 3451190 -1587113 -5758600 -4953477 -1620579 189975 1116487 4092715 7923643 7373781
9768G373781p284672r294679m179463K127845K287405k924078n344578n43886
$$ 7373781 89109 -9205570 -13385033 -11257188 -8969783 -11893861 -17238439 -17782325
9760a7782325N968433O740802K555443m22420m29689m57290p73650J304689M474799
$$ -17782325 -11813892 -5073090 -2517647 -2940067 -3369756 -3827046 -4600696 -3296007 1178792
9751A178792L967088j22538k422011j500362j754364m143322l467147J716959
$$ 1178792 5145880 5023342 2601331 1100969 -653395 -4796717 -8263864 -6546905
9743f546905M906708K202557r21816P08200L017871L89145m429700n850103m752750
$$ -6546905 -1640197 562360 -359456 348744 3366615 3755760 -673940 -6524043 -11276793
9734a1276793m024970r48972O277894J0123834L456375o445323o608425J299594
$$ -11276793 -15301763 -16250735 -9972841 150993 3607368 -2837955 -9446380 -8146786
9726h146786L661873k295577m193220L614446R698405M675364l242192k492682
$$ -8146786 -4484913 -6780490 -10973710 -7359264 2339141 7014505 3772313 1279631
9718A279631L104891K532497l356693m583465N23846L876247K063586K75465J446366
$$ 1279631 4384522 6917019 3560326 -1023139 -499293 3376954 5440540 5716005 7162371
9709G162371J999655l1490j600843j293016j655556l154056k836265m15142J101386
$$ 7162371 9162026 9130536 7529693 6236677 4581121 1427065 -1409200 -1824342 -722956
9700g22956J666555L819624N610089K364825l546176m380287l29191j88788n327917
$$ -722956 943599 4763223 10373312 12738137 9191961 4811674 4482483 4293695 -1034222
9691a034222n497109K975872P869871K51120q793758m524955P338450R472173
$$ -1034222 -6531331 -3555459 4314412 4565532 -4228226 -8753181 -1414731 8057442
9683H057442O52463l535503L102151Q511885L481442m404037m997091j046242
$$ 8057442 8709905 5174402 8276553 16788438 20269880 15865843 10868752 9822510
9675I822510p07320l921043n016847k529656R23028L670760M400286J534897k450455
$$ 9822510 9115190 5194147 177300 -2352356 -1429328 2241432 6641718 8176615 5726160
9666E726160j977442K318187K372331m335805q714102l589161M660600O232108
$$ 5726160 3748718 6066905 8439236 4103431 -4610671 -8199832 -3539232 2692876
9658B692876K410317M97175P03819j087640k660519N90522M638318K055948l978100
$$ 2692876 5103193 5600368 6304187 5216547 2556028 3146550 7784868 9840816 5862716
9649E862716l694157K178010K875524l792071p230229k064373K985189L36436
$$ 5862716 2168559 4346569 7222093 3430022 -3800207 -5864580 -2879391 -2542955
9641b542955m190321k398190K677617L311653o0586j691667q51671o84055p86352
$$ -2542955 -6733276 -9131466 -6453849 -3142196 -3202782 -4894449 -5746120 -6430175 -7216527
9632g216527J088490L015872J790209p28714n70952J519667K039290Q13725k97704
$$ -7216527 -6128037 -3112165 -1321956 -2050670 -2621622 -1101955 937335 1751060 1453356
9623A453356j564979k897266j341570K926398L243098l312368p888307k003572
$$ 1453356 -111623 -3008889 -4350459 -1424061 1819037 -1493331 -9381638 -11385210
9615a1385210P205587O360519k672055n396688J435818M853951j639212o735425
$$ -11385210 -4179623 2180896 -491159 -5887847 -4452029 401922 -1237290 -7972715
9607g972715r56368O746115L913676m844900o083760Q50087M795651J663457j483832
$$ -7972715 -8929083 -2182968 1730708 -3114192 -9197952 -8347865 -3552214 -1888757 -3372589
9598c372589m26014O08939j244895k455766l66576K553473L761067L297424P25129
$$ -3372589 -3798603 -3189664 -4434559 -6890325 -7256901 -4703428 -942361 2355063 3080192
9589C080192l735997n222600N27126P885309O593811k594530p655298l124387
$$ 3080192 -655805 -5878405 -5351279 2534030 9127841 6533311 -1121987 -4246374
9581d246374K536966J650618j534066q93895O13436j338740k532245J844855O201192
$$ -4246374 -1709408 -58790 -1592856 -2486751 -1873315 -3212055 -5744300 -3899445 2301747
9572B301747K547189n335502o936463j126811L677349L509282K197134J521122
$$ 2301747 4848936 -486566 -7423029 -8549840 -4872491 -1363209 833925 2355047
9564B355047j169011m723486l628454K320240O383184M916840J283216j623457
$$ 2355047 1186036 -3537450 -7165904 -4845664 1537520 6454360 7737576 6114119
9556F114119m540519o022542k350027M213202N833628J014474k476517j57014
$$ 6114119 1573600 -4448942 -6798969 -2585767 3247861 4262335 1785818 1628804
9548A628804K690826J604201N45893K669004K655271l412095q395508m257715
$$ 1628804 4319630 5923831 6469724 9138728 11793999 8381904 -13604 -4271319
9540d271319L966688N072072j126532m426699o43183L156375R07376l796675m146867
$$ -4271319 -304631 4767441 3640909 -785790 -1428973 1727402 2634778 -1161897 -5308764
9531e308764Q49519O534071P981661L759477k837324o036380l522421P47787K054715
$$ -5308764 -4459245 2074826 10056487 13815964 10978640 4942260 1419839 2167626 4222341
9522D222341R98654P35009R91086m80635k780226l280171k336237j694554l58355
$$ 4222341 5220995 5956004 6947090 6466455 3686229 406058 -1930179 -3624733 -3983088
9513c983088K742321M543683K405307K37929K857013O448971L218588n403958
$$ -3983088 -1240767 3302916 5708223 5946152 8803165 15252136 18470724 13066766
9505A3066766r451597n002344R24763J843685m31063k045745k837938k501251
$$ 13066766 3615169 -1387175 -462412 1381273 950210 -1095535 -3933473 -6434724
9497f434724J123331O072339N999410M9987m208417k095917J384266J033862j40336
$$ -6434724 -5311393 760946 6760356 6810343 2601926 506009 1890275 2924137 2783801
9488B783801J604459K579200j002995m281938j677731K008927j016230p078247
$$ 2783801 4388260 6967460 5964465 1682527 4796 2013723 997493 -6080754
9480f080754n719113K791756O819765J423475m414930k368677L274424M040706
$$ -6080754 -11799867 -9008111 -2188346 -764871 -5179801 -7548478 -4274054 -233348
9472b33348K46715j395926J270284L920632K991567j86427k182874j294725J401864
$$ -233348 13367 -1382559 -112275 3808357 6799924 6613497 4430623 3135898 4537762
9463D537762L269354K623732L73880j627377l110270m360240l949790q47835K174555
$$ 4537762 7807116 10430848 10804728 9177351 6067081 1706841 -2242949 -3090784 -916229
9454i16229J645791o07161L459K181228l80902p490861r683273j858440P284976
$$ -916229 729562 122401 125860 2307088 1926186 -5564675 -15247948 -17106388 -9821412
9445i821412O715503j163465m913719j125062K718650J927817J031877L891421
$$ -9821412 -3105909 -4269374 -9183093 -10308155 -7589505 -5661688 -4629811 -738390
9437g38390O266341L329098j896070l463500j325419O06756J708006L743563N070090
$$ -738390 5527951 8857049 6960979 3497479 2172060 2778816 4486822 8230385 13300475
9428A3300475K348137k686803m503312k273002j050009k977968l379986J086265
$$ 13300475 15648612 12961809 8458497 6185495 5135486 2157518 -1222468 -136203
9420a36203N578785L525489l164118o158912k118112L473394M805372L139615
$$ -136203 5442582 8968071 5803953 -354959 -2473071 1000323 5805695 8945310
9412H945310K929379M135659K775919k010660n938441n715531l668854l711549
$$ 8945310 11874689 16010348 18786267 16775607 10837166 5121635 1452781 -2258768
9404b258768n139613m111996k99210K331826K092231K429388N647409P690840
$$ -2258768 -7398381 -11510377 -11809587 -9477761 -7385530 -4956142 691267 8382107
9396H382107L561468m340975q345354n364720J06918L012290L027327J870255
$$ 8382107 11943575 7602600 -742754 -6107474 -6000556 -2988266 39061 1909316
9388A909316j9262k078817k737832k098631k133426k460489L2303N104777P372329
$$ 1909316 1890054 -188763 -2926595 -5025226 -7158652 -9619141 -9586838 -4482061 2890268
9379B890268M037693j72579l08232R75080j288780n026366m353019J01647K061925
$$ 2890268 6927961 6755382 6447150 7422230 6133450 1107084 -3245935 -3144288 -1082363
9370a082363J35049o50395J451224J858369j383453l397200r68302J724249O24029
$$ -1082363 -947314 -1597709 -146485 1711884 328431 -3068769 -4037071 -2312822 -1688793
9361a688793j182033L05328K190141J4803l258532j479918L835720N095551N72641
$$ -1688793 -2870826 -2565498 -375357 -360554 -3619086 -5099004 -1263284 3832267 4404908
9352D404908l184331k012239K15606p33462k665980j938852p4861m19829j746931
$$ 4404908 1220577 -791662 -576056 -1309518 -3975498 -5914350 -5989211 -6409040 -8155971
9343h155971n30332K453522L089469P90491n03387J361885L668191L279568P85293
$$ -8155971 -8686303 -6232781 -3143312 -2352821 -2856208 -1494323 2173868 5453436 6238729
9334F238729j315073j777341n15589J936648L257634N84398m740106o559363j407667
$$ 6238729 4923656 3146315 2630726 4567374 7825008 8409406 3669300 -2890063 -4297730
9325d297730N542190O080026n98185p098755p055081j251303N265744Q045885
$$ -4297730 1244460 7324486 6726301 -372454 -7427535 -8678838 -3413094 4632791
9317D632791N001239k233460p792915o684985j429959Q10618j442362k215179
$$ 4632791 9634030 7400570 -392345 -7077330 -8507289 -7696671 -9139033 -11354212
9309a1354212J582193M865576L298578P96219K270522M697120K789523r37832
$$ -11354212 -9772019 -4906443 -1607865 -811646 1458876 6155996 8945519 8007687
9301H007687k49404L556566L378985j909803n987731n254144k460093R7599L062532
$$ 8007687 7758283 11314849 14693834 12784031 6796300 1542156 -917937 -820338 2242194
9292B242194M960877K639499j898229k849224k61240k75525l986963m881756k70639
$$ 2242194 7203071 9842570 7944341 5095117 4833877 4558352 571389 -4310367 -4581006
9283d581006L697580K457604k26583o19464j385893l987006l421197K526751O844583
$$ -4581006 -883426 1574178 1347595 728131 -657762 -4644768 -8065965 -5539214 1305369
9274A305369L804445j526745k358568j219122k824727l477128J498396O273358
$$ 1305369 5109814 3583069 1224501 5379 -2819348 -6296476 -4798080 1475278
9266A475278K844532m188568m320228J207333K521465o28663Q02122O730131O135223
$$ 1475278 4319810 131242 -4188986 -2981653 -460188 -1088851 -286729 6443402 12578625
9257A2578625l154139q373532j652776P444821O979112p94714o096044n655422
$$ 12578625 9424486 1050954 -601822 6842999 13822111 13027397 6931353 1275931
9249A275931k085892K683939N639754J922079o525632r003756p57491P836841
$$ 1275931 -809961 1873978 7513732 9435811 2910179 -6093577 -6851068 985773
9241I85773N765518k160690l904972Q29060K484127j195328k797190P31505L644182
$$ 985773 6751291 4590601 685629 1514689 3998816 2803488 6298 737803 4381985
9232D381985K268859n6549j070345l202236o159184m588064K686536Q354030O335373
$$ 4381985 6650844 6594295 5523950 2321714 -3837470 -8425534 -5738998 2615032 8950405
9223H950405Q4288l488623l416972k999705k820176j129364J152839J318046m2288
$$ 8950405 9034693 5546070 2129098 -870607 -3690783 -4820147 -3667308 -2349262 -2391550
9214b391550L69452K620110K591576j333384m180238m51355P211914R788423L341996
$$ -2391550 -2022098 598012 3189588 1856204 -2324034 -2775389 4436525 14224948 17566944
9205A7566944n303702p475928l923608k100116m311111n616875l602577k058539
$$ 17566944 12263242 4787314 863706 -1236410 -5547521 -11164396 -14766973 -16825512
9197a6825512k319208N99671Q010391J1677501N627797k760252k940947K658601
$$ -16825512 -19144720 -18545049 -10534658 1142843 6770640 4010388 1069441 3728042
9189C728042L693413m79271j105767K928935K394046n208466r319523l104854
$$ 3728042 7421455 6942184 5836417 8765352 11159398 5950932 -3368591 -6473445
9181f473445M999262M602091j234156l201183q10044K7552r51846N01304L172555
$$ -6473445 -1474183 3127908 1893752 -1307431 -2117475 -2089923 -3041769 -2540465 632090
9172F32090K075563j264443k75896M729715N576560j000104p882655p792211k143314
$$ 632090 2707653 1443210 1167314 5897029 11473589 10473485 2590830 -5201381 -7344695
9163g344695L473221O568886O868788L477448k611126o825609n866341j715511
$$ -7344695 -3871474 2697412 9566200 13043648 10432522 3606913 -2259428 -3974939
9155c974939J940649M107922M486374J101032n598117r418203m860947M414041
$$ -3974939 -2034290 2073632 6560006 7661038 2062921 -7355282 -12216229 -7802188
9147g802188Q973904N264550j168802m402450m537095l702147j362271K509742
$$ -7802188 1171716 6436266 5267464 865014 -3672081 -7374228 -8736499 -6226757
9139f226757M043812O41965l206583j390605L804581M047156k044591n761641
$$ -6226757 -2182945 -1540980 -4747563 -6138168 -2333587 1713569 -331022 -6092663
9131f092663j458494M206254K314106m313620n481181N28175M773356J958036
$$ -6092663 -7551157 -3344903 -1030797 -5344417 -10825598 -10297423 -5524067 -3566031
9123c566031k020325k81889M621426N824470K549825m96164r29716k67551L99864
$$ -3566031 -5586356 -5868245 -1246819 4577651 7127476 6631312 5701596 5434045 5833909
9114E833909J167096P78361k013655m928943m135752N4273K912215J346568k228889
$$ 5833909 7001005 7779366 5765711 836768 -3298984 -3244711 -332496 1014072 -1214817
9105a214817k791932J656713P293602P351379k66959q312613p142908K462586
$$ -1214817 -4006749 -2350036 4943566 12294945 12027986 3715373 -3427535 -964949
9097i64949Q863961M900381k688087m418557j878922k050420l549731O3062O187536
$$ -964949 7899012 12799393 10111306 5692749 3813827 1763407 -1786324 -1723262 4464274
9088D464274N357502k295146n846023j427075J849310j358355l247858J901690
$$ 4464274 9821776 7526630 1680607 253532 2102842 744487 -2503371 -601681
9080f01681N755664L74711n971861j492452Q186245P729515l098265r003653l531990
$$ -601681 5153983 5528694 -443167 -1935619 6250626 13980141 10881876 1878223 -1653767
9071a653767K386351q7315m434564j898149M092670N343177J958940q21972k172012
$$ -1653767 732584 645269 -3789295 -5687444 -1594774 3748403 5707343 4885371 2713359
9062B713359l537454k469055K735514O487306K814064m197470n644502j469279
$$ 2713359 -824095 -3293150 -557636 5929670 8743734 4546264 -1098238 -2567517
9054b567517K33382l068268m770951q35388L675551L354840P06404Q78019L218320
$$ -2567517 -2334135 -5402403 -10173354 -11008742 -7333191 -3978351 -3271947 -2393928 824392
9045H24392L236637n3003l237928l304570k10018L788244N156604J615145m112128
$$ 824392 4061029 4008026 770098 -2534472 -2744490 1043754 6200358 7815503 3703375
9036C703375n678178r35320M389735M175623K55715j114121J118796K293304L43862
$$ 3703375 -1974803 -2910123 1479612 5655235 5910950 4796829 5915625 8208929 8552791
9027H552791j431817q65501n29960k473532m085692k554640J76019O36628o76367
$$ 8552791 7120974 6255473 5725513 3251981 -833711 -3388351 -3212332 -2575704 -3252071
9018c252071r00314R1220K06361m94322O364J624149K163883J379833J351749
$$ -3252071 -4152385 -4061165 -3854804 -4349126 -4342762 -2718613 -554730 825103 2176852
9009B176852K327781J793965j175882l810261l452733r75044J142213J974366
$$ 2176852 4504633 6298598 5122716 1312455 -2140278 -3115322 -1973109 1257
9001A257J969786J533359J051407O25644q15561l810918n496520k175564L986874
$$ 1257 1971043 3504402 4555809 5181453 4365892 554974 -4941546 -7117110 -3130236
8992c130236N489265k49280n703779l129046M052150O117233J164911l117385
$$ -3130236 2359029 2109749 -3594030 -6723076 -2670926 3446307 4611218 1493833
8984A493833j862034N84477o99750l036382j484715K409074L177684L84268r64761
$$ 1493833 -368201 216276 -483474 -3519856 -5004571 -2595497 582187 966455 1694
8975A694J291199L091413P32842l098703k971399J391710M353468K053278j996184
$$ 1694 1292893 4384306 5117148 2018445 -952954 438756 4792224 6845502 4849318
8966D849318j614120K994512M904201L31900n374601n214227p79263M76298l196249
$$ 4849318 3235198 6229710 11133911 11465811 6091210 876983 97720 574018 -2622231
8957b622231n460241j801856M329521P356709O080475J947216l559154o833798
$$ -2622231 -8082472 -9884328 -5554807 1801902 7882377 9829593 6270439 -563359
8949e63359l655143L131062M100707k962491p024904K13898R270351N642025o938576
$$ -563359 -4218502 -1087440 3013267 50776 -6974128 -6760230 2510121 8152146 1213570
8940A213570j0727934r55317P271639L142656m048525j902052N130145M984030
$$ 1213570 -9514364 -10469681 -3198042 -55386 -4103911 -6005963 -875818 4108212
8932D108212j714409m369456o39920J668835n91503j832769N75004J696376j114512
$$ 4108212 2393803 -1975653 -2615573 -946738 -1538241 -3371010 -2796006 -1099630 -2214142
8923b214142l189795j122192J537895J355631R66751L202879M901507J907825
$$ -2214142 -5403937 -6526129 -4988234 -3632603 -2665852 537027 5438534 7346359
8915G346359l653114o093704l632428Q54629M447003N986528M848923J124536
$$ 7346359 3693245 -2400459 -6032887 -5178258 -731255 5255273 10104196 11228732
8907A1228732l467966o524224o333517k420440L266422O088117L013854k587283
$$ 11228732 7760766 1236542 -5096975 -7517415 -4250993 1837124 4850978 2263695
8899B263695m295701j243619J123188k28281j754007l4091K583996K310215l25226
$$ 2263695 -2032006 -3275625 -2152437 -2380718 -4134725 -4168816 -1584820 725395 400169
8890D00169k296483k229170l17136K235518K160638k548636o857104l007832O821900
$$ 400169 -1896314 -4125484 -4442620 -2207102 -46464 -2595100 -9452204 -12460036 -5638136
8881e638136J0371241K379963o817973o424174l28465J651086k84289K35000K347358
$$ -5638136 4733105 7113068 295095 -6129079 -6457544 -4806458 -5090747 -4855747 -2508389
8872b508389J001602j111939J975766O155989K514330n581771n808926K245241
$$ -2508389 -1506787 -2618726 -642960 5513029 8027359 2445588 -3363338 -1118097
8864a118097N376580j193664o048059j421842M457242K926380j105761n90832
$$ -1118097 4258483 3064819 -2983240 -4405082 52160 2978540 1872779 1281947
8856A281947O31991k366070l718944K368062P926344K716462p228777p656704
$$ 1281947 1913938 -452132 -4171076 -1803014 6123330 8839792 1611015 -6045689
8848f045689J267819N659327J88370n030280j871454M198147M423594p58671m623723
$$ -6045689 -4777870 881457 1069827 -3960453 -5831907 -1633760 2789834 2031163 -2592560
8839b592560l467612Q64759L946211K451503k313364n027365l336901j420376
$$ -2592560 -6060172 -5195413 -1249202 1202301 -1111063 -6138428 -9475329 -10895705
8831a0895705k463595k274097K842827O904569K623070m829172m147088L828410
$$ -10895705 -13359300 -15633397 -12790570 -5886001 -3262931 -8092103 -12239191 -8410781
8823h410781P059608J813224k394169O0942K582649K36120j234567K362011M413510
$$ -8410781 -1351173 462051 -1932118 -1871176 711473 947593 -286974 2075037 6488547
8814F488547k81626m585984j052159M148828J568160m476743l021270L988257
$$ 6488547 6206921 1620937 568778 4717606 6285766 1809023 -1212247 2776010
8806B776010M195580m185776q663055k373264N365693M050132k764360m705127
$$ 2776010 6971590 2785814 -5877241 -8250505 -2884812 1165320 -1599040 -6304167
8798f304167m8352M123201L493535Q75485k3961M48181K8623j610477k453103
$$ -6304167 -6352519 -2229318 1264217 2139702 2115741 2563922 2592545 982068 -1471035
8789a471035p34255K365229L146207j13332l681541k277755L167881N407275N34848
$$ -1471035 -2205290 159939 3306146 3192814 -488727 -2766482 401399 5808674 6343522
8780F343522n833997n715958L91160M693879L349383R07377J901753L353518Q6325
$$ 6343522 509525 -5206433 -4815273 -121394 3227989 4135366 6037119 9390637 9476962
8771I476962n763304o666382q63622M375206K838654k225972l655705o29167J804283
$$ 9476962 3713658 -2952724 -3816346 558860 3397514 1171542 -2484163 -3113330 -1309047
8762a309047J433737J110120K195528J753787j592947l986590k082231J087070
$$ -1309047 124690 1234810 3430338 5184125 3591178 -395412 -2477643 -1390573
8754a390573L86500l285758l939354N88844N124402M265486k31771k215730J22248
$$ -1390573 -1004073 -4289831 -8229185 -7640341 -2515939 1749547 1517776 -697954 -575706
8745e75706J993602n52765m263278l158299K075245M079150n23816n417090l434321
$$ -575706 1417896 865131 -3398147 -6556446 -4481201 -402051 -925867 -6342957 -9777278
8736i777278K644792M139818l26750k914935Q94709M993826K250937l833779l694314
$$ -9777278 -7132486 -2992668 -3319418 -6234353 -5339644 -345818 1905119 -1928660 -5622974
8727e622974M014175R601519N343601l904832o923406n00427O956247O502757
$$ -5622974 -1608799 7992720 13336321 9431489 2508083 2007656 8963903 15466660
8719A5466660o81626o307611n877189k293924M27097J727423J634564j176058
$$ 15466660 14785034 8477423 2600234 306310 733407 2460830 4095394 2919336
8711B919336n254089n220900N63093N336608K827723k672780k411619L037416
$$ 2919336 -2334753 -7555653 -6992560 -1655952 1171771 -1501009 -3912628 -875212
8703h75212M890497P21592j757444K058729N767289K346894m735902p177489l668860
$$ -875212 4015285 4736877 2979433 5038162 10805451 13152345 8416443 1238954 -2429906
8694b429906L85528J784583J960590K037619Q47529k081267m916354n087544j206302
$$ -2429906 -2044378 -259795 1700795 3738414 4585943 2504676 -2411678 -7499222 -8705524
8685h705524N204570R122610O029672j975177p197816n287811J00354L242895
$$ -8705524 -3500954 5621656 11651328 9676151 2478335 -2809476 -2709122 533773
8677E33773K932162R55440j501056k871697r50479K955231L793386J53307k748644
$$ 533773 3465935 4421375 2920319 48622 -901857 2053374 5846760 6000067 3251423
8668C251423j374268J77522k254365m740526j664981L966665M688979M27757k048197
$$ 3251423 1877155 2054677 -199688 -4940214 -6605195 -2638530 2050449 2478206 430009
8659D30009k66719J406960K88135j158524j280519j794667k791025j329140K762673
$$ 430009 163290 1570250 1858385 699861 -580658 -2375325 -5166350 -6495490 -3732817
8650c732817M883395K061662k580062m135347j741417J739647L556109L135388
$$ -3732817 1150578 3212240 632178 -3503169 -5244586 -3504939 51170 3186558
8642C186558J756907Q35597Q2285j592758k994222j457871J914391K254486j054238
$$ 3186558 4943465 5779062 5861347 4268589 1274367 -183504 1730887 3985373 2931135
8633B931135j788990L008934O289283J466837n733684n316620R32931K503553
$$ 2931135 1142145 4151079 10440362 11907199 6173515 856895 1789826 4293379
8625D293379k481260m987777r18878K743803Q20367j904205j51482L512746N028077
$$ 4293379 1812119 -3175658 -4094536 -1350733 -530366 -2434571 -2586053 926693 5954770
8616E954770N267339M895764Q94222n928878p784982j188261N509041L475000
$$ 5954770 11222109 16117873 17012095 11083217 3298235 2109974 7619015 11094015
8608A1094015l537618n505678p98529L698621L691906Q50690k454720m672257
$$ 11094015 7556397 2050719 1252190 4950811 8642717 9493407 7038687 2366430
8600B366430l496036P33926K525995j433881n468292k701601L450826M314871
$$ 2366430 -1129606 -395680 2130315 696434 -4771858 -7473459 -4022633 292238
8592B92238J47812r91791J995840J184952n266659p530433M23956R503922Q196387
$$ 292238 440050 -551741 1444099 2629051 -2637608 -10168041 -9744085 -240163 7956224
8583G956224l64408m095134o92411M78049n038603r162190m076751N637077R817942
$$ 7956224 7591816 3496682 2804271 3282320 -1756283 -10918473 -14995224 -9358147 459795
8574D59795O387380J448904j002718k151570k498941p14289Q79239k592416r221204
$$ 459795 6847175 8296079 7293361 5141791 2642850 1928561 2807800 215384 -9005820
8565i005820r589819k36265Q907922P425459o82357l517654J143419M771917K909258
$$ -9005820 -18595639 -18831904 -9923982 -2498523 -3180880 -6698534 -5555115 -783198 2126060
8556B126060L69697Q27689J513831Q23740J543595K991873l79339p732041q955016
$$ 2126060 2495757 3323446 4837277 5661017 7204612 10196485 9817146 2085105 -6869911
8547f869911J86499R008785O598636k144434n128357j522763k32421l804958n708475
$$ -6869911 -6683412 2325373 8924009 6779575 1651218 128455 -103966 -3908924 -9617399
8538i617399k529056J777182M050099N078114M248980j04192m462445k975999
$$ -9617399 -12146455 -10369273 -6319174 -1241060 3007920 2903728 -1558717 -4534716
8530d534716K587042M514347J717991R92608L754931K179198o889104j4050625
$$ -4534716 -1947674 2566673 4284664 5277272 9032203 11211401 4322297 -9728328
8522i728328j0197021L77644O989871O692193M080248J943662j37688j129437
$$ -9728328 -19925349 -19547705 -12557834 -5865641 -1785393 158269 20581 -1108856
8514a108856J63130R68925k008975o291271o138149l94112O523545J0055967Q173065
$$ -1108856 -945726 23199 -1985776 -8277047 -14415196 -14809308 -8285763 1770204 9943269
8505I943269J142035o861449q661723k083248N133241M254218k509333n528655
$$ 9943269 11085304 4223855 -4437868 -6521116 -1387875 2866343 357010 -5171645
8497e171645j860393J847171Q96704j015000M37487K899120K208665k84981l61801
$$ -5171645 -7032038 -5184867 -4288163 -5303163 -4865676 -1966556 242109 -42872 -404673
8488d04673J774190J642380k604279o894145n840630O29888O388769N640414k980
$$ -404673 1369517 3011897 407618 -6486527 -12327157 -11697269 -5308500 331914 328934
8479C28934l303868j085204J554387m35780l796219k529142J658263K131052j078357
$$ 328934 -2974934 -4060138 -2505751 -2941531 -6737750 -9266892 -7608629 -5477577 -6555934
8470f555934j398024K167045K739031j891719m120395R52620O599969N047727
$$ -6555934 -7953958 -5786913 -3047882 -4939601 -9059996 -8107376 -1507407 3540320
8462C540320l59266j776474K98338M0644k106797p80325L501830M486116P60402
$$ 3540320 3181054 1404580 1702918 1743562 -363235 -1143560 2358270 6844386 7604788
8453G604788k324857j717520n8121O64202J790161L298802K792121K33662j788159
$$ 7604788 5279931 3562411 3504290 4168492 5958653 9257455 12049576 12283238 10495079
8444A0495079k770581l882865l718798q05003J066636k180287n892380k154603
$$ 10495079 7724498 3841633 122835 -682168 384468 -1795819 -7688199 -9842802
8436i842802O134891P808424J340472k210473K085138M447600k357945r230406
$$ -9842802 -3707911 4100513 5440985 3230512 5315650 9763250 7405305 -1825101
8428a825101m585722O941141J1285004M874203l195882n602362l663615j430329
$$ -1825101 -6410823 530318 11815322 16689525 13493643 7891281 4227666 2797337
8420B797337q07523j804111k484255o12000J501364j326825p246961o884041J727750
$$ 2797337 1989814 185703 -2298552 -2910552 -1409188 -2736013 -9982974 -16867015 -15139265
8411a5139265P022638J174873o052440k307920P009642P808672L84212k899298
$$ -15139265 -8116627 -6941754 -12994194 -15302114 -8292472 -483800 -99588 -2998886
8403b998886N00017J064541l475444l798355L301236Q523630N973275J569384
$$ -2998886 -2498869 -1434328 -4909772 -8708127 -5406891 3116739 9090014 10659398
8395A0659398K79487k040914p699846r972971m418761K465709L392672P54364
$$ 10659398 10938885 8897971 1198125 -8774846 -13193607 -10727898 -7335226 -6580862
8387f580862Q4520P64922J06882k0313K667247N347254M175172l34475n214856
$$ -6580862 -6496342 -5731420 -5624538 -5644851 -2977604 2369650 6544822 6210347 995491
8378I95491p603708m340248M158713R355578L324561p136144o834177M934050
$$ 995491 -6608217 -10948465 -6789752 2565826 5890387 -1245757 -8079934 -3145884
8370c145884J1348206L009585q141500p900657L05007M779468L412546R34871
$$ -3145884 8202322 11211907 3070407 -4830250 -4525243 254225 3666771 4601642
8362D601642j924038n042122l244058M588482Q693245K021072p024195o819268
$$ 4601642 2677604 -2364518 -5608576 -1020094 7673151 9694223 2670028 -4149240
8354d149240K19373M364566M534404M640511J959499o222918j1161974l775323
$$ -4149240 -3929867 434699 4969103 9609614 11569113 5346195 -5815779 -9591102
8346i591102P805000Q107985j754191o457017o37044N674292N144696R51201l732163
$$ -9591102 -1786102 6321883 4567692 -1889325 -2526369 3147923 8292619 9243820 5511657
8337E511657r019348j0565555l398912N667513M375409n088914p888765P5676
$$ 5511657 -3507691 -14073246 -17472158 -11804645 -7429236 -12518150 -20406915 -20331239
8329b0331239O705732M711931J582193L531647N329767K705152M17150J036318
$$ -20331239 -13625507 -8913576 -7331383 -3799736 1530031 4235183 4652333 5688651
8321E688651n88834m878202l677508L690926N369792k885424p546471J010987
$$ 5688651 5099817 221615 -3455893 235033 5604825 2719401 -4827070 -3816083
8313c816083J0816027O707136n372025q774196k158844J954945p17950k381091
$$ -3816083 6999944 13707080 8335055 -439141 -2597985 -643040 -1360990 -3742081
8305c742081O01399K797575J542065R49873K480777K014939j679463m312021l818556
$$ -3742081 -3140682 -343107 1198958 2148831 4629608 6644547 4965084 653063 -3165493
8296c165493l305391m411883m124979k83739M593847O761289N331956K276199
$$ -3165493 -6470884 -10882767 -15007746 -15291485 -10697638 -3936349 1395607 3671806
8288C671806N29367J515145L017940J511615k174690l211781m18071J684384J050918
$$ 3671806 4201173 5716318 8734258 10245873 8071183 4859402 4441331 6125715 7176633
8279G176633J740051N050694M429386l919171j1864805r502556K11027O091717
$$ 7176633 8916684 13967378 18396764 14477593 2612788 -6889768 -6678741 -587024
8271e87024M572308J543881O84091k38279j830898j018615K250828L626059J211140
$$ -587024 3985284 5529165 6213256 5974977 4144079 3125464 5376292 9002351 10213491
8262A0213491k015236l532569l842798l323529j459448N68069R32340M61989Q10151
$$ 10213491 8198255 4665686 822888 -2500641 -3960089 -3392020 -2459680 -1997691 -1187540
8253a187540O23822j861553m113051k484381J410589L027465K085651J684297
$$ -1187540 -563718 -2425271 -6538322 -9022703 -7612114 -4584649 -2498998 -814701
8245h14701J878560N01981r66255P70286L933658L596496Q1792j601569m57267
$$ -814701 1063859 1565840 599585 1369871 5303529 8900025 8981817 7380248 6922981
8236F922981k29668j398318n15857J550204o63721o811419q464893j444881O706710
$$ 6922981 6693313 5294995 4779138 6329342 5665621 -1145798 -9610691 -11055572 -4348862
8227d348862O824725K69436m460803l348841K33699J925233J042477m38682o69718
$$ -4348862 2475863 2745299 -1715504 -5064345 -4830646 -2905413 -1862936 -2301618 -2971336
8218b971336J80385R478k279158m289092k896799Q70498K821941J411782p45084
$$ -2971336 -2790951 -2781473 -5060631 -9349723 -12246522 -11376024 -8554083 -7142301 -7887385
8209g887385j184668o897J922848L553772K702105j441564n135178l830124J157410
$$ -7887385 -9072053 -9078950 -7156102 -3602330 -900225 -2341789 -7476967 -11307091 -10149681
8200a0149681M492737M895322N606592O769004M209943k502235p380526o207752
$$ -10149681 -5656944 -761622 4844970 11613974 15823917 13321682 5941156 -266596
8192b66596j807981J585761L608863M325165J435556m573018p430428k693254
$$ -266596 -2074577 -488816 3120047 7445212 8880768 4307750 -3122678 -5815932
8184e815932M770233O105354k59296o799986n815036K425087J0099136R424260
$$ -5815932 -1045699 5059655 4800359 -1999627 -7814663 -5389576 4709560 14133820
8176A4133820P38278p246894p089022j184687K611876J960980J094580K115863
$$ 14133820 14872098 7625204 536182 -648505 1963371 3924351 5018931 7134794
8168G134794K402337J030051K57658n34488m375799q557467o102787J757293M694346
$$ 7134794 9537131 10567182 10824840 10290352 5914553 -2642914 -8745701 -6988408 -2294062
8159b294062n55360l980602R24529N376260L00694o977610m118741N526021Q283593
$$ -2294062 -2849422 -6830024 -5905495 -529235 -228541 -7206151 -11324892 -5798871 2484722
8150B484722J892873l190576k364200j646844l348679j763717L792877N235161
$$ 2484722 4377595 1187019 -1177181 -2824025 -6172704 -7936421 -4143544 1091617
8142A091617k09413m270094j666163J399961n07366k031128K290180O615233L151878
$$ 1091617 882204 -3387890 -5054053 -3654092 -4161458 -6192586 -3902406 2712827 5864705
8133E864705m041304n148581K61956M374073M057783K685980J142848k917495
$$ 5864705 1823401 -3325180 -3063224 1310849 5368632 8054612 9197460 6279965
8125F279965p225997n877902N65327M260248J446853k612877k437535O99389L460546
$$ 6279965 -946032 -6823934 -6258607 -1998359 -551506 -3164383 -5601918 -4902529 -1441983
8116a441983N556210O359099K602175n245950r282039l453518O333496Q315759
$$ -1441983 4114227 10473326 13075501 7829551 -1452488 -4906006 1427490 9743249
8108I743249K75110p721726o933503l32277L396563J500244j630165k277276j318739
$$ 9743249 10018359 2296633 -4636870 -4969147 -1572584 -72340 -1702505 -3979781 -5298520
8099e298520n69492K18289J207904Q68348j076712j797699M63673K527937O53538
$$ -5298520 -5868012 -5649723 -4441819 -3573471 -4650183 -6447882 -5984209 -3456272 -2802734
8090b802734k554071r42042N053265P133196R67307o190616n071444K150128M892559
$$ -2802734 -5356805 -6298847 -1245582 5887614 6854921 664305 -4407139 -2257011 2635548
8081B635548n99908o465374n090960Q27819L727830J865962l27387m0712P88695
$$ 2635548 2035640 -4429734 -9520694 -8692875 -4965045 -3099083 -3426470 -3467182 -2678487
8072b678487j41139j839413j856774K47904K463355K790312J561665R04255J598026
$$ -2678487 -2819626 -4659039 -6515813 -6267909 -3804554 -1014242 547423 1451678 3049704
8063C049704J508141j258825m563049m409404q05846J916130J261389o16396j444775
$$ 3049704 4557845 3299020 -1264029 -5673433 -6479279 -4563149 -3301760 -3918156 -5362931
8054e362931j994153k574178q15341L651779O357722M103044L77208o9300J311624
$$ -5362931 -7357084 -9931262 -10746603 -7094824 -737102 3365942 3743150 3673850 4985474
8045D985474L10145k315816k997547k484874l399449l007895K611583Q426370
$$ 4985474 5295619 2979803 -17744 -2502618 -5902067 -8909962 -6298379 2127991
8037B127991N148188m869682p975814O58168Q658988M935584l824048m630880
$$ 2127991 7276179 2406497 -5569317 -4911149 3747839 8683423 4859375 228495
8029B28495K057407N569378K730366R5751P25502M93316k197035l466972k259984
$$ 228495 2285902 7855280 10585646 10681397 11406899 11900215 9703180 6236208 3976224
8020C976224k356044m019319k359563L096244N546210J638185k485169q81276
$$ 3976224 1620180 -2399139 -4758702 -1662458 3883752 5521937 3036768 2155492
8012B155492K938693K351361j855575l733059j649512O25103N31622q40764k024072
$$ 2155492 5094185 7445546 5589971 1856912 207400 832503 1364125 523361 -1500711
8003a500711k580263j715034J068857M127924M901608K589659j733949o196562
$$ -1500711 -4080974 -5796008 -4727151 -599227 4302381 6892040 5158091 -1038471
7995a038471q071145n179098O30741M071931K911133J055110K380586M733882
$$ -1038471 -9109616 -14288714 -13657973 -9586042 -6674909 -5619799 -3239213 1494669
7987A494669L917710O82677j063499q58189j236958k082200r51479J520278K075693
$$ 1494669 5412379 6095056 5031557 4173368 2936410 854210 -97269 1423009 3498702
7978C498702O97542M59404J149895q27592m823286m800852J063113N728212K955250
$$ 3498702 4196244 4655648 5805543 4977951 154665 -4646187 -3583074 2145138 5100388
7969E100388l211384m320901M94681M531911L566825j97110l390866m713515k812664
$$ 5100388 1889004 -2431897 -1937216 2594695 6161520 5964410 2573544 -2139971 -4952635
7960d952635L074497R033677Q605493J442559m929850m941095k081536k335475
$$ -4952635 -1878138 7155539 15761032 17203591 12273741 7332646 5251110 2915635
7952B915635m589100l068414K813594O955285M986309n12605m148517l539364
$$ 2915635 -1673465 -4741879 -1928285 5027000 10013309 9500704 5352187 1812823
7944A812823m1595L389937M099786J830863n80660p39636m39881k693124n647955
$$ 1812823 1771228 5161165 9260951 11091814 10511154 9771518 9331637 6638513 990558
7935I90558m312967R66082L430275j64285m153991k816030M55310q77581m899571
$$ 990558 -3322409 -2356327 1073948 909663 -3244328 -6060358 -5605048 -6482629 -11382200
7926a1382200l645608L704471Q361579M756346j403137k182594J003279Q39345
$$ -11382200 -15027808 -11323337 -2961758 1794588 391451 -1791143 -787864 51481
7918E1481l929653o701183l128039K737465M535863J873209n64001J17075K304718
$$ 51481 -3878172 -10579355 -13707394 -10969929 -6434066 -4560857 -5124858 -5007783 -2703065
7909b703065L119513J390037k346300n949766n721925K61268P835255R409143
$$ -2703065 416448 1806485 -539815 -6489581 -12211506 -11950238 -4114983 5294160
$$ [...]
##END NTUPLES=NMR SPECTRUM
##END=
