##TITLE=31Pdec_SR62x_k
 CDCl3, 124 sc
 31.05.2021
##JCAMPDX= 6.0         $$ Bruker NMR JCAMP-DX V2.0
##DATA TYPE= NMR SPECTRUM
##DATA CLASS= NTUPLES
##ORIGIN= UXNMR, Bruker Analytische Messtechnik GmbH
##OWNER= root
$$ XWIN-NMR		Version 3.5
$$ Mon May 31 14:08:11 2021 Russian Standard Time (UT+4h)  she@DPX200
##.OBSERVE FREQUENCY= 81.013821
##.OBSERVE NUCLEUS= ^31P
##.ACQUISITION MODE= SIMULTANEOUS
##.ACQUISITION SCHEME= undefined
##.AVERAGES= 124
##.DIGITISER RES= 16
##SPECTROMETER/DATA SYSTEM= spect
##.PULSE SEQUENCE= zgpg30
##.SOLVENT NAME= D2O
##.SHIFT REFERENCE= (INTERNAL, D2O, 0, 248.564)
##AUDIT TRAIL= $$ (NUMBER, WHEN, WHO, WHERE, WHAT)
$$ ##TITLE= Audit trail, XWIN-NMR		Version 3.5
$$ ##JCAMPDX= 5.01
$$ ##ORIGIN= Bruker BioSpin GmbH
$$ ##OWNER= she
$$ F:/spectra/data/she/nmr/P31/1/pdata/1/auditp.txt
$$ ##AUDIT TRAIL=  $$ (NUMBER, WHEN, WHO, WHERE, WHAT)
(   1,<2021-05-31 14:07:05.12 +0400>,<she>,<DPX200>,
      <continue with go, POWCHK disabled, PULCHK disabled
       configuration hash MD5:
       00 E9 B6 7A A2 85 ED C7 34 08 36 98 17 FE 4E 26
       data hash MD5: 32K
       A1 F3 4D 7E 17 B1 A7 BF 19 6F 2F B6 45 70 3F D2>)
(   2,<2021-05-31 14:07:08.17 +0400>,<she>,<DPX200>,
      <Start of raw data processing
       efp BC_mod = 2 LB = 1 FT_mod = 6 PKNL = 1 PHC0 = -5879.748 PHC1 = 145.2724 SI = 64K 
       data hash MD5: 64K
       81 36 8B 97 8D AD CF DE E6 A4 8B 3B D1 1E 31 E2>)
(   3,<2021-05-31 14:07:32.65 +0400>,<she>,<DPX200>,
      <pk PHC0 = -126.2375 PHC1 = 222.7999 
       data hash MD5: 64K
       D6 32 7B 3E 96 1B AC DF 44 3E A4 F6 B1 3B ED EB>)
(   4,<2021-05-31 14:07:42.35 +0400>,<she>,<DPX200>,
      <abs ABSG = 5 
       data hash MD5: 64K
       19 6C 32 D2 76 74 21 41 98 64 92 30 BA 9C A9 A4>)
$$ ##END=
$$ 
$$ hash MD5
$$ 1B 47 AE C0 86 8A 5E 52 41 73 C7 1F 32 58 95 A1
##$RELAX= 
##$RELAX= 
##$RELAX= 
##$RELAX= 
##$RELAX= 
##$RELAX= 
##$RELAX= 
##$RELAX= 
$$ Bruker specific parameters
$$ --------------------------
##$DU= <F:/spectra>
##$EXPNO= 1
##$NAME= <P31>
##$PROCNO= 1
##$TYPE= <nmr>
##$USER= <she>
##$AMP= (0..31)
100 100 100 100 100 100 100 100 100 100 100 100 100 100 100 100 100 100 
100 100 100 100 100 100 100 100 100 100 100 100 100 100 
##$AQSEQ= 0
##$AQ_mod= 1
##$AUNM= <au_zg>
##$AUTOPOS= <>
##$BF1= 81.014009
##$BF2= 200.13
##$BF3= 200.13
##$BF4= 200.13
##$BF5= 200.13
##$BF6= 200.13
##$BF7= 200.13
##$BF8= 200.13
##$BYTORDA= 1
##$CFDGTYP= 0
##$CFRGTYP= 5
##$CHEMSTR= <none>
##$CNST= (0..31)
1 1 145 1 1 1 1 1 1 1 1 1 1 1 1 1 1 1 1 1 1 1 1 1 1 1 1 1 1 1 1 1 
##$CPDPRG= <waltz16>
##$CPDPRG1= <>
##$CPDPRG2= <waltz16>
##$CPDPRG3= <>
##$CPDPRG4= <mlev>
##$CPDPRG5= <mlev>
##$CPDPRG6= <mlev>
##$CPDPRG7= <mlev>
##$CPDPRG8= <mlev>
##$CPDPRGB= <>
##$CPDPRGT= <>
##$D= (0..31)
0 1 0 0 0 0 0 0 0 0 0 0.03 2e-05 3e-06 0 0 0 0 0 0 0 0 0 0 0 0 0 0 0 0 
0 0 
##$DATE= 1622455464
##$DBL= (0..7)
120 120 120 11 120 120 24 19 
##$DBP= (0..7)
150 150 150 150 150 150 150 150 
##$DBP07= 0
##$DBPNAM0= <>
##$DBPNAM1= <>
$$ [...]
##$SUBNAM3= <"">
##$SUBNAM4= <"">
##$SUBNAM5= <"">
##$SUBNAM6= <"">
##$SUBNAM7= <"">
##$SUBNAM8= <"">
##$SUBNAM9= <"">
##$SW= 501.771253377433
##$SWIBOX= (0..15)
0 1 3 0 0 0 0 0 0 0 0 0 0 0 0 0 
##$SW_h= 40650.406504065
##$TD= 32768
##$TD0= 1
##$TE= 0
##$TE2= 300
##$TE3= 300
##$TEG= 300
##$TL= (0..7)
0 120 53 12 22 120 120 120 
##$TP= (0..7)
150 150 150 150 150 150 150 150 
##$TP07= 0
##$TPNAME0= <>
##$TPNAME1= <>
##$TPNAME2= <>
##$TPNAME3= <>
##$TPNAME4= <>
##$TPNAME5= <>
##$TPNAME6= <>
##$TPNAME7= <>
##$TPOAL= (0..7)
0.5 0.5 0.5 0.5 0.5 0.5 0.5 0.5 
##$TPOFFS= (0..7)
0 0 0 0 0 0 0 0 
##$TUNHIN= 0
##$TUNHOUT= 0
##$TUNXOUT= 0
##$USERA1= <user>
##$USERA2= <user>
##$USERA3= <user>
##$USERA4= <user>
##$USERA5= <user>
##$V9= 5
##$VALIST= <valist>
##$VCLIST= <CCCCCCCCCCCCCCC>
##$VD= 0
##$VDLIST= <DDDDDDDDDDDDDDD>
##$VPLIST= <PPPPPPPPPPPPPPP>
##$VTLIST= <TTTTTTTTTTTTTTT>
##$WBST= 1024
##$WBSW= 4
##$XGAIN= (0..3)
0 0 0 0 
##$XL= 0
##$YL= 0
##$YMAX_a= 12179
##$YMIN_a= -15121
##$ZGOPTNS= <>
##$ZL1= 120
##$ZL2= 120
##$ZL3= 120
##$ZL4= 120
##$ABSF1= 248.5645
##$ABSF2= -253.2056
##$ABSG= 5
##$ABSL= 3
##$ALPHA= 0
##$AQORDER= 0
##$ASSFAC= 0
##$ASSFACI= 0
##$ASSFACX= 0
##$ASSWID= 0
##$AUNMP= <proc_1d>
##$AZFE= 0.1
##$AZFW= 0.5
##$BCFW= 0
##$BC_mod= 2
##$BYTORDP= 0
##$COROFFS= 0
##$CY= -3
##$DATMOD= 1
##$DC= 0
##$DFILT= <>
##$DTYPP= 0
##$F1P= 0
##$F2P= 0
##$FCOR= 1
##$FTSIZE= 65536
##$FT_mod= 6
##$GAMMA= 0
##$GB= 0
##$INTBC= 1
##$INTSCL= 5.30512e-09
##$ISEN= 30
##$LB= 1
##$LEV0= 0
##$LPBIN= 0
##$MAXI= 10000
##$MC2= 0
##$MEAN= 0
##$ME_mod= 0
##$MI= 50
##$NCOEF= 0
##$NC_proc= -7
##$NLEV= 6
##$NOISF1= 182.463
##$NOISF2= 159.3651
##$NSP= 0
##$NTH_PI= 0
##$NZP= 0
##$OFFSET= 248.5645
##$PC= 4
##$PHC0= -6005.985
##$PHC1= 368.0723
##$PH_mod= 1
##$PKNL= yes
##$PPARMOD= 0
##$PSCAL= 0
##$PSIGN= 0
##$REVERSE= no
##$SF= 81.014009
##$SI= 65536
##$SIGF1= 159.3651
##$SIGF2= -187.1042
##$SINO= 113.3802
##$SIOLD= 16384
##$SREGLST= <1H.CDCl3>
##$SSB= 0
##$STSI= 65536
##$STSR= 0
##$SW_p= 40650.406504065
##$SYMM= 0
##$S_DEV= 0
##$TDeff= 32768
##$TDoff= 0
##$TI= <>
##$TILT= no
##$TM1= 0
##$TM2= 0
##$TOPLEV= 0
##$USERP1= <user>
##$USERP2= <user>
##$USERP3= <user>
##$USERP4= <user>
##$USERP5= <user>
##$WDW= 1
##$XDIM= 65536
##$YMAX_p= 534807328
##$YMIN_p= -93569800
$$ End of Bruker specific parameters
$$ ---------------------------------
##NTUPLES= NMR SPECTRUM
##VAR_NAME=  FREQUENCY,     SPECTRUM/REAL,   SPECTRUM/IMAG
##SYMBOL=    X,             R,               I
##VAR_TYPE=  INDEPENDENT,   DEPENDENT,       DEPENDENT
##VAR_FORM=  AFFN,          ASDF,            ASDF
##VAR_DIM=   65536,         65536,           65536
##UNITS=     HZ,            ARBITRARY UNITS, ARBITRARY UNITS
##FACTOR=    0.620285442955139, 1,           1
##FIRST=     20137.2065510759, 0,            0
##LAST=      -20513.1999529892, 0,           0
##MIN=       -20513.1999529892, -93569800,   0
##MAX=       20137.2065510759, 534807328,    0
$$ Real data points
##PAGE= N=1
##DATA TABLE= (X++(R..R)), XYDATA
$$ [...]
##PAGE= N=2
##DATA TABLE= (X++(I..I)), XYDATA
12892g447116q32187P685382L189640n097399n666282k247585k932702l581660
12884a6929909K805605Q140441o96510j6179619j4971700O912987K3211051J2928524
12876E220870r249840j4516145p19991Q871417K965926l914914J652957J1332446
12868A642726J0962902K158045m278835n882975o435484l991636M933091J3264914
12860A2372748R489371m463297j3561935r484274J74772M784818L289974L63778
12852B965955j830150l230505l119398k036774k042604k387491J05640M150986
12844g424341L841963j189146k423763N002371J2408064Q129424n395284j3702066
12836g52778r089581M84372L441607o65303k831667K083599Q845193R282415K821349
$$ plain form
12892 -7447116 -8279303 -593921 2595719 -2501680 -8167962 -10415547 -13348249 -16929909
12884 -16929909 -14124304 -5983863 -6680373 -22859992 -37831692 -30918705 -7707654 5220870
12876 5220870 -4028970 -18545115 -19265106 -10393689 -7427763 -11342677 -9689720 1642726
12868 1642726 12605628 14763673 10484838 4601863 -1833621 -5825257 -892166 12372748
12860 12372748 21862119 17398822 3836887 -5647387 -5472615 -687797 2602177 2965955
12852 2965955 1135805 -2094700 -5214098 -7250872 -9293476 -11680967 -11575327 -7424341
12844 -7424341 -3582378 -4771524 -7195287 -2192916 10215148 18344572 12949288 -752778
12836 -752778 -9842359 -9357987 -5916380 -6581683 -9413350 -7329751 1515442 10797857 13619206
12827A3619206l364265l941626j550377j616693m078597m040646N22624N698455
12819A248081O412608J390889o210503j0343295n918650M561258J0096216L155502
12811D392106q460552r683841J255319R610760M664530o040131r036803l049482
12803a6348094L489169O360865P232041N904456J402018j478284K770390R157330
12795A8489891O414668o067280j5369492j2588352m489096k295307n879542o118604
12787b7903114J109286J0299479J4282201J1204217L639941m774518j0677170
12780b819678j1859352q599243l393730J219606M253578N868918O192142N051066
12772d086693K882748J349879K008749L977557M054597K61526n382249q730439
$$ plain form
12827 13619206 10254941 6313315 4762938 3146245 -932352 -4972998 -4450374 1248081
12819 1248081 7660689 9051578 2841075 -7502220 -13420870 -8859612 1236604 4392106
12811 4392106 -4068446 -13752287 -12496968 -2886208 1778322 -4261809 -13298612 -16348094
12803 -16348094 -12858925 -6498060 733981 6638437 8040455 6562171 9332561 18489891
12795 18489891 24904559 18837279 3467787 -9120565 -13609661 -15904968 -21784510 -27903114
12787 -27903114 -26793828 -16494349 -2212148 8992069 12632010 7857492 -2819678
12780 -2819678 -14679030 -23278273 -26672003 -25452397 -21198819 -15329901 -9137759 -4086693
12772 -4086693 -1203945 145934 2154683 6132240 10186837 10448363 5066114 -3664325
12764c664325p667745l469034J151917L876279L254809n89411n124949o635281
12756a8867740l438060K358668O997301Q738464Q229730N066220l198358j5291894
12748i405669k1559899j2157363P848475J9124568J0238300o579163j0633195
12741b3123946M72823J0604123R786304N191474M805390M492539r00259n344956
12733E983492j452504N523661N127245j818814n366450k206554J326575R81447
12725H098098k92105L91977J185096m70577m328606q260161r146734m501823L199537
12716a4125298O839061L305354k152449m181497l935278k368610M611203J5846953
12708C839439J8785471N939572r907161j1698522l355068j723760p507339n337629
$$ plain form
12764 -3664325 -11332070 -14801104 -13649187 -9772908 -6518099 -7107510 -12232459 -18867740
12756 -18867740 -22305800 -19947132 -12949831 -4211367 4018363 9084583 5886225 -9405669
12748 -9405669 -30965568 -43122931 -35274456 -16149888 -5911588 -12490751 -23123946
12741 -23123946 -22651123 -12047000 -2260696 2930778 7736168 12228707 11328448 5983492
12733 5983492 4530988 10054649 15181894 13363080 7996630 5790076 7116651 8098098
12725 8098098 7805993 8197970 9383066 8912489 4583883 -3676278 -12823012 -17324835 -14125298
12716 -14125298 -7286237 -3980883 -6133332 -10314829 -14250107 -16618717 -12007514 3839439
12708 3839439 22624910 28564482 18657321 6958799 3603731 1879971 -5627368 -10964997
12700a0964997O650937J0526505j088030j0164091j675537J1215237P612403q245895
12692C866532j4242272m131721N442167J574163q009945r543750k534669L342391
12684b4237104L983732M734323R294402J1946522N472735o000556r325182K65845
12676c865283J1053567R900015m65352p357421o407534l574320k400720j314495
12668d431543j718412n617079o128578M731939J8306128J6394704o88709j1618947
12660I229503n997368P15941n138072j2196956m686015R642968J1920350J772905
12652E263256n472875m157473j572389n16291K702581N263167N96679o708851
12644d602196n480326K644388M768563j580106n043690j110870P56885m287698
$$ plain form
12700 -10964997 -4314060 6212445 5124415 -5039676 -6715213 4500024 12112427 3866532
12692 3866532 -10375740 -14507461 -9065294 -7491131 -15501076 -25044826 -27579495 -24237104
12684 -24237104 -20253372 -15519049 -6224647 5721875 11194610 5194054 -4131128 -3865283
12676 -3865283 7188284 17088299 16622947 9265526 2857992 -716328 -3117048 -4431543
12668 -4431543 -6149955 -11767034 -17895612 -13163673 5142455 21537159 20848450 9229503
12660 9229503 3232135 3948076 -1189996 -13386952 -18072967 -8429999 3490351 5263256
12652 5263256 -209619 -4367092 -5939481 -6455772 -3753191 1509976 2106655 -4602196
12644 -4602196 -10082522 -7438134 -2669571 -4249677 -9293367 -10404237 -9647352 -13935050
12636a3935050o870147k81560O855113M756365j448596o57404O745107J1021069
12628F184897P982283K037686l135570q074582j1818400j0292106l016650L270605
12620a6861837J851142m479101n619207K399326J0548250Q577144L47661j559539
12612d796161M077045M634280m959153j1996154o225603K514014O26585n835512
12604b1960659j834808R463303J0771822J8474n767942J206125P839905L844558
12596C580778j841894P50990M289362j634316r992250o463351O650260J2664563
12588H004142M711930o063551p878484k984819j133109n490506r996767q083945
12580b8915109n18038N868629O390487L755282L344708M951205L440573k391539
$$ plain form
12636 -13935050 -20805197 -21086757 -14231644 -9475279 -10923875 -11581279 -4836172 6184897
12628 6184897 14167180 16204866 13069296 4994714 -6823686 -17115792 -20132442 -16861837
12620 -16861837 -15010695 -19489796 -25109003 -22709677 -12161427 -3584283 -3236622 -4796161
12612 -4796161 -719116 3915164 -1043989 -13040143 -19265746 -16751732 -16125147 -21960659
12604 -21960659 -23795467 -14332164 -3560342 -3541868 -9309810 -8103685 -263780 3580778
12596 3580778 1738884 2489874 6779236 5144920 -4847330 -11310681 -4660421 8004142
12588 8004142 12716072 6652521 -1225963 -4210782 -5343891 -10834397 -20831164 -28915109
12580 -28915109 -29433147 -23564518 -17174031 -13418749 -10074041 -5122836 -1682263 -4073802
12572d073802o731959m563123J401422M345860J560401l095941l780519R21681
12564a4015980N550588L314953m479309q174633k534951M793243L939188k204927
12556a3811828k629475M484566R753417Q094699N097667N025411L171114l960464
12548A5225107r436662n020454N028132P361677l342729j5952289j4584505J723554
12540a8998169J4822768Q017777j0929739j7375323k969041J2157679R161371
12533f112677k076970j409595P940945P005508m404022p402183J884720N448004
12525H73730l699309q662517M42198Q067774J251461o676920q9248J0201360N109985
12516F818514r708235j3147076k301031O292426M309906p18968l314832o177591
$$ plain form
12572 -4073802 -10805761 -15368884 -13967462 -9621602 -8061201 -11157142 -14937661 -14015980
12564 -14015980 -8465392 -5150439 -9629748 -17804381 -20339332 -15546089 -11606901 -13811828
12556 -13811828 -16441303 -11956737 -2203320 5891379 10989046 16014457 19185571 15225107
12548 15225107 5788445 767991 5796123 13157800 9815071 -6137218 -20721723 -18998169
12540 -18998169 -4175401 3842376 -7087363 -24462686 -27431727 -15274048 -6112677
12533 -6112677 -8189647 -9599242 -1658297 5347211 943189 -6458994 -4574274 873730
12525 873730 -2825579 -11488096 -11045898 -2978124 -1726663 -8403583 -8492831 1708529 6818514
12516 6818514 -2889721 -16036797 -18337828 -12045402 -7735496 -8454464 -11769296 -17946887
12508a7946887q249692l617944N946590J1079830Q777089M891074K813561L11292
12500D004913l080110n200877o217122o115117j379627P103057R601251K016311
12492G32679l394532L959830J2446567L892184j5754424k2195897p937349Q581735
12484a9669207J0795456K568780m257121m520778J347582Q647736P259155o373865
12476d202262j7279270r316282P571697R300187l523457n406466J0678055J9334047
12468G156249M365764j3967557j2053919J113824L941097j827173q01485N602933
12460f470267N214142R90684M403185J0373623N001897o696050p334297J085272
12452F568189l77612j2224420j2357924N574831J6946942K745273k0739804k5699490
$$ plain form
12508 -17946887 -26196579 -29814523 -23867933 -12788103 -4011014 880060 3693621 4004913
12500 4004913 924803 -4276074 -10493196 -16608313 -17987940 -10884883 -1283632 732679
12492 732679 -2661853 1297977 13744544 17636728 1882304 -20313593 -28250942 -19669207
12484 -19669207 -8873751 -6304971 -10562092 -15082870 -13735288 -5087552 2171603 -4202262
12476 -4202262 -21481532 -30797814 -23226117 -13925930 -17449387 -22855853 -12177798 7156249
12468 7156249 11522013 -2445544 -14499463 -13385639 -9444542 -11271715 -12073200 -6470267
12460 -6470267 -1256125 -265441 4137744 14511367 19513264 12817214 5482917 6568189
12452 6568189 6190577 -6033843 -18391767 -12816936 4130006 6875279 -13864525 -39564015
12444c9564015j0047494O536863J2129411J0738994P996282M588161J459884k4019
12436f185933j636978m446779m810567m39636M708306P437769R908671J0791051
12428A5325904K304978j3660257j8237952m79006J9837710J5314094p910148j6656347
12420d161024J47509J5322146O155389j1735201j1324976M420102J1612222L926113
12412A4362280l555644l812811n446214r771808n139457Q828307J3304030j489660
12404G279023j7795882j4946624R60591Q490806K447967l708215j967043J526424
12396a7712953J702868K709111P092724Q927138L226257n679043r817547o379939
12388a5931384J721139R110423J0042105K405261q150020j2033306n465634N892810
$$ plain form
12444 -39564015 -49611509 -43074646 -30945235 -20206241 -12209959 -7621798 -6161914 -6185933
12436 -6185933 -7822911 -12269690 -17080257 -17519893 -12811587 -5373818 4534853 15325904
12428 15325904 17630882 3970625 -14267327 -14746333 5091377 20405471 12495323 -4161024
12420 -4161024 -4013515 11308631 17464020 5728819 -5596157 -1176055 10436167 14362280
12412 14362280 10806636 6993825 1547611 -8224197 -13363654 -4535347 8768683 7279023
12404 7279023 -10516859 -25463483 -24502892 -16012086 -13564119 -17272334 -19239377 -17712953
12396 -17712953 -16010085 -13300974 -6208250 2718888 5945145 266102 -9551445 -15931384
12388 -15931384 -14210245 -5099822 4942283 7347544 -802476 -12835782 -18301416 -12408606
12380a2408606J2740871R326116k537306j2895897j0891844K025917J0659509
12373c981240N015855m824907l268997O510429P617232l061398r764818l271649
12365i029493N851778O297810K287200J107242p45207o445394p100911L556862
12357d220113J3449487Q483258l421322l814602N727755N610189r506038k1525836
12349i217222j6576253k931502O148039J0357637J3005126R120370l460513j2528649
12341f082967o214577P642275J1100778Q46170r764136j0548770l920955L885804
12333a3056378Q868555P030145k098723r245718m223163P924783J1330013J706117
12325H235631q101480q130297l511420j321582R69638N638994O280034j45872
$$ plain form
12380 -12408606 332265 9658381 7121075 -5774822 -16666666 -14640749 -3981240
12373 -3981240 1034615 -3790292 -7059289 -548860 7068372 4006974 -5757844 -9029493
12365 -9029493 -3177715 3120095 5407295 6514537 5769330 -676064 -7776975 -4220113
12357 -4220113 9229374 17712632 14291310 10476708 16204463 21814652 12308614 -9217222
12349 -9217222 -25793475 -28724977 -22576938 -12219301 785825 9906195 6445682 -6082967
12341 -6082967 -12297544 -4655269 6445509 7291679 -2472457 -13021227 -16942182 -13056378
12333 -13056378 -4187823 2842322 743599 -8502119 -12725282 -4800499 6529514 8235631
12325 8235631 134151 -7996146 -11507566 -12829148 -11859510 -6220516 59518 -86354
12317h6354m518899p83392J630005n103033r469287J257612J4851142R540904
12309G318698r370642j4594749P20536J3057155P567251l64630M307120R510106
12301A8150845m42958j4718297j3100780M35364N902266M67038q99591O266949
12293B060836J0270729N666750N12926o77929k828545o520819n303291J06978
12285C287635Q89631l333795k723743M308432O870370Q55649l413484N11739M307922
12276A1560356N28416m377372j927259M945604R093431R605742P330575K82831
12268C7042324q935061j1592732o199461k731056o310926q649199l883980K68390
12260a0991701k506738m240784K693953J0290283Q246984J621848L93983J802243
$$ plain form
12317 -86354 -4605253 -5388645 -3758640 -8861673 -18330960 -17073348 -2222206 7318698
12309 7318698 -2051944 -16646693 -15926157 -2869002 4698249 4333619 8640739 18150845
12301 18150845 17707887 2989590 -10111190 -9675826 -3773560 -3306522 -4206113 2060836
12293 2060836 12331565 17998315 18511241 17833312 15004767 8483948 3180657 3287635
12285 3287635 4177266 843471 -1880272 2428160 9298530 10154179 6740695 7252434 11560356
12276 11560356 12088772 7711400 5784141 10729745 19823176 29428918 36759493 37042324
12268 37042324 28107263 16514531 10315070 7584014 1273088 -7376111 -11260091 -10991701
12260 -10991701 -13498439 -17739223 -15045270 -4754987 3491997 5113845 5507828 7310071
12252G310071j116484l526441J081334M146404m817702j6027983j2039953K845896
12244b2144858Q795028K949789J203757P569014P662956k860700q739905k334756
12236g899675L056846j802298n641300J090276P571797K418238n352460l113898
12228i672474K669438k26289o716222n221153n19192l501228o883875M118533
12220b5952462K1829502K3116273O181396n846080k070490J521579o654767j3132157
12212a007206m772008O911650O011551k97227L332833J0708875M352631j1309828
12204A3931271j3543799J814298J2512655M866660o642585n741561J78538k822114
12196D553363q748738k973574R577453J0241333k022439p520054K178575R888164
$$ plain form
12252 7310071 6193587 2667146 3748480 7894884 3077182 -12950801 -24990754 -22144858
12244 -22144858 -13349830 -10400041 -9196284 -1627270 6035686 3174986 -5564919 -7899675
12236 -7899675 -4842829 -6645127 -12286427 -11196151 -3624354 -1206116 -6558576 -9672474
12228 -9672474 -7003036 -7229325 -13945547 -19166700 -19685892 -23187120 -30070995 -25952462
12220 -25952462 -4122960 18993313 25174709 19328629 17258139 18779718 12124951 -1007206
12212 -1007206 -5779214 1132436 7143987 6846760 10179593 20888468 25241099 13931271
12204 13931271 387472 2201770 14714425 19581085 12938500 7196939 7375477 4553363
12196 4553363 -4195375 -7168949 2408504 12649837 10627398 3107344 5285919 15174083
12188A5174083M82922j4113521j3018389J598789Q932885J601749n659871j678806
12180f680159M230350k85318r455454q670501K436179J0168036P406924P53722
12172i6221l229727n654093o108349O54680J2001902J3981411J141325j0797315
12164A893613n633274Q191169R558557l382097j2108118p548060r01763j124512
12156a1054485j583196K964112M635876j199222m503168J172858M440698m269993
12148i396520j3031472o928701N769598O906590j336190k155181O239048J0356213
12140c576615P225061O214406O368985k807606j6364659j5631094J97289R723645
12132h650588L877860j006794N164316P935305l298008j3209957o374013N743980
$$ plain form
12188 15174083 15657005 1543484 -11474905 -9876116 -943231 658518 -5001353 -6680159
12180 -6680159 -2449809 -2735127 -12190581 -20861082 -18424903 -8256867 -849943 -96221
12172 -96221 -3325948 -8980041 -15088390 -14433710 -2431808 11549603 12690928 1893613
12164 1893613 -3739661 4451508 14010065 10627968 -1480150 -9028210 -9929973 -11054485
12156 -11054485 -12637681 -9673569 -5037693 -6236915 -10740083 -9567225 -5126527 -9396520
12148 -9396520 -22427992 -29356693 -23587095 -16680505 -18016695 -20171876 -13932828 -3576615
12140 -3576615 3648446 9862852 16231837 13424231 -2940428 -18571522 -18374233 -8650588
12132 -8650588 -4772728 -5779522 -615206 7320099 4022091 -9187866 -15561879 -9817899
12124i817899N473968r39299K347474J0283488O102764p937831j3593269n898909
12116a3979513K330778K910144K65471j415495k547523j301638L533803O051023
12108d152950K338012J47820N776523R528438R21684j0135095p293869M021803
12100A152366M664206o221964j0753691k834029M067739J389574l712295m945946
12092a7194040m692158k654493M570192J0958214P031163j246191J2047O854751
12084C639485L148505p842266n666199R754196J3781747r98313j0801603k645657
12076B369895K545309j0404365j9600834l037212J9094241J3574004j1976870
12069g435832k0850635l463734J3619909J2304122L685920R20300K98526k796383
$$ plain form
12124 -9817899 -4343931 -5283230 -2935756 7347732 13450496 5512665 -8080604 -13979513
12116 -13979513 -11648735 -8738591 -8473120 -9888615 -12436138 -13737776 -10203973 -4152950
12108 -4152950 -1814938 -1667118 4109405 13637843 14559527 4424432 -2869437 1152366
12100 1152366 5816572 -405392 -11159083 -13993112 -9925373 -8535799 -12248094 -17194040
12092 -17194040 -21886198 -24540691 -19970499 -9012285 -1981122 -3227313 -3215266 3639485
12084 3639485 6787990 -1054276 -6720475 3033721 16815468 15817155 5015552 2369895
12076 2369895 4915204 -5489161 -25089995 -28127207 -9032966 4541038 -7435832
12069 -7435832 -28286467 -31750201 -18130292 -5826170 -2140250 -1219950 -921424 -3717807
12061c717807k436922L764565P102861K941002j477913j590246l635037j0303530
12053i353027j1486638L58330J5049203J5868838J363449j2856200j2812105p89975
12045a4658125R342621Q391162J008560k338091J02280N50531m620862q826944
12037a1048868o675316k984802l966522o650853m623928J773883Q077527J2194274
12029a3904605J1689041K765765j0170370j3584689l556021M926831P3932o416835
12021b8176951J796555J6233819J4848080k024827j0988758j971316P973830L465192
12013A155624p216214r057426k809396J459826J496533J663598K286846L69497
12005a0651112l422385n359642l223443K720543R160340R655082J619368o682214
$$ plain form
12061 -3717807 -6154729 -2390164 4712697 7653699 6175786 4585540 950503 -9353027
12053 -9353027 -20839665 -20481335 -5432132 10436706 11800155 -1056045 -13868150 -14658125
12045 -14658125 -5315504 3075658 4084218 1746127 1848407 2398938 -2221924 -11048868
12037 -11048868 -17724184 -20708986 -24675508 -31326361 -35950289 -34176406 -26098879 -13904605
12029 -13904605 -2215564 550201 -9620169 -23204858 -26760879 -21834048 -21760116 -28176951
12021 -28176951 -26380396 -10146577 4701503 2676676 -8312082 -10283398 -2309568 1155624
12013 1155624 -6060590 -15118016 -17927412 -16467586 -14971053 -13307455 -11020609 -10651112
12005 -10651112 -14073497 -19433139 -22656582 -19936039 -10775699 -1120617 498751 -6183463
11997f183463m504822N745309J0747944M787498m266540q320089p045057j371008
11989a0410228Q186275J4347642P984463n998099j1652883n156157L15809j769816
11981d152994p58357Q667001J2200369o53169j4684370r769401P363725J2765148
11973A0977952N14650j1852685j1188340l455333Q96694P28180k74155l96591
11965a4049628J055871L408710K672642k751342o368885k124003M539787M481912
11957i134936K96640J438635O463334M730938m458610r817657o890423l289479
11949b0661558j966603L837888J2988548J1682242l323388j3372832m276334J0174614
11941d917423Q933451l265469n141625N339750Q866629j133098p013083K675512
$$ plain form
11997 -6183463 -10688285 -4942976 5804968 10592466 6325926 -1994163 -9039220 -10410228
11989 -10410228 -2223953 12123689 20108152 14110053 2457170 -2698987 -2383178 -4152994
11981 -4152994 -4911351 3755650 15956019 15302850 618480 -9150921 -1787196 10977952
11973 10977952 11492602 -360083 -11548423 -15003756 -14107062 -13378882 -13653037 -14049628
11965 -14049628 -12993757 -9585047 -6912405 -9663747 -16032632 -18156635 -13616848 -9134936
11957 -9134936 -8838296 -7399661 -936327 3794611 -663999 -10481656 -17372079 -20661558
11949 -20661558 -22628161 -18790273 -5801725 5880517 2557129 -10815703 -15092037 -4917423
11941 -4917423 4016028 750559 -4391066 948684 9815313 8682215 1669132 4344644
11933D344644J3138577P502915o062546r038019k391309j473326p540095o206430
11925g725589N579921J1986359L697381p043902o545278J0833Q24232j994258
11917a210301N49214N082031R80228q834086r680840J468907J0348588O892513
11909E596254j941903o454123p877550r680034p069231L948487J5487456J7110836
11901I120192J0487143M242093n12303p856584j4128705j0708457L39017N983898
11893c033706M33053p037990o704997j422590R62661M62777K301866O201509O810808
11884a026609L218713K66898k73267k670891q195182r262052O67218J4080842
11876c194330J5153437N94975j3614988j2488859k064783Q16477n633609o428420
$$ plain form
11933 4344644 17483221 24986136 18923590 9885571 7494262 6020936 -1519159 -7725589
11925 -7725589 -2145668 9840691 13538072 6494170 -51108 -40275 783957 -1210301
11917 -1210301 -661087 4420944 5401172 -3432914 -13113754 -11644847 -1296259 5596254
11909 5596254 3654351 -2799772 -10677322 -20357356 -27426587 -23478100 -7990644 9120192
11901 9120192 19607335 23849428 23337125 15480541 1351836 -9356621 -9017604 -3033706
11893 -3033706 -2600653 -9638643 -16343640 -17766230 -16803569 -16340792 -14038926 -7837417 -1026609
11884 -1026609 2192104 2459002 2185735 -485156 -8680338 -17942390 -17275172 -3194330
11876 -3194330 11959107 12554082 -1060906 -13549765 -15614548 -14798071 -20431680 -26860100
11868b6860100N212036J6286477J4106827M701424N40211P27721k814191p153854
11860D746551k603624Q101128J1272235L481997l728214l089603j399424n076035
11852A1705011q698734n196815K446947O971042O439368K034286n842521j3282667
11844c424083j2715511l594826M272024M437080K772220N635037P851556J904128
11836G137625q058425j1522357n680962M396580J3593086J6337185O419654j2043551
11828A0578835k1693925j2840607Q25266K340766j809808M845314J5984311R887709
11820H117861j0823361j6677430K907549J9900007R955155j0375050j1550148
11813h545417L057469P286924l067163o465017N019899J1854562Q3346j5219058
$$ plain form
11868 -26860100 -21648064 -5361587 8745240 13446664 13986875 14714596 11900405 4746551
11860 4746551 2142927 10244055 21516290 24998287 21270073 18180470 16781046 11705011
11852 11705011 3006277 -2190538 256409 7227451 13666819 15701105 9858584 -3424083
11844 -3424083 -16139594 -19734420 -15462396 -11025316 -8253096 -2618059 5233497 7137625
11836 7137625 -920800 -12443157 -18124119 -13727539 -134453 16202732 22622386 10578835
11828 10578835 -11115090 -23955697 -23130431 -20789665 -22599473 -17754159 -1769848 8117861
11820 8117861 -2705500 -19382930 -16475381 3424626 13379781 3004731 -8545417
11813 -8545417 -5487948 1798976 -1268187 -7733204 -2713305 9141257 9224603 -5994455
11805e994455j2809627L830732J3108963M760116j0054171j5281960p355260M374691
11797b5420971R445424O656788L088318L691130N452499M255319K234011K276444
11789A1678962K69598p894508j4890616r062646P419409J9115836J7529743R499145
11781C3664923L102696k567560q871313j0895865o668819l185474n089564n929814
11773f440790N75073Q218503P050483j282776o707760n236892j409166O28608
11765d604717L24170k416943o295598o911131k131981L754516O321459O660780
11757e299445N632119m9429q304637p267072P715425K0410051J2585019q102713
11749A7319318j6721059o332911M302585J267968n545986k416784N923253O764987
$$ plain form
11805 -5994455 -18804082 -14973350 -1864387 2895729 -7158442 -22440402 -29795662 -25420971
11797 -25420971 -15975547 -9318759 -6230441 -2539311 2913188 7168507 9402518 11678962
11789 11678962 11948560 4054052 -10836564 -19899210 -12479801 6636035 24165778 33664923
11781 33664923 36767619 34200059 25328746 14432881 7764062 4578588 -510976 -6440790
11773 -6440790 -5865717 2352786 9403269 8120493 1412733 -3824159 -5233325 -4604717
11765 -4604717 -4280547 -6697490 -12993088 -19904219 -22036200 -18281684 -11960225 -5299445
11757 -5299445 332674 283245 -8021392 -15288464 -7573039 12837012 25422031 17319318
11749 17319318 598259 -5734652 -1432067 -164099 -5710085 -8126869 -2203616 4561371
11741D561371O01053k278156K79879R41266l363415p331465o568001k841974N05590
11732a5493852K876017N394072Q364629R507720M702119o072481j3990066r507216
11724a4219058L296303R238924K546428n047459k900601K635388J078023l203942
11716f575994O51428Q703082O258159p568735j5921255q549310M190185Q223430
11708a0589010M828349L966304P148077P281506J465956n225056p812764o688927
11700e625565m570996k670442p68326J230721K539605K070071L74948O0258K089361
11691e270365L143910N24086j856900J666646Q152189Q310028P16938m799925
11683A0586607j939998K479188R9139n594604o304436l410945m705060r692422
$$ plain form
11741 4561371 5162424 2884268 3164147 4105413 741998 -6589467 -13157468 -15999442 -15493852
11732 -15493852 -12617835 -7223763 1140866 10648586 15350705 9278224 -4711842 -14219058
11724 -14219058 -10922755 -1683831 862597 -4184862 -7085463 -4450075 -3372052 -6575994
11716 -6575994 -5924566 2778516 9036675 1467940 -14453315 -23002625 -18812440 -10589010
11708 -10589010 -5760661 -1794357 5353720 12635226 14101182 8876126 1063362 -5625565
11700 -5625565 -10196561 -12867003 -13635329 -12404608 -9865003 -7794932 -7419984 -7359726 -5270365
11691 -5270365 -2126455 -1602369 -3459269 -1792623 6359566 14669594 15386532 10586607
11683 10586607 8646609 11125797 11224936 5630332 -674104 -4085049 -8790109 -18482531
11675a8482531r422404j006187P805722J0316194Q423203O004367K812647j505316
11667D945695m145502l878650l534580m425381l744856p10716O20596j466381
11659a6339775k342048J070035M176942K215672j343964n10645L435255N019922
11651d618606L901733L359009K156482l375817j0018021r203652P87845J1379401
11643e631626J4312813R712863K041860n629400j0590568r439304k332716M766515
11635b789563N596236K10400n329214m941818J630192P787566O453614r00812
11627G716601n008130j578073J911599j831970o862451k708949P543191J0293952
11619I475770K134446n408742m094889N55179J148458j007065k643333m797100
$$ plain form
11675 -18482531 -27904935 -28911122 -21105400 -10789206 -2366003 3638364 6451011 4945695
11667 4945695 800193 -3078457 -6613037 -11038418 -14783274 -15493990 -14873394 -16339775
11659 -16339775 -18681823 -17611788 -13434846 -11219174 -12563138 -13073783 -9638528 -4618606
11651 -4618606 -716873 2642136 4798618 1422801 -8595220 -17798872 -17011027 -5631626
11643 -5631626 8681187 18394050 20435910 14806510 4215942 -5223362 -7556078 -2789563
11635 -2789563 2806673 3017073 -2312141 -7253959 -5623767 2163799 8617413 7716601
11627 7716601 2708471 1130398 3041997 1210027 -5652424 -8361373 -818182 9475770
11619 9475770 11610216 6201474 2106585 2661764 3810222 2803157 159824 -4637276
11611d637276o295027j813269P027495R833282L937306N34787N542899P818900
11603B1949097j515176j1454761q585554l50355j807620q390330l929350R379782
11595d704267J2703878J720820p131077m639572q78210l202329l433080L415159
11587f148678O664345j311556r540955n272031N984205J0600910O915629K366756
11579A0258625o91276l707611l815432Q64944L940121L0064m420793n41472Q165782
11570A0082952J1205011O405434l56528n784406r467833q813593l819697j311959
11562a860619m242928l825601N822204J3402973O112652p572965r239756J52063
11554a251977L331979k538378j631561J0565017J6808379O767945n311890m756669
$$ plain form
11611 -4637276 -10932303 -12745572 -5718077 4115205 8052511 8587298 14130197 21949097
11603 21949097 20433921 8979160 393606 43251 -1764369 -10154699 -14084049 -4704267
11595 -4704267 7999611 9720431 2589354 -2050218 -2928428 -6130757 -9563837 -6148678
11587 -6148678 515667 -795889 -10336844 -15608875 -9624670 976240 7891869 10258625
11579 10258625 9567349 5859738 2044306 2909250 6849371 6879435 2458642 1917170 10082952
11570 10082952 21287963 27693397 27336869 21552463 12084630 3271037 -548660 -1860619
11562 -1860619 -6103547 -9929148 -4106944 9296029 15408681 7835716 -1404040 -1251977
11554 -1251977 2080002 -458376 -2089937 8475080 25283459 32051404 26739514 21982845
11546B1982845K84789l878431j1080852o548363O395879J0731803J875702q461153
11538A1302219j1933278j0644708o009433L058155J0200286N983607m859186n864622
11530h766960O591430J5905468R706072k306644n374189k199979m425093j0327952
11522a197847p934556K775171P818627J348615n440090l189955J308367j118332
11514e630000n028012l5901R523430R924934Q81233l246791K269173L778063o643224
11505E792905j3928192k453054J5213709J3237812p276828j7009565k554042J2058654
11497C081399K648624j6241865j3306845R988101K0302568K703810j7688893j4022393
11489b2535494N286202J4219618P271158l71451j233261k501139o769496n692088
$$ plain form
11546 21982845 22267634 18389203 7308351 759988 7155867 17887670 19763372 11302219
11538 11302219 -631059 -11275767 -17285200 -14227045 -4026759 1956848 -2902338 -8766960
11530 -8766960 -2175530 13729938 23436010 21129366 15755177 13555198 9130105 -1197847
11522 -1197847 -9132403 -6357232 1461395 2810010 -2630080 -5820035 -4511668 -5630000
11514 -5630000 -10658012 -10693913 -1170483 8754451 9635684 6388893 8658066 12436129 5792905
11505 5792905 -8135287 -10588341 4625368 17863180 10586352 -6423213 -8977255 3081399
11497 3081399 5730023 -10511842 -23818687 -13830586 6471982 9175792 -8513101 -22535494
11489 -22535494 -17249292 -3029674 4241484 3870033 2636772 135633 -6633863 -12325951
11481a2325951L442058J0223456O335907k867119p712656o053638p31200O073494
11473c615649J0267233N654249o833378j5784121j1826135R38432J1159993J3064464
11465C025088Q167623k35279q056238j0280868o090366j029955M56123N16312
11457a3527560J924272K619045J438458K299979N735087L936296o276454j2916986
11449a4767863l876580J2547259J6716307N260081n530825m792149j82127j384190
11441C989913m535677j360771O005293Q301652J817469q478520j4413667r938176
11433a8612484L498405J4321998J0579034m454773j3918148q382937K952223O941525
11425g075157L621423J532722L391254N123597M310561J556045l008829p747224
$$ plain form
11481 -12325951 -8883893 1339563 7675470 4808351 -2904305 -8957943 -9689143 -3615649
11473 -3615649 6651584 12305833 5472455 -10311666 -22137801 -21199369 -10039376 3025088
11465 3025088 11192711 10957432 2901194 -7379674 -13470040 -14499995 -14043872 -13527560
11457 -13527560 -11603288 -8984243 -7545785 -5245806 489281 4425577 -1850877 -14767863
11449 -14767863 -18644443 -6097184 10619123 15879204 10348379 5556230 5374103 3989913
11441 3989913 -545764 -1906535 4098758 12400410 14217879 5739359 -8674308 -18612484
11433 -18612484 -15114079 -792081 9786953 5332180 -8585968 -16968905 -14016682 -7075157
11425 -7075157 -3453734 -1921012 1470242 6593839 10904400 12460445 9451616 1704392
11417A704392p716913j526764L673574J051770n264050n682477J080960P014043
11409e665465O320593J299465k798893l220252k69800L138826L175507j05313
11401A874668j478641K090003N384748J372008p970242j2761389p181420L772756
11393a4897509J0084898O978611q39050m626937j931864L26113l556885p752930
11385a6215553l316225N060013L443543p828751j0161517N677739K2307264J9125882
11377A8092395J448009r732501q487090o040487p126933m393999L509426P107260
11369e623920K890628j199678j138354k192957m361030J067992J3104453J5687799
11361A8234933J641564j2646653j0337093L42585M12804q889942r068071M644041
$$ plain form
11417 1704392 -6012521 -7539285 -3865711 -2813941 -8077991 -13760468 -12679508 -5665465
11409 -5665465 655128 1954593 -844300 -4064552 -4334352 -1195526 1979981 1874668
11401 1874668 396027 2486030 7870778 9242786 1272544 -11488845 -18670265 -14897509
11393 -14897509 -4812611 2166000 1326950 -3299987 -5231851 -4905738 -8462623 -16215553
11385 -16215553 -19531778 -14471765 -11028222 -18856973 -29018490 -23340751 -1033487 18092395
11377 18092395 19540404 9807903 1320813 -4719674 -11846607 -16240606 -12731180 -5623920
11369 -5623920 -2733292 -3932970 -5071324 -7264281 -11625311 -10557319 2547134 18234933
11361 18234933 19876497 7229844 -3107249 -2764664 -2351860 -11241802 -20309873 -15665832
11353a5665832J4896161Q208678o916126j4765511j2551793o753843Q34092J1680600
11345b1033574K0141124J6940051L592379o530831m998252J155238N99709o307053
11337C558791r574371m553076K900292O013666M579322J293346k567037m797606
11329c146673j893405M643478P067132J557700n182916n063219L99725M599961
11321B981783O419197Q019178O277627k941453j3520385j3453372j905777Q283116
11313A59914P905524J742157k035068l274831m808186m328874O35498N026857
11305A022991J952083o328655j0138386m393225O193337J3321267J2542036N281726
11297A9453174k882561o214577l762205p2309M26350j749959l429396l422942
$$ plain form
11353 -15665832 -769671 7439007 522881 -14242630 -26794423 -33548266 -32714174 -21033574
11345 -21033574 -892450 16047601 19639980 13109149 8110897 9266135 9865844 3558791
11337 3558791 -6015580 -10568656 -7668364 -1654698 2924624 4217970 1650933 -3146673
11329 -3146673 -5040078 -396600 6670532 8228232 3045316 -2017903 -1618178 2981783
11321 2981783 9400980 17420158 23697785 20756332 7235947 -6217425 -8123202 159914
11313 159914 8065438 9807595 7772527 4497696 -310490 -4639364 -4003866 1022991
11305 1022991 2975074 -3353581 -13491967 -17885192 -11691855 1629412 14171448 19453174
11297 19453174 16570613 10356036 6593831 6521522 6947872 5197913 1768517 -1654425
11289a654425k259292M65902M918890Q344038P185539J961747k802888l939620
11281A2219891k615427j384612o91230j4607p53633m841201j0093664j0189083
11273a8363566k075442Q363173J1920322P101281J406243Q73160K929824J777344
11265A3932339l355366q327379r010180l586427O005559J2324090P546832n480027
11257A0049441j2962434o497376N770716J0763848P155338K012149k945314r817411
11249C528957j3239629n034077R597512J4513117M690471o418970o482800J04561
11241A259142K888607J516720K100320M284906K051745m957867q981863l791477
11233c629767P168904J3453891Q224719l388069q808295l465471K553997r38875
$$ plain form
11289 -1654425 -3913717 -3447815 1471075 9815113 17000652 18962399 16159511 12219891
11281 12219891 9604464 8219852 7528622 7514015 6760382 1919181 -8174483 -18363566
11273 -18363566 -20439008 -12075835 -155513 6945768 8352011 9225171 12154995 13932339
11265 13932339 10576973 2249594 -6760586 -10347013 -4341454 7982636 15529468 10049441
11257 10049441 -2912993 -9410369 -3639653 7124195 14279533 16291682 13346368 3528957
11249 3528957 -9710672 -14744749 -5147237 9365880 14056351 7637381 1154581 1259142
11241 1259142 4147749 5664469 7764789 12049695 14101440 9143573 161710 -3629767
11233 -3629767 3539137 16993028 25217747 21829678 13021383 9555912 12109909 11171034
11225A1171034q307652o870778K219042N749812M83013k582665R92950J183366
11217D038122o258344q505706L294359J5907247J2346192k107963q945500m337504
11209E430903n41340l206804m918605j519866J168741l1093J00343L751846M277402
11200D511527k375937r165896p039966L287780J3449971J6852065J2435186L174013
11192C5128743n644640r307963p371366l308487o12197j149436n388508j0309840
11184g963694r220132O51614J1537189J2648012M270981k557392j536771J072404
11176H902211k711334j0271766j2120337m529589O372369J1900611Q912339J115912
11168G570416n307988o802962l858947J501675P531371J1280905Q623087o13561
$$ plain form
11225 11171034 2863382 -4007396 -1788354 3961458 4444471 1861806 2854756 4038122
11217 4038122 -2220222 -10725928 -7431569 8475678 20821870 18713907 9768407 5430903
11209 5430903 4889563 1682759 -3235846 -4755712 -3586971 -3618064 -3517721 234125 4511527
11200 4511527 2135590 -7030306 -14070272 -10782492 2667479 19519544 31954730 35128743
11192 35128743 29484103 20176140 12804774 9496287 8884090 7734654 2346146 -7963694
11184 -7963694 -17183826 -16532212 -4995023 7652989 11923970 9366578 7829807 8902211
11176 8902211 6190877 -4080889 -16201226 -20730815 -14358446 -2457835 6454504 7570416
11168 7570416 2262428 -4540534 -8399481 -6897806 633565 11914470 20537557 19923996
11160A9923996r338939r590455k161235M119378L279710j168319j695520L828917
11152G197533R724850Q407679j652120j3326652j7291526j2008639m945209k088224
11144b5982308l7371O970957J5239842J4067654O87496j3599850j5463613m281596
11136b2398789P989905R764899P00765r045165r063946J068165J1382983J2017810
11128B416627L557769m446844m428765J871113O714850M838699j684683n774495
11120C064271k707636M081587N964682n26419q126063o623710M392842J3791314
11112A3310868J0899429k408966j2957190r930297K843593J0055508K498116j0662582
11104C648479j2407084n6021J0892155P937598k125597n201436r32498o97980
$$ plain form
11160 19923996 10585057 994602 -1166633 2952745 6232455 5064136 3368616 7197533
11152 7197533 16922383 25330062 23677942 10351290 -6940236 -18948875 -23894084 -25982308
11144 -25982308 -26019679 -19048722 -3808880 10258774 10946270 -2653580 -18117193 -22398789
11136 -22398789 -14408884 -4643985 -3943220 -12988385 -22052331 -20984166 -9601183 2416627
11128 2416627 5974396 1527552 -2901213 -1030100 5684750 10523449 8838766 3064271
11120 3064271 356635 4438222 10402904 9876485 1750422 -4873288 -480446 13310868
11112 13310868 24210297 21801331 8844141 -1086156 1757437 11812945 14311061 3648479
11104 3648479 -8758605 -8814626 2077529 10015127 7889530 2688094 1755596 1057616
11096A057616p689280j1449668m217870P694657J3385923J0446463L483597l896589
11088H814849r444267r484824l033032L473725K229471n284864r054132k864064
11080b4647138Q188855J3932439R914218N56709o125552n326213J448322Q313780
11072F255420J0302370P122082J377135n477041j2528263j5519440r080147M316657
11064a3231227J2738185P972434k747223n436125J707390O934809L374913j517872
11056I795284K95926M051965J150889n618281o608619j305218J323404k355995
11048G29355n604927k354286M875258R803542Q810114J842544p238012j1476584
11040f12996p731985j326943J987070M671180R712109J0145465n76628j2195866
$$ plain form
11096 1057616 -6631664 -18081332 -22299202 -14604545 -1218622 9227841 12711438 8814849
11088 8814849 -629418 -10114242 -13147274 -9673549 -7444078 -12728942 -21783074 -24647138
11080 -24647138 -16458283 -2525844 7388374 7945083 1819531 -3506682 -2058360 6255420
11072 6255420 16557790 23679872 25057007 19579966 7051703 -8467737 -17547884 -13231227
11064 -13231227 -493042 7479392 4732169 -703956 1003434 7938243 11313156 9795284
11056 9795284 10091210 14143175 15294064 9675783 3067164 1761946 3085350 729355
11048 729355 -4875572 -7229858 -2354600 7448942 16259056 18101600 10863588 -612996
11040 -612996 -8344981 -9671924 -7684854 -3013674 6698435 16843900 16267272 4071406
11032D071406r012547L490154L799812j0551996j5667038J226122J8778474J2513046
11024H647433q409863j5848763k930402J1380913J2030787K750761o449530r798812
11016h627476m415554P164892J3483639N898627p078921r489547p01920M509132
11008G42872j480565r570249q843540O3122R100407J1719284O251983k492132
11000E491182n572553n73214L155604k101242q958008o069723K297974K378679
10992i951301o008117q711460l74780P489843N141155k423068n747330k511736
10984b3096794N215536J4360173J7713068Q204133r403712k0482009j7553616
10977b5043221o742663L853733J1530404J3477569O540290l984954o951871q75845
$$ plain form
11032 4071406 -4941141 -1450987 2348825 -8203171 -23870209 -22644087 -3865613 8647433
11024 8647433 237570 -15611193 -18541595 -7160682 4870105 7620866 1171336 -8627476
11016 -8627476 -13043030 -5878138 7605501 13504128 6425207 -3064340 -3766260 742872
11008 742872 -737693 -10307942 -19151482 -19088360 -9987953 1731331 7983314 5491182
11000 5491182 -81371 -654585 2501019 399777 -8558231 -14627954 -12329980 -9951301
10992 -9951301 -15959418 -24670878 -25045658 -17555815 -12414660 -14837728 -20585058 -23096794
10984 -23096794 -17881258 -3521085 14191983 22396116 12992404 -7489605 -25043221
10977 -25043221 -31785884 -27932151 -16401747 -2924178 3616112 -368842 -7320713 -8196558
10969h196558L527234n87607p938242j0981279p205724L861653J8074449K1739252
10961A2293178N834702j4341335j3625417O071265J6123429M651340o300932J039692
10953A1745922J1743806O979468l359315j783772L443600m577758j6234283r787298
10945a829630Q335545J1170908m289165j3353350n741004J125468k936677m391719
10937a1909624L957263O020268p341075j6753482m694912J3015257J1011922m893347
10929a1587730p860500O836983J6274067P259135n757146o354302P35233K726121
10921B271861o3293P67557M670460L488458l870525r428425q306890l795062N49698
10912a3716161N336572R145924O181083l882703j0029025k651714J0945652J3891535
$$ plain form
10969 -8196558 -4669324 -5256931 -13195173 -24176452 -31382176 -27520523 -9446074 12293178
10961 12293178 18127880 3786545 -9838872 -3767607 12355822 17007162 10706230 11745922
10953 11745922 23489728 30469196 27109881 25326109 28769709 24191951 7957668 -1829630
10945 -1829630 6505915 17676823 13387658 34308 -5706696 -4581228 -7517905 -11909624
10937 -11909624 -7952361 -1932093 -9273168 -26026650 -30721562 -17706305 -6694383 -11587730
10929 -11587730 -19448230 -12611247 3662820 10921955 5164809 -1189493 -454260 2271861
10921 2271861 2208568 2976125 7646585 11135043 7264518 -2163907 -10470797 -14265859 -13716161
10912 -13716161 -8379589 766335 6947418 3064715 -6964310 -9616024 1329628 15221163
10904A5221163K560968q739535q901083m300648m685405n634907K220455J3100294
10896H41302J0986264n738106j9078751j4518004K302775J6433864K0364804J4347013
10888B5941161P34533j3541701j7205856p020916N539066Q373994M005661K162354
10880H988296L375945J233583l415621l500367N30120R57335k692070k227261
10872C249960L780026N945432q6617n859229m334905n26322k29880Q67104O934625
10863I740194J0682415M412892n182504o505662j732479j989565p700593q817117
10855g092419l268183J90490j485936j335477K545912K607060k590788l033019
10847a3462360N296651J1287599O313940j468928j658916O84776m461683j2427373
$$ plain form
10904 15221163 17782131 9042596 141513 -4159135 -8844540 -14479447 -12258992 841302
10896 841302 11827566 6089460 -12989291 -27507295 -25204520 -8770656 11594148 25941161
10888 25941161 26675694 13133993 -4071863 -11092779 -5553713 2820281 6825942 8988296
10880 8988296 12364241 13597824 10182203 6681836 7211956 8169291 5477221 3249960
10872 3249960 7029986 12975418 12888801 7029572 2694667 2168345 1938465 2805569 9740194
10863 9740194 20422609 24835501 19652997 13147335 11414856 9425291 1724698 -7092419
10855 -7092419 -10360602 -10170112 -11656048 -12991525 -10445613 -7838553 -10429341 -13462360
10847 -13462360 -8165709 3121890 9435830 7966902 6307986 6992762 2531079 -9896294
10839i896294j0361145J009392P632980L488556k056172j26816N857707P889450
10831C437658M472392J18063j046065J049492J888391l608136j2778573j4521358
10823b0988136l533137Q660529O810901n778379j0098958J771639J5043991J3166883
10815E055333N1804p826515m930579j098154l940892p545544k881647P392684
10807a5723510J1753972N724460k176542k485997L161045O706787N588930L020538
10799A5569683l73599o210910j0767395p892269m84405J597465k452818k177278
10791a3191526N737282R449451L86804j1778161j3038707m617210K503702M469729
10783b0078636M339396K346045j397095j103136N201289P089683l427200j4778239
$$ plain form
10839 -9896294 -20257439 -19248047 -11615067 -8126511 -10182683 -10309499 -4451792 3437658
10831 3437658 7910050 8028113 6982048 8031540 9919931 6311795 -6466778 -20988136
10823 -20988136 -24521273 -15860744 -9049843 -14828222 -24927180 -23155541 -8111550 5055333
10815 5055333 5107137 -2719378 -7649957 -8748111 -12689003 -20234547 -23116194 -15723510
10807 -15723510 -3969538 1754922 -421620 -2907617 253428 6960215 12549145 15569683
10799 15569683 15196084 8985174 -1782221 -9674490 -10158895 -8561430 -11014248 -13191526
10791 -13191526 -7454244 1995207 2382011 -9396150 -22434857 -27052067 -24548365 -20078636
10783 -20078636 -15739240 -13393195 -14790290 -15893426 -10692137 -3602454 -7029654 -21807893
10775b1807893r740602P628325J6345961Q568230j897657k562171K411273L855218
10767B800684J126488j250093r34101J660570L237671j297439j0024929j0589952
10759a5271101L154773J6380757J0722279p118730j3009211j120766Q904106M267282
10751F909389l133440l33347M816808l58406j0006823r168820J531257O692330
10743c051052o63159r737956p818487L137633J0441978P663817J770327J270320
10735C013421L051958n84511n182039J016723J3589422J2035552p760390k1153178
10727a973042j0479014O237845M300112p531496m412028J0391366J2338803k08599
10719H663947m461942M593386O056575p704288j7137949r738923J799107N521861
$$ plain form
10775 -21807893 -31548495 -23920170 -7574209 994021 -903636 -3465807 -1054534 2800684
10767 2800684 3927172 2677079 1742978 3403548 6641219 5343780 -4681149 -15271101
10759 -15271101 -12116328 4264429 14986708 7867978 -5141233 -6261999 2642107 6909389
10751 6909389 3775949 3442602 8259410 7901004 -2105819 -11274639 -9743382 -3051052
10743 -3051052 -3714211 -13452167 -21270654 -18133021 -7691043 -27226 1743101 3013421
10735 3013421 6065379 5480868 298829 1315552 14904974 26940526 19180136 -1973042
10727 -1973042 -12452056 -6214211 -1914099 -9445595 -13857623 -3466257 8872546 8663947
10719 8663947 4202005 8795391 14851966 7147678 -9990271 -19729194 -17930087 -12408226
10711a2408226O399129P065675J50988j0252721p380856P625972J2353288P47809
10703D301058o235075O74460K848095q381064j2207204K902902J4400401M012487
10695B316060j0237057p210035J558074j656725o436156J777694Q988761j741252
10687a2640636j4518959o178576J1816682J3269141K033065J85149O292991L077913
10679C336770n258313j025452J0730265J0349627K91105j452527K901836k505417
10671A7367894j1921804o652844O117602J961473j5337894j6326701M153950J7798032
10663b840292R223523m147616o432613m587630o013478m590839J116451J862677
10655a6409817k108961O92323R103851Q545855j556402n554755p47311j345637
$$ plain form
10711 -12408226 -6009097 1056578 1207566 -9045155 -16426011 -8800039 3553249 4301058
10703 4301058 -1934017 -1259557 1588538 -6792526 -18999730 -16096828 -1696427 2316060
10695 2316060 -7920997 -15131032 -13572958 -15229683 -21665839 -19888145 -10899384 -12640636
10687 -12640636 -27159595 -33338171 -21521489 -8252348 -6219283 -6034134 258857 3336770
10679 3336770 -1921543 -2946995 7783270 18132897 18424002 16971475 19873311 17367894
10671 17367894 5446090 -1206754 4910848 6872321 -8465573 -24792274 -20638324 -2840292
10663 -2840292 6383231 2235615 -4196998 -8784628 -14798106 -19388945 -18272494 -16409817
10655 -16409817 -18518778 -17826455 -8722604 -176749 -1733151 -7287906 -8035217 -9380854
10647i380854q572948n772062R360705J6353592N571804o306372n038690J530633
10639b254192L081141K967564M512437K539527k548911k635794l4559n770973
10631a43760j4737830p606774J5456371K8828145J8409021Q360q670939j0040525
10623B1502069j0616812p130610K10189K552431K5162L051891R352014M016439
10615B2962773j0942326j4578342k751263L494677m499085q157981K457963R869600
10607b143984K797986k947253L502130O230421m987749j0731626L522513J7075200
10599A2317638P560534r963190r011934M366343O688412j063224p12456O275011
10591A6457134K944646r285766j2042339k041769N495777L886646J399471J468924
$$ plain form
10647 -9380854 -17953802 -23725864 -14365159 1988433 7560237 1253865 -3784825 -2254192
10639 -2254192 826949 3794513 8306950 10846477 8297566 5661772 5627213 -143760
10631 -143760 -14881590 -22488364 -7031993 21796152 40205173 40213533 31542594 21502069
10623 21502069 10885257 3754647 3964836 6517267 6542429 9594320 18946334 22962773
10615 22962773 12020447 -2557895 -5309158 -1814481 -6313566 -14471547 -12013584 -2143984
10607 -2143984 654002 -2293251 1208879 7439300 2451551 -8280075 -4757562 12317638
10599 12317638 19878172 9914982 903048 5269391 11957803 10894579 10182123 16457134
10591 16457134 19401780 10116014 -1926325 -3968094 1527683 5414329 6813800 8282724
10583H282724j643141o834662m861723N065214J2318505R927003J597819n729227
10575A8122512p829969m326667k47231j571299n179647k080465N835294N512054
10567H234582n290893j1439134l801426P158480J0250691Q715422O669608l96809
10559B0100521r776938o926370Q632045J4011422k559276j8721713j0739657R603763
10551C623797J5031821M045877l696474j740659o28358m132899m946956p28484
10543F827665L704363O516534P248159J728965q698313j1989146k324580Q079462
10535A1093109O835500n46538l271295k820813m122380k955140L020239M374162
10527A1606844l728758q908384p76912J0520450J0386785J921102k374881O75529
$$ plain form
10583 8282724 6639583 -195079 -5056802 8412 12326917 22253920 23851739 18122512
10575 18122512 10292543 5965876 5718645 4147346 -1032301 -3112766 2722528 8234582
10567 8234582 2943689 -8495445 -12296871 -5138391 5112300 13827722 20497330 20100521
10559 20100521 10323583 3397213 12029258 26040680 23481404 4759691 -5979966 3623797
10551 3623797 18655618 22701495 19005021 17264362 16636004 12503105 7556149 6827665
10543 6827665 10532028 17048562 24296721 26025686 17327373 5338227 3013647 11093109
10535 11093109 17928609 17382071 14110776 11289963 7167583 4212443 7232682 11606844
10527 11606844 7878086 -1030298 -1807210 8713240 19100025 21021127 18646246 19321775
10519A9321775O354965J0168527O380542o832904j6025547n994722J2269762J2850969
10511C8493367k860403p516356L874666O243098o151035p662015P300553J0056029
10503D1777904n908218p617021J3877608K0509648j932392j2636938P585988J7185879
10495G2842458l603181p998809K2965906K9197831r128000j080076R3345848J29380487
10487C25922464l1865357k62168530k91362735q3752907J09208442J05821956
10481a28196667R710611p783368L9036956L9547705o119639j7996428P565286
10474f4235544J1455275o529586M26776K4691922J9772285o476100q469221P600015
10466b1764178n26876k3177188j3363577K1573506K7271959k459834j7577107
$$ plain form
10519 19321775 25676740 35845267 42225809 35392905 19367358 13372636 25642398 38493367
10511 38493367 35632964 28116608 31991274 38234372 32083337 24421322 31721875 41777904
10503 41777904 35869686 28252665 42130273 62639921 60707529 48070591 55656579 72842458
10495 72842458 69239277 61240468 84206374 113404205 104276205 103196129 196541977 325922464
10487 325922464 294057107 31888577 -259474158 -343227065 -234018623 -128196667
10481 -128196667 -118486056 -126269424 -87232468 -47684763 -53804402 -71800830 -64235544
10474 -64235544 -52780269 -59309855 -58883079 -34191157 -14418872 -20894972 -29364193 -21764178
10466 -21764178 -22291054 -45468242 -58831819 -37258313 -9986354 -12446188 -30023295
10459c0023295r39074R898541k385534q721489M290179R979714l617484j0899349
10451c2417791J017908R016745o77164q444142m28347Q070138N014161J651066
10443a7197426N373242N462378j263030j396817P582818J0082016J360519m837087
10435E166613l962674o517592j1221814l698983J2325060J4813229J242616n830191
10427B316264J444727M198256n995112j1482190k152452P054024N358415K671016
10419C412948M136610j215671j2705685j0503411P855441J5115660j970763j7297124
10411a3171995p222445J0786586R061818m957474n718825N668750O379104p691985
10403f866466j6490305q529774N123865J0855228Q432787M490299K524784J824682
$$ plain form
10459 -30023295 -30962369 -21063828 -23449362 -32170851 -27880672 -17900958 -21518442 -32417791
10451 -32417791 -31399883 -22383138 -23060302 -31504444 -31932791 -23862653 -18848492 -17197426
10443 -17197426 -11824184 -6361806 -7624836 -9021653 -1438835 8643181 10003700 5166613
10435 5166613 1203939 -5313653 -16535467 -20234450 -7909390 6903839 8146455 2316264
10427 2316264 3760991 7959247 1964135 -9518055 -11670507 -4616483 741932 3412948
10419 3412948 7549558 6333887 -6371798 -16875209 -9019768 6095892 4125129 -13171995
10411 -13171995 -20394440 -9607854 -546036 -5503510 -11222335 -5553585 825519 -6866466
10403 -6866466 -23356771 -31886545 -26762680 -15907452 -7474665 -2984366 -459582 1365100
10395A365100o3280l596738m313972J187597O462252K492089n890542m865242
10387g222736N115171P982136j591095r553537p321085m722548p940788o202666
10379c1457148N245415J0412362m60998r019805L134525K1026812J7406290m429074
10371A1858379j6843791j0111187n26791J096992J395877L091887j886957j1610758
10363b3536349j0303453M914222J4205392M451712r166045o208013Q321171J3973794
10355c347569O642519J227160N251668Q325919J769219o427426n147191J444808
10347I739107Q30460p094533r163439k5731Q225177M150066n024600m509529M517424
10338A644402O305929m739133j4703980j0382372K810953J0832386R770727N308597
$$ plain form
10395 1365100 1301820 -2294918 -6608890 -5421293 1040959 3533048 -2357494 -7222736
10387 -7222736 -2107565 5874571 4283476 -5270061 -12591146 -17313694 -25254482 -31457148
10379 -31457148 -26211733 -15799371 -16260369 -25280174 -22145649 -1118837 16287453 11858379
10371 11858379 -4985412 -15096599 -15623390 -14526398 -13130521 -10038634 -11925591 -23536349
10363 -23536349 -33839802 -28925580 -14720188 -10268476 -19434521 -25642534 -17321363 -3347569
10355 -3347569 3294950 4522110 9773778 18099697 19868916 13441490 8294299 9739107
10347 9739107 10569567 3475034 -5688405 -5714136 2511041 6661107 1636507 -2873022 1644402
10338 1644402 7950331 3211198 -11492782 -21875154 -19064201 -8231815 1538912 6847509
10330F847509M28745n420287q749683m741790L171557N863610J178008l952101
10322e374432m572789k905874j396061J000982L071518L82304n551984n163598
10314b0509934N494500J5564655J2468262j33884p247937l572801J021622j694103
10306A390380o598068n205178J141624N122994M620727K489360o71647n522461
10298c232269q288587m131734M540339R971984Q579034K490166o257645j5127355
10290a1456067j6719421n566537J0033763J3936173L000993p972477o253373L604944
10282a7392002R795018R018445N297395J145300k309958k646339n12442q11615
10274A583802l663839j548516P548089J2355981L288211j1432972j5486321n993445
$$ plain form
10330 6847509 7276254 1855967 -6893716 -11635506 -8463949 -2600339 -1422331 -5374432
10322 -5374432 -9947221 -12853095 -14249156 -13248174 -10176656 -9794352 -15346336 -20509934
10314 -20509934 -15015434 549221 13017483 12883599 5635662 2062861 3084483 1390380
10306 1390380 -5207688 -10412866 -9271242 -4148248 472479 2961839 2290192 -3232269
10298 -3232269 -11520856 -15652590 -11112251 -1140267 7438767 9928933 3671288 -11456067
10290 -11456067 -28175488 -33742025 -23708262 -9772089 -6771096 -14743573 -20996946 -17392002
10282 -17392002 -7596984 1421461 6718856 7864156 5554198 2907859 2395417 1583802
10274 1583802 -2080037 -3628553 3919536 16275517 19563728 8130756 -7355565 -13349010
10266a3349010N070694Q012729M029429j518403n289266n762274l619611j723957
10258a4149669o99723J979037M974005K118456n884593p630832K389843J2253142
10250d650334R076922r58557k724532M132656O933753J329626m861231p004260
10242A274043p371682m739830M033039J2115056Q352157l825049q788608k183601
10234a134475L815984J816785r37953O26067l98488p329737r628953N48125J3304623
10225F81978J4439096N266255k278410l623162l615208m974877n031477k704691
10217a840496j164959l022225o556681o911261q85399P631747R335607J418712
10209a994955n716643j929456N959159L128038r006934j2946549k141564Q481303
$$ plain form
10266 -13349010 -8278316 -265587 3763842 2245439 -3043827 -8806101 -12425712 -14149669
10258 -14149669 -14849392 -12870355 -7896350 -5777894 -11662487 -19293319 -16903476 -4650334
10250 -4650334 4426588 3468031 743499 4876155 11809908 13139534 8278303 1274043
10242 1274043 -6097639 -10837469 -6804430 5310626 13662783 9837734 1049126 -1134475
10234 -1134475 2681509 4498294 3560341 4186408 3787920 -3541817 -13170770 -12622645 681978
10225 681978 15121074 20387329 18108919 14485757 10870549 5895672 864195 -1840496
10217 -1840496 -3005455 -6027680 -12584361 -19495622 -20381021 -12749274 -3413667 -1994955
10209 -1994955 -7711598 -9641054 -3681895 -553857 -9560791 -22507340 -24648904 -16167601
10201a6167601N980189j779541j143250O030544Q359769K955843m509015j0268011
10193a0541073j1810888m195806J0877638J8968419R538537n876340o689849P591249
10185G861887J6317302P105474q279183j2829056o927749l077499n700793p124544
10177a2654161j874108M732765N176392M59191k992683l426023l787270k908803
10169a7274700M160181J4238772J4457152K98798j3223078r785673M713602J0619170
10161H204224L086646m034543k924050k270851p863035j0169119j408986R054336
10153h325378Q714634O21522m430197n324815o897923o352973J685495J1113395
10145i196240J0481610J542193k738108Q61197J145323p495646j3493220m438427
$$ plain form
10201 -16167601 -10187412 -11966953 -13110203 -7079659 1280110 4235953 -273062 -10541073
10193 -10541073 -22351961 -26547767 -15670129 3298290 12836827 6960487 270638 7861887
10185 7861887 24179189 31284663 23005480 10176424 3248675 171176 -5529617 -12654161
10177 -12654161 -14528269 -9795504 -4619112 -4159921 -7152604 -10578627 -14365897 -17274700
10169 -17274700 -13114519 1124253 15581405 15880203 2657125 -7128548 -2414946 8204224
10161 8204224 11290870 7256327 4332277 2061426 -5801609 -15970728 -17379714 -8325378
10153 -8325378 389256 1010778 -3419419 -8744234 -15642157 -21995130 -20309635 -9196240
10145 -9196240 1285370 2827563 89455 950652 2095975 -5399671 -18892891 -23331318
10137b3331318J3563874K2355915J4089039j027706r093808p785373m358734l199945
10129A211944j634465K187958M184105J100207k836428k105715J068243J106011
10121D281860p78089K67647K023221j339628o340100l857444L550567L206190
10113A014224n153186n475875P747504J6090421M534880j2586590j1708205L811143
10105a725684R259265l177461j3551815n200432J1418346J4736874O24722j4652932
10097b269117j5127660j929930R849919Q602785n91942l054922M984562J0472801
10089A0936496K843174r511823j1501865k992187L962263M571537M099473L942103
10081F349171J12149m412057j389163O218169N039181o673500j3375898o287213
$$ plain form
10137 -23331318 -9767444 12588471 26677510 25649804 16555996 8770623 4411889 1211944
10129 1211944 -422521 1765437 5949542 7049749 4213321 2107606 3175849 4281860
10121 4281860 3503771 3771418 5794639 4455011 -1885089 -5742533 -2191966 1014224
10113 1014224 -4138962 -9614837 -1867333 14223088 18757968 6171378 -5536827 -1725684
10105 -1725684 7533581 4356120 -9195695 -14396127 -2977781 11759093 12383815 -2269117
10097 -2269117 -17396777 -19326707 -9476788 -874003 -1465945 -4520867 463695 10936496
10089 10936496 13779670 4267847 -7234018 -10226205 -6263942 -1692405 2407068 6349171
10081 6349171 6461320 2049263 660100 6878269 11917450 5243950 -8131948 -14419161
10073a4419161J952611j914231r438392m355071R939438J4460135L260726q874689
10065i388634r147149k464287Q73736J266490N082502J1239324J1900236M141129
10057A3503347n995490j0718792p649384p23846K846060j728199j0700707j3534901
10049c4701912m847238P864390J3562380J1653052Q948735N455241m553894j5839614
10041a2458860j1776072J0511564K7652691J7318955j0014012k3473721j2215259
10034a4454714M671639Q890079M192509J049569j744827q429070j2599563o431164
10026b4855542M261642P424902K641507K389L851892P827833N108712l872007
10018B391328j2741308j3353060k434946J1297749J3141591J746978o010290J311631
$$ plain form
10073 -14419161 -12466550 -14380781 -23819173 -28174244 -18234806 -3774671 -513945 -9388634
10065 -9388634 -18535783 -21000070 -20126334 -18859844 -13777342 -2538018 9362218 13503347
10057 13503347 7507857 -3210935 -10860319 -11584165 -8738105 -10466304 -21167011 -34701912
10049 -34701912 -39549150 -31684760 -18122380 -6469328 2479407 7934648 3380754 -12458860
10041 -12458860 -24234932 -13723368 13929323 31248278 21234266 -2239455 -14454714
10034 -14454714 -9783075 -892996 3299513 4349082 2604255 -5824815 -18424378 -24855542
10026 -24855542 -20593900 -13168998 -10527491 -10525102 -6673210 1154623 6263335 2391328
10018 2391328 -10349980 -23703040 -26137986 -14840237 -1698646 48332 -5961958 -4650327
10010d650327J0841142M363596j1540348j3402738L184393J6091174R250910o091813
10002H045989j1547532p108960m021649l949133k91909O039360P098096K584840
9994c150898J089495N160884O263894j051377q776103o274151L623030P683112
9986D567886N51541p993935p110355J9849J625422m975111r354034l111339Q254864
9977a7525212J3157141Q636612J623210j549610r72743L22385L25098j569036
9969B447845m063268l841501M58188M440570K169406n393508j0233464p122655
9961b1138387k03144K957764J635231K098581P003235R310658J655096j0378629
9953g059595j2437790j191051R022420O018572k481092k149785M301577L201941
$$ plain form
10010 -4650327 6190815 10554411 -985937 -14388675 -11204282 4886892 14137802 8045989
10002 8045989 -3501543 -10610503 -14632152 -18581285 -18873194 -12833834 -5735738 -3150898
9994 -3150898 -2061403 3099481 9363375 8311998 -464105 -6738256 -3115226 4567886
9986 4567886 5119427 -2874508 -9984863 -9965014 -8339592 -13314703 -22668737 -25780076 -17525212
9977 -17525212 -4368071 4268541 5891751 4342141 3369398 3691783 4016881 2447845
9969 2447845 -1615423 -5456924 -4998736 -558166 1611240 -3782268 -14015732 -21138387
9961 -21138387 -21341531 -18383767 -16748536 -14649955 -7646720 1663938 3319034 -7059595
9953 -7059595 -19497385 -20688436 -11666016 -5647444 -8128536 -10278321 -5976744 -2774803
9945b774803l968289j218819J2630929J7454112L788035r828275o185055K965434
9937A2863269j444163j2092794q222783P217846J1075433j537531r347041J29562
9929a358202J1826357Q727133l159827p671305k442152K633088K138560n73711
9921A0119941j266118K63878Q15775l001969r050737q938910N97486R155377N558075
9912D252798m231500n463548J432996J674023q493599j5037770q696601K673920
9904c1889281R596709J2356068J1276517L003728o681894m544902P442505J0312213
9896A0871663j533125r483161k654955K857839n782179j2681242j830177J0818313
9888i417024L674413j0297402m605188J2634080J0833907r056651j4539850K923610
$$ plain form
9945 -2774803 -6743092 -7961911 4669018 22123130 25911165 16082890 9897835 12863269
9937 12863269 11419106 -673688 -8896471 -1678625 9396808 7859277 -1487764 -1358202
9929 -1358202 10468155 19195288 16035461 8364156 5922004 8555092 10693652 10119941
9921 10119941 8853823 9117701 9933476 6931507 -2119230 -11058140 -10460654 -1305277 4252798
9912 4252798 21298 -5442250 -4009254 -2335231 -10828830 -25866600 -34563201 -31889281
9904 -31889281 -22292572 -9936504 1340013 4343741 -2338153 -6883055 559450 10871663
9896 10871663 9338538 -144623 -2799578 58261 -5723918 -18405160 -20235337 -9417024
9888 -9417024 -5742611 -16040013 -20645201 -8011121 2822786 -6233865 -20773715 -17850105
9880a7850105J4492610M773695n023027J1531K643128o553004j752527L2454955
9872B3197256N9164719L4638196k2990561n3393247l4212820j082385J0840035
9865A6161193N691718P17012k535995o141001k861852P710200J0886128k9515
9857B9597888j0365082p844667k078354n088426r447940l863854M175090J678608
9849c236737n364090k401130O939928O971119j920239m016928L956848Q041443
9841H970214K203085k785546m55047J262106j792466o67140P897489J0724694
9833B5357389p64289j3377612j1055846M75472M194742j394721l198724L061205
9825C297616P442051L935567m92179J669114P444889Q775173K420633p942057
$$ plain form
9880 -17850105 -3357495 1416200 -3606827 -3595296 -952168 -7505172 -9257699 23197256
9872 23197256 82361975 117000171 94009610 40616363 6403543 5321158 16161193
9865 16161193 21852911 22569923 20033928 13892927 11031075 18741275 29627403 29597888
9857 29597888 19232806 11388139 9309785 4221359 -5226581 -9090435 -4915345 -3236737
9849 -3236737 -8600827 -11001957 -4062029 2909090 988851 -3028077 928771 8970214
9841 8970214 11173299 8387753 7932706 9194812 7402346 6735206 14632695 25357389
9833 25357389 24593100 11215488 159642 635114 4829856 3435135 236411 3297616
9825 3297616 10739667 14675234 14183055 15852169 23297058 32072231 34492864 26550807
9817B6550807j5146617j3789633n866996J37085o85607l604962k304088J761159
9809a2948852L718880L820681M615559M565247K068832O42796K067500P01064
9801I251707n939105q491653J20941R540534O431117k564927j209925P506797
9793A4645486N332398q837075j4906935m724212M919487J631427l334070J525933
9785c747561O493397j34229q858751m657178P362165J1502432O290652J096933
9777A5347860k643631p893829q157690K944946J4815500J2373450l6017o552700
9769B0197889n456154n903567n527332L838394J2244495J874576j8610115k0288654
9761a7630468M37809J3687831L660591p328656R26486J2427018N137554r833640
$$ plain form
9817 26550807 11404190 -2385443 -8252439 -8115354 -8800961 -12405923 -14710011 -12948852
9809 -12948852 -9229972 -5409291 -793732 3771515 5840347 6483143 8550643 9251707
9801 9251707 3312602 -5179051 -5058110 4482424 10913541 8348614 7138689 14645486
9793 14645486 19977884 11140809 -3766126 -8490338 -3570851 -1939424 -5273494 -3747561
9785 -3747561 2745836 2611607 -6247144 -10904322 -3542157 7960275 14250927 15347860
9777 15347860 12704229 4810400 -3347290 -402344 14413156 26786606 26750589 20197889
9769 20197889 14741735 8838168 3310836 7149230 19393725 21268301 2658186 -17630468
9761 -17630468 -17192659 -3504828 155763 -7172893 -6246407 6180611 11318165 1484525
9753A484525q421083N232925Q925783J565129N64562O949959M623719p128761
9745A3796758j0574381j595002L299529k517777n145689J613374L517975o188518
9737c793731j0442729L039164J7285621J0696828q911260j6550419o451538M902609
9729a0225455O402348L002148O51739j772405m179689k806372J784620M347652
9721b795414L209421P38440k593102o321337n845327L60034M285359L01673k651549
9712a1311802M672455J1614030J320672j8079279j9671947J352538J7391573Q858965
9704c852795p895190q584847K822330O643233J742177K851047J0776545J0014945
9696A4517445l655428j4566911j0895784j96411N060235L960579K131550J034142
$$ plain form
9753 1484525 -6936558 -1703633 7222150 8787279 9351841 16301800 20925519 13796758
9745 13796758 3222377 1627375 4926904 2409127 -2736562 -1123188 2394787 -3793731
9737 -3793731 -14236460 -11197296 6088325 16785153 7873893 -8676526 -15128064 -10225455
9729 -10225455 -3823107 -820959 -169220 -1941625 -6121314 -8927686 -7143066 -2795414
9721 -2795414 414007 1152447 -1440655 -7761992 -13607319 -13247285 -8961926 -8660253 -11311802
9712 -11311802 -6639347 4974683 6295355 -11783924 -31455871 -30103333 -12711760 -3852795
9704 -3852795 -11747985 -20332832 -17510502 -10867269 -9125092 -6274045 4502500 14517445
9696 14517445 10862017 -3704894 -14600678 -14797089 -9736854 -5776275 -3644725 -2610583
9688b610583l00113p41500p48441m198636j0877580j2754582l541172J1700999
9680b4071608K0944138J6869812K539143j0872838j1517418K009283J5603210
9673A1503722J2781800m529880j6223805r327933N320490Q913840j31139p061460
9665A245635l013501M933559O306746K73609o760002r531921o366712J342949
9657a1569638Q215178P577686q04755q611119q364323k346757J974223K768040
9649a1161465M196754O929205N574169k052956r300731q810861j986786M480195
9641a2132476P712362Q531601N891955q67904o355931m633527K71033o69797n445597
9632g698281k095567J0490531J6336368N261787j0286286j3285560o682163m590008
$$ plain form
9688 -2610583 -2910696 -3652196 -4400637 -8599273 -19476853 -32231435 -35772607 -24071608
9680 -24071608 -3127470 13742342 16281485 5408647 -6108771 -4099488 11503722
9673 11503722 24285522 19755642 3531837 -5796096 -475606 8438234 8307095 1245635
9665 1245635 -1767866 3165693 9472439 9746048 2986046 -6545875 -12912587 -11569638
9657 -11569638 -3354460 4223226 3418471 -5192648 -13556971 -15903728 -13929505 -11161465
9649 -11161465 -6964711 -35506 5538663 3485707 -5815024 -14625885 -16612671 -12132476
9641 -12132476 -4420114 4111487 10003442 9135538 2779607 -1853920 -1582887 -2252684 -7698281
9632 -7698281 -9793848 696683 17033051 22294838 12008552 -1277008 -7959171 -12549179
9624a2549179o741228q32949J2077005J5004609J797818j1548030j0133231L1859
9616a2893326M994347L226626J844965K179647J176541L40191J704708L60362
9608B934061p333384j2591859m256408J1899911J7318375N633401q450998r172628
9600d019529J473632J0474755J1062362N926422j210029q759252j3814524j2852858
9592a1719021o823349p13743L049984O588903J0407393R904212K213871o467654
9584F440596o636101J301759N987858K20965q578437q386716R17300Q000078N300287
9575D567589l255455r487443r067755k004024P849441J2591684P016038k615505
9567E594570m549025J368979K487293o039172j1003415j191472J2319795J0230039
$$ plain form
9624 -12549179 -19290407 -20123356 -8046351 6958258 8756076 -2791954 -12925185 -12893326
9616 -12893326 -7898979 -4672353 -2827388 -647741 528800 868991 2573699 2934061
9608 2934061 -4399323 -16991182 -21247590 -9347679 7970696 13604097 5153099 -4019529
9600 -4019529 -2545897 7928858 18991220 24917642 23707613 14948361 1133837 -11719021
9592 -11719021 -18542370 -19256113 -16206129 -9617226 790167 10694379 12908250 6440596
9584 6440596 -195505 1106254 7094112 7315077 -1263360 -9650076 -8732776 -732698 4567589
9575 4567589 1312134 -8175309 -17243064 -19247088 -11397647 1194037 8210075 5594570
9567 5594570 1045545 2414524 4901817 -1137355 -12140770 -13332242 -1012447 9217592
9559I217592n995092j5296427o755501P365379J1644612O295860m40620n855630
9551A80173r149537m747031Q238173J6624484P405997j1118973j6692227k979038
9543a2237979J1351957Q575819m897204j0173322k173834P178673Q057102L194961
9535H876173j014011l539703n363611m714299o45649L158075K737138m53356j506297
9526b465540J848749P043433R146774N041631k775978p151053m388665j61203
9518F138148k117396p956163q499537k462601J607298L7484n02821L358120M585341
9509e812127m80032l317868J692253N114169j566294q694201l507994O607576
9501i964518N320997m515471n881315K143042L144799n982471q093948L626857
$$ plain form
9559 9217592 3222500 -12073927 -18829428 -11464049 180563 6476423 6035803 180173
9551 180173 -8969364 -13716395 -5478222 11146262 18552259 7433286 -9258941 -12237979
9543 -12237979 -886022 7689797 2792593 -7380729 -9554563 -2375890 5681212 8876173
9535 8876173 7862162 4322459 -1041152 -5755451 -6401100 -3243025 -505887 -959243 -2465540
9526 -2465540 -616791 6426642 15573416 20615047 17839069 10688016 6299351 6138148
9518 6138148 4020752 -3935411 -12434948 -14897549 -13290251 -13252767 -13755588 -10397468 -5812127
9509 -5812127 -6292159 -9610027 -7917774 -2803605 -4369899 -13064100 -16572094 -9964518
9501 -9964518 -4643521 -9158992 -15040307 -12897265 -9752466 -15734937 -23828885 -20202028
9493b0202028J1875831L640807q304068o938940L140015P296841M145444J141141
9485d204957j120558m247604k413277O703179J1388481K657342q126415n765432
9477e129241L954868N250823j89634J273391P880720M816296p564714j2332265
9469b039756n211280j270914o470282n940162Q558783K0073329J0493102j1581796
9461F611024k2649380j4266703K340666J3917874J4911534N635981p271019j2227065
9453a2997088m529798O007729P278000R70486k094873P25280J376497m366859
9445g630626r237157m866915N716635J1056541N893467j455019O4859P746142
9437G287927P028835o828805j8254350j1974989L691848Q728612J862498K62417
$$ plain form
9493 -20202028 -8326197 -4685390 -12989458 -19928398 -16788383 -9491542 -5346098 -4204957
9485 -4204957 -5325515 -9573119 -11986396 -5283217 6105264 8762606 636191 -5129241
9477 -5129241 -1174373 4076450 3886816 5160207 13040927 17857223 10292509 -2039756
9469 -2039756 -7251036 -8521950 -14992232 -20932394 -12373611 7699718 18192820 6611024
9461 6611024 -16038356 -30305059 -27964393 -14046519 865015 6500996 -770023 -12997088
9453 -12997088 -17526886 -11519157 -4241157 -3270671 -5365544 -4640264 -3263767 -7630626
9445 -7630626 -16867783 -21734698 -16018063 -4961522 931945 -523074 -458215 7287927
9437 7287927 14316762 7487957 -10766393 -22741382 -19049534 -10320922 -8458424 -8196007
9429h196007Q790831J1477523M54610q451686k243787O400235Q92153j0246735
9421a122863q016527M279566P029689k505172p500445j178519M488837K553115
9413a972319J280837M577743K978507o898042j2458585n641294K886096J896919
9405a3350138k769036j601162J389357o24555j864434M600464J0719969O193340
9397B693805j978183j463169K184160m249159j4303972r447911P674365J3924433
9389d965631K985597m510093L519106J0923908K895801q428255o542495J096152
9381c025910p86719o709852k306606P158413O201107r88498K338068J2414987
9373A4294990Q278756j0223228j7248664j782466J3621252Q262292o141983p723341
$$ plain form
9429 -8196007 594824 12072347 12526957 4075271 1831484 8231719 9123872 -1122863
9421 -1122863 -9139390 -4859824 2169865 -335307 -7835752 -9014271 -4525434 -1972319
9413 -1972319 -691482 3886261 6864768 -33274 -12491859 -18133153 -15247057 -13350138
9405 -13350138 -16119174 -17720336 -16330979 -16955534 -18819968 -14219504 -3499535 2693805
9397 2693805 715622 -747547 1436613 -2812546 -17116518 -26564429 -18890064 -4965631
9389 -4965631 -1980034 -6490127 -2971021 7952887 10848688 2420433 -4122062 -3025910
9381 -3025910 -3812629 -10522481 -12829087 -5670674 530433 -458065 1880003 14294990
9373 14294990 22573746 12350518 -4898146 -6680612 6940640 15202932 9060949 1337608
9365A337608J826264O124775K911504K487561N427685K359383p079257j2413163
9357B982360q966722k522135K275811O100315P835204M477858j342991l259722
9349G579978j024409m03613l443176o187433n481661j682272L729519P578794
9341F65727N617236k98197j350345M385328N051784o931389j8048633j0617358
9333b1525847Q789448J6337118M977497p670142p525303r93522J743468K344050
9325c523233M728788N408116K834197K660548M544751j778474j6455078k0986932
9317b2567317m646608J4228435J1871169o189654j4823382p196594j61913l297639
9309c2783503o147407j030951K983218j239459l968848M357704J4403925J1477200
$$ plain form
9365 1337608 3163872 9288647 12200151 14687712 20115397 22474780 15395523 2982360
9357 2982360 -5984362 -8506497 -6230686 -130371 7704833 12182691 10839700 7579978
9349 7579978 6555569 6151956 2708780 -3478653 -8960314 -10642586 -6913067 665727
9341 665727 6282963 5984766 4634421 9019749 14071533 7140144 -10908489 -21525847
9333 -21525847 -12736399 3600719 8578216 908074 -6617229 -7610751 -5867283 -3523233
9325 -3523233 1205555 6613671 9447868 12108416 16653167 14874693 -1580385 -22567317
9317 -22567317 -27213925 -12985490 -1114321 -7303975 -22127357 -29323951 -29485864 -32783503
9309 -32783503 -38930910 -39961861 -36978643 -38218102 -42186950 -37829246 -23425321 -11948121
9301a1948121o53634n189926K293674Q660262L722905o355291r263597j489994
9293b0223722J0195513J6162456J0960492j582192r552523n257716L731897L675281
9285H109486n099638q064851L24409O621583M6775q501707l225375R824992J0940645
9276A0976319j969518j0047477l315346N486261L650574k495577k175618J099186
9268A208804p72421l471885J486766R363101Q884023J205928l220755l070037
9260A1613524n605827r767764o457756L572306Q409473M453531J664086M950905
9252A2832478N848224n61949n532483k838122j144057q020573j3696604o142441
9244a9255527O288979N298807p629178j0583087O551295K5138615K1555528k329733
$$ plain form
9301 -11948121 -12601755 -17791681 -15498007 -6837745 -3114840 -9470131 -18733728 -20223722
9293 -20223722 -10028209 6134247 17094739 15512547 5960024 702308 4434205 8109486
9285 8109486 3009848 -5055003 -4730594 1890989 1937764 -6563943 -9789318 35674 10976319
9276 10976319 9006801 -1040676 -4356022 1130239 4780813 2285236 109618 1208804
9268 1208804 436383 -3035502 -1548736 7814365 16698388 17904316 14683561 11613524
9260 11613524 6007697 -3760067 -10217823 -6645517 1763956 6217487 7881573 12832478
9252 12832478 18680702 18118753 12586270 9748148 8604091 583518 -13113086 -19255527
9244 -19255527 -12966548 -7667741 -15296919 -25880006 -19328711 5809904 27365432 25035699
9236B5035699k2630276k2462873p754344N153790Q860534P987940Q124810Q311849
9228A0627129M908468j826330p835604r698218o622938j74554N299868M427168
9220h95011l021095r409046p292816P77634N425371K904201j109669o78375L035404
9211a0263402N312623M157039R65740j571641r53340K492627M153975L20485n267563
9202f53457n191953Q96942N185074K767366k108909l206061k96788K799388L610012
9193C801614J931945o31138n20774L969270Q020346N100614k777529o592353l567196
9184H734799p94332l000803n680905m701517l352071l614607J95703J0412386
9176a801347J6882851R757670m289231j0172078n123485L05697q1168j630854
$$ plain form
9236 25035699 2405423 -20057450 -27811794 -22658004 -13797470 -5809530 2315280 10627129
9228 10627129 15535597 13709267 5873663 -3824555 -10447493 -10622047 -5322179 -895011
9220 -895011 -3916106 -13325152 -20617968 -19840334 -14414963 -11510762 -12620431 -13298806 -10263402
9211 -10263402 -4950779 -793740 172000 -1399641 -2352981 139646 4293621 4614106 -653457
9202 -653457 -5845410 -4948468 236606 3003972 895063 -2310998 -2607786 191602 3801614
9193 3801614 5733559 5102421 4581647 8550917 16571263 21671877 18894348 12301995 8734799
9184 8734799 7940467 4939664 -741241 -5442758 -8794829 -12409436 -12213733 -1801347
9176 -1801347 15081504 24839174 20549943 10377865 5254380 5560077 5478909 3848055
9168C848055m69513M9273k395401m028767k386305j078137k764655l811866m76413
9159a3513729M832462P658719P218848M293765j567930q333249j0001085m470273
9151a3882472J362018Q69565j648514K323899J0475577J1280218J424515q474229
9143C730577r193969m610810k369957j715797J079804K809598m17367k909805
9135a3597726J937526O943513K57721j2465807j2627887K105662J1815337M572602
9127a1059059n608496k407053P947363J0518686O146079M446554M000502j025323
9119A2959253l963131L336104R865261o55188j9340839k0666747j368206J4355624
9111e477869J1975844M119785L971243N135517q67722p626406p341155m664864
$$ plain form
9168 3848055 3378542 3427815 1032414 -2996353 -5382658 -6460795 -9225450 -13037316 -13513729
9159 -13513729 -8681267 -1022548 6196300 10490065 8922135 588886 -9412199 -13882472
9151 -13882472 -12520454 -11650889 -13299403 -10975504 -499927 10780291 12204806 3730577
9143 3730577 -5463392 -10074202 -12444159 -14159956 -13080152 -10270554 -10687921 -13597726
9135 -13597726 -11660200 -4716687 -4458966 -16924773 -29552660 -27446998 -15631661 -11059059
9127 -11059059 -16667555 -19074608 -11127245 -608559 5537520 9984074 13984576 12959253
9119 12959253 8996122 12332226 22197487 21542299 2201460 -18465287 -19833493 -5477869
9111 -5477869 6497975 10617760 14589003 19724520 18856798 11230392 3889237 -775627
9103g75627n098651m375795K06750K642417J509135M260153R598059M621325r899540
9094B688226j3108525K503535J3817615K569966j3607809r789736N886698R005285
9086c4745O88977P51429R183133P958359l355881o947383j193338l069956j3017737
9077i037142j0366993P835179J5441965q98980j6919969p623792J3753003J7144553
9069I327824N55849j1082076m583742O480742N491234n403234j1752955n857199
9061a6823557N377560R047060J092438q805913r631257l315407J40955p25555
9053b3643676K138436J0132069J3054750M759774o538442r439728k985602N714977
9045f807442J0286724P652844q26574p468993n132172J686338J622424n614624
$$ plain form
9103 -775627 -5874278 -10250073 -10043323 -7400906 -5891771 -1631618 7966441 12587766 2688226
9094 2688226 -10420299 -7916764 5900851 8470817 -5136992 -14926728 -9040030 -34745
9086 -34745 654232 1405661 10588794 18547153 15191272 8243889 7050551 3980595 -9037142
9077 -9037142 -19404135 -11568956 3873009 2974029 -13945940 -21569732 -7816729 9327824
9069 9327824 9883673 -1198403 -5782145 698597 6189831 786597 -10966358 -16823557
9061 -16823557 -11445997 -2398937 -1306499 -10112412 -19743669 -23059076 -22918121 -23643676
9053 -23643676 -21505240 -11373171 1681579 6441353 -97089 -9536817 -12522419 -6807442
9045 -6807442 3479282 11132126 10305552 2836559 -2295613 -609275 1013149 -4601475
9037d601475p625650L14310O417048J495749n529445k112488P816624J0941013
9029G115686N089259m16717j304993k488059o111832o758471j244081M793367
9021a325841M162651k186672o275186k838783M044230N331482j728210r281658
9013a0097987q602179j352633L900853M045129L251882L734617L106277J251485
9005g62556J133052J693890j046251m649544k309354L816563L294715m659538
8997c489023p129205J764642R301848L637031o777216o304208M097620J0589830
8989E691319Q122573L764565J709797n60816k119072J501825P037172M944670
8981C0092033m930497j0732807o025764N92583o44442o032122n535004J390701
$$ plain form
9037 -4601475 -12227125 -11912815 -5495767 -4000018 -9529463 -11641951 -3825327 7115686
9029 7115686 12204945 11788228 10483235 7995176 1883344 -4875127 -6119208 -1325841
9021 -1325841 2836810 650138 -5625048 -8463831 -4419601 911881 -816329 -10097987
9013 -10097987 -18700166 -20052799 -16151946 -12106817 -8854935 -5120318 -2014041 -762556
9005 -762556 370496 2064386 1018135 -3631409 -5940763 -2124200 1170515 -3489023
8997 -3489023 -10618228 -8853586 448262 4085293 -2691923 -8996131 -4898511 5691319
8989 5691319 13813892 17578457 19288254 18727438 16608366 18110191 25147363 30092033
8981 30092033 25161536 14428729 8402965 8995548 8351106 2318984 -3216020 -1825319
8973a825319N751415K276327m796832r015368q912095o677024l870928p36290
8965b7806114K267120M196299M439313L197622J620484J267988K301815K518255
8957e997218J55857k385694q15233M038582N819031K187887l39297L163386N935160
8948A1762461n79361j0148462q280889M403552J0797623L850662k295328K738249
8940A2248507O626632l685463j5801477r722897P349176R701919n903322j4429899
8932a3616824j955223J3997778J3421822J860433m291638l755981n651563j0305716
8924a0296912j0483369n046248J308713O854095J1260409J0560284L010845m896450
8916B271367o484148m002148k640046j523922J870117M727268M277209L950071
$$ plain form
8973 -1825319 3926096 6202423 1405591 -7609777 -16521872 -23198896 -27069824 -27806114
8965 -27806114 -25538994 -21342695 -16903382 -13705760 -12085276 -10817288 -8515473 -5997218
8957 -5997218 -5841361 -8227055 -9042288 -5003706 815325 3003212 2663915 5827301 11762461
8948 11762461 11183100 1034638 -7246251 -2842699 7954924 11805586 9510258 12248507
8940 12248507 18875139 15189676 -611801 -10334698 -2985522 6716397 813075 -13616824
8932 -13616824 -15572047 -1574269 11847553 13707986 9416348 5660367 8804 -10296912
8924 -10296912 -20780281 -25826529 -24517816 -17663721 -6403312 4156972 7167817 2271367
8916 2271367 -4212781 -8214929 -10854975 -12378897 -10508780 -5781512 -1504303 2445768
8908B445768O132952N309866k712708j0953209j0371572l662569l0149n72475
8900a4414096Q43328N094771O220298J316799n751394r661728p294954J033410
8892b2613566R105270Q419046P467l597316M440636J3048319Q151743n971488
8884A0990111j2132698l955176P641538J0802290M987088l373403q153849n755733
8876A050168J810124N480841j692205j3502383j6148448n673686P299823J1646495
8868i729271P632241K230067j216480m048524o345263n216807J63268N028091
8860a1502678L850647j769046m495989j968432l560j226509J184828J0070901
8852e859838J3729553K734810j0182513o105619Q556092R866923m349661j0057970
$$ plain form
8908 2445768 8578720 13888586 11175878 222669 -10148903 -13811472 -13841621 -14414096
8900 -14414096 -13570768 -8475997 -2255699 -938900 -6690294 -16352022 -23646976 -22613566
8892 -22613566 -13508296 -5089250 -5081783 -8679099 -4238463 8809856 16961599 10990111
8884 10990111 -1142587 -5097763 2543775 13346065 18333153 14959750 6805901 1050168
8876 1050168 2860292 8341133 6648928 -6853455 -23001903 -28675589 -21375766 -9729271
8868 -9729271 -2097030 133037 -1083443 -5131967 -11477230 -16694037 -16530769 -11502678
8860 -11502678 -7652031 -9421077 -13917066 -15885498 -15889058 -17115567 -15930739 -5859838
8852 -5859838 7869715 10604525 422012 -5683607 2872485 12739408 8389747 -1668223
8844a668223K119405J0422946n23889j3507697r287070J523269O98087n079501
8836a5302673o19045P185002L920132k750213J616245P237899k605864j5171167
8828a6489684o001482J4825106J4428691p262548j5870551m53260J0001847r47362
8820g769243j0169575R21942J3268496O080092o319690k325979Q179082L828722
8812E693847q899806p849672O124884J2303692M518385l703535m120875j489345
8804B577575P25623L081864J606080o356608j1566450m700798N623562L783965
8796e225187p596379j1208849j987664P382547Q247443O094355N850361K545016
8788D101643p119370j5055570j1036385L788277J7241952J7888622N691551p807674
$$ plain form
8844 -1668223 451182 10874128 10350239 -3157458 -12444528 -10921259 -10223172 -15302673
8836 -15302673 -15921718 -8736716 -4816584 -7566797 -5950552 1287347 -1318517 -16489684
8828 -16489684 -22491166 -7666060 6762631 -499917 -16370468 -16823728 -6821881 -7769243
8820 -7769243 -17938818 -17016876 -3748380 2331712 -3987978 -6313957 1865125 5693847
8812 5693847 -3205959 -11055631 -4930747 7372945 11891330 8187795 4066920 2577575
8804 2577575 3303198 6385062 7991142 1634534 -9931916 -14632714 -9009152 -5225187
8796 -5225187 -12821566 -24030415 -26018079 -18635532 -10388089 -4293734 1556627 4101643
8788 4101643 -3017727 -18073297 -29109682 -25321405 -8079453 9809169 15500720 7693046
8780G693046j1680357p799766n421061m684928K788758J4393812J3775646l386504
8772E678646j6988533j0265577M388562N676850k795528j568595R991096J3705871
8764G822792M963911p19573L652314N742161j351028n909183J13839M983171l032296
8755A6266108j5115325j5899267o308298K300705P344975J2731978J4064609L275326
8747A8660811j3408968j8067166n188037R070842Q073073l353410o687844M402094
8739f498605J5477159J0873164n289373j4471851p583527M923919Q555043K060963
8731H046892n999027j0676535j2246208r424253j282245O052682M962880j279237
8723b1845051j517866O499939J1946488O539804m268985r915043p499068j677784
$$ plain form
8780 7693046 -3987311 -11787077 -17208138 -21893066 -19104308 -4710496 9065150 5678646
8772 5678646 -11309887 -21575464 -17186902 -11510052 -14305580 -15874175 -5883079 7822792
8764 7822792 12786703 12067130 15719444 21461605 20110577 14201394 14315233 19298404 16266108
8755 16266108 1150783 -14748484 -21056782 -18756077 -11411102 1320876 15385485 18660811
8747 18660811 5251843 -12815323 -18003360 -8932518 -859445 -4212855 -10900699 -6498605
8739 -6498605 8978554 19851718 14562345 90494 -7493033 -2569114 5985929 8046892
8731 8046892 2047865 -8628670 -20874878 -30299131 -31581376 -25528694 -20565814 -21845051
8723 -21845051 -23362917 -16862978 -4916490 1623314 -2645671 -12560714 -20059782 -21737566
8715b1737566K525474L115623J898898L634922R277430J0537856j21784j3869709
8707d738856j2396314N493487J8105422J0373040m258713m881302N182943O081663
8699A8961370n316495j1217212k990684N093597k75727j0716188j0771930r83055
8691a8216324O839378R033222J0838446J2426971Q079466j621858q764666j0003467
8683H611168r206548p561019j902384N099398M632960l831142q627743k930983
8675a5716293M296807K896155k051242L88320P860802Q354040J70844n224383
8667I75050j355491L985688J277320p603716j3146568r562600M51637Q370907
8659a6607773O821259j985045o512293j29473Q416398P211620k5358K17518Q286874
$$ plain form
8715 -21737566 -19212092 -16096469 -14197571 -10562649 -1285219 9252637 9130853 -4738856
8707 -4738856 -17135170 -11641683 6463739 16836779 12578066 7696764 12879707 18961370
8699 18961370 13644875 2427663 -563021 4530576 4254849 -6461339 -17233269 -18216324
8691 -18216324 -11376946 -2343724 8494722 20921693 29001159 27379301 18614635 8611168
8683 8611168 -595380 -8156399 -10058783 -4959385 -326425 -4157567 -12785310 -15716293
8675 -15716293 -11419486 -8523331 -10574573 -10186253 -2325451 6028589 6199433 975050
8667 975050 -380441 3605247 4882567 -2721149 -15867717 -25430317 -24978680 -16607773
8659 -16607773 -9786514 -11771559 -18283852 -18413325 -9996927 -2785307 -2810665 -2593147 5693727
8650E693727R657703j303725j1545420r356942J65393P454765J2337787J5763788
8642B8867076J1210308k962652j3976154j1425536l857579m002454p166265j716845
8634e030101P009486M090190p651290r958965L99816N592661l375699j1488100
8626b0412002m790231O832982O324007l307849m671567O924317J7078038J2680305
8618A6658000k146304j2671227r779343K360088J1418677Q692329k739309j1729059
8610F3852j0906403k899632M910156Q081323O594645K516784j614664m227865
8602B518196n714323o670977o139144m003092k835709l236274l14372Q732435
8594a7663260J6106983J1471134j908104r192964m113204L153239K228854l473450
$$ plain form
8650 5693727 15351430 14047705 2502285 -6854657 -6689264 765501 13103288 28867076
8642 28867076 40077384 37114732 23138578 11713042 7855463 3853009 -3313256 -5030101
8634 -5030101 1979385 6069575 -1581715 -11540680 -11140864 -5548203 -8923902 -20412002
8626 -20412002 -25202233 -18369251 -12045244 -15353093 -20024660 -13100343 3977695 16658000
8618 16658000 14511696 1840469 -7938874 -5578786 5839891 14532220 11792911 63852
8610 63852 -10842551 -13742183 -8832027 -750704 5843941 8360725 6746061 2518196
8602 2518196 -3196127 -9867104 -16006248 -20009340 -22845049 -26081323 -26395695 -17663260
8594 -17663260 -1556277 9914857 8006753 -1186211 -5299415 -2146176 82678 -3390772
8586c390772n492614l982791l678416k872242L060550J0460868J0106083R75742
8578E186408p351744p612111l223228j150820j989965j273307K329420M709090
8570a0376257K422951j998734l127946r0283K240166P15483q39113K558385Q441750
8561e3598R455326L903006k053446l630205l118179m170804n719737m989338k437019
8552a2813994n5865J963869L506018K701710l80980j159996L697592R660115Q517338
8543A5635807p17178r481353r953560m548009j994027n072305o641482k51907
8535b3024014R035556J0476932L375348j257554K424474N641730m86510r086516
8527b900554p518283J875896N018400j006511l358900M953234J3057559R050295
$$ plain form
8586 -3390772 -8883386 -12866177 -16544593 -19416835 -16356285 -5895417 4210666 5186408
8578 5186408 -2165336 -9777447 -13000675 -14151495 -16141460 -17414767 -15085347 -10376257
8570 -10376257 -7953306 -9952040 -13079986 -13170269 -10930103 -10214620 -11053733 -8495348 -53598
8561 -53598 9401728 13304734 11251288 7621083 4502904 332100 -5387637 -10376975 -12813994
8552 -12813994 -12869859 -10905990 -7399972 -4698262 -5079242 -6239238 -2541646 7118469 15635807
8543 15635807 14918629 5437276 -4516284 -9064293 -11058320 -16130625 -22772107 -23024014
8535 -23024014 -13988458 -3511526 -136178 -1393732 1030742 6672472 6185962 -2900554
8527 -2900554 -10418837 -8542941 -3524541 -4531052 -7889952 -2936718 10120841 19171136
8519A9171136k407818q369510n328860L46948L625664L910394J466943j749966
8511A0664931j477216K564267M200472J76946l789490k705064j221749m539547
8503C873550p174862j625847O821130O314405l116394r751968p973368l535733
8495a6169087n80788L814493R308274Q865321R25679n514419m214155p30550j241306
8486e536538j546395L527231P520028J191223j0128356j1205665O69043J0073587
8478e435842M574337q220522j1879965l212307N471220L917263m328680q765915
8470b7880411m426235M946485J1943851J1029968K353754p174749r319483l555714
8462b2082534K248931K606973J439437M008220O890978L705749k334143j638957
$$ plain form
8519 19171136 16763318 8393808 3064948 3411896 7037560 10947954 12414897 10664931
8511 10664931 9187715 11751982 15952454 16129400 12339910 9634846 8413097 3873550
8503 3873550 -3301312 -4927159 1893971 8208376 5091982 -4659986 -12633354 -16169087
8495 -16169087 -16749875 -12935382 -3627108 5238213 6163892 649473 -3564682 -4295232 -5536538
8486 -5536538 -7082933 -3555702 3964326 5155549 -4972807 -16178472 -15509429 -5435842
8478 -5435842 -861505 -9082027 -20961992 -24174299 -18703079 -14785816 -19114496 -27880411
8470 -27880411 -32306646 -27360161 -15416310 -4386342 -2032588 -9207337 -18526820 -22082534
8462 -22082534 -19833603 -17226630 -15787193 -11778973 -4887995 -1182246 -3516389 -5155346
8454e155346N842693Q428205n6581j0031845r046749J894248J1265823J1217727
8446A4358175K793947q600310j6547027j5682242o668466K646642N546714L710905
8438a8441662K654341L583780M136163L466550J904161q47289k962464o16776
8430g123196M704134N240064p95477l467206L785421J0783179M272066j0471299
8422F927686j5820249p134969K835057M992799M336917O416160P621797M714240
8414A4889438J945316J909746l54223o994811j0433398m814520L276471L725015
8406C149034l207382r054200q462990k520283M466772O832848J770982m420631
8398a1445850j679368P944855R493694k915031j4055675q384340O330575J0164913
$$ plain form
8454 -5155346 687347 9115552 9058971 -972874 -10019623 -8125375 3140448 14358175
8446 14358175 17152122 8551812 -7995215 -23677457 -30345923 -27699281 -22152567 -18441662
8438 -18441662 -15787321 -12203541 -8067378 -4600828 -2696667 -3543956 -6506420 -7123196
8430 -7123196 -2419062 2821002 2025525 -1441681 2343740 13126919 17398985 6927686
8422 6927686 -8892563 -16027532 -13192475 -8199676 -3862759 2553401 10175198 14889438
8414 14889438 16834754 18744500 18390277 11395466 962068 -3852452 -575981 3149034
8406 3149034 -58348 -9112548 -17575538 -20095821 -15629049 -8796201 -7025219 -11445850
8398 -11445850 -13125218 -5180363 4313331 1398300 -12657375 -21041715 -14711140 -4546227
8390d546227p7211q572652m993507L777050P776049O476569L464635o58275n289949
8381b643518p514370o657126n221655l389040J070093O282690O992861L414711
8373g665354J847980M313542N132125O77620m670354n767535l569392j455105
8365a1156473l78302m19002j752304k284707r9941J287886k317478n899964n44990
8356b3565275J0138333J1879561J796167o056393l879095k452859q969890r809171
8348c0918622O255588K1978862J3595639q835663j1404984J2737987L0834416
8341C4243223J7602128j0284953k1769381j3162328k910460Q13217M581177Q658173
8333A7770796M108583q135851j3611535m797771P894086J1383866O096782P18861
$$ plain form
8390 -4546227 -4623438 -13196090 -18189597 -14412547 -6636498 -159929 3304706 2646431 -2643518
8381 -2643518 -10157888 -16815014 -22036669 -25425709 -24355616 -18072926 -11080065 -7665354
8373 -7665354 -5817374 -1503832 3628293 4305913 -364441 -6131976 -9701368 -11156473
8365 -11156473 -11534775 -11953777 -13706081 -15990788 -16090729 -14802843 -17120321 -23020285 -23565275
8356 -23565275 -13426942 -1547381 248786 -5807607 -9686702 -12139561 -21109451 -30918622
8348 -30918622 -24663034 -2684172 10911467 2075804 -9329180 3408807 34243223
8341 34243223 51845351 41560398 19791017 6628689 3718229 4531446 9112623 17770796
8333 17770796 21879379 13743528 131993 -4665778 3228308 14612174 20708956 21427817
8325B1427817j241363k399328l856756l869371k647861k875038m858869m913952
8317e234721m77390M953262M733978k562331j0151681j0522163l991862L214369
8309b0038539P272875Q391857O029129m49149o433922n517868K71647K340396
8301h133574k20985J256125Q540682J0565676J943935n116682N49405R495101
8293A8879683O069505o155344j1127848o622526m118948n342045m49736R363933
8285D96674R691224j378735o755861J711140R043960K852636n628769j886290
8277H145979O522639L623952p729453j1847797n687718L74258J843267K330181
8269b424692P13709n949507r620445j07496J4139652J3402201l048443j3154823
$$ plain form
8325 21427817 20186454 17787126 13930370 10060999 7413138 4538100 -320769 -5234721
8317 -5234721 -5712111 -758849 3975129 1412798 -8738883 -19261046 -23252908 -20038539
8309 -20038539 -12765664 -4373807 1655322 1206173 -5227749 -10745617 -10473970 -8133574
8301 -8133574 -8354559 -7098434 1442248 12007924 13951859 8835177 9384582 18879683
8293 18879683 24949188 18793844 7665996 1043470 -3075478 -8417523 -8867259 496674
8285 496674 10187898 8809163 2053302 3764442 12808402 15661038 10032269 8145979
8277 8145979 14668618 18292570 10563117 -1284680 -6972398 -6598140 -4754873 -2424692
8269 -2424692 -1710983 -7660490 -17280935 -17388431 -3248779 10153422 7104979 -6049844
8261f049844l862290J1046922J3123353L643513m750204p969295r607715r180851
8253a3606411l935372K611275M634500L421066M230632O512956N187278j44636
8245H911288m241809l542308Q24756N873111Q060650M156897m024388q202904
8237G815293l069708M535893L022581p376271j3240805o062227N427434P214195
8229a733615l74196m048397J833585O541262L15988q684745n986562N438277P960779
8220A262376k961824r990207m49991J2939752J0951396l414993j1431523p279774
8212a0374788k338741l283087l810062M15152M770085O648794Q735542Q499774
8204I262669j11751j0893035q426320O917902J4742854M413049q586572q000570
$$ plain form
8261 -6049844 -9912134 1134788 14258141 17901654 13151450 5182155 -4425560 -13606411
8253 -13606411 -17541783 -14930508 -10296008 -6874942 -2644310 3868646 9055924 8911288
8245 8911288 4669479 1127171 1951927 7825038 15885688 20042585 16018197 7815293
8237 7815293 4745585 9281478 12304059 4927788 -8313017 -14375244 -8947810 -1733615
8229 -1733615 -2107811 -6156208 -4322623 2218639 2534627 -6150118 -12136680 -6698403 1262376
8220 1262376 -1699448 -11689655 -12139646 800106 11751502 8336509 -3095014 -10374788
8212 -10374788 -12713529 -15996616 -19806678 -19391526 -14621441 -7972647 762895 9262669
8204 9262669 9150918 -1742117 -10168437 -3250535 11492319 15905368 7318796 -681774
8196f81774r84897j170139l718861K533559J0546132N813437o107278o891833
8188f61654L049828M469626q191146j7026273q747064P107275J5258395J3304277
8180H563264N871099m414065j2000778q693847K390011O132584k643587r654100
8172a4449419l210635P687331R307518M448983L031643K465089m911516j2395120
8164h026126o574855Q382216J3301406K086348j0170846j0754798m676017m31710
8156a6864382L956423J0791506J1589387l98319j4489098j3680369J584241J3449421
8148d061190J0164027j705833j0040540j1293618p753855m97850P616859Q933511
8140h638489K01879q871513n947591O145062J1925757N002496l251164j719301
$$ plain form
8196 -681774 -1666671 -2836810 -6555671 -4022112 6524020 12337457 6230179 -661654
8188 -661654 2388174 6857800 -1333346 -18359619 -27106683 -19999408 -4741013 8563264
8180 8563264 14434363 10020298 -1980480 -10674327 -8284316 -2151732 -4795319 -14449419
8172 -14449419 -17660054 -9972723 -665205 3783778 6815421 9280510 4368994 -8026126
8164 -8026126 -14600981 -6218765 7082641 9168989 -1001857 -11756655 -16432672 -16864382
8156 -16864382 -12907959 -2116453 9472934 9074615 -5414483 -19094852 -17510611 -4061190
8148 -4061190 6102837 4397004 -5643536 -16937154 -24691009 -25188859 -17572000 -8638489
8140 -8638489 -8436610 -17308123 -23255714 -17110652 -5184895 -182399 -3433563 -5152864
8132e152864L955699K400782l484401j114196R375185J2180741o83317j5552907
8124A924722j5009922r30614J0151270R313010K538822j703471j863551J39387
8116D559653K834600L393697j000971p246244p862216j455849L981499J789324
8108a006507m590424p801931o522681l693733Q20316Q265156J3722053R383853
8100H576102l336478j2077117p757590M001862R832263M120611o406655j1774307
8092a4821309q457873o05688M952321M509393N46868q35933K880637O967986N530869
8083F67271R6811k199039O48542K022956k975454q550498n587951M218936R140201
8074b518225L605026l641904k390560L554849J850447r101556j5957759q991425
$$ plain form
8132 -5152864 -1197165 1203617 -2280784 -3394980 5980205 18160946 17477629 1924722
8124 1924722 -13085200 -14015814 -3864544 5448466 7987288 6283817 4420266 4559653
8116 4559653 7394253 10787950 9786979 2540735 -5321481 -6777330 -2795831 -1006507
8108 -1006507 -5596931 -13398862 -19921543 -23615276 -22794960 -14529804 -807751 8576102
8100 8576102 5239624 -6837493 -14595083 -10593221 -760958 3359653 -3047002 -14821309
8092 -14821309 -23279182 -23884870 -18932549 -14423156 -13876288 -14712221 -11831584 -4863598 667271
8083 667271 764082 -1434957 -786415 1236541 -1738913 -10289411 -15877362 -11658426 -2518225
8074 -2518225 1086801 -2555103 -4945663 -1390814 459633 -8641923 -24599682 -33591107
8066c3591107L331124O097601m01583j283939J0227545K1285205J6388447j240671
8058B0812622j3498373r663705K947049J0110619N817014m703090j1821650r890006
$$ plain form
8066 -33591107 -30259983 -24162382 -24563965 -25847904 -15620359 5664846 22053293 20812622
8058 20812622 7314249 -2349456 597593 10708212 16525226 11822136 486 -9889520
$$ [...]
##END NTUPLES=NMR SPECTRUM
##END=
