##TITLE=31Pdec_SR62_mat
 CDCl3, 24 sc
 2.2.2021
##JCAMPDX= 6.0         $$ Bruker NMR JCAMP-DX V2.0
##DATA TYPE= NMR SPECTRUM
##DATA CLASS= NTUPLES
##ORIGIN= UXNMR, Bruker Analytische Messtechnik GmbH
##OWNER= root
$$ XWIN-NMR		Version 3.5
$$ Tue Feb  2 13:21:43 2021 Russian Standard Time (UT+4h)  she@DPX200
##.OBSERVE FREQUENCY= 81.013821
##.OBSERVE NUCLEUS= ^31P
##.ACQUISITION MODE= SIMULTANEOUS
##.ACQUISITION SCHEME= undefined
##.AVERAGES= 24
##.DIGITISER RES= 17
##SPECTROMETER/DATA SYSTEM= spect
##.PULSE SEQUENCE= zgpg30
##.SOLVENT NAME= CDCl3
##.SHIFT REFERENCE= (INTERNAL, CDCl3, 0, 182.463)
##AUDIT TRAIL= $$ (NUMBER, WHEN, WHO, WHERE, WHAT)
$$ ##TITLE= Audit trail, XWIN-NMR		Version 3.5
$$ ##JCAMPDX= 5.01
$$ ##ORIGIN= Bruker BioSpin GmbH
$$ ##OWNER= she
$$ F:/spectra/data/she/nmr/P31/1/pdata/1/auditp.txt
$$ ##AUDIT TRAIL=  $$ (NUMBER, WHEN, WHO, WHERE, WHAT)
(   1,<2021-02-02 13:19:06.15 +0400>,<she>,<DPX200>,
      <created by zg, POWCHK disabled, PULCHK disabled
       configuration hash MD5:
       00 E9 B6 7A A2 85 ED C7 34 08 36 98 17 FE 4E 26
       data hash MD5: 32K
       F4 4D A0 3D 76 5D DE 39 7C F9 3F 1A 63 24 57 8B>)
(   2,<2021-02-02 13:19:08.71 +0400>,<she>,<DPX200>,
      <Start of raw data processing
       efp BC_mod = 2 LB = 1 FT_mod = 6 PKNL = 1 PHC0 = -1744.483 PHC1 = -24.39859 SI = 64K 
       data hash MD5: 64K
       5D 6E 1E 6D E5 A9 7F DA 73 D8 70 3A 5B 9F 04 36>)
(   3,<2021-02-02 13:19:30.46 +0400>,<she>,<DPX200>,
      <pk PHC0 = 48.43719 PHC1 = 0 
       data hash MD5: 64K
       26 80 89 DD 9D F9 9E B8 70 6A CC 06 D3 3A 2E BB>)
(   4,<2021-02-02 13:20:18.59 +0400>,<she>,<DPX200>,
      <pk PHC0 = 79.74042 PHC1 = -214.8002 
       data hash MD5: 64K
       8A 5E 67 42 BC A8 22 B5 4F D3 F1 75 FA 25 C4 68>)
(   5,<2021-02-02 13:20:58.03 +0400>,<she>,<DPX200>,
      <pk PHC0 = -321.6226 PHC1 = 879.6008 
       data hash MD5: 64K
       E0 F7 A0 72 DD 1C 54 74 AD 0E BE D4 0B 4E 9D 7B>)
(   6,<2021-02-02 13:21:02.14 +0400>,<she>,<DPX200>,
      <abs ABSG = 5 
       data hash MD5: 64K
       0C 63 81 11 0D 8E 3F D0 09 D3 D0 9C 7B EB C3 FA>)
$$ ##END=
$$ 
$$ hash MD5
$$ 8A 8A 42 AD 79 08 79 49 1D C2 22 DF E0 85 3F 33
##$RELAX= 
##$RELAX= 
##$RELAX= 
##$RELAX= 
##$RELAX= 
##$RELAX= 
##$RELAX= 
##$RELAX= 
$$ Bruker specific parameters
$$ --------------------------
##$DU= <F:/spectra>
##$EXPNO= 1
##$NAME= <P31>
##$PROCNO= 1
##$TYPE= <nmr>
##$USER= <she>
##$AMP= (0..31)
100 100 100 100 100 100 100 100 100 100 100 100 100 100 100 100 100 100 
100 100 100 100 100 100 100 100 100 100 100 100 100 100 
##$AQSEQ= 0
##$AQ_mod= 1
##$AUNM= <au_zg>
##$AUTOPOS= <>
##$BF1= 81.014009
##$BF2= 200.13
##$BF3= 200.13
##$BF4= 200.13
##$BF5= 200.13
##$BF6= 200.13
##$BF7= 200.13
##$BF8= 200.13
##$BYTORDA= 1
##$CFDGTYP= 0
##$CFRGTYP= 5
##$CHEMSTR= <none>
##$CNST= (0..31)
1 1 145 1 1 1 1 1 1 1 1 1 1 1 1 1 1 1 1 1 1 1 1 1 1 1 1 1 1 1 1 1 
##$CPDPRG= <waltz16>
##$CPDPRG1= <>
##$CPDPRG2= <waltz16>
##$CPDPRG3= <>
##$CPDPRG4= <mlev>
$$ [...]
##$SUBNAM3= <"">
##$SUBNAM4= <"">
##$SUBNAM5= <"">
##$SUBNAM6= <"">
##$SUBNAM7= <"">
##$SUBNAM8= <"">
##$SUBNAM9= <"">
##$SW= 369.568048894756
##$SWIBOX= (0..15)
0 1 3 0 0 0 0 0 0 0 0 0 0 0 0 0 
##$SW_h= 29940.119760479
##$TD= 32768
##$TD0= 1
##$TE= 0
##$TE2= 300
##$TE3= 300
##$TEG= 300
##$TL= (0..7)
0 120 53 12 22 120 120 120 
##$TP= (0..7)
150 150 150 150 150 150 150 150 
##$TP07= 0
##$TPNAME0= <>
##$TPNAME1= <>
##$TPNAME2= <>
##$TPNAME3= <>
##$TPNAME4= <>
##$TPNAME5= <>
##$TPNAME6= <>
##$TPNAME7= <>
##$TPOAL= (0..7)
0.5 0.5 0.5 0.5 0.5 0.5 0.5 0.5 
##$TPOFFS= (0..7)
0 0 0 0 0 0 0 0 
##$TUNHIN= 0
##$TUNHOUT= 0
##$TUNXOUT= 0
##$USERA1= <user>
##$USERA2= <user>
##$USERA3= <user>
##$USERA4= <user>
##$USERA5= <user>
##$V9= 5
##$VALIST= <valist>
##$VCLIST= <CCCCCCCCCCCCCCC>
##$VD= 0
##$VDLIST= <DDDDDDDDDDDDDDD>
##$VPLIST= <PPPPPPPPPPPPPPP>
##$VTLIST= <TTTTTTTTTTTTTTT>
##$WBST= 1024
##$WBSW= 4
##$XGAIN= (0..3)
0 0 0 0 
##$XL= 0
##$YL= 0
##$YMAX_a= 9974
##$YMIN_a= -24400
##$ZGOPTNS= <>
##$ZL1= 120
##$ZL2= 120
##$ZL3= 120
##$ZL4= 120
##$ABSF1= 182.463
##$ABSF2= -187.1042
##$ABSG= 5
##$ABSL= 3
##$ALPHA= 0
##$AQORDER= 0
##$ASSFAC= 0
##$ASSFACI= 0
##$ASSFACX= 0
##$ASSWID= 0
##$AUNMP= <proc_1d>
##$AZFE= 0.1
##$AZFW= 0.5
##$BCFW= 0
##$BC_mod= 2
##$BYTORDP= 0
##$COROFFS= 0
##$CY= -3
##$DATMOD= 1
##$DC= 0
##$DFILT= <>
##$DTYPP= 0
##$F1P= 0
##$F2P= 0
##$FCOR= 1
##$FTSIZE= 65536
##$FT_mod= 6
##$GAMMA= 0
##$GB= 0
##$INTBC= 1
##$INTSCL= 5.30512e-09
##$ISEN= 30
##$LB= 1
##$LEV0= 0
##$LPBIN= 0
##$MAXI= 10000
##$MC2= 0
##$MEAN= 0
##$ME_mod= 0
##$MI= 50
##$NCOEF= 0
##$NC_proc= -8
##$NLEV= 6
##$NOISF1= 182.463
##$NOISF2= 159.3651
##$NSP= 0
##$NTH_PI= 0
##$NZP= 0
##$OFFSET= 182.463
##$PC= 4
##$PHC0= -1937.929
##$PHC1= 640.402
##$PH_mod= 1
##$PKNL= yes
##$PPARMOD= 0
##$PSCAL= 0
##$PSIGN= 0
##$REVERSE= no
##$SF= 81.014009
##$SI= 65536
##$SIGF1= 159.3651
##$SIGF2= -187.1042
##$SINO= 113.3802
##$SIOLD= 16384
##$SREGLST= <1H.CDCl3>
##$SSB= 0
##$STSI= 65536
##$STSR= 0
##$SW_p= 29940.119760479
##$SYMM= 0
##$S_DEV= 0
##$TDeff= 32768
##$TDoff= 0
##$TI= <>
##$TILT= no
##$TM1= 0
##$TM2= 0
##$TOPLEV= 0
##$USERP1= <user>
##$USERP2= <user>
##$USERP3= <user>
##$USERP4= <user>
##$USERP5= <user>
##$WDW= 1
##$XDIM= 65536
##$YMAX_p= 468452651
##$YMIN_p= -63009543
$$ End of Bruker specific parameters
$$ ---------------------------------
##NTUPLES= NMR SPECTRUM
##VAR_NAME=  FREQUENCY,     SPECTRUM/REAL,   SPECTRUM/IMAG
##SYMBOL=    X,             R,               I
##VAR_TYPE=  INDEPENDENT,   DEPENDENT,       DEPENDENT
##VAR_FORM=  AFFN,          ASDF,            ASDF
##VAR_DIM=   65536,         65536,           65536
##UNITS=     HZ,            ARBITRARY UNITS, ARBITRARY UNITS
##FACTOR=    0.456856943014862, 1,           1
##FIRST=     14782.0589164895, 0,            0
##LAST=      -15158.0608439895, 0,           0
##MIN=       -15158.0608439895, -63009543,   0
##MAX=       14782.0589164895, 468452651,    0
$$ Real data points
##PAGE= N=1
##DATA TABLE= (X++(R..R)), XYDATA
$$ [...]
44044H670812r19898q58444M75045j447369m908791l751748K250688N009760n18707
44035D001348p812699p253663J56095M497646J492519k024104Q87943P187726
44027A132811Q974631M467250j176510l832297m122644l619828k089568K30314
44019c5841J270448K78091k21280J633009K887350p30712p374593r330648k735494
44010a4359670O230962Q365681K747908l159151l894416j512106J00414J127550
44002d352828K996483L719247M78816n140600q519007p690165m609259j706572
43994b4823885P4850R00941K283694O232143J1480089J2591639O377008k597360
43986A2519119o891749n006608j195449J498911K775303J411353l363187p319261
$$ plain form
44044 8670812 7750914 6892470 7367515 5920146 1011355 -2740393 -489705 4520055 4001348
44035 4001348 -3811351 -11065014 -10908919 -6411273 -4918754 -6942858 -6054915 1132811
44027 1132811 10107442 14574692 13398182 9565885 5443241 1823413 -266155 -35841
44019 -35841 1234607 1512698 1291418 2924427 5811777 5081065 -2293528 -11624176 -14359670
44010 -14359670 -8128708 236973 2984881 -174270 -4068686 -5580792 -5480378 -4352828
44002 -4352828 -1356345 2362902 2841718 -2298882 -10817889 -18508054 -23117313 -24823885
43994 -24823885 -24749035 -23848094 -21564400 -15332257 -3852168 8739471 15116479 12519119
43986 12519119 5627370 620762 -574687 924224 3699527 5110880 1747693 -5571568
43978e571568m958707J687163M850090K515223O63877K377068L041602k11218
43970D393530k714610r85878P14217j000692j016588N029414J0393257O277247
43962B1089897l187861o144620j001220K305074q73655l431447J43166M324429
43954A3223763K060521l901399n784733k142242J599300J291411k049375m993613
43946f96367m894923j467786K515463L294853L85719k655843k617879K3345K690910
43937c422508L526841K303762O76836J177661L448646K966458k466385o971473
43929A239838l698134L462644L831929l387273o359579J368749J0045306Q236481
43921A4739961j90021l391251L3079J173839l504428p915377p701148n654216
$$ plain form
43978 -5571568 -10530275 -8843112 -3993022 -1477799 -813922 1563146 4604748 4393530
43970 4393530 1678920 693042 1407259 406567 -610021 4419393 14812650 21089897
43962 21089897 17902036 11757416 10756196 13061270 12187615 8756168 8899334 13223763
43954 13223763 15284284 11382885 5598152 3455910 5055210 6346621 4297246 -696367
43946 -696367 -5591290 -7059076 -4543613 -1248760 -863041 -3518884 -6136763 -6113418 -3422508
43937 -3422508 104333 2408095 3084931 4262592 7711238 10677696 8211311 1239838
43929 1239838 -2458296 1004348 4836277 1449004 -4910575 -3541826 6503480 14739961
43921 14739961 14549940 11158689 11191768 12365607 8861179 945802 -6755346 -12409562
43913a2409562m181274j331049K882855M020442P12452j922383l10605J820060
43905a0719064J72295k414833k48487O122208J0110654P454505Q93248l387126
43897G983400k238583J269627R60387m970747j0437789q321767j84272N173387
43889a0766357L175240j515265k888068j158271M25108J455397K930066L520420
43881d821730J627155j195195k472513k273576j401837J030486M644573N361750
43873D99113M39220o103835p639406l143756K832157O843934Q688521Q053295
43865A0469243M082333j581360n472933o440131n937062m570761j795880J407197
43857i839354L161367L631921L924438L008070j68962k612477n43751L647660
$$ plain form
43913 -12409562 -16590836 -17921885 -15039030 -11018588 -10306136 -12228519 -12539124 -10719064
43905 -10719064 -10546769 -12961602 -13210089 -7087881 3022773 10477278 11370526 7983400
43897 7983400 5744817 7014444 7974831 3004084 -7433705 -15755472 -15939744 -10766357
43889 -10766357 -7591117 -9106382 -11994450 -13152721 -12727613 -11272216 -8342150 -4821730
43881 -4821730 -3194575 -4389770 -6862283 -9135859 -10537696 -9507210 -4862637 499113
43873 499113 938333 -5165502 -12804908 -15948664 -13116507 -6272573 2415948 10469243
43865 10469243 14551576 12970216 7497283 1057152 -4879910 -9450671 -11246551 -9839354
43857 -9839354 -6677987 -3046066 878372 3886442 3717480 1105003 561252 4208912
43849D208912L546615j638528n723371n319172m373728n911757n698000O53962
43841b0255067Q941361J0978670N606994n79729k562801j938428k419769m347974
43833f576743m988927k250285K711049N945380M420783o3019k276564j8425K933254
43824a63497K112786j610169l768011k210374J394058M383011M758852J713981
43816F610637k552118l347126O66194L907392N95970o192422p619907j347839
43808i279219N111297N014887Q15056j288237m08657K14768K00692K005638N008008
43799G394233N288993K122606j37844J311215L114187Q16015m258691p013679
43791H637035o069508n016238n978840o053969k187101L368643N603069L498806
$$ plain form
43849 4208912 7755527 6116999 393628 -4925544 -9299272 -15211029 -20909029 -20255067
43841 -20255067 -11313706 -335036 5271958 4692229 2129428 191000 -2228769 -6576743
43833 -6576743 -11565670 -13815955 -11104906 -5159526 -738743 -801762 -3078326 -3096751 -163497
43824 -163497 1949289 339120 -3428891 -5639265 -4245207 137804 4896656 6610637
43816 6610637 4058519 711393 1377587 5284979 5880949 -311473 -7931380 -9279219
43808 -9279219 -4167922 846965 1662021 373784 -34873 179895 380587 2386225 7394233
43799 7394233 12683226 14805832 14667988 15979203 19093390 19909405 15650714 8637035
43791 8637035 2567527 -2448711 -8427551 -14481520 -16668621 -13299978 -7696909 -4198103
43783d198103J136302J997161M669604N170484K056126j883803k613064Q08492
43775G143199M683760L983575k072208q408323r255861m323218J657543M856847
43767a734686N552635N387501M149614R15055l033863m474237j807081K363509
43759G318447L167855j160593o349995o472818j508805K352777J277167j096089
43751b472054j63138J995699Q12185j954691q98259K621185J144272o360202j0849095
43742a6124098n776979L567332P977498N825832J576347j973892m134628l252370
43734a2314958O09851L106913J555610L79385M435462R664941P488747k647869
43726A2278082j1757071j2300428n416594K596182O363861M505773O57650L20311
$$ plain form
43783 -4198103 -3061801 -1064640 3604964 8775448 10831574 8947771 6334707 7143199
43775 7143199 11826959 15810534 13738326 5330003 -3925858 -8249076 -6591533 -1734686
43767 -1734686 3817949 9205450 13355064 14270119 11236256 6762019 4954938 7318447
43759 7318447 10486302 9325709 2975714 -3497104 -5005909 -2653132 -1375965 -2472054
43751 -2472054 -2635192 -639493 172692 -1781999 -2680258 -59073 1085199 -5275003 -16124098
43742 -16124098 -21901077 -18333745 -10356247 -4530415 -2954068 -4927960 -9062588 -12314958
43734 -12314958 -11705107 -8598194 -7042584 -6663199 -2227737 7437204 14925951 12278082
43726 12278082 521011 -11779417 -17196011 -14599829 -8235968 -3730195 -3072545 -2752234
43718b752234L490474L691355j472052m217470J571416P886213L045472q551501
43710B691673j0618955N98512J0129082O550696k683190n317389k336794k136467
43702c122832m876455l792031K027844O086999M376009l97285l740755l519014
43694f957520m52207J911439Q4788l731323l029746K853719N790835R34757m641872
43685g237130k412857M184310N552978R47937k042838n11093J290421J490407
43677A262135K660486L962470R99389m732896n531379L34939M659938J634945
43669E250027l564316l756597o49512k56441k284871j425759L019684N600315
43661A932530K861437k073062m294015l110749j511836j357657j081521J513898
$$ plain form
43718 -2752234 738240 4429595 2957543 -1259927 311489 8197702 11243174 2691673
43710 2691673 -7927282 -7328770 2800312 9351008 6667818 1350429 -986365 -3122832
43702 -3122832 -7999287 -11791318 -9763474 -3676475 699534 302249 -3438506 -6957520
43694 -6957520 -7409727 -5498288 -5413500 -9144823 -12174569 -9320850 -3530015 -2595258 -7237130
43685 -7237130 -9649987 -5465677 87301 1035238 -1007600 -1518693 -228272 1262135
43677 1262135 3922621 7885091 8884480 4151584 -1379795 -1044856 3615082 5250027
43669 5250027 1685711 -2070886 -2720398 -2976839 -5261710 -6687469 -3667785 1932530
43661 1932530 4793967 2720905 -1573110 -4683859 -6195695 -7553352 -8634873 -7120975
43653g120975N204037N804254J424694m357728o360742l757044k11575R79282
43645h395797k25080j672496r29651K670055N970315M195238k089859n356671
43637e833946q85503N048330L356918l576885m391503M009637J0946404P237230
43629A5910682k132426o429740m138841k275824m210057n646632k353448L822808
43621g453478P853858P134910L091033j152457m033165o554246r366794r765619
43613b0245958m579960L800094Q367771O149273K022546J423614L001485J957832
43605A896697k384715o344854p202356n118806j289790K562518M223302L400759
43597a0257245K659976L458326L423684N76284k260539j232383K405057M375078
$$ plain form
43653 -7120975 -1916938 3887316 5312010 954282 -5406460 -9163504 -9375079 -8395797
43645 -8395797 -8620877 -10293373 -11223024 -8552969 -2582654 1612584 -477275 -5833946
43637 -5833946 -6719449 -1671119 1685799 -1891086 -6282589 -2272952 8673452 15910682
43629 15910682 13778256 7348516 3209675 933851 -3276206 -8922838 -11276286 -7453478
43621 -7453478 400380 7535290 10626323 9473866 5440701 -1113545 -10480339 -20245958
43613 -20245958 -24825918 -21025824 -12658053 -6508780 -4486234 -3062620 -61135 1896697
43605 1896697 -488018 -6832872 -14035228 -19154034 -20443824 -17881306 -13658004 -10257245
43597 -10257245 -7597269 -4138943 -715259 -138975 -2399514 -3631897 -1226840 3148238
43589C148238M034831L967066L885263O92861m792872o816518k676510K649043
43581D091402K978937j030866l748037k590299m36578j58087j55820K642500O819503
43572H412655O525538j208162j1086679j4152473p511555L025648J0002854J0967774
43564D975600P662896K666240j111820j360233K08945j294528o336137p998905
43556b587942j485783O831004O603896j853296p694736m773847Q91133J511577
43548b557994j558116k157188M27107J718166K87496k50351K360979N205151M398374
43539G873624M23982k699954k530072p31853j77361o67799O86879M369983O003558
43530A2550987J595938n790473q283321k931275M094219N076499J19011l871896
$$ plain form
43589 3148238 7183069 11150135 15035398 15728259 10935387 4118869 1442359 4091402
43581 4091402 7070339 6039473 2291436 -298863 -735441 -893528 -1049348 1593152 8412655
43572 8412655 14938193 13730031 2643352 -11509121 -19020676 -15995028 -5992174 4975600
43564 4975600 12638496 15304736 14192916 12832683 13041628 11747100 5410963 -2587942
43556 -2587942 -4073725 2757279 9361175 7507879 -186857 -4960704 -4069571 -2557994
43548 -2557994 -4116110 -6273298 -5846191 -4128025 -3840529 -4090880 -1729901 3475250 7873624
43539 7873624 8297606 5597652 3067580 2335727 2158366 1490567 2177446 6547429 12550987
43530 12550987 14146925 8356452 73131 -2858144 1236075 6312574 6431585 2559689
43522B559689k370862J672340K390612j488417n278493m175450Q54963M209982
43514a625636K538911j302722k460323n71164N89737p33751j886277l91810K164096
43505c678939K796336J480214M97270P44713J052080N64832l07750j186533k131484
43496a69261k562729j411882R51101K129876K32735l286226m483558j260203L807244
43487f052903O148475M626914K617477K946308L817840J907721k029318l967387
43479A0015127k806260k088317m321698o884789n940100k040815J052745J665807
43471a1348300J276690J086690P75487Q03480K708778N811175O241279J545912
43463H901191n052625p392898l259984L154823N829637K613930l685022q160882
$$ plain form
43522 2559689 188827 1861167 4251779 2763362 -2515131 -6690581 -5835618 -1625636
43514 -1625636 913275 -389447 -2849770 -3420934 -2831197 -3564948 -5451225 -5843035 -3678939
43505 -3678939 -882603 597611 1094881 1839594 2891674 3456506 3148756 1962223 -169261
43496 -169261 -2731990 -4143872 -3192771 -1062895 -830160 -4116386 -8599944 -9860147 -6052903
43487 -6052903 95572 4722486 7339963 10286271 14104111 16011832 13982514 10015127
43479 10015127 7208867 5120550 798852 -6085937 -12026037 -14066852 -13014107 -11348300
43471 -11348300 -10071610 -8984920 -8209433 -7405953 -4697175 1114000 7355279 8901191
43463 8901191 3848566 -3544332 -6804316 -3649493 2180144 4794074 1109052 -7051830
43455g051830p064233j56467Q188809J1187677N536946m334653r694099o128007
43447i515857K323215Q115498P780556L702426P2921j011578j71661N76178m30776
43438A1440922k980808n094415n190950l748343k219376j090148k5489P86047
43430h122560P77501J70294k03824j14182m4404l02562p80850j278289j425651
43421a1324527p89148L97364J313326J810116K503781L143211K495143O79209
43413B28475l45996J09463J29601j209058j433739J308830M065161K677907j681031
43404C849613l602536q21143L055745L410916o68198o438484r508825o342053
43396a7064965J950611Q608346P490191L35223n487079n969439l294409k91852
$$ plain form
43455 -7051830 -14116063 -14272530 -6083721 5103956 10640902 6306249 -3387850 -9515857
43447 -9515857 -7192642 922856 8703412 12405838 12478759 11467181 11295520 11871698 11440922
43438 11440922 8460114 3365699 -1825251 -5573594 -7792970 -8883118 -8908607 -8122560
43430 -8122560 -7345059 -7174765 -7378589 -7492771 -7537175 -7839737 -8620587 -9898876 -11324527
43421 -11324527 -12113675 -11716311 -10402985 -8592869 -6089088 -2945877 -450734 228475
43413 228475 -117521 -8058 121543 -1087515 -2521254 -1212424 2852737 5530644 3849613
43404 3849613 247077 -574066 2481679 5892595 5224397 -1214087 -10722912 -17064965
43396 -17064965 -15114354 -6506008 984183 1319406 -4167673 -10137112 -13431521 -13723373
43388a3723373K692734M705333L449073k10938j617264J190254M177791L066515
43380C730125j027099m069462l972424q71768L894227O802818L972069l182651
43372E275835p639551n060838J000749M938923O082750O317963M987055J038488
43364A6941374k932741l928158l466649m429334n352153l177803J85730p0322
43356f230056l723843n228443j691041L463433N459173L239912p10460k742658
43348h163983o79804L367190M324617J081434q17843K319696M805513n29838r364167
43339c657185r817049L49127R652063Q750080K038640j107116N32085J770574
43331H511219O56859m74004o28243o78199M8933K402970L856891J288096l433726
$$ plain form
43388 -13723373 -11030639 -6325306 -2876233 -3087171 -4704435 -3514181 663610 3730125
43380 3730125 2703026 -1366436 -5338860 -6210628 -2316401 4486417 8458486 5275835
43372 5275835 -2363716 -7424554 -6423805 -1484882 4597868 10915831 15902886 16941374
43364 16941374 14008633 10080475 6613826 2184492 -3167661 -6345464 -6159734 -6230056
43356 -6230056 -9953899 -15182342 -16873383 -13409950 -7950777 -4710865 -5421325 -8163983
43348 -8163983 -8843787 -5476597 -1151980 -70546 -888389 1431307 6236820 5706982 -3657185
43339 -3657185 -13474234 -13125107 -3473044 5277036 7315676 6208560 6740645 8511219
43331 8511219 9168078 8694074 8065831 7387632 7436565 9839535 13696426 14984522 11550796
43322A1550796n407212l941227k979505l845413k726019K390868O639833M168334
43314E850455l058935o853825l312894K248275K786038j139396l227537j256523
43306g964342o869k986504o012581l095288M123850P932120M747253j128415m311131
43297h701907m176017k458041N59539M624301P316285O430455L003173k32199
43289F365589j899143j752991M84126L568265L810342j018266p493418r431434
43281g366930n262990L07418K930032L981432O748422R227790N394198n075867
43273A0883505j2803024q928774K786225R893758P137198J590832j9311j021867
43265I518542n929201r077308k173847J0160609J3798883M673375n535454o189162
$$ plain form
43322 11550796 6143584 2202357 -777148 -4622561 -7348580 -4957712 1682121 5850455
43314 5850455 2791520 -4062305 -7375199 -5126924 -2340886 -3480282 -6707819 -7964342
43306 -7964342 -7971211 -10957715 -16970296 -20065584 -15941734 -8009614 -3262361 -4390776 -8701907
43297 -8701907 -12877924 -15335965 -14776426 -10152125 -2835840 3594615 6597788 6365589
43289 6365589 4466446 2713455 3197581 6765846 10576188 9557922 2064504 -7366930
43281 -7366930 -12629920 -12322502 -9392470 -5411038 1337384 10565174 15959372 10883505
43273 10883505 -1919519 -10848293 -8062068 1831690 8968888 10559720 10540409 9518542
43265 9518542 3589341 -5487967 -7661814 2498795 16297678 20971053 15435599 9246437
43257I246437n96557K649293K529112K759572K694351n78616m795281n068796
43249H839515k009617m76865j423524j415732J78882j83457l564489n870380l722616
43240i648283P50697K971676J418565j460682k584035j591025j000037k551941
43232a3695065l863555j243425L837363N184385Q69027k749273J13840N833827
43224e712876O707520K057164k140726k761379k027465j326528O07059K909365
43216a687866K577434N45851J406246M935107M324689l394435j0726936q851378
43208a0871288J01075N680518K710119l059653l490522J910690O747680O390516
43200F119135K900451R63067J283451M57569l213987o936937p398203m601382
$$ plain form
43257 9246437 8649880 11299173 13828285 16587857 19282208 18703592 13908311 8839515
43249 8839515 6829898 6353033 4929509 3513777 3692659 3509202 -55287 -5925667 -9648283
43240 -9648283 -8897586 -5925910 -4507345 -5968027 -8552062 -10143087 -11143124 -13695065
43232 -13695065 -17558620 -18802045 -14964682 -9780297 -8911270 -11660543 -11546703 -5712876
43224 -5712876 994644 3051808 911082 -1850297 -3877762 -5204290 -4597231 -1687866
43216 -1687866 889568 1435419 2841665 7776772 12101461 8707026 -2019910 -10871288
43208 -10871288 -10770213 -5089695 -2379576 -5439229 -8929751 -7019061 -271381 6119135
43200 6119135 9019586 9982653 11266104 11723673 8509686 1572749 -5825454 -10426836
43192a0426836j92285M744316P842800N326588k192176p260906m320436J888884
43184d590051K988599l78602n96171L302200L878297j108586l574117J447675
43176A369244O288583K241071o089873p434051j058648K632884j914331p974919
43168a1940040p195824m95370N321144O860562N833048M361986K797493J319294
43160F862293N19414J43403p59596k092781k747317k872368m158680o318019n319963
43151a6743614J338820Q415654P348114j249516n490610K307654J3071563J1915737
43143B0913802r83967j0317221o885057J558761M357682K663940K891806L599816
43135A7799562r73839q481940j0070481l829152K226816J897442j710399k750868
$$ plain form
43192 -10426836 -10619121 -5874805 1967995 7294583 5102407 -2158499 -6478935 -4590051
43184 -4590051 -1601452 -1980054 -2576225 725975 4604272 3495686 -78431 1369244
43176 1369244 7657827 9898898 3809025 -3625026 -4683674 -2050790 -3965121 -11940040
43168 -11940040 -19135864 -19631234 -14310090 -7449528 -1616480 2745506 5542999 6862293
43160 6862293 7381707 7525110 6765514 4672733 1925416 -946952 -5105632 -11423651 -16743614
43151 -16743614 -15404794 -6989140 358974 -890542 -6381152 -4073498 8998065 20913802
43143 20913802 19929835 9612614 2727557 4286318 8644000 11307940 14199746 17799562
43135 17799562 16825723 8343783 -1726698 -5555850 -3329034 -1431592 -3141991 -5892859
43127e892859q86325L61845k02859l61110J678664M291935L579574j851439p152731
43118f435305n077384M487442J2146513R776801P31535n325335m953307k317777
43110C033183k13334K573338M919747K495239m263046q122752m748863R41089
43102c385399K202758k14183p81167K018963M492431L745483P66617k059506l611099
43093C174898m175920m525133m721078l522291j2920M330710P031567P650857
43085E230690O926344L889854j977008o326150l712032L089413M356465k837150
43077H640426q997387n492677K767734N120717Q05522j998978j36869J308995
43069B017483j91950k53010L246967M917515N57466n100808n002614l1978K958828
$$ plain form
43127 -5892859 -6779184 -6417339 -6620198 -6981308 -5302644 -1010709 2568865 717426 -6435305
43118 -6435305 -11512689 -7025247 5121266 14898067 15629602 10304267 5350960 3033183
43110 3033183 2819849 5393187 10312934 12808173 8545127 422375 -4326488 -3385399
43102 -3385399 -1182641 -1396824 -2177991 -159028 4333403 8078886 8845503 6785997 3174898
43093 3174898 -1001022 -5526155 -10247233 -13769524 -13782444 -9451734 -2420167 5230690
43085 5230690 12157034 16046888 14069880 7743730 4031698 7121111 11477576 8640426
43077 8640426 -356961 -5849638 -3081904 2038813 2844335 845357 708488 2017483
43069 2017483 1825533 1572523 4819490 9737005 10294471 5193663 191049 159071 3117899
43060C117899R11534k808546m222143k633675O68941L632753L539171n39768n205187
43051c539021n806232k314800Q91924J351212J089636J917543K023218k34376
43043d620896k177245o5852M913737P430801M558772j200394n422845n846378
43035b430300k988204O26438J464213k001623o299640n588333J240949Q293114
43027g683386R222118M272448q70136j607753J793941N347503M740135p58626
43019A4456244o548375p030508k800609k01546j904854k589294K110354P149755
43011B641167M995893k221681n314217j561548K568980K614635J627119K330080
43003G680428J823998j901706m924053l688924r92330q91368k323622k441633
$$ plain form
43060 3117899 4029433 1220887 -3001256 -5634931 -4965990 -1333237 2205934 1666166 -3539021
43051 -3539021 -9345253 -11660053 -10768129 -9416917 -8327281 -6409738 -4386520 -4620896
43043 -4620896 -6798141 -6863993 -1950256 5480545 10039317 8838923 3416078 -2430300
43035 -2430300 -5418504 -4792066 -3327853 -5329476 -11629116 -17217449 -15976500 -7683386
43027 -7683386 1538732 5811180 4941044 3333291 5127232 10474735 15214870 14456244
43019 14456244 7907869 877361 -1923248 -2124794 -4029648 -6618942 -4508588 2641167
43011 2641167 7637060 5415379 101162 -1460386 1108594 3723229 5350348 7680428
43003 7680428 9504426 7602720 2678667 -1010257 -2002587 -2893955 -5217577 -7659210
42995g659210j810010j501258M95070M689655O241005J638610m468110n372601
42987g746849j978866J29586J99964J638029M158592M359582K859853L199017
42979F818908M283398J669030l651859n547847k483406O97216J695881L403269
42971F884590N788412L647701l964181r732841q195307l376132j354145j106791
42963a1408694J493656N316728N818270K258143k164643n023890n248236j743315
42955a0701981M128886P162135L940824j927257m202361j906938R15550J592228
42947i98914J092274J074954K116044M148555O086000N883685K852277j307290
42939B0947585m837248p149131p113615l660751Q33588K148339P27629J371305
$$ plain form
42995 -7659210 -9469220 -10970478 -10475408 -5785753 455252 2093862 -2374248 -7746849
42987 -7746849 -9725715 -9596129 -9396165 -7758136 -3599544 760038 3619891 6818908
42979 6818908 11102306 12771336 9119477 3571630 1088224 1785440 3481321 6884590
42971 6884590 12673002 16320703 12356522 2623681 -5571626 -8947758 -10301903 -11408694
42963 -11408694 -9915038 -4598310 1219960 3478103 1313460 -3710430 -8958666 -10701981
42955 -10701981 -6573095 589040 4529864 2602607 -1599754 -3506692 -2591142 -998914
42947 -998914 93360 1168314 3284358 7432913 13518913 19402598 22254875 20947585
42939 20947585 16110337 8961206 1847591 -1813160 -979572 1168767 1896396 3267701
42931C267701M490902M334215o41703l231045J085887N679652L371292j408040
42923A6948861o65423K676749q7087p368947q931801k699628K384563J289639
42915C546926j026444p84798j322886m076291m156861Q512K057409j534707m636732
42906a1925872j760351K743811K903440J375131L371797O219478L849666k304542
42898D472558n610353m878338m523770n563555m172740R50773O268377Q710781
42890d346267Q053798M255459k274161p659833o994536p69891N023518N897786
42882A185873K786946j022118l460909l898080k739560j220779K29865K582703
42874e556059N284229M931177J75595m209644k768188K386911L976040P9140l199672
$$ plain form
42931 3267701 7758603 12092818 11451115 8220070 9305957 14985609 18356901 16948861
42923 16948861 16283438 18960187 18873100 11504153 2572352 -127276 2257287 3546926
42915 3546926 2520482 1735684 412798 -3663493 -7820354 -7811842 -5754433 -7289140 -11925872
42906 -11925872 -13686223 -10942412 -8038972 -6663841 -3292044 2927434 6777100 4472558
42898 4472558 -1137795 -6016133 -10539903 -16103458 -20276198 -19325425 -13057048 -4346267
42890 -4346267 3707531 7962990 5688829 -1971004 -8965540 -9735431 -4711913 1185873
42882 1185873 3972819 2950701 -510208 -4408288 -7147848 -8368627 -8138762 -5556059
42874 -5556059 -271830 4659347 4834942 625298 -2142890 244021 4220061 4299201 1099529
42865A099529q99277M006477N787906M154850L355183M792154M681858n7527o395269
42856B0525884q397939n322491l100498n862423r145236n798154L155199R292808
42848d652850Q268839M130421J126928j504690l825000k151099L228536M649692
42840I270777j811611q235865n851265J563043M420139K464520K490583M679045
42832H989366L336795n07180q2531L439070J472006n799948p420607k08212M246948
42823G465707j670434q301998m129540N662327P940605J811856k588537j412516
42815D777470p38699l959676o603747n011760j552737O86905J759826J914322
42807h728096M89009j036755M2233K764903L315994J451586J153062L723185N158596
$$ plain form
42865 1099529 200252 4206729 9994635 14149485 17504668 22296822 26978680 26921153 20525884
42856 20525884 12127945 6805454 3704956 -2157467 -11302703 -17100857 -13945658 -4652850
42848 -4652850 3615989 7746410 8873338 7368648 3543648 1392549 4621085 9270777
42840 9270777 7459166 -776699 -6627964 -5064921 -644782 1819738 4310321 8989366
42832 8989366 12326161 11818981 11736450 15175520 16647526 10847578 3426971 3218759 7465707
42823 7465707 5795273 -2506725 -6636265 -973938 6966667 8778523 6189986 4777470
42815 4777470 4038771 79095 -6524652 -11536412 -13089149 -12402244 -10642418 -8728096
42807 -8728096 -8239087 -9275842 -9233609 -6468706 -3152712 -1701126 -548064 3175121 8333717
42798H333717K410948j922126l673312k643922j384115p28303N97434K805997
42790C796318L859714J976291j631148l590038k453576r24498k153434m415350
42782e535721k708199L608861Q527436P005266J654150j295215k66500R05780
42774A1895858r90952m906059p236210n283091p3215L443069J413391l078574
42766d815783l185712J544230L849232K32414l175635j251849R08958k649686
42758h543831o472702j527672Q382980J0296153J717771n530456l293392K342202
42750b628947K884371R95j05025K591233L860490K807636J180416j288250n287568
42741D015351q347563p498914l477275J038320M824219O975255N791439K109097
$$ plain form
42798 8333717 10744665 8822539 5149227 2505305 1121190 392887 990321 3796318
42790 3796318 7656032 9632323 8001175 4411137 1957561 1033063 -1120371 -5535721
42782 -5535721 -8243920 -4635059 3892377 10897643 12551793 11256578 10990078 11895858
42774 11895858 10904906 5998847 -1237363 -6520454 -6593669 -3150600 -1737209 -4815783
42766 -4815783 -8001495 -6457265 -2608033 -2375619 -5551254 -6803103 -5894145 -8543831
42758 -8543831 -15016533 -16544205 -8161225 2134928 3852699 -1677757 -4971149 -2628947
42750 -2628947 255424 256419 151394 2742627 6603117 9410753 10591169 9302919 4015351
42741 4015351 -4332212 -11831126 -15308401 -14270081 -9445862 -2470607 3320832 5429929
42733E429929L18686K408030M263706J785564k546706l615888j367305K62554
42725F938570L2769m189O06601J20018j386036j722924p11915q77616l073075
42716g7797m410393k174641J971499L638371J438679n64446K119430P325728P570343
42707A6836773M39955o295496m689515J468291J934431m232253p186309j800562
42699c524685M764785M819982Q21542j145772p70011O3834K942352P404307O575236
42690B1951570k629535j0796934p825484J210342L437833j903949l769613J521022
42682A195252N058330J386736l054837k207883m8884j714998m064668k253519
42674e704471J199921J046880k088593m006117l699928k549050o71487J331144
$$ plain form
42733 5429929 5748615 8156645 12420351 14205915 11659209 8043321 6676016 6938570
42725 6938570 6971339 6967150 7573751 7693769 6307733 4584809 3872894 2995278 -77797
42716 -77797 -4488190 -6662831 -4691332 -1052961 385718 -178728 1940702 9266430 16836773
42707 16836773 17276728 10981232 6291717 7760008 9694439 5462186 -1724123 -3524685
42699 -3524685 1240100 6060082 6881624 5735852 4965841 5029675 7972027 15376334 21951570
42690 21951570 19322035 8525101 699617 1909959 5347792 3443843 -325770 1195252
42682 1195252 6253582 7640318 4585481 2377598 2328714 613716 -3450952 -5704471
42674 -5704471 -4504550 -3457670 -5546263 -9552380 -13252308 -15801358 -16472845 -15141701
42666a5141701J207130j50943K185339Q493038J0644520L492614n370182n298155
42658F1660J941049N345868R30564m697076o409752o503830o890490m373205K240456
42649a8354756P298539N764439Q95103n50257K329799M767717L987182K033672
42641H171438J232308P16272j210782l470173l002658R59798M919465M747359
42633A3063027Q70746k186425j933196r66585k182603l778096k424184N21431
42625I84115M17478l487114o576649n067639r282N398766Q733464Q043942K913469
42616A1350550k917224m351333k049213j996915n646353o190025Q46146Q617895
42608b336472P415446j231687o798891m778245j029871m38789K8227L495607O168229
$$ plain form
42666 -15141701 -13934571 -14085514 -11900175 -3407137 7237383 10729997 5359815 61660
42658 61660 2002709 7348577 8279141 3582065 -2827687 -9331517 -16222007 -20595212 -18354756
42649 -18354756 -11056217 -5291778 -4396675 -4946932 -2617133 2150584 6137766 8171438
42641 8171438 9403746 10120018 8909236 5439063 2436405 3396203 8315668 13063027
42633 13063027 13933773 11747348 9814152 8847567 6664964 2886868 462684 984115
42625 984115 1401593 -2085521 -8662170 -13729809 -13739091 -8340325 393139 8437081 11350550
42616 11350550 8433326 4081993 2032780 35865 -5610488 -11800513 -10954367 -2336472
42608 -2336472 5078974 3847287 -2951604 -7729849 -8759720 -9198509 -9170282 -5674675 493554
42599D93554L924571K16216M94500K638259O23892m315558m612543J109354M580342
42590E152587k6596p215690q079114k371117K761089L238920J640543J415348
42582c484030K584122L578776L562432K166611l25837k131957j693406k37057
42574D019654j08537q69059j63976J633639J456288j113887k619497j399505l38744
42565D96376j411761j571965J954311N538140L520149k931015o856836n223386
42557f485987k134403j229223l19840L361539O939273N578948K43694l027264
42549B926737j314469J803129J859944r45303l462559m178031l768082k789701
42541i868335j423102o81438j244681j254468J973088P315331R545112N434072
$$ plain form
42599 493554 4418125 4634341 5128841 7767100 8390992 4075434 -537109 572245 5152587
42590 5152587 5125991 -2089699 -10168813 -12539930 -9778841 -6539921 -4899378 -3484030
42582 -3484030 -899908 2678868 6241300 8407911 8082074 5950117 4256711 4019654
42574 4019654 3911117 3042058 2878082 4511721 5968009 4854122 2234625 835120 496376
42565 496376 -915385 -2487350 -533039 5005101 8525250 5594235 -1262601 -6485987
42557 -6485987 -8620390 -9849613 -10169453 -6807914 131359 5710307 5954001 2926737
42549 2926737 1612268 3415397 5275341 4330038 867479 -3310552 -7078634 -9868335
42541 -9868335 -11291437 -11972875 -13217556 -14472024 -12498936 -5183605 4361507 9795579
42533I795579j654543n447120l896619k96456J994205K998193L887717M148111
42525A1529067K677133P1836j988236k813166k749295j932451n55902J17797j164929
42516C191854l389287l793569j498350O62151o09807m465803o263807l085711
42508a9252329K499869N520883M541469K513104J883706J585058J91858n00624
42500a017006J998578N921367O292060J478902m096654n256577k297231k02973
42492B820466k345456o435706p178612k691718K530359K496678k402341n148969
42484a8355299j509602L533692K833679j863247k097982M306131R476783P054332
42476C378487J064105r71196J486656L681724L635434K597839M70922k881628
$$ plain form
42533 9795579 8141036 2693916 -1202703 -1499159 495046 3493239 7380956 11529067
42525 11529067 14206200 14278036 12289800 9476634 6727339 4794888 4238986 4356783 3191854
42516 3191854 -197433 -3991002 -5489352 -4827201 -5437008 -9902811 -16166618 -19252329
42508 -19252329 -16752460 -11231577 -6690108 -4177004 -2293298 -708240 -516382 -1017006
42500 -1017006 981572 6902939 13194999 14673901 10577247 5320670 3023439 2820466
42492 2820466 475010 -5960696 -13139308 -15831026 -13300667 -10803989 -13206330 -18355299
42484 -18355299 -19864901 -16331209 -13497530 -15360777 -17458759 -13152628 -3675845 3378487
42476 3378487 4442592 3471396 4958052 8639776 12275210 14873049 15343971 12462343
42468A2462343l907815K72040N010373K915812m513691p616919k410815L792418
42460F003746L723337J52524k97782K288992K939566O18561j184815j124597j464401
42451A1655131l102317l967330k926296j402384k60102J634262M514997N972456
42443A2118417L729533j274828n838096p758014p278346n641924l041689J186381
42435a3798566O063755Q101381N024699k77079k539558r92740K76647l65970N79277
42426B071846M415120N700914M20150n631983m102705K540091L634415l324274
42418E723574q104173k970068N534173O197886r57646n849812k844499L231902
42410c8663N612959L921995J910706J019393o28141m085265o820067n067458J011572
$$ plain form
42468 12462343 8554528 8826568 13836941 16752753 12239062 4622143 2211328 6003746
42460 6003746 9727083 9879607 9581825 11870817 14810383 15428944 14244129 13119532 11655131
42451 11655131 8552814 4585484 1659188 256804 -3298 1630964 6145961 12118417
42443 12118417 15847950 14573122 8735026 977012 -6301334 -11943258 -14984947 -13798566
42435 -13798566 -7734811 366570 5391269 5114190 2574632 1581892 1858539 1492569 2071846
42426 2071846 6486966 12187880 12608030 6976047 2873342 5413433 9047848 5723574
42418 5723574 -2380599 -5350667 183506 6381392 5423746 -426066 -3270565 -38663
42410 -38663 5574296 9496291 11406997 12426390 11798249 7712984 892917 -4174541 -3162969
42401c162969N740822L719187k888308o140658k540340K529834L242973J796431
42393B296972L455788O522558M371706l175434p824411m046216L413066O046831
42385A1060860J306030o691050j2194105j1155217l656446M153886M669825j374023
42377a3880240m137644K078705R584981P643074j569478n715655j01464O273325
42369A75604M763773q16992j328446L871150O962103L557746j733191k570482
42361A2881265P29319K639839J87376l701207m818769l305842k615508l749365
42353a752892l624662k41281L489827L700793J301523M17794K201261L711244
42345I203607K599753l73941l342372m712058k964258J340113L737910L19053
$$ plain form
42401 -3162969 2577853 6297040 3408732 -2731926 -5272266 -2742432 500541 2296972
42393 2296972 5752760 12275318 16647024 13471590 5647179 1600963 5014029 11060860
42385 11060860 12366890 5675840 -6518265 -17673482 -21329928 -17176042 -12506217 -13880240
42377 -13880240 -18017884 -15939179 -6354198 1288876 -280602 -5996257 -6097721 175604
42369 175604 4939377 4122385 2793939 6665089 13627192 17184938 15451747 12881265
42361 12881265 13610584 16250423 16437799 12736592 7917823 4611981 1996473 -1752892
42353 -1752892 -5377554 -5618835 -2129008 1571785 2873308 3291102 5492363 9203607
42345 9203607 11803360 11429419 8087047 3374989 410731 1750844 5488754 5807807
42337E807807n868580p537542k911564K244360L426940K679886L125378M010331
42329D977016M139044M571146M408690q4632p683583r912155k712590N510173
42321C213109N119340o76489k027172J504539J887958k531320m802906k232519
42313e45460o973j6336K613990Q153269Q548306P98976o065919m616865n06602
42304H356386j720703m599581j233942N363842N509658j047580n155146l207067
42296B265867p37495q31220r5761J935429K62130m991695n564659J820967Q167659
42287B231222N038608k621022m605904o63870J577766J41421J88064L107328L833032
42278H226645M06347k299403j334470p49134l673246n637270j541722N270319
$$ plain form
42337 5807807 -60773 -7598315 -10509879 -8265519 -4838579 -2158693 966685 4977016
42329 4977016 9116060 13687206 18095896 18011264 10327681 415526 -2297064 3213109
42321 3213109 8332449 7655960 5628788 7133327 9021285 6489965 1687059 -545460
42313 -545460 -552433 -568769 2045221 10198490 18746796 19545772 13479853 8862988 8356386
42304 8356386 6635683 2036102 802160 6166002 11675660 10628080 5472934 2265867
42296 2265867 1528372 697152 601391 2536820 2798950 -2192745 -7757404 -5936437 2231222
42287 2231222 7269830 4648808 42904 -620966 956800 1098221 1286285 4393613 8226645
42278 8226645 8632992 6333589 4999119 4249985 576739 -5060531 -6602253 -1331934
42270a331934P537093M966976L530270M789534L507543k440780o782660l791150
42262I984892K429231L305039k147594o580921m968194k77338K433041K358872
42254F537028J079370j127189l462831k527320L220049Q718219P185390l34170
42246A9288546n253976k656940K298079K086986k681854m956718j676631K712944
42238I160436L677524K489088K045746R25159l608844q692193p832988m05709
42230b241781O271360O669553L930595L281049L218743p45641o517825p105341
42222F760712j456769L780701M505357L868948M327257K676418k333694m512245
42214A7616685Q17416P741206P546039J723252j497352r66075l001716q364656
$$ plain form
42270 -1331934 6205159 11172135 14702405 19491939 22999482 20558702 13776042 9984892
42262 9984892 12414123 15719162 13571568 6990647 2022453 1745115 4178156 6537028
42254 6537028 7616398 6489209 3026378 499058 3719107 12437326 19622716 19288546
42246 19288546 14034570 11377630 13675709 15762695 13080841 8124123 6447492 9160436
42238 9160436 12837960 15327048 17372794 18297953 14689109 5996916 -1836072 -2241781
42230 -2241781 4029579 10699132 14629727 17910776 21129519 20383878 13866053 6760712
42222 6760712 5303943 9084644 13590001 17458949 21786206 24462624 22128930 17616685
42214 17616685 18434101 26175307 33721346 35444598 33947246 32981171 29979455 21614799
42206B1614799r410956k889576L833884L988211J089336J730091M936190N204151
42198C0096130J710320j847844l438178l128846l75505L594704L823477j738994
42190B8695264o410567k733167N615107P867437J756911l391571p58061M831694
42182C5473047N416635R26563k943727l024208k04210L658079O189841M985304
42174E0477324J265413j88262J936760K798823l3393o63349N619775J1574451
42166G2787542O674797n217880q455617J861577J1343042O627806n167157p035097
42158G3419013L733901J3468621J2650657P104857O147741R154504R572780N959451
42150A41211525K354153J033171J061270K446607O141846J0218168J0920728Q115250
$$ plain form
42206 21614799 12203843 9314267 13148151 17136362 18225698 19955789 24891979 30096130
42198 30096130 31806450 29958606 26520428 23391582 23016077 26610781 30434258 28695264
42190 28695264 22284697 19551530 25166637 33034074 34790985 31399414 30641353 35473047
42182 35473047 40889682 41816245 38872518 35848310 35644100 39302179 45492020 50477324
42174 50477324 51742737 51554475 53491235 56290058 56256665 55593316 61213091 72787542
42166 72787542 79462339 74244459 65788842 67650419 78993461 85621267 80454110 73419013
42158 73419013 77152914 90621535 103272192 110377049 116524790 125679294 135252074 141211525
42150 141211525 143565678 144598849 145660119 148106726 154248572 164466740 175387468 183502718
42142A83502718N604527N161519M130740M00288l962281o342628p662587r739652
42134A71092644j0976536q559606l861755j614088l475380o093731o660355o883363
42126A22967830r055655j0970726q588859k896539m2591l497764r167263j0521717
42118F8226716o546880j746295O52015J888659L558001L895006O92121m160813
42110F6458530o328602m808205l121955m193354o512271o663377l845338k90561
42102C0694867J630386J209644p77566k538518k300851m91860k27174l694818
42094B3504110q352731q967673l846861K992698O627759O276733M442574K903494
42086B5580103J367327j029163m609103q719573j1029717q625280j855303M199178
$$ plain form
42142 183502718 189107245 194268764 198399504 198799792 194837511 188494883 180832296 171092644
42134 171092644 160116108 151556502 147694747 146080659 142605279 136511548 129851193 122967830
42126 122967830 113912175 102941449 94352590 91456051 91413460 87915696 78748433 68226716
42118 68226716 61679836 59933541 60585556 62474215 66032216 69927222 70619343 66458530
42110 66458530 60129928 55321723 52199768 48006414 41494143 34830766 30985428 30694867
42102 30694867 32325253 33534897 32757331 30218813 27917962 27426102 27198928 23504110
42094 23504110 15151379 6183706 2336845 5329543 11957302 18234035 22676609 25580103
42086 25580103 26947430 25918267 21309164 12589591 1559874 -7065406 -8920709 -4721531
42078d721531M890348J869993O01372K478336L515994J465530n07859M56407J891048
42069A1939638M25203k212547k290442p67675j510204l973449l449067J008324
42061h30219M347590K807335j132252l140098k463227p49983J017256K030863
42053A887265J246992k67598L37738K953131L693374J278614O9562L228306O927970
42044B1355354N894320J158142k778323n099606p035106o215270j78820O204734
42036A3305425N188773j876895n364710j593074K196395J34623l271452j658441
42028G060644K540952K740736j211690m135252m196092l617174k442038J592923
42020a666991P060119Q771414M966586O475j673540p56318n31571k007652l544560
$$ plain form
42078 -4721531 168817 2038810 2640182 5118518 8634512 10100042 9592183 10048590 11939638
42069 11939638 12364841 10152294 7861852 7094177 5583973 1610524 -1838543 -830219
42061 -830219 3517371 6324706 5192454 2052356 -410871 -1160854 -143598 1887265
42053 1887265 3134257 2866659 3204397 6157528 9850902 11129516 11199078 14427384 21355354
42044 21355354 27249674 28407816 25629493 20529887 13494781 7279511 7100691 13305425
42036 13305425 18494198 16617303 11252593 9659519 11855914 11990537 8719085 7060644
42028 7060644 9601596 12342332 11130642 6995390 2799298 -817876 -3259914 -1666991
42020 -1666991 5393128 14164542 19131128 19137603 17464063 16707745 16176174 14168522 10623962
42011A0623962l733525k717464r98796J691738N357433P616414M588827l731840
42003A8696749j0240949p124194L764229J1401263Q532847j97134n829794o044265
41995A2958752m165561j686382J926221M571416L360220J30662q88220k07085
41987A6000023j764301m882167m320100P36130M395043K913203l2323K80140K993896
41978A6319544M504790L708979J475699j477947l640739l127410j091057q63303
41970A5808556k008708k25222M479439N525260k82344o450689o083220k181036
41962H582036j607786l111310j55217O477981Q510418L202467k240560j834772
41954A7823257J281252K037035J845271M146910O275290K777597m828320q303522
$$ plain form
42011 10623962 6890437 4172973 3174177 4865915 10223348 17839762 22428589 18696749
42003 18696749 8455800 1331606 5095835 16497098 25029945 24832811 19003017 12958752
41995 12958752 8793191 7106809 9033030 13604446 16964666 17095328 16207108 16000023
41987 16000023 14235722 9353555 5033455 5769585 10164628 13077831 13045508 13325648 16319544
41978 16319544 20824334 24533313 26009012 24531065 20890326 17762916 16671859 15808556
41970 15808556 13799848 13574626 18054065 23579325 23296981 16846292 10763072 8582036
41962 8582036 6974250 3862940 3707723 10185704 18696122 21898589 19658029 17823257
41954 17823257 19104509 21141544 22986815 27133725 33409015 36186612 31358292 23054770
41946B3054770l737834K809028L558614m35057j248995M232230R494581P627630
41938D5354967J576342J00470M916012Q451326N975214L112063O599326J3248504
41930H9334224J5287726J3155914J4299898K0220599K3964677K2244034K1201733
41923B19708805K5679391K9829528K4492898R398114p654464k0253955k6616342
41916B54583975k6693807k2395843j8969269k0169764k2768885k0964152j5227615
41909A07394640j1279016j1081975j1093695r528333q674260q786629o555186
41902D0395546k183551j277460n795103r346376o629242j892753j503523k940545
41894H826993M90144O903310P327450j58736o908239o343107j980973M21221J174061
$$ plain form
41946 23054770 19316936 22125964 25684578 25249521 24000526 28232756 37727337 45354967
41938 45354967 46931309 47031779 51947791 60399117 66374331 69486394 76085720 89334224
41930 89334224 104621950 117777864 132077762 152298361 176263038 198507072 219708805
41923 219708805 245388196 275217724 299710622 309108736 301454272 281200317 254583975
41916 254583975 227890168 205494325 186525056 166355292 143586407 122622255 107394640
41909 107394640 96115624 85033649 73939954 64411621 55737361 46950732 40395546
41902 40395546 38211995 36934535 31139432 21793056 15163814 13271061 11767538 8826993
41894 8826993 9317137 16220447 23547897 23389161 16480922 10137815 8156842 8578063 9752124
41885I752124K373743J952757j837700n048680l787680j455739l237854o465039
41877g754068m258379K926688P437467N700308J584038j617183m259260m439480
41869d679869J621422J0184825J0433937k14838r745481p653038K33378K082380
41861B262716j347926j51463O285290P611358J26265o207605k752275N303339
41853A1129699P340024J518586n332361p371278m018069J947485O050948M658897
41845A5923931n76019l563550j791579K86355r79906j941672K154797Q234188
41837A7746545Q675139J680318o953249j1265914r714003l623586L982077Q467022
41829H994349O933384J649504k880474n219922o221685n082905q38758L627277
$$ plain form
41885 9752124 12125867 14078624 12240924 7192244 3404564 1948825 -1289029 -7754068
41877 -7754068 -12012447 -9085759 -1648292 4052016 5636054 4018871 -240389 -4679869
41869 -4679869 -3058447 7126378 17560315 17345477 7599996 -53042 180336 2262716
41861 2262716 914790 763327 7048617 14659975 14786240 8578635 5826360 11129699
41853 11129699 18469723 19988309 14655948 7284670 3266601 5214086 11265034 15923931
41845 15923931 15347912 11784362 9992783 10279138 9299232 7357560 9512357 17746545
41837 17746545 26421684 28102002 21148753 9882839 168836 -3454750 527327 8994349
41829 8994349 15927733 17577237 14696763 9476841 3255156 -1827749 -2666507 960770
41821I60770M211232J622619K9282M65092O55942M98264J801291L001790P39404
41812A3985686k938137k031015L399351N933210J909430l253242m011119j952079
41804A1042085k44960J933530M413122K702306l838330p193016k001859M258720
41796A1071598J892870n017704m573903L548313P335742J786561l494631n4210
41788A2494636O935030Q207175L711086r84750m629581q212804q061293n15707
41780H943792Q870124J0172161L169836j934663M72315L802895O05925n485107
41772B8617278n740011o1758L246058N96004j974036O30628M016672J585752m397744
41763B6518843o236728l264944k685756p008889q828394k175463P569896J1009929
$$ plain form
41821 960770 5172002 6794621 6823903 7288995 7944937 8443201 10244492 13246282 13985686
41812 13985686 11047549 9016534 12415885 18349095 20258525 17005283 12994164 11042085
41804 11042085 10797125 12730655 17143777 19846083 16007753 8814737 6812878 11071598
41796 11071598 12964468 7946764 3372861 6921174 14256916 16043477 12548846 12494636
41788 12494636 19429666 27636841 31347927 30363177 25733596 17520792 9459499 8943792
41780 8943792 17813916 27986077 31155913 29221250 29693565 33496460 34102385 28617278
41772 28617278 22877267 22815509 26061567 26657571 24683535 25314163 29330835 30916587 26518843
41763 26518843 20282115 17017171 14331415 7322526 -1505868 -3681331 3888565 14898494
41755A4898494P176241K072308j457762m714354o311108l068871K272447K638788
41747A3506183k451296n279936j883273J806689k82303n075026n857077j806526
41739g322565L181316O747069P949565N021792j158622m871003k530182J330042
41731H347412R29068j249074J121785O829591Q398582M004484j55274j57465R40984
41722B9010093O26057J341156L815234L096831l349018q950670n909819L367801
41714B3047665R186535P477426L405908J721726p8378n583709j0996224q831600
41706A9349349K94406N518118j117553j3035417j6300371p364020L035856N185466
41698d434166K271664K209327M287592K371310k197738j112688P030296J2644945
$$ plain form
41755 14898494 22074735 24147043 22689281 17974927 11663819 8594948 10867395 13506183
41747 13506183 11054887 5774951 3891678 5698367 5416064 341038 -5516039 -7322565
41739 -7322565 -4141249 2605820 10555385 15577177 14418555 9547552 7017370 8347412
41731 8347412 9276480 8027406 9149191 15978782 24377364 28381848 28226574 28069109 29010093
41722 29010093 29636150 30977306 34792540 37889371 34540353 25589683 19679864 23047665
41714 23047665 32234200 39711626 43117534 44839260 44760882 39177173 28180949 19349349
41706 19349349 19643755 25161873 24044320 11008903 -5291468 -12655488 -9619632 -4434166
41698 -4434166 -2162502 46825 4334417 6705727 4507989 3395301 10425597 23070542
41690B3070542Q166926j902857p950283o740817j926795K226692L268451L78448
41682A8590307m010168n087889j549833K074168J802065l72741n95734Q36121
41674A1686296J364853Q61784M09488n94525k011007q31933L832037O766847L178714
41665B4662554l336747n405978k563689p63338k230310k808964J23335L545446
41657A1222309L987249J536732k454943o652876p983907m085538J488850K303204
41649f38920j432980k644472J539428N574709N300053M278778N551827M595675
41641B2124098k413509r417809q131568p82206L630807K932782K380201L514972
41633A3837768K557775p2763R03810M854770M119881k575794n650116N45058P669782
$$ plain form
41690 23070542 31237468 29334611 21384328 14643511 12716716 14943408 18211859 18590307
41682 18590307 14580139 9492250 7942417 10016585 11818650 11445909 10850175 11686296
41674 11686296 13051149 13912933 14322421 13727896 11716889 10884956 14716993 21483840 24662554
41665 24662554 21325807 15919829 13356140 12592802 10362492 7553528 7676863 11222309
41657 11222309 15209558 16746290 14291347 7638471 -345436 -4430974 -2942124 -638920
41649 -638920 -2071900 -4716372 -3176944 2397765 7697818 11976596 17528423 22124098
41641 22124098 19710589 10292780 2161212 1379006 5009813 7942595 10322796 13837768
41633 13837768 16395543 16322780 17226590 22081360 26201241 23625447 17975331 18520389 26190171
41624B6190171N985779q32726k975651k92687L27338q57296K510954Q916925R048242
41615D8021049J665259k865740Q94923M768064J278949l448526k8268Q650746
41607E8936456J2481247R771912P391771Q052589P712382M992166L740641N397695
41599A18476859P097436Q786029J4422925K3864442L0842880L2288794L3349219
41592B69128584L9021631M5600426M4736723L3095554J5063366j698545j1666020
41585D33281719j5012753j6577978j8660876j6173975m212341J1010397J7246028
41578C90900221J3290510J1245739J7712159K2433986J2870036p733797k5668806
41571D35050048l4507192l8109581l9777187l8413326l4365127l0444051k6839117
$$ plain form
41624 26190171 32175950 31343224 28367573 28074886 28402224 27544928 30055882 38972807 48021049
41615 48021049 49686308 46820568 47715491 52483555 53762504 50313978 50285710 58936456
41607 58936456 71417703 81189615 88581386 96633975 104346357 109338523 113079164 118476859
41599 118476859 125574295 134360324 148783249 172647691 203490571 235779365 269128584
41592 269128584 308150215 353750641 398487364 431582918 446646284 444947739 433281719
41585 433281719 418268966 401690988 383030112 366856137 362643796 373654193 390900221
41578 390900221 404190731 415436470 433148629 455582615 468452651 460718854 435050048
41571 435050048 400542856 362433275 322656088 284242762 249877635 219433584 192594467
41564A92594467k1617233j6058652j3503647j3442352j2430974j0011969q246812
41557I7282828o890546m897506m663861q006867j0131970n600250J429423K034164
41549F0555415l315355n608146k596018j929187o546015q571323k945048L362574
41541C2406897K746979j336178k106227j282771l934697p216335m334410L231631
41533A8174889O861297L168765k600714n314335n221866m078562k027785L55856
41525I317545J352714P45526L09850J214664L004038M619210M624741J895557
41517B7083845j976821l182170q68074J011672k53870j787920n63035P14791j614392
41508A8564026m794793l434471J435222L783428J912599m38093j745176m083183
$$ plain form
41564 192594467 170977234 154918582 141414935 127972583 115541609 105529640 97282828
41557 97282828 90392282 85494776 80830915 72824048 62692078 57091828 58521251 60555415
41549 60555415 57240060 51631914 49035896 47106709 40560694 31989371 29044323 32406897
41541 32406897 35153876 33817698 31711471 30428700 26494003 19277668 14943258 18174889
41533 18174889 25036186 28204951 25604237 20289902 15068036 10989474 8961689 9317545
41525 9317545 10670259 11415785 11725635 12940299 15944337 20563547 25188288 27083845
41517 27083845 25107024 21924854 21056780 22068452 21814582 20026662 19463627 20178418 18564026
41508 18564026 13769233 10334762 11769984 15553412 17466011 17027918 15282742 11199559
41500A1199559o357671m092421J663113K919129l325311q282651k835760Q586342
41492e25671J2991363O032546l063736m652563j98547K738682K096906K071246
41484A7490226M068493L628385j637561o513731n114314J09383K102923K47419
41476A4381223P84692N682312Q295741L318138m884623q441522o080378k247741
41468A0807842L08142J878380K270987J111860J42661R16556J739507O78063n00654
41459A9353344O29398K601700K833677K228821K285468Q38270l501735n936593
41451B1332350j767253M472215M612485J30882L27684O939386J0622292N444465
41443E2114506k357401m474927j632339N04651J03347j499851l927351n975221
$$ plain form
41500 11199559 4841888 749467 2412580 5331709 2006398 -6276253 -9112013 -525671
41492 -525671 12465692 18498238 15434502 10781939 10583392 13322074 15418980 17490226
41484 17490226 21558719 25187104 23549543 17035812 11921498 12030881 14133804 14381223
41476 14381223 15165915 20848227 29143968 32462106 27577483 19135961 13055583 10807842
41468 10807842 11115984 12994364 15265351 16377211 16519872 17436428 19175935 19853998 19353344
41459 19353344 19982742 22584442 25418119 27646940 29932408 30770678 27268943 21332350
41451 21332350 19565097 24037312 28649797 28780679 29108363 36047749 46670041 52114506
41443 52114506 49757105 45282178 43649839 44154490 44257837 42757986 38830635 32855414
41435C2855414m270635J179850M232589O02315m983439m977855M87550M586166
41427B9711955L266098j116691m270356l897729j97629M118748N262106K369533
41419C5246035j306370k969562l428871l715824k330878R71124K565818L51876
41411B5383348j819039o7795K407816R9769n289593o786397k721864J245895J071753
41402A3523893p99011p90748R46663K920210M798007N233467J486587n641354
41394B1677714r722338n282506M909057J2040706J0369455K439947m345136n053257
41386B7033642j277768J450164K28992j865755j61051M650005O636793K491277
41378C9186299l573264n139739j903194P05801l76038k219617j711753r17841
$$ plain form
41435 32855414 28584779 29764629 33997218 34599533 29616094 24638239 25125789 29711955
41427 29711955 32978053 31861362 27591006 23693277 23495648 27614396 32876502 35246035
41419 35246035 33939665 30970103 27541232 23825408 21494530 22465654 25031472 25383348
41411 25383348 23564309 23496514 25904330 26004099 20714506 13928109 11206245 12452140 13523893
41402 13523893 12724882 11934134 12880797 15801007 20599014 25832481 27319068 21677714
41394 21677714 11955376 6672870 11581927 23622633 33992088 36432035 32086899 27033642
41386 27033642 25755874 27206038 27435030 25569275 25408224 30058229 36695022 39186299
41378 39186299 35613035 30473296 28570102 29275903 28899865 26680248 24968495 24050654
41370B4050654l059000n976784m828395k46226K232418J393285K115174N499052
41362B1180178M960497k410912p881044k948292O210476O732508j598452o878116
41354A7366843m160158j138368k758316l325541Q75257L269410j084916n720343
41346C323868l855159j45612j318523l207950J213322P321303N390750k318748
41338F403251m389855J398274N459299K602990j213611n87552J471551Q41057
41330A1985404j122809j776052j243243q631J500098K81443n377472r642168n387823
41321a0791253L084338L935877l853030p487120Q0403Q997095P838812K39638
41313B044760k604796J351444N152282M691084J651251k063590n138410m509988
$$ plain form
41370 24050654 20991654 15014870 10186475 9940249 12172667 13565952 15681126 21180178
41362 21180178 26140675 23729763 15848719 12900427 19110903 25843411 24244959 17366843
41354 17366843 13206685 12068317 9310001 5984460 6859717 10129127 9044211 3323868
41346 3323868 -531291 -676903 -1995426 -5203376 -3990054 3331249 8721999 6403251
41338 6403251 2013396 3411670 8870969 11473959 10260348 9672796 11144347 11985404
41330 11985404 10862595 9086543 7843300 7834669 9334767 9616210 4238738 -5403430 -10791253
41321 -10791253 -7706915 -3771038 -7624068 -15111188 -15030785 -6033690 1805122 2044760
41313 2044760 -560036 791408 5943690 10634774 12286025 10222435 5084025 574037
41305E74037J109427P179787Q078013L795593k160324p895683j1527842q996753
41297i843745K79772R078776J0106506N258704J319262j55195j993417l761189
41289A0289474k723303l94531m06716j237225J212790M811089L211978l258971
41281A1504585o959180m344142k91493Q45910R90176K293355K383735k15549j601379
41272D606018J773493O785376P559745L233768j809976l805823k999726k218758
41264A3124117l504156n388643l942231J486290N149530J698388n052684o140596
41256b569985l83218L942350K324268P68342M462459P360539J314550r240135
41248G979170j1691584l284945M764927L228719l063077l547484L177398Q519224
$$ plain form
41305 574037 1683464 8863251 16941264 20736857 18576533 10680850 -846992 -9843745
41297 -9843745 -9563973 -485197 9621309 14880013 16199275 16044080 14050663 10289474
41289 10289474 7566171 7171640 6764924 5527699 6740489 11551578 14763556 11504585
41281 11504585 4545405 201263 -90230 755680 1745856 4039211 6422946 6207397 4606018
41272 4606018 6379511 13164887 20724632 23958400 22148424 18342601 15342875 13124117
41264 13124117 9619961 4231318 289087 1775377 6924907 8623295 3570611 -2569985
41256 -2569985 -2953203 989147 3313415 4081757 8544216 15904755 17219305 7979170
41248 7979170 -3712414 -6997359 -2232432 996287 -2066790 -5614274 -2436876 6082348
41240F082348N593136l244404j0162823r588961k107794O442492R351705M986758
41232G352457j047545j926243J889822L359941p14112m314840j146375M690272
41224H143377L597748m872936r999946m736850M516766P555056L901576M13837
41216H518628k59654j070100k606947j955926M25500K02596l131005m780025k766595
41207g423528r34047j199799M31322N908289R363087N228895k298741m555246
41199D520232n37492K926892K080445P58244L048805O675303O159930j35113q026207
41190A7471039j1416364p746375o31074L222103Q85385l735693m880258j515606
41182h346843K749983M503731K821317j465957n599117n453026n4803N379961
$$ plain form
41240 6082348 11675484 8431080 -1731743 -11320704 -13428498 -6986006 2365699 7352457
41232 7352457 6304912 4378669 6268491 9628432 8914320 4599480 3453105 8143377
41224 8143377 11741125 6868189 -3131757 -7868607 -3351841 4203215 8104791 8518628
41216 8518628 8258974 7188874 4581927 2626001 3051501 3254097 123092 -4656933 -7423528
41207 -7423528 -8357575 -9557374 -9126052 -3217763 6145324 11374219 9075478 4520232
41199 4520232 3982740 6909632 8990077 9748321 12797126 19472429 25632359 25497246 17471039
41190 17471039 6054675 -1691700 -2322774 899329 1784714 -1950979 -6831237 -8346843
41182 -8346843 -5596860 -1093129 1728188 262231 -5336886 -10789912 -10844715 -5464754
41174e464754N021716M49136j600560N31219J205439k752745o050158k869129
41166a1529836L672223N703657J963338j053324R14779M388496M279102J026519
41158I364954j314390j191596l79741j77068o4063J97186j2890l46870L65374
41149F440896J388679K8061m095771o926075m736519K30304K052898r97201m099051
41140a0713779k572509J863442L832501J603351j188718p98688K178114M336125
41132a460161L739311J472525l10973o63044k8626R95679K135602K545243O83129
41123I108685l455460o518645m536938J714400O284916M819140J23470j576282
41115E963286J017952K955625M36828l856888m896991k412775o57920j687756
$$ plain form
41174 -5464754 -443038 6098 -1594462 -1063243 142196 -2610549 -8660707 -11529836
41166 -11529836 -7857613 -2153956 -190618 -1243942 -329163 4059333 8338435 9364954
41158 9364954 8050564 6858968 6479227 6302159 6238096 6435282 6422392 6075522 6440896
41149 6440896 7829575 7857636 3761865 -3164210 -7900729 -7670425 -5617527 -6614728 -10713779
41140 -10713779 -13286288 -11422846 -7590345 -5986994 -7175712 -7974400 -5796286 -1460161
41132 -1460161 2279150 3751675 3440702 2777658 2749032 3744711 5880313 8425556 9108685
41123 9108685 5653225 -865420 -5402358 -3687958 2596958 7416098 7539568 5963286
41115 5963286 6981238 9936863 10373691 6516803 1619812 -792963 -1450883 -3138639
41107c138639k252576J221903O798690Q717192M498124j956356n100054l817615
41099D970669j360077m99606r18180j179701j008275p71831l61955K20706K73382
41090f34868m57598q91024k895J597807K526053K314533J178019r79493l788927
41081H61607n378571m092496j143380L84060m92709j486991n01238J543799K583178
41072g722741K629143L188081M078388L072580o55210m446672n016038k565575
41064g438044k13379O15854J952711N227069P598615N167254q89275m746549l248322
41055D025934K36840R26940j083913k177858q47109J179835K376751K729352J937103
41046I303875n33108l339943m124388l023086k526389l114473k143812J459395
$$ plain form
41107 -3138639 -5391215 -4169312 2629378 11346570 15844694 13888338 8788284 4970669
41099 4970669 3610592 3110986 2192806 1013105 4830 -767001 -1128956 -908250 -634868
41090 -634868 -1092466 -1983490 -1986385 -388578 2137475 4452008 5630027 4650534 861607
41081 861607 -4516964 -8609460 -9752840 -9368780 -9861489 -11348480 -11849718 -10305919 -7722741
41072 -7722741 -5093598 -1905517 2172871 5245451 4590241 143569 -4872469 -7438044
41064 -7438044 -7651423 -7035569 -5082858 144211 7742826 12910080 12020805 7274256 4025934
41055 4025934 4262774 5189714 4105801 1927943 1080834 2260669 4637420 7366772 9303875
41046 9303875 8770767 5430824 1306436 -1716650 -4243039 -7357512 -9501324 -8041929
41038h041929M473327L803026J283597J042175L470961M996016L346366O4449
41030A4437988k463331l803691m385782l751749j506764R70173J308050j207733
41022d02839m351918m724478j144301L663897N444736K933250p97828k278578
41014a658059j817912k080012l274888k488896J458303N049940M175091o6258
41006g02691k368759k03544K704617J431838l156538n011578p00333N696413P178921
40997D868346K230258l534068m179630J04244M313571M776501K305207j03356
40989A0781073q78682q21106j491477l250499m691438m028609j214614J691094
40981c904258K541530R11085k365087o198714q741360p266370q47767P049621
$$ plain form
41038 -8041929 -3568602 234424 1518021 2560196 6031157 11027173 14373539 14437988
41030 14437988 11974657 8170966 3785184 33435 -1473329 -503156 804894 -402839
41022 -402839 -4754757 -9479235 -10623536 -6959639 -1514903 1418347 620519 -1658059
41014 -1658059 -3475971 -5555983 -8830871 -11319767 -9861464 -4811524 -636433 -702691
41006 -702691 -3071450 -3274994 -570377 861461 -2295077 -7306655 -8006988 -2310575 4868346
40997 4868346 7098604 3564536 -615094 -510850 3802721 8579222 10884429 10781073
40989 10781073 9902391 9081285 7589808 4339309 -352129 -4380738 -5595352 -3904258
40981 -3904258 -1362728 -451643 -2816730 -9015444 -17756804 -25023174 -25870941 -18821320
40973a8821320J0893464Q614632L302809r07429k762535l073584k212727k21927
40965e188617J810776K357972J124457r13243k578754k843205j155719J383113
40957f003220K187487O5394k734405k885471O1642L426680M503237K573238j213265
40948a8683m102814k912732K389506O803329N237566m17847k786592J180171N700127
40939A1072031M178599j571225m396865k301541o29875l265873o617419n175105
40931h707273K71169M006127L678261K901428M828493O932974M882821o12132
40923A8181868m413618l948956k059293k064095l264433l252707j900822l00775
40915c022831K043246N507598P420851M982917M64325r70037J156453J874973
$$ plain form
40973 -18821320 -7927856 686776 3989585 3082156 319621 -2753963 -4966690 -5188617
40965 -5188617 -3377841 -1019869 104588 -808655 -3387409 -6230614 -7386333 -6003220
40957 -6003220 -3815733 -3750339 -6484744 -9370215 -9308573 -5881893 -1378656 1194582 -18683
40948 -18683 -4121497 -7034229 -4644723 2158606 7396172 6978325 4191733 5371904 11072031
40939 11072031 15250630 13679405 9282540 6980999 6351124 3085251 -3532168 -8707273
40931 -8707273 -8436104 -4429977 -751716 2149712 6978205 13911179 18794000 18181868
40923 18181868 13768250 9819294 7760001 5695906 2431473 -821234 -2722056 -3022831
40915 -3022831 -979585 4528013 11948864 16931781 17396106 16426069 17582522 19457495
40907A9457495j412834n292618o538641o873996q121295p380865k074502L784858
40899a4452398M396591J157757M46417L191425L433727j590271o277505m640202
40891a4334459J179884M276422K136949j268406j407235J678722M161683K966486
40883f09954p23623k735279j249230M68955j123515l679565j604081N086098R237639
40874C067445N820405j233134m360940j654218K389438L386570J098716k008950
40866F505332l452990k275222L04522K061974K422403K897657M237438M886426
40858A7587540L265015k30107m340829p759617q008434k847209N206028R085586
40850A1957973M925850k910270p465793p228446n220583k926446J93403K802406
$$ plain form
40907 19457495 18044661 12752043 6213402 -660594 -8781889 -16162754 -18237256 -14452398
40899 -14452398 -10055807 -8898050 -8451633 -5260208 -1826481 -3416752 -9694257 -14334459
40891 -14334459 -13154575 -8878153 -6741204 -8009610 -9416845 -7738123 -3576440 -609954
40883 -609954 -1333577 -4068856 -5318086 -4849131 -5972646 -9652211 -11256292 -6170194 3067445
40874 3067445 8887850 7654716 3293776 1639558 4028996 7415566 8514282 6505332
40866 6505332 3052342 777120 1081642 3143616 5566019 8463676 12701114 17587540
40858 17587540 20852555 20622448 16281619 8522002 513568 -2333641 2872387 11957973
40850 11957973 16883823 13973553 6507760 -720686 -5941269 -8867715 -8674312 -5871906
40842e871906K403466k26023j580404o00127M47126M86792J256723L532035M990407
40833D838089L306367o11950l461115k572213J638873N155249L605759k239726
40825I659333o128950l955907O00653J514633j011181k124026m35261J218579
40817f62127J884985K856212K416413k330093p638921n393757M136201J0074426
40809E343339O033875m48484j53926L269547L08109p457493q660893q5050P392642
40800E541666M259992m380758o703763l22282N862680M296963k401975o290740
40792a38217m091480J97770J474283l73101j632518m87584Q76645J62415j384863
40783e396650q29432K246947N171576N308112K488513j240877l380429l097450
$$ plain form
40842 -5871906 -3468440 -3694463 -5274867 -5874994 -5427868 -4941076 -3684353 -152318 4838089
40833 4838089 8144456 7532506 4071391 1499178 3138051 8293300 11899059 9659333
40825 9659333 3530383 -425524 175129 1689762 678581 -1445445 -1880706 -662127
40817 -662127 1222858 4079070 6495483 4165390 -3473531 -8867288 -4731087 5343339
40809 5343339 11377214 10928730 10774804 14044351 14352460 6894967 -1765926 -1850976 5541666
40800 5541666 9801658 5420900 -1282863 -1605145 4257535 8554498 6152523 -138217
40792 -138217 -4229697 -4031927 -2557644 -2930745 -4563263 -5050847 -4174202 -4011787 -5396650
40783 -5396650 -6226082 -3979135 1192441 6500553 8989066 7748189 4367760 1270310
40775A270310k293731l561355o338882o661695k159479M174867P190269N551755
40767b827941K387803O47606K28037j78145n90332p5652J527522L061245K992374
40758G172517Q60229k005143l580629l262971k276454j678038j010279L42317
40750e438451J615326J737506J173930J264281J993229J768290k57491k445941
40742A410679j967412J943048O351375P164853L627809r31019l512689m634893
40734I451751n435254m232566K97958M356643K743071k732969m276865J002652
40726A174421O795666O825211L069745Q97161P21890l77846k208017k375863j703846
40717A2818522l184650o273221p070271m138108j33311K385272L248826K690482
$$ plain form
40775 1270310 -1023421 -4584776 -10923658 -17585353 -19744832 -15569965 -8379696 -2827941
40767 -2827941 -440138 207468 435505 257360 -332972 -408624 1118898 4180143 7172517
40758 7172517 8032746 6027603 2446974 -815997 -3092451 -4770489 -5780768 -5438451
40750 -5438451 -3823125 -2085619 -911689 352592 2345821 4114111 3856620 1410679
40742 1410679 -556733 1386315 7737690 14902543 18530352 17599333 14086644 9451751
40734 9451751 4016497 -216069 81889 4438532 7181603 4448634 171769 1174421
40726 1174421 7970087 14795298 17865043 18762204 19484094 19106248 16898231 14522368 12818522
40717 12818522 9633872 3360651 -3709620 -7847728 -7981039 -5595767 -2346941 343541
40709C43541L43944l106202n427827m562725k31888N230793P470263M209344n68423
40700C700820n19653L641033M179653j380536n008287p53384M487577J391435
40692I738658o204686o968350k5338M708376L120427J300680K092854P990o442713
40683A327898r214918l822303K167472J248371k034193K64790N886742O831393
40675B655252K524892q25382r85071j068490j907524j094726R24383Q27529j395785
40666c44922k160557m99128O16216l56331j323616m08315J595540L203485L938888
40657D261260L818414L094099K172976O60390k018378m216197l278359n30011
40649C964194q82449n027940o891357k621394K867463L328698M44506l45055J004480
$$ plain form
40709 343541 687485 -2418717 -7846544 -12409269 -12641157 -7410364 59899 4269243 3700820
40700 3700820 3181167 6822200 11001853 9621317 4613030 3859646 8347223 9738658
40692 9738658 3533972 -3434378 -3459716 1248660 4369087 5669767 7762621 7770611 1327898
40683 1327898 -7887020 -11709323 -9541851 -8293480 -10327673 -10062883 -4176141 2655252
40675 2655252 5180144 4354762 3369691 2301201 393677 -701049 223334 1050863 -344922
40666 -344922 -2505479 -3004607 -2388391 -2744722 -4068338 -4476653 -2881113 322372 4261260
40657 4261260 8079674 11173773 13346749 14007139 11988761 7772564 4494205 3964194
40649 3964194 3081745 -1946195 -8837552 -11458946 -8591483 -5262785 -4818279 -5163334 -4158854
40640d158854J061139L43406J253671J633948j385924l575997J163187R029068
40632E363644R575904J138107o468961o145157j385246K147926L922518M218457
40624A2367192J122638l841432m663647n8675L190066P38126k459833j169216
40616E225219J107451j157302n448136n281321l56808M328819O295192N977092
40608A0690206K458967m192282q665370n682885J601545N049524K580325n84919
40600C255111j093170j001876j647602q75501J487200J354405l032959o606397
40592h160789l555512M431187R523384O610355j418833p068192n683022M57971
40584d863451M860433L260574k875629q654793j0009819n817025J554720O742702
$$ plain form
40640 -4158854 -3097715 -2754309 -1500638 133310 -1252614 -4828611 -3665424 5363644
40632 5363644 14939548 16077655 9608694 3463537 2078291 4226217 8148735 12367192
40624 12367192 13489830 9648398 4984751 4926076 8116142 8854268 6394435 5225219
40616 5225219 6332670 5175368 -272768 -5554089 -5910897 -1582078 4713114 10690206
40608 10690206 13149173 8956891 291521 -5391364 -3789819 1259705 3840030 3255111
40600 3255111 2161941 1160065 -487537 -1363038 124162 1478567 -1554392 -8160789
40592 -8160789 -11716301 -7285114 2238270 8848625 7429792 361600 -5321422 -4863451
40584 -4863451 -3018 3257556 381927 -8272866 -18282685 -24099710 -22544990 -15802288
40576a5802288N301535q36642m358796j381772L468461L777597J95423j663671
40568a1300153J51768K630410M004093N616058P264072N984246J118420l502989
40560A1965925m333546k032446O73152K031449J046567k461404n902625n086437
40552d099365M90140N899047O457190L187346M99325O5095n54803l709645p946841
40543B87489q972464m212518L430922P311067L977545k450659n114148k957674
40535h700440j189598k992042m769298j764128M616483Q215170N580348o16505
40527a620010n210423n547979k693639Q40246L478107M710229L925453Q62068
40519a255948k504836k842769K48106L033331K780590J407147J020708p13774
$$ plain form
40576 -15802288 -10500753 -11337395 -15696191 -17077963 -13609502 -9831905 -9636482 -11300153
40568 -11300153 -11148385 -8517975 -4513882 1102176 8366248 14350494 15468914 11965925
40560 11965925 7632379 5599933 6273085 8304534 9351101 6889697 987072 -4099365
40552 -4099365 -3609225 2289822 8747012 11934358 12433683 12498778 11943975 8234330 287489
40543 287489 -8684975 -12897493 -9466571 -2155504 1822041 -628618 -5742766 -8700440
40535 -8700440 -9890038 -12882080 -17651378 -19415506 -14799023 -6583853 -1003505 -1620010
40527 -1620010 -6830433 -12378412 -15072051 -14231805 -10753698 -6043469 -2118016 -1255948
40519 -1255948 -3760784 -6603553 -6355447 -3322116 -541526 865621 1886329 1172555
40511A172555n618371q503463l199861O056722Q193723J432818l500780L66770
40503c599887O315216O066311K841840L691578O012469K464133n124277q126069
40495A0541314n328482l616901m928559l743559J121204L257694K91017j533889
40487c940161J313978L529857J635061J082417N375697P094403n84197j0522750
40479D984305j0942999l257717J300785n5328L08342M403448M118839l589390
40471b729715r022984m024281N144278P294190K298951r77899J236916M228715
40463C448171L987142J991203J84061k513735o501779q544995n342923J668091
40455a1624764O988165O388528J219251k884606k336141M7851p47701l969818
$$ plain form
40511 1172555 -4445816 -12949279 -16149140 -10092418 -1898695 -465877 -3966657 -3599887
40503 -3599887 2715329 8781640 11623480 15315058 21327527 23791660 18667383 10541314
40495 10541314 5212832 1595931 -3332628 -7076187 -5954983 -2697289 -2406272 -3940161
40487 -3940161 -2626183 903674 2538735 3621152 8996849 16091252 15507055 4984305
40479 4984305 -5958694 -9216411 -7915626 -7970954 -7662612 -3259164 859675 -2729715
40471 -2729715 -11752699 -15776980 -10632702 -3338512 -1039561 -2017460 -780544 3448171
40463 3448171 7435313 9426516 9610577 7096842 595063 -7949932 -13292855 -11624764
40455 -11624764 -4636599 1751929 2971180 86574 -2249567 -2201716 -2949417 -6919235
40447f919235l597291K113915O793570M942893p4736j897131q32343j295462k665656
40438c431476n12527M109505M826139M06616k703381q60266R32871k213756o491943
40429e938218n116219J295094N800930M665267Q75793j158954n39486O47462L67809
40420H99478j094201j178102J712004M960163M210539l81096l752677l070882
40412B305226j344027j764607k693565j615589j20390n82399j145999R65311L585596
40403b410443K473926j416354k952028n51937K158842K485384J775410J773449
40395C336249J916812J251811o3523j808666l712090m412280k856242k55276J704397
40386d898808L268396M419211K562934l191242p403064l774560N236032J0133648
$$ plain form
40447 -6919235 -10516526 -8402611 -1609041 3333852 3259116 1361985 529642 -765820 -3431476
40438 -3431476 -3944003 165502 4991641 5398257 2694876 1834610 2767481 553725 -5938218
40429 -5938218 -11054437 -9759343 -3958413 706854 1582647 423693 -115793 531669 899478
40420 899478 -194723 -1372825 339179 5299342 9509881 9128785 5376108 2305226
40412 2305226 961199 -803408 -3496973 -5112562 -5232952 -5815351 -6961350 -5996039 -2410443
40403 -2410443 63483 -1352871 -4304899 -4856836 -2697994 -212610 1562800 3336249
40395 3336249 5253061 6504872 6441349 4632683 920593 -3491687 -6347929 -6603205 -4898808
40386 -4898808 -1630412 2788799 5351733 2160491 -5242573 -9017133 -3781101 6352547
40378F352547O239574j501403o160512n787777j796777L784146P465068N887495
40370A4482361O50477k669883j885936j25632M92604J348562K025359o02997n058027
40361H656888m224844L640839R447331N037542m825752r223752n871115j688704
40353I48433j143411j755054o84062J053635J876740K027881J592210j7833j832643
40344B065896j767561O0992R69396p94306l783648m756211j867143K652863L446336
40335c773386j613232o487513l274774N902268R858249L768805l753142l755851
40327c128576M34818Q85241j438036l57044L067060K493456j599742k270392K011771
40318I8556N369572M389623J226594k744793p235373p665662J4382Q933594P390685
$$ plain form
40378 6352547 12592121 11090718 4930206 -857571 -2654348 1129798 8594866 14482361
40370 14482361 15132838 12462955 10577019 10451387 10943991 12292553 14317912 13714915 8656888
40361 8656888 4432044 8072883 17520214 22557756 17732004 8508252 2637137 948433
40353 948433 -194978 -1950032 -2634094 -1580459 296281 2324162 3916372 3898539 2065896
40344 2065896 298335 359327 1328723 534417 -3249231 -8005442 -9872585 -7219722 -3773386
40335 -3773386 -5386618 -11874131 -15148905 -9246637 611612 4380417 627275 -3128576
40327 -3128576 -2693758 -1808517 -3246553 -3603597 -536537 1956919 357177 -1913215 98556
40318 98556 5468128 9857751 11084345 8339552 1104179 -6561483 -6547101 2386493 9777178
40309I777178k980530p542059n19068O565111M062881j440660p57849J997147
40301I162151j115340o005134l766587K599452K759232l105173m772175O59027
40293c584547M787044K404630j592499k328823j810864k219856j215551K036295
40285c524171L770559K576194K371125M344971L267967k818977o353589j135761
40277B498318N981415L407720p804847j4434760r256756J60763L701582J960352
40269a3786213J722086L782012L051380j097250k577700J817250P051742P382237
40261G345544M139229J614265l96140l894336n639183o41596P679302Q943609
40253A9150694k31714j0540452j1911862n469995O96316K595781J816224j9316
$$ plain form
40309 9777178 6796648 -745411 -1264479 5300632 9363513 7922853 7165004 9162151
40301 9162151 8046811 2041677 -1724910 874542 3633774 528601 -4243574 -3584547
40293 -3584547 1202497 3607127 2014628 -314195 -2125059 -4344915 -5560466 -3524171
40285 -3524171 246388 2822582 5193707 9538678 12806645 9987668 3634079 2498318
40277 2498318 8479733 11887453 4082606 -10352154 -19608910 -19448147 -15746565 -13786213
40269 -13786213 -12064127 -8282115 -5230735 -6327985 -8905685 -7088435 -36693 7345544
40261 7345544 11484773 13099038 12702898 8808562 3169379 2527783 10207085 19150694
40253 19150694 18918980 8378528 -3533334 -9003329 -8307013 -5711232 -3895008 -3914324
40245c914324k059375j758093K456539P025793O792998K063357k183552l192788
40237E230555k101459K60281M026706O752846M454309k372228p683967o551733
40229B015310l62324N450170O591177K585033l250949o126101m000694N25482
40221C427104L781988M974401M706822K260505k095790m557331k299495J222876
40213A1421080P75376k290919k320314P91609J263092k283408l808544J75530
40205C723502M576596L825757K54290o50291J095804J503093l24754k073192l185176
40196H745629m813657n879501l997514j81809J658117M85650l25291J527180L424340
40187F43144J750794k217856l304598O96314N743095O656481L621527P99350n59875
$$ plain form
40245 -3914324 -5973699 -7731792 -5275253 1750540 8543538 10606895 8423343 5230555
40237 5230555 3129096 3389377 7416083 14168929 18623238 16251010 8567043 2015310
40229 2015310 1652986 7103156 13694333 16279366 13028417 6902316 2901622 3427104
40221 3427104 7209092 12183493 16890315 19150820 17055030 12497699 10198204 11421080
40213 11421080 12196456 9905537 7585223 8376832 9639924 7356516 3547972 3723502
40205 3723502 8300098 12125855 12380145 11729854 12825658 14328751 14003997 11930805 8745629
40196 8745629 3931972 -1947529 -5945043 -6126852 -4468735 -3983085 -4308376 -2781196 643144
40187 643144 2393938 176082 -3128516 -2432202 3310893 9967374 13588901 14388251 13828376
40178A3828376l351322q070483r942863n858801k8275J985673J519927L216569
40170f701199N740072L507884k917321o060367k654010J666966J537176p46657
40162f627456p99759M27631m25243k654522k675797N63309M885567P788588P637615
40153H119933M142226l83314k679232k970826m643758p976457q125761j964816
40145a6482005O467525J0386791P891622L016594J003026L453310O199268K745151
40137B4681282o799608j2420671o071823N079041O480823k842968q563828k881904
40129c339656M546138L488359j555791k143406p88508l304120n487063j054282
40121i638329M082289K16398q051984p362605K894127R586461O264306L58561
$$ plain form
40178 13828376 10477054 2406571 -7536292 -13395093 -13423368 -11437695 -9917768 -6701199
40170 -6701199 -961127 2546757 -370564 -6430931 -9084941 -7417975 -5880799 -6627456
40162 -6627456 -7427215 -6999584 -7424827 -10079349 -12755146 -12191837 -7306270 482318 8119933
40153 8119933 12262159 11878845 9199613 6228787 1585029 -6391428 -14517189 -16482005
40145 -16482005 -10014480 372311 8263933 11280527 12283553 15736863 21936131 24681282
40137 24681282 17881674 5461003 -610820 4468221 10949044 8106076 -457752 -3339656
40129 -3339656 1206482 4694841 3139050 995644 207136 -3096984 -8584047 -9638329
40121 -9638329 -5556040 -5339642 -13391626 -20754231 -17860104 -8273643 -2009337 -1650776
40113a650776j361892j022229p79580J590966M681306K647074l542473m865928
40105d303532J470959O803981M534513r99164l747956m252967l849100l75986
40097d719252M821110N012925j042183n439744l829094k004828l896829l840415
40089a4938310J555396M887973P84098l372272o56162J678295m803203j1823997
40081b6688182n656858R236423J4883835O191507l608081m440919r78737J26328
40073a0934684O37880L210714M732273L041424J637866K592077K236466j536777
40065E617239m564814l435088j101692j235858k303181j233457J461125L426813
40057c368913L501027J219289k467950l365943J447457O789321M210382m972345
$$ plain form
40113 -1650776 -3012668 -4034897 -4814477 -3223511 1457795 4104869 562396 -4303532
40105 -4303532 -2832573 3971408 8505921 7506757 3758801 -494166 -4343266 -4719252
40097 -4719252 101858 5114783 4072600 -1367144 -5196238 -7201066 -11097895 -14938310
40089 -14938310 -13382914 -8494941 -7710843 -11083115 -11739277 -10060982 -14864185 -26688182
40081 -26688182 -32345040 -23108617 -8224782 -2033275 -5641356 -10082275 -11061012 -10934684
40073 -10934684 -10296804 -7086090 -2353817 687607 2325473 4917550 7154016 5617239
40065 5617239 1052425 -2382663 -3484355 -4720213 -7023394 -8256851 -6795726 -3368913
40057 -3368913 132114 1351403 -1116547 -4482490 -3035033 3754288 7964670 2992325
40049B992325r619555m402650L094470M892884L247854K809603R06823n741511
40041a819757j1272649p732157J857159P154631N265168K649496K968045K347756
40033A417692j476805l475098J052401Q324490J0217082M380966l300748o027410
40025A1112570l683206k023540m547663p248833m081256L472278P137232L279789
40017C417371j811498j284934K720700L793614J338686k70338R1632k74765j341291
40008F379177K28264M782625Q191312P269328K467494m445848j0711162j1438629
40000B722561m102489N562143Q165875K216875m521212o113934m601977l442063
39992d114221j788448J226976K664421P17998j376077p78319j4651k069165m644427
$$ plain form
40049 2992325 -6627230 -11029880 -7935410 -3042526 205328 3014931 3921754 -1819757
40041 -1819757 -13092406 -20824563 -18967404 -11812773 -6547605 -3898109 -930064 1417692
40033 1417692 -59113 -3534211 -2481810 5842680 16059762 20440728 17139980 11112570
40025 11112570 7429364 5405824 858161 -6390672 -10471928 -6999650 137582 3417371
40017 3417371 1605873 320939 3041639 6835253 8173939 7903601 7995233 7720468 6379177
40008 6379177 6607441 11390066 19581378 26850706 29318200 24872352 14161190 2722561
40000 2722561 -1379928 4182215 12348090 14564965 10043753 3929819 -672158 -4114221
39992 -4114221 -5902669 -4675693 -2011272 -1293274 -2669351 -3447670 -3462321 -5531486 -10175913
39983a0175913l974270o06740L070385O917294R836012P382918j015686p045404
39975D388596l645774L414769L200576l660067o336908j163873L796364L266690
39967C260373K181325M204603L829733k925325q990281o200199J863284N937820
39959C161333M649849K797737O93509m316575q546868n413761K372690M922420
39951C20334M92729j918664K171678N497592J840278l580398l407650q2160k56495
39942A077244k907478k003697K144241L034108j371334n707178n386932j557541
39934a2678567K932878O982130R138802O816090J21423o295074p243923j717072
39926a943313O483300J1269915Q323074o33591p983163p470485j178655L344269
$$ plain form
39983 -10175913 -14150183 -14756923 -11686538 -4769244 5066768 12449686 11434000 4388596
39975 4388596 742822 4157591 7358167 3698100 -2638808 -3802681 -6317 3260373
39967 3260373 5441698 9646301 13476034 10550709 1560428 -4639771 -2776487 3161333
39959 3161333 7811182 10608919 11302428 6985853 -1561015 -6974776 -4602086 320334
39951 320334 813063 -1105601 1066077 6563669 8403947 4823549 1415899 1333739 1077244
39942 1077244 -1830234 -3833931 -1689690 1344418 -26916 -5734094 -11121026 -12678567
39934 -12678567 -9745689 -2763559 6375243 13191333 13312756 7017682 -226241 -1943313
39926 -1943313 4539987 15809902 24132976 23499385 15516222 8045737 6867082 10211351
39918A0211351K370300q70116k115495j252142n56187r98706j917847k273370
39910B597788j099721J595215L797475L101488k64767l652567n111408m415797
39902c452294j553646L051749O824814O438057J586576m622504q928903r535454
39894a0191605n625094J335611O542311O159913K520797R21430J701942P16029
39886D081334k396029l078271n02837l7818l609988m766453J119376P858219O821263
39877E488796j84743m407541l516810k747021l904647k581433K290134M822660
39869d740605J796429j271489J103330N005059L095525l154012m524417K634286
39861e5894J0528428R898436J483649o274808q410950p505695o921275n279109
$$ plain form
39918 10211351 12581651 11711535 9596040 8343898 7787711 6789005 4871158 2597788
39910 2597788 1498067 3093282 6890757 9992245 9727478 6074911 963503 -3452294
39902 -3452294 -5005940 -1954191 4870623 11308680 12895256 8272752 -656151 -10191605
39894 -10191605 -15816699 -14481088 -7938777 -1778864 741933 1663363 3365305 4081334
39886 4081334 1685305 -1392966 -1895803 -1933621 -5543609 -10310062 -9190686 -1332467 5488796
39877 5488796 5304053 896512 -2620298 -5367319 -9271966 -11853399 -9563265 -4740605
39869 -4740605 -2944176 -4215665 -3112335 1892724 4988249 1834237 -2690180 -55894
39861 -55894 10472534 20370970 21854619 15579811 7168861 -336834 -7258109 -12537218
39853a2537218m62091M645505N027164O98333l497097m742852m254654k494392
39845a7617302J919215P028409P330420K103577j535411J534908O466922N986163
39837A3216901J526716l14149P41802p98999n319618o653965k636676J070558
39829H32570K68267j912897j941182k117142n202279q100598o283546r22918L364476
39820b2015249N104432N672291M867235J683880j880928k300746O21241L678848
39812d568996M468433L076485P92634k57071K052496O252186O472451p05518r856913
39803G726187j1702203m280972N011679Q702751O417959K146205j328255l206627
39795I486724l038430r77690J497243K483783P08907l842628q499442q092471
$$ plain form
39853 -12537218 -12999309 -8353804 -3326640 -2628307 -6125404 -10868256 -15122910 -17617302
39845 -17617302 -15698087 -8669678 -1339258 764319 -771092 763816 7230738 13216901
39837 13216901 14743617 14429468 15171270 14372271 9052653 2398688 -237988 832570
39829 832570 1100837 -812060 -2753242 -4870384 -10072663 -18173261 -24456807 -25379725 -22015249
39820 -22015249 -16910817 -11238526 -6371291 -4687411 -6568339 -8869085 -8247844 -4568996
39812 -4568996 -100563 2975922 3768556 3511485 5563981 11816167 18288618 17583100 7726187
39803 7726187 -3976016 -8256988 -3245309 5457442 11875401 14021606 12693351 9486724
39795 9486724 6448294 5470604 6967847 9451630 10160537 6317909 -2181533 -10274004
39787a0274004k92414Q961496R865116P10131q503452p816259L46472M977137
39779b025777R34987n540410o132131n71101M758811N145059J496052k328995
39771d263505l157845j62815M300276N551250J132051m891933n259944J180645
39763e571820O604294L745092m260888q153074n208106j602593j655860j754889
39755a7857844J558699M058359Q61115l534658o87994P830725J0844853L368649
39747F441904o076593p544403k333314J539763J334464P14043J934461L461725
39739e27950M427458N723864O382857L654442k271068p294589q266997n999491
39731d171474k824974o4232J385728R21204j55240N67171L071700M593554L904564
$$ plain form
39787 -10274004 -10566418 -1604922 8260194 8970325 466873 -7349386 -7002914 -2025777
39779 -2025777 -1090790 -6631200 -12763331 -13334432 -8575621 -3430562 -1934510 -4263505
39771 -4263505 -7421350 -7584165 -3283889 2267361 3399412 -1492521 -6752465 -5571820
39763 -5571820 1032474 4777566 516678 -7636396 -12844502 -14447095 -16102955 -17857844
39755 -17857844 -16299145 -12240786 -11379671 -14914329 -15602323 -7771598 3073255 6441904
39747 6441904 365311 -7179092 -9512406 -7972643 -6638179 -5924136 -3989675 -527950
39739 -527950 3899508 9623372 16006229 19660671 17389603 10095014 1828017 -4171474
39731 -4171474 -6996448 -7060680 -5674952 -4753748 -4908988 -4341817 -1270117 3323437 7228001
39722G228001L149866L668547K759104k369169q909246j0230809l851694M647927
39714c907473P071163J327237o288371p777852j931472M650187N103844l42139
39706b094876n478182n426645j152593K821358L365682J229213k31445J302823
39698e664665M329257N345815L882263L294578M917283M759603l17546o144244
39690A4402344o363021k075233R8398j328216j544667O70258N11023k958964l358877
39681a946955J945258N728811K298255k630397j503614K270954Q28603l953464
39673C037451l824485J285224L648177J607095J394722M369531L994610j745246
39665A3767079n664867l299422R0101n76682k042532k20805K072655J405345P98283
$$ plain form
39722 7228001 10377867 14046414 16805518 14436349 5527103 -4703706 -8555400 -3907473
39714 -3907473 3163690 4490927 -1797444 -9575296 -11506768 -6856581 -1752737 -2094876
39706 -2094876 -7573058 -12999703 -14152296 -11330938 -7965256 -6736043 -6967488 -5664665
39698 -5664665 -1335408 4010407 7892670 11187248 16104531 20864134 20546588 14402344
39690 14402344 8039323 5964090 6062488 4734272 3189605 3859863 4370886 1411922 -1946955
39681 -1946955 -1697 5727114 8025369 5394972 3891358 6162312 6990915 3037451
39673 3037451 -787034 498190 4146367 5753462 7148184 11517715 15512325 13767079
39665 13767079 8102212 4802790 4892891 4316209 2273677 2052872 4125527 5530872 6329155
39656F329155L463955N410078J773831m167785n750897l000455q93010o87774
39648B477098J4265R83841p404j746691q86784K173349L698575J964844j663740
39639G007353n205503o312019l099851J769604K033425k970277n281858O4479
39631a1994647O361192N413097M53685l32100K039229P96469k687414r74144M941174
39622D016541O006697L90439m044462l986328m814975p750227n732825K989844
39614a2925296R140726O581027J462886M07689l9698m117424o773529k473436
39606h737055L895320M849464K327607J972950J722993k984552p805978n228250
39598i987501J559259K696488j873354k164086M881638R873041N707966k000074
$$ plain form
39656 6329155 9793110 15203188 16977019 12809234 7058337 4057882 3164872 2477098
39648 2477098 2491363 3475204 3467800 1721109 834325 3007674 6706249 8671093 7007353
39639 7007353 1801850 -4510169 -7610020 -5840416 -3806991 -6777268 -12059126 -11994647
39631 -11994647 -5633455 -220358 233327 -98773 1940456 2736925 49511 -924633 4016541
39622 4016541 10023238 10413677 6369215 2382887 -2432088 -10182315 -15915140 -12925296
39614 -12925296 -3784570 2796457 4259343 4667032 4627334 509910 -6263619 -8737055
39606 -8737055 -4841735 7729 2335336 4308286 6031279 3046727 -4759251 -9987501
39598 -9987501 -8428242 -5731754 -7605108 -9769194 -4887556 4985485 10693451 8693377
39590H693377m252247j155071N95381j866067n055844n087113k192415O12662
39582i707337J526361J694530K433735J895339k182244o356900l699195N379627
39574i016084J0834140O356194j137548k112684J446658J500424j383863j82082
39566F305155M292816L775022k468884n411776j567968J259306k078740n448403
39558a343472k988495N88161q64976l705414j532696K774027J903511k898779
39550h068133l545521J706877N723719L534204j410660l454867j664702J131217
39542f047866K283446J066369q12158l42646K734207M160640P59721l704009k907001
39533b809297K454423M936042J043831l792842l423823M72215J863797p33371
$$ plain form
39590 8693377 4441130 3286059 3881440 2015373 -3040471 -8127584 -10319999 -9707337
39582 -9707337 -8180976 -6486446 -4052711 -2157372 -4339616 -10696516 -14395711 -9016084
39574 -9016084 1818056 8174250 7036702 4924018 6370676 7871100 6487237 6305155
39566 6305155 10597971 14372993 11904109 6492333 4924365 6183671 4104931 -1343472
39558 -1343472 -4331967 -3743806 -4608782 -8314196 -9846892 -7072865 -5169354 -8068133
39550 -8068133 -11613654 -9906777 -4183058 -648854 -2059514 -5514381 -7179083 -6047866
39542 -6047866 -3764420 -2698051 -3510209 -3852855 -1118648 3041992 3801713 97704 -2809297
39533 -2809297 -354874 4581168 5624999 1832157 -1591666 -1119451 744346 10975
39525A0975l296878k809515l98779J913927L622864L973875J450374k867674m363050
39516b763881l76463N213713O313640K337010k081100m124753m817022m145683
39508d444539j92702N054454N332076o06633n057131k010812L474740L313804
39500D863257q17197j419013J250229R132n433358o685477r62545L509752J025608
39491d659612k278279P03937N879535M986379r36795m071560k392230r55954k085824
39482e810403k372125J70954K619356K201312N5363j287371o69214J917801N232566
39473B058239O482713M034084O0203k214147k845451l585596l486178m28101L699069
39464C774835M204101M23670l108966l368288k541427l331314m376274l066838
$$ plain form
39525 10975 -3285903 -6095418 -6494197 -4580270 -957406 3016469 4466843 1599169 -2763881
39516 -2763881 -3140344 2073369 8387009 10724019 8642919 4518166 -298856 -4444539
39508 -4444539 -4637241 417213 5749289 5142656 85525 -1925287 1549453 4863257
39500 4863257 4046060 2627047 3877276 3886408 -1546950 -8232427 -9194972 -5685220 -4659612
39491 -4659612 -6937891 -6233954 -354419 4631960 3695165 -376395 -2768625 -3724579 -5810403
39482 -5810403 -8182528 -8011574 -5392218 -3190906 -3135543 -4422914 -5092128 -3174327 2058239
39473 2058239 8540952 12575036 12635239 10421092 7575641 3990045 503867 75766 3774835
39464 3774835 7978936 8402606 5293640 1925352 -616075 -3947389 -8323663 -11390501
39456a1390501k74800Q96844j05327o56938Q44421K473644J700237m36514j96142
39447g145076L439763O362811M233629j674223o134225o467133m182964r86767
39439a2554185K496409M034949J127984l648550m101082M97583L465207J019829
39431g661856j724855Q9078K298633o32963m326709l20940R073439J1823072L118673
39422A1735572p304087p893823Q59097Q899128Q854742K496944k937512k761077
39414A1948984L73385J78327m226421o240847j582807M081100K882721l223491
39406D190951n537959j910197J246288J16825j587338l08846K177388L400491
39398A787603L508671K039455k260072o620203n868474p58328K120993N41616
$$ plain form
39456 -11390501 -11665301 -10768457 -10873784 -11530722 -10686301 -8212657 -6512420 -6948934 -7145076
39447 -7145076 -3705313 2657498 6891127 5216904 -917321 -7384454 -11567418 -12554185
39439 -12554185 -10057776 -6022827 -4894843 -8543393 -12644475 -12146892 -8681685 -7661856
39431 -7661856 -9386711 -9297633 -6999000 -7631963 -11958672 -12279612 -3206173 8616899 11735572
39422 11735572 4431485 -3462338 -2603241 6295887 15150629 17647573 14710061 11948984
39414 11948984 12322369 12500696 8274275 2033428 450621 4531721 7414442 4190951
39406 4190951 -1347008 -3257205 -2010917 -1894092 -3481430 -3790276 -1612888 1787603
39398 1787603 5296274 7335729 5075657 -1544546 -7413020 -8171348 -6050355 -5508739
39390e508739q34790j07175j304234m502515k773769N244140R527299L441428
39382C181645m402749k925744M106820N070318n57181l132356k29810K55509m823756
39373c457304p936714l541677L221884N284682L385190J901059R75830j621572
39365a788622m727477n067900k363253N45334J501833O28164p38549j109090P1928
39356a3047632J458633J028761j321329l551484l730247j357509K661652N731480
39348a2127675M736254l7810l624735k004086K424216M323967K752051R32115
39340b625703K58601m33165m96890J907215M710763L357530j541985l658426l7608
39331A440332M371388L771132j304792o285686p915997n054466J514439P376316
$$ plain form
39390 -5508739 -6343529 -6450704 -7754938 -12257453 -15031222 -9787082 -259783 3181645
39382 3181645 -1221104 -4146848 -40028 5030290 4473109 1340753 1110943 1366452 -3457304
39373 -3457304 -11394018 -14935695 -11713811 -6429129 -3043939 -1142880 -167050 -1788622
39365 -1788622 -6516099 -11583999 -13947252 -13401918 -11900085 -11271921 -12010470 -13119560 -13047632
39356 -13047632 -11588999 -10560238 -11881567 -15433051 -19163298 -20520807 -17859155 -12127675
39348 -12127675 -7391421 -7429231 -11053966 -13058052 -10633836 -6309869 -3557818 -2625703
39340 -2625703 -2367102 -2800267 -3297157 -1389942 3320821 6678351 5136366 1477940 1440332
39331 1440332 5811720 9582852 8278060 1992374 -5923623 -10978089 -9463650 -2087334
39323b087334O899903N97872l788066r92862M615914N359751M54781m293149m520323
39314B246487r44934L217113M838387K319290k554818n606341n234245m059729
39306e778790l667288j474799L861333P915347O063268M63177l450966m491781
39298e60499m411311k290191K973267O831751L563411m088313p476201m426494
39290i884580j213908j355201j042033J795577K629750r75090l584034n86722
39282a4216241L927523M425758L119032M482157N767394J787023m362592m911632
39274A8422n8242K645311J230810J581669N262329N447790p74574n420510j591990
39265H341015M862222L835293l760406p969448m586921O12011K080400J041800
$$ plain form
39323 -2087334 4812569 5410441 1622375 629513 5245427 10605178 11059959 6766810 2246487
39314 2246487 1301553 4518666 9357053 11676343 9121525 3515184 -1719061 -5778790
39306 -5778790 -9446078 -10920877 -7059544 855803 6919071 7382248 3931282 -560499
39298 -560499 -4971810 -7262001 -4288734 2543017 6106428 2018115 -5458086 -9884580
39290 -9884580 -11098488 -12453689 -13495722 -11700145 -9070395 -10045485 -13629519 -14216241
39282 -14216241 -10288718 -5862960 -2743928 1738229 7505623 9292646 4930054 18422
39274 18422 -39820 2605491 3836301 5417970 10680299 16128089 15353515 9933005 8341015
39265 8341015 13203237 17038530 13278124 5308676 721755 1333766 3414166 4455966
39257D455966M23027K8898n00157P42940M018412N558402K616977j988067l742327
39248A1614071k552836j620714k071524k501146k810341m344034o080081m746933
39240a5113538j00688L494474L075205J512456K470365L598996J54755n449791
39232f357766m777973L489568Q615977K142195q121926p611070L562321R667733
39224F09059J981248q547053p560224K643520Q559320N094125q88941l632282
39216a741228m038568k571532K584103Q348342P583535N09014l656202p68638
39208F248826J272058m414858j1744085j0815938k929797K608036K740919K399049
39200a4635790L934690M006129J256329p95346k4647J398227J921251K970041
$$ plain form
39257 4455966 4878993 4907891 4407734 5150674 9169086 14727488 17344465 15356398 11614071
39248 11614071 9061235 7440521 5368997 2867851 57510 -4286524 -10366605 -15113538
39240 -15113538 -15214226 -11719752 -8644547 -7132091 -4661726 -1062730 -907975 -6357766
39232 -6357766 -11135739 -7646171 969806 3112001 -5009925 -12620995 -9058674 609059
39224 609059 2590307 -5956746 -13516970 -10873450 -2314130 2779995 1891054 -1741228
39216 -1741228 -5779796 -8351328 -5767225 2581117 10164652 10673666 7017464 6248826
39208 6248826 7520884 3106026 -8638059 -19453997 -22383794 -19775758 -17034839 -14635790
39200 -14635790 -10701100 -6694971 -5438642 -6233988 -6258635 -4860408 -2939157 30884
39192C0884M764272M688020J793717j103455j659431j004829j122262k197537
39184D189379l569550m543516l809550r92377J200235j73151l315082l546394
39176a4560006l80880J692058L38135j322053k21935K054484K482725J059878
39168h857594k50259n80379m67002r48908k844714m862730l325503K746782P659074
39159a1731233N402974q66948k414829J977823M577681J871052j96222J901577
39151E21875J964940m227023q595778k262789Q502839R523533m62475p797027
39143b831905l620767M597753M909815l135799r397269o287597L120532R253397
39135c391840O533991p64388m250805k366813j185549l122768k052488N241492
$$ plain form
39192 30884 4795156 9483176 11276893 10173438 8514007 7509178 6386916 4189379
39184 4189379 619829 -3923687 -7733237 -8725614 -7525379 -7698530 -11013612 -14560006
39176 -14560006 -14940886 -13248828 -12910693 -14232746 -14454681 -12400197 -9917472 -8857594
39168 -8857594 -9107853 -9688232 -10155234 -11104142 -13948856 -18811586 -22137089 -19390307 -11731233
39159 -11731233 -6328259 -7195207 -9610036 -7632213 -3054532 -1183480 -1379702 521875
39151 521875 2486815 -1740208 -10335986 -12598775 -4095936 5427597 4965122 -2831905
39143 -2831905 -6452672 -1854919 3054896 -80903 -9478172 -15765769 -12645237 -3391840
39135 -3391840 3142151 2377763 -1873042 -4239855 -5425404 -8548172 -10600660 -5359168
39127e359168J0264540M562278n294011o137937J353950L886738k867793p968773
39119g560176l835522K326914K172066n54142R38895L943615K837711P60317L826134
39110D855812Q632674O380918l040669j0616357j0566120n201246J107281N243403
39102c204304M123885k151956o891110l835866L373555N974235K921938P53813
39094A064190J546308N11833l415508m177908J063716O200769M855455j276477
39086F372378o183683o515294k430605L329873N532604J178979m773156m725023
39078h213927J59064J940444k82224P53618N545844M598368m300187q918534j811918
$$ plain form
39127 -5359168 4905372 9467650 4173639 -1964298 -610348 3276390 408597 -7560176
39119 -7560176 -11395698 -9068784 -6896718 -7450860 -6511965 -2568350 269361 1029678 4855812
39110 4855812 13488486 19869404 16828735 6212378 -4353742 -9554988 -8447707 -3204304
39102 -3204304 919581 -1232375 -8123485 -11959351 -8585796 -2611561 310377 1064190
39094 1064190 2610498 3122331 -293177 -4471085 -3407369 2793400 7648855 6372378
39086 6372378 188695 -6326599 -8757204 -5427331 105273 1284252 -3488904 -8213927
39078 -8213927 -8054863 -6114419 -6396643 -5643025 -97181 4501187 201000 -8717534 -10529452
$$ [...]
##END NTUPLES=NMR SPECTRUM
##END=
