##TITLE=31Pdec_SR62_m2
 CDCl3, 24 sc
 3.2.2021
##JCAMPDX= 6.0         $$ Bruker NMR JCAMP-DX V2.0
##DATA TYPE= NMR SPECTRUM
##DATA CLASS= NTUPLES
##ORIGIN= UXNMR, Bruker Analytische Messtechnik GmbH
##OWNER= root
$$ XWIN-NMR		Version 3.5
$$ Wed Feb  3 13:45:29 2021 Russian Standard Time (UT+4h)  she@DPX200
##.OBSERVE FREQUENCY= 81.013821
##.OBSERVE NUCLEUS= ^31P
##.ACQUISITION MODE= SIMULTANEOUS
##.ACQUISITION SCHEME= undefined
##.AVERAGES= 24
##.DIGITISER RES= 17
##SPECTROMETER/DATA SYSTEM= spect
##.PULSE SEQUENCE= zgpg30
##.SOLVENT NAME= CDCl3
##.SHIFT REFERENCE= (INTERNAL, CDCl3, 0, 182.463)
##AUDIT TRAIL= $$ (NUMBER, WHEN, WHO, WHERE, WHAT)
$$ ##TITLE= Audit trail, XWIN-NMR		Version 3.5
$$ ##JCAMPDX= 5.01
$$ ##ORIGIN= Bruker BioSpin GmbH
$$ ##OWNER= she
$$ F:/spectra/data/she/nmr/P31/1/pdata/1/auditp.txt
$$ ##AUDIT TRAIL=  $$ (NUMBER, WHEN, WHO, WHERE, WHAT)
(   1,<2021-02-03 13:44:03.32 +0400>,<she>,<DPX200>,
      <created by zg, POWCHK disabled, PULCHK disabled
       configuration hash MD5:
       00 E9 B6 7A A2 85 ED C7 34 08 36 98 17 FE 4E 26
       data hash MD5: 32K
       42 9C 14 89 FA D3 26 58 6E 5B F0 E2 A8 9B F9 CC>)
(   2,<2021-02-03 13:44:16.28 +0400>,<she>,<DPX200>,
      <Start of raw data processing
       efp BC_mod = 2 LB = 1 FT_mod = 6 PKNL = 1 PHC0 = -1728.137 PHC1 = 5.602172 SI = 64K 
       data hash MD5: 64K
       C1 6C 98 BE 6C 53 6B F7 A5 EA AA 7A 8D 88 1C 92>)
(   3,<2021-02-03 13:45:01.10 +0400>,<she>,<DPX200>,
      <pk PHC0 = 21.44097 PHC1 = 0 
       data hash MD5: 64K
       A9 83 4B 8C 1B 40 67 D7 A7 BF 73 E3 70 4D 03 C9>)
(   4,<2021-02-03 13:45:04.51 +0400>,<she>,<DPX200>,
      <abs ABSG = 5 
       data hash MD5: 64K
       5B B8 9E F8 96 45 94 5E 0C 03 62 EA 8B 33 2B 57>)
$$ ##END=
$$ 
$$ hash MD5
$$ 06 DB 1D 44 8F 08 9B 4A D3 B5 97 34 B9 0B AB 37
##$RELAX= 
##$RELAX= 
##$RELAX= 
##$RELAX= 
##$RELAX= 
##$RELAX= 
##$RELAX= 
##$RELAX= 
$$ Bruker specific parameters
$$ --------------------------
##$DU= <F:/spectra>
##$EXPNO= 1
##$NAME= <P31>
##$PROCNO= 1
##$TYPE= <nmr>
##$USER= <she>
##$AMP= (0..31)
100 100 100 100 100 100 100 100 100 100 100 100 100 100 100 100 100 100 
100 100 100 100 100 100 100 100 100 100 100 100 100 100 
##$AQSEQ= 0
##$AQ_mod= 1
##$AUNM= <au_zg>
##$AUTOPOS= <>
##$BF1= 81.014009
##$BF2= 200.13
##$BF3= 200.13
##$BF4= 200.13
##$BF5= 200.13
##$BF6= 200.13
##$BF7= 200.13
##$BF8= 200.13
##$BYTORDA= 1
##$CFDGTYP= 0
##$CFRGTYP= 5
##$CHEMSTR= <none>
##$CNST= (0..31)
1 1 145 1 1 1 1 1 1 1 1 1 1 1 1 1 1 1 1 1 1 1 1 1 1 1 1 1 1 1 1 1 
##$CPDPRG= <waltz16>
##$CPDPRG1= <>
##$CPDPRG2= <waltz16>
##$CPDPRG3= <>
##$CPDPRG4= <mlev>
##$CPDPRG5= <mlev>
##$CPDPRG6= <mlev>
##$CPDPRG7= <mlev>
##$CPDPRG8= <mlev>
##$CPDPRGB= <>
##$CPDPRGT= <>
##$D= (0..31)
0 1 0 0 0 0 0 0 0 0 0 0.03 2e-05 3e-06 0 0 0 0 0 0 0 0 0 0 0 0 0 0 0 0 
0 0 
##$DATE= 1612345442
##$DBL= (0..7)
120 120 120 11 120 120 24 19 
##$DBP= (0..7)
150 150 150 150 150 150 150 150 
##$DBP07= 0
##$DBPNAM0= <>
##$DBPNAM1= <>
##$DBPNAM2= <>
$$ [...]
##$SUBNAM3= <"">
##$SUBNAM4= <"">
##$SUBNAM5= <"">
##$SUBNAM6= <"">
##$SUBNAM7= <"">
##$SUBNAM8= <"">
##$SUBNAM9= <"">
##$SW= 369.568048894756
##$SWIBOX= (0..15)
0 1 3 0 0 0 0 0 0 0 0 0 0 0 0 0 
##$SW_h= 29940.119760479
##$TD= 32768
##$TD0= 1
##$TE= 0
##$TE2= 300
##$TE3= 300
##$TEG= 300
##$TL= (0..7)
0 120 53 12 22 120 120 120 
##$TP= (0..7)
150 150 150 150 150 150 150 150 
##$TP07= 0
##$TPNAME0= <>
##$TPNAME1= <>
##$TPNAME2= <>
##$TPNAME3= <>
##$TPNAME4= <>
##$TPNAME5= <>
##$TPNAME6= <>
##$TPNAME7= <>
##$TPOAL= (0..7)
0.5 0.5 0.5 0.5 0.5 0.5 0.5 0.5 
##$TPOFFS= (0..7)
0 0 0 0 0 0 0 0 
##$TUNHIN= 0
##$TUNHOUT= 0
##$TUNXOUT= 0
##$USERA1= <user>
##$USERA2= <user>
##$USERA3= <user>
##$USERA4= <user>
##$USERA5= <user>
##$V9= 5
##$VALIST= <valist>
##$VCLIST= <CCCCCCCCCCCCCCC>
##$VD= 0
##$VDLIST= <DDDDDDDDDDDDDDD>
##$VPLIST= <PPPPPPPPPPPPPPP>
##$VTLIST= <TTTTTTTTTTTTTTT>
##$WBST= 1024
##$WBSW= 4
##$XGAIN= (0..3)
0 0 0 0 
##$XL= 0
##$YL= 0
##$YMAX_a= 15403
##$YMIN_a= -17716
##$ZGOPTNS= <>
##$ZL1= 120
##$ZL2= 120
##$ZL3= 120
##$ZL4= 120
##$ABSF1= 182.463
##$ABSF2= -187.1042
##$ABSG= 5
##$ABSL= 3
##$ALPHA= 0
##$AQORDER= 0
##$ASSFAC= 0
##$ASSFACI= 0
##$ASSFACX= 0
##$ASSWID= 0
##$AUNMP= <proc_1d>
##$AZFE= 0.1
##$AZFW= 0.5
##$BCFW= 0
##$BC_mod= 2
##$BYTORDP= 0
##$COROFFS= 0
##$CY= -3
##$DATMOD= 1
##$DC= 0
##$DFILT= <>
##$DTYPP= 0
##$F1P= 0
##$F2P= 0
##$FCOR= 1
##$FTSIZE= 65536
##$FT_mod= 6
##$GAMMA= 0
##$GB= 0
##$INTBC= 1
##$INTSCL= 5.30512e-09
##$ISEN= 30
##$LB= 1
##$LEV0= 0
##$LPBIN= 0
##$MAXI= 10000
##$MC2= 0
##$MEAN= 0
##$ME_mod= 0
##$MI= 50
##$NCOEF= 0
##$NC_proc= -7
##$NLEV= 6
##$NOISF1= 182.463
##$NOISF2= 159.3651
##$NSP= 0
##$NTH_PI= 0
##$NZP= 0
##$OFFSET= 182.463
##$PC= 4
##$PHC0= -1706.696
##$PHC1= 5.602172
##$PH_mod= 1
##$PKNL= yes
##$PPARMOD= 0
##$PSCAL= 0
##$PSIGN= 0
##$REVERSE= no
##$SF= 81.014009
##$SI= 65536
##$SIGF1= 159.3651
##$SIGF2= -187.1042
##$SINO= 113.3802
##$SIOLD= 16384
##$SREGLST= <1H.CDCl3>
##$SSB= 0
##$STSI= 65536
##$STSR= 0
##$SW_p= 29940.119760479
##$SYMM= 0
##$S_DEV= 0
##$TDeff= 32768
##$TDoff= 0
##$TI= <>
##$TILT= no
##$TM1= 0
##$TM2= 0
##$TOPLEV= 0
##$USERP1= <user>
##$USERP2= <user>
##$USERP3= <user>
##$USERP4= <user>
##$USERP5= <user>
##$WDW= 1
##$XDIM= 65536
##$YMAX_p= 379164598
##$YMIN_p= -25779084
$$ End of Bruker specific parameters
$$ ---------------------------------
##NTUPLES= NMR SPECTRUM
##VAR_NAME=  FREQUENCY,     SPECTRUM/REAL,   SPECTRUM/IMAG
##SYMBOL=    X,             R,               I
##VAR_TYPE=  INDEPENDENT,   DEPENDENT,       DEPENDENT
##VAR_FORM=  AFFN,          ASDF,            ASDF
##VAR_DIM=   65536,         65536,           65536
##UNITS=     HZ,            ARBITRARY UNITS, ARBITRARY UNITS
##FACTOR=    0.456856943014862, 1,           1
##FIRST=     14782.0589164895, 0,            0
##LAST=      -15158.0608439895, 0,           0
##MIN=       -15158.0608439895, -25779084,   0
##MAX=       14782.0589164895, 379164598,    0
$$ Real data points
##PAGE= N=1
##DATA TABLE= (X++(R..R)), XYDATA
$$ [...]
$$ plain form
44156 1018719 -2184384 -357135 3563264 4165259 1794427 1561571 4918118 7760176
44148 7760176 7364426 5788690 4910475 3194078 -157750 -2262358 -892593 1700102
44140 1700102 2413390 1768632 1649746 1434629 -6193 -747431 1795761 6293197 8940828
44131 8940828 8497371 6618023 4220688 1065718 -1669689 -1996457 -246523 1487373
44123 1487373 2831439 4896653 6878870 6563750 4411931 3252055 3175792 843011 -4574161
44114 -4574161 -8768710 -8084716 -4466972 -1632810 586963 4240704 7946256 8309841
44106 8309841 5862006 4916465 6947362 8258355 5856788 2193039 1515083 3881542
44098 3881542 5814381 5657000 5090613 5368587 5048282 2684860 -373251 -1806079 -1779068
$$ packed form
44156A018719l203103J827249L920399O01995k370832k32856L356547K842058
44148G760176l95750j575736q78215j716397l351828k104608J369765K592695
44140A700102P13288o44758j18886k15117j440822p41238K543192M497436K647631
44131H940828m43457j879348k397335l154970k735407l26768J749934J733896
44123A487373J344066K065214J982217l15120k151819j159876p6263k332781n417172
44114d574161m194549O83994L617744K834162K219773L653741L705552L63585
44106H309841k447835r45541K030897J310993k401567l663749o77956K366459
44098C881542J932839j57381n66387K77974l20305k363422l058111j432828K7011
$$ plain form
44089 -1779068 -2400664 -3979190 -4057850 -968328 3378821 5684410 5277497 4419830 5057600
44080 5057600 6793901 8063360 7900890 6246501 3767635 1933825 2137030 3861531
44072 3861531 4521804 2190271 -1826773 -4101734 -2793315 539400 3023906 3568655
44064 3568655 3147272 2474866 813990 -2193364 -4639908 -4044756 -884851 1407617 783682
44055 783682 -679720 175876 2946076 4061929 1627839 -1970549 -2891542 -245054 3037510
44046 3037510 3554212 1357125 9515 2027941 5036260 4685849 1456700 1014783 5828463
44037 5828463 10132449 7372204 97062 -3135713 138591 3486297 1833070 -1648664
44029 -1648664 -1744235 1036524 3057966 3779382 4397739 3197360 -2115145 -8665844 -10413628
$$ packed form
44089a779068o21596j578526p8660L089522M347149K305589m06913q57667O37770
44080E057600J736301J269459j62470j654389k478866j833810K03205J724501
44072C861531O60273k331533m017044k274961J308419L332715K484506N44749
44064C568655m21383o72406j660876l007354k446544N95152L159905K292468o23935
44055G83682j463402Q55596K770200J115853k434090l598388r20993K646488L282564
44046C037510N16702k197087j347610K018426L008319l50411l229149m41917M813680
44037E828463M303986k760245p275142l232775L274304L347706j653227l481734
44029a648664r5571K780759K021442P21416O18357j200379n312505o550699j747784
$$ plain form
44020 -10413628 -6111760 -845590 1034704 558823 602092 1335326 1180392 -187792 -1862590
44011 -1862590 -3290493 -4322866 -4697169 -4508035 -4351239 -4328526 -3745953 -2254944 -479110
44002 -479110 739032 908176 -239446 -2390061 -4253383 -4733220 -4399618 -4457424 -4401175
43993 -4401175 -2448292 1382529 4371473 4123044 1329009 -1271301 -1885934 -1037776 -520481
43984 -520481 -1414079 -2948436 -3493584 -2800369 -2326355 -2733934 -2532563 -689794 838180
43975 838180 -517837 -3876353 -5697907 -4172048 -409018 4070406 7987918 8822797
43967 8822797 4478398 -2762129 -7375197 -6975903 -4565506 -3312602 -2630267 -1282593
43959 -1282593 -662257 -1874784 -2448636 309833 4431432 5398409 2246668 -1610944 -3104526
$$ packed form
44020a0413628M301868N266170J880294m75881M3269P33234j54934j368184j674798
44011a862590j427903j032373l74303J89134J56796K2713N82573J491009J775834
44002d79110J218142J69144j147622k150615j863322m79837L33602n7806N6249
43993d401175J952883L830821K988944k48429k794035k600310o14633Q48158N17295
43984e20481q93598j534357n45148O93215M74014m07579K01371J842769J527974
43975H38180j356017l358516j821554J525859L763030M479424L917512Q34879
43967H822797m344399p240527m613068L99294K410397J252904O82335J347674
43959a282593O20336j212527n73852K758469M121599R66977l151741l857612j493582
$$ plain form
43950 -3104526 -2235697 -526109 561577 -167490 -2567324 -4367563 -3664405 -1995886 -2626958
43941 -2626958 -5845641 -8400892 -7923406 -5622533 -4001092 -3925902 -4760073 -5687494 -6004464
43932 -6004464 -5383413 -4535725 -4487713 -4767759 -3633163 -702454 1931701 2105240 168756
43923 168756 -1724473 -2280543 -2099103 -2236764 -2511798 -1709150 525640 2602793 2678590
43914 2678590 1222508 403288 507018 -1070474 -5809101 -10803777 -11875720 -9002419
43906 -9002419 -6104232 -5778953 -6792184 -6859785 -5355864 -2714487 443843 2647998 2214076
43897 2214076 -166458 -1243373 971624 4557102 6141215 4762840 1984854 -605231
43889 -605231 -2370208 -2902111 -2082010 -778370 -278527 -899623 -1732857 -1521895 601106
$$ packed form
43950c104526Q68829J709588J087686p29067k399834j800239P03158J668519o31072
43941b626958l218683k555251M77486K300873J621441P5190q34171r27421l16970
43932f004464O21051Q47688M8012k80046J134596K930709K634155J73539j936484
43923A68756j893229n56070J81440j37661k75034Q02648K234790K077153P5797
43914B678590j456082q19220J03730j577492m738627m994676j071943K873301
43906i002419K898187L25279j013231o7601J503921K641377L158330K204155m33922
43897B214076k380534j076915K214997L585478J584113j378375k777986k590085
43889f05231j764977n31903Q20101J303640M99843o21096q33234K10962K123001
$$ plain form
43880 601106 4524656 8487955 9685080 6777266 1731609 -1797335 -2054936 -543911
43872 -543911 190252 -607649 -1598792 -1362983 -59918 1067440 1399194 1523094 2087786
43863 2087786 2816377 3070491 2652867 1366514 -1396253 -5449894 -8807847 -9438912 -7894233
43854 -7894233 -6632456 -6673701 -6600618 -5210080 -3330540 -2169854 -1486844 -587889 149817
43845 149817 47731 -602889 -1342727 -2743681 -5407247 -8383226 -9954329 -9592123 -7952758
43836 -7952758 -5480188 -2466856 -144767 29507 -1549406 -2722512 -2282405 -1441387 -1845444
43827 -1845444 -3021247 -2816566 -81197 3928466 6898990 7698137 7046756 6231656 5523653
43818 5523653 4051728 1144042 -2501291 -5205686 -5857511 -4928759 -3836191 -3342749 -2913041
$$ packed form
43880F01106L923550L963299J197125k907814n045657l528944k57601J511025
43872e43911P34163p97901r91143K35809J303065J127358L31754J23900N64692
43863B087786P28591K54114m17624j286353k762767m053641l357953o31065J544679
43854g894233J261777m1245P3083J390538J879540J160686O83010Q98955P37706
43845A49817j02086o50620p39838j400954k663566k975979j571103L62206J639365
43836g952758K472570L013332K322089J74274j578913j173106M40107Q41018m04057
43827a845444j175803K04681K735369M009663K970524P99147o51381q15100p08003
43818E523653j471925k907686l645333k704395o51825R28752J092568M93442M29708
$$ plain form
43809 -2913041 -1919269 -1018926 -1356429 -2382239 -1924659 633009 2572706 1023952 -2737633
43800 -2737633 -4376660 -2023520 1470903 2591215 1439106 521422 869942 1422057 1571136
43791 1571136 2220470 3956474 5535296 4939064 1596333 -2727937 -5333616 -5184860 -4028765
43782 -4028765 -4185767 -5298466 -4715964 -1623536 1105790 783255 -952964 -416279 2392174
43773 2392174 3398732 416299 -3340134 -3419396 189752 3802420 5220605 5516152 5923568
43764 5923568 5760819 4370471 2901995 2532093 2421418 1298443 -62991 -172622 108260
43755 108260 -1433607 -4293882 -5250270 -3400341 -2135852 -4078911 -6687004 -5777229 -1558604
43746 -1558604 2124545 3338235 3306592 2802693 1213940 -576250 -251104 1956260 2760216
$$ packed form
43809b913041R93772R00343l37503j025810M57580K557668J939697j548754l761585
43800b737633j639027K353140L494423J120312j152109r17684L48520N52115J49079
43791A571136O49334J736004J578822n96232l342731m324270k605679J48756J156095
43782d028765j57002j112699N82502L092428K729326l22535j736219N36685K808453
43773B392174J006558k982433l756433p9262L609148L612668J418185K95547M07416
43764E923568j62749j390348j468476l69902j10675j122975j361434j09631K80882
43755A08260j541867k860275r56388J849929J264489j943059k608093R09775M218625
43746a558604L683149J213690l1643n03899j588753j790190L25146K207364Q03956
$$ plain form
43737 2760216 658547 -1881738 -2569442 -2383355 -2585190 -1902065 632520 2834308 2486425
43728 2486425 1033213 878160 959961 -1326939 -5202957 -7303941 -6626141 -5029756 -3345941
43719 -3345941 -777373 1882334 2325678 666031 -279551 330933 -189487 -3360041 -6345794
43710 -6345794 -5676579 -1926372 1617104 3372795 4267714 5106974 5437924 4978056 4491851
43701 4491851 4738828 5353940 5299648 4232644 2914680 1880867 201188 -3153283 -6670957
43692 -6670957 -7020789 -3478717 384670 1250391 343322 700839 2024467 1714602 -149710
43683 -149710 -933628 -270963 -581427 -2273477 -2509469 105747 3323755 5047338 5661775
43674 5661775 5165599 2075348 -2588851 -4306684 -1212944 2206297 1161340 -2689787
$$ packed form
43737B760216k101669k540285o87704J86087k01835O83125K534585K201788l47883
43728B486425j453212j55053Q1801k286900l876018k100984O77800J596385J683815
43719c345941K568568K659707M43344j659647r45582O10484n20420l170554k985753
43710f345794O69215L750207L543476J755691Q94919Q39260L30950m59868m86205
43701D491851K46977O15112n4292j067004j317964j033813j679679l354471l517674
43692f670957l49832L542072L863387Q65721r07069L57517J323628l09865j864312
43683a49710p83918O62665l10464j692050k35992K615216L218008J723583O14437
43674E661775m96176l090251m664199j717833L093740L419241j044957l851127
$$ plain form
43666 -2689787 -4524783 -3841858 -4113466 -6617994 -9255715 -10643264 -10906056 -8818069 -2835706
43657 -2835706 4488576 7510059 4386270 -456497 -2334217 -1796524 -2257249 -4686738
43649 -4686738 -7039672 -7506070 -6144491 -3850989 -1340050 801805 1935766 1690171
43641 1690171 669279 654552 2931780 5751211 4998675 -905195 -7966394 -10682945 -8356887
43632 -8356887 -4937131 -3280657 -2640931 -1836746 -1489307 -2005196 -2160876 -1269236 -669591
43623 -669591 -1606993 -3311028 -4343107 -4277910 -3254345 -1740044 -1407441 -3776217 -6962843
43614 -6962843 -6748889 -2674758 88755 -2245645 -6119916 -5615148 -1297031 795951
43606 795951 -1699165 -4559177 -4106357 -2320043 -2392705 -3199901 -1859763 737706 1144410
$$ packed form
43666b689787j834996O82925k71608k504528k637721j387549k62792K087987N982363
43657b835706P324282L021483l123789m842767j877720N37693m60725k429489
43649d686738k352934m66398J361579K293502K510939K141855J133961k45595
43641A690171j020892j4727K277228K819431p52536n903870p061199k716551K326058
43632h356887L419756J656474O39726Q04185L47439n15889j55680Q91640N99645
43623f69591r37402j704035j032079O5197J023565J514301L32603k368776l186626
43614f962843K13954M074131K763513k334400l874271N04768M318117K092982
43606G95951k495116k860012M52820J786314p2662q07196J340138K597469M06704
$$ plain form
43597 1144410 -852891 -1635388 715150 3671501 4257100 3096192 2658865 3390500 3740302
43588 3740302 2858312 1042820 -1797129 -5689051 -8670603 -7900250 -3579749 356919
43580 356919 858876 -624796 -816215 582319 1094586 -179673 -1033818 564597 3685041
43571 3685041 5893450 6136987 5107445 3622071 1804390 -319354 -2144937 -2598041
43563 -2598041 -932655 2365627 5535319 6706336 5119767 1275261 -3388585 -6626559
43555 -6626559 -6428182 -3206428 -185515 -120572 -2164868 -3532269 -3535280 -3759670 -4613642
43546 -4613642 -4556782 -3285422 -2807567 -3998459 -4631558 -2798761 -256770 11688 -1771007
43537 -1771007 -2605109 -832604 2336562 4948213 5942331 4929826 2278501 -430458
$$ packed form
43597A144410j997301p82497K350538K956351N85599j160908m37327P31635L49802
43588C740302q81990j815492k839949l891922k981552P70353M320501L936668
43580C56919N01957j483672j91419J398534N12267j274259q54145J598415L120444
43571C685041K208409K43537j029542j485374j817681k123744j825583m53104
43563b598041J665386L298282L169692J171017j586569l844506m663846l237974
43555f626559J98377L221754L020913O4943k044296j367401l011k24390q53972
43546d613642N6860J271360M77855j190892o33099J832797K541991K68458j782695
43537a771007q34102J772505L169166K611651R94118j012505k651325k708959
$$ plain form
43529 -430458 -1486844 -704696 982811 3048063 5132733 5998670 4698373 2564694 1918702
43520 1918702 2623495 2094721 -620276 -2902256 -2013727 1053606 2841959 1800522 -97868
43511 -97868 -38909 2310020 4452932 3858447 1043822 -511013 1865398 6691392 9844828
43502 9844828 9364732 7339688 6609201 7158839 6961020 5262658 3367175 2429549 1996246
43493 1996246 1104833 -215811 -1231661 -1765269 -2383584 -3306551 -3817964 -3309347 -2554619
43484 -2554619 -2998448 -4581860 -5350660 -4022318 -2023514 -1680892 -2964004 -3689480 -2884355
43475 -2884355 -2113632 -2915542 -4530897 -5127682 -4041433 -1802482 943687 3406292 4524733
43466 4524733 4167493 3705938 4122506 4305278 2716312 96468 -1365010 -1342035 -1806197
$$ packed form
43529d30458j056386P82148J687507K065252K084670Q65937j300297k133679o45992
43520A918702P04793n28774k714997k281980Q88529L067333J788353j041437j898390
43511i7868N8959K348929K142912n94485k814625j554835K376411M825994L153436
43502I844828m80096k025044p30487N49638j97819j698362j895483r37626m33303
43493A996246q91413j320644j015850n33608o18315r22967n11413N08617P54728
43484b554619m43829j583412p68800J328342J998804L42622j283112p25476Q05125
43475b884355P70723q01910j615355n96785J086249K238951K746169K462605J118441
43466D524733l57240m61555M16568J82772j588966k619844j461478K2975m64162
$$ plain form
43457 -1806197 -3762576 -5460797 -4836202 -2315093 6582 1016860 1200281 1202024 990796
43448 990796 340752 -633730 -1383533 -1027562 983112 3827586 5572659 5179319 3660035
43439 3660035 2458990 1495964 79926 -992552 -215578 1828514 2660642 1589045 1055059
43430 1055059 2840650 4784087 3571800 -212558 -2504744 -1207021 1293421 1779803
43422 1779803 205991 -1268029 -1531730 -1032368 -51899 1559978 3146471 3385324 1955067
43413 1955067 -19570 -1435218 -2279446 -3041234 -3808177 -4207382 -3736118 -2120575 71539
43404 71539 1250979 115623 -2554098 -4104622 -2572661 1150367 4012401 3703084 950030
43395 950030 -1115495 -251651 2312001 3449366 2361195 1567528 2778093 3930685 2720091
$$ packed form
43457a806197j956379j698221O24595K521109K321675J010278J83421J743k11228
43448I90796o50044r74482p49803L55971K010674K844474J745073l93340j519284
43439C660035j201045r63026j416038j072478P76974K044092Q32128j071597n33986
43430A055059J785591J943437j212287l784358k292186J297723K500442M86382
43422A779803j573812j474020k63701M99362R80469J611877J586493K38853j430257
43413A955067j974637j415648q44228p61788p66943l99205M71264J615543K192114
43404G1539J179440j135356k669721j550524J531961L723028K862034l09317k753054
43395I50030k065525Q63844K563652J137365j088171p93667J210565J152592j210594
$$ plain form
43386 2720091 1314775 3734959 8958185 11173734 8139181 4812836 5929300 8933220
43378 8933220 8443856 4740298 2445380 2256728 70767 -5167557 -8616859 -6845503
43370 -6845503 -3179783 -2412453 -3897805 -3940372 -2378459 -2168310 -3697136 -4159479 -2667963
43361 -2667963 -1836134 -3185536 -4397313 -2987762 -285486 463584 -1374156 -3209822
43353 -3209822 -2704895 -370272 1407706 1184141 52899 413538 3012133 5612791 5302250
43344 5302250 1828106 -2253247 -4500317 -4529918 -3206242 -1357278 322721 1269933 1479694
43335 1479694 1210963 229282 -1662831 -3448533 -3638603 -2332871 -1113920 -693199 -215572
43326 -215572 860785 1973918 2920969 4102756 4714865 2958374 -936935 -4179818 -5148328
$$ packed form
43386B720091j405316K420184N223226K215549l034553l326345J116464L003920
43378H933220m89364l703558k294918j88652k185961n238324l449302J771356
43370f845503L665720P67330j485352m2567J561913K10149j528826m62343J491516
43361b667963Q31829j349402j211777J409551K702276P49070j837740j835666
43353c209822N04927K334623J777978k23565j131242L60639K598595K600658l10541
43344E302250l474144m081353k247070k9601J323676J848964J679999R47212K09761
43335A479694k68731r81681j892113j785702j90070J305732J218951M20721M77627
43326b15572J076357J113133R47051J181787O12109j756491l895309l242883r68510
$$ plain form
43317 -5148328 -5237949 -5508976 -4387937 -1122197 1274044 -73504 -3105239 -3694573 -1786019
43308 -1786019 -646282 -1097312 -966309 128336 158790 -796970 -157469 2010618 2165841
43299 2165841 -612179 -2320681 -425756 1771009 629344 -1738340 -1213781 1276302
43291 1276302 1360099 -1569515 -3514590 -1951092 1372166 3986704 5467716 5974893 5154148
43282 5154148 3629657 3296717 4994159 7353682 8518020 7787949 5582447 3139134
43274 3139134 1963609 2058591 1261373 -1881602 -5401519 -6325084 -4932219 -3780998 -3292730
43265 -3292730 -1956926 -667718 -2385648 -6522067 -8243451 -5526490 -2667902 -3649336
43257 -3649336 -5816168 -4364199 -180153 1931162 1246545 1733168 4646841 6042773
$$ packed form
43317e148328q9621k71027J121039L265740K396241j347548l031735n89334J908554
43308a786019J139737m51030J31003J094645L0454r55760O39501K168087J55223
43299B165841k778020j708502J894925K196765j141665k367684N24559K490083
43291A276302Q3797k929614j945075J563498L323258K614538J481012N07177q20745
43282E154148j524491l32940J697442K359523J164338p30071k205502k443313
43274C139134j175525R4982p97218l142975l519917r23565J392865J151221M88268
43265c292730J335804J289208j717930m136419j721384K716961K858588r81434
43257c649336k166832J451969M184046K111315o84617M86623K913673J395932
$$ plain form
43249 6042773 3395725 57531 164915 2502202 3049895 1506677 1290144 3764406 6301216
43240 6301216 6679028 6210784 6965879 8270063 8175875 7058470 7276379 9492253 11470925
43231 11470925 10998167 8363385 5247774 2569180 459629 -742233 -787903 -135686 942909
43222 942909 3230621 7058536 10340794 9986989 5667456 663856 -1720902 -1451140 -815560
43213 -815560 -1420212 -3146766 -5131117 -6400738 -5988454 -3850783 -1754219 -1949953 -4383091
43204 -4383091 -6159422 -4732005 -1175526 815508 -748297 -3982470 -5875661 -6052868
43196 -6052868 -6425201 -7796063 -8873844 -8867478 -8830825 -9245739 -8218392 -4131666 1025120
43187 1025120 3273991 1337236 -2157880 -4061342 -3581336 -1848558 -396392 -348658 -1614829
$$ packed form
43249F042773k647048l338194J07384K337287N47693j543218k16533K474262K536810
43240F301216L77812m68244P55095J304184r4188j117405K17909K215874J978672
43231A1470925m72758k634782l115611k678594k109551j201862m5670O52217J078595
43222I42909K287712L827915L282258l53805m319533n003600k384758K69762O35580
43213h15560o04652j726554j984351j269621M12284K137671K096564j95734k433138
43204d383091j776331J427417L556479J991034j563805l234173j893191j77207
43196f052868l72333j370862j077781O366L6653m14914J027347M086726N156786
43187A025120K248871j936755l495116j903462M80006J732778J452166M7734j266171
$$ plain form
43178 -1614829 -2604710 -1965331 -502876 47598 -231647 16709 331317 -1389209 -4958469
43169 -4958469 -6945876 -5207817 -2116830 -1244629 -2487192 -2803999 -910007 1076436
43161 1076436 716002 -1622501 -3251536 -2212037 524516 2156902 1522567 539329 1090211
43152 1090211 1719331 -112242 -3166035 -3358133 -128752 1876454 -722651 -5233430
43144 -5233430 -7026678 -5531125 -3086735 -417487 3009272 5824018 5897510 3861795
43136 3861795 2063778 710961 -1486063 -3442789 -2430784 1047745 2872690 845846
43128 845846 -2441324 -3510747 -2173567 -464452 405364 535279 312740 164293 366960
43119 366960 499808 -10735 -735205 -770663 -209381 246509 617904 967255 204819 -2226671
$$ packed form
43178a614829r89881O39379J462455N50474k79245K48356L14608j720526l569260
43169d958469j987407J738059L090987Q72201j242563l16807J893992J986443
43161A076436l60434k338503j629035J039499K736553J632386o34335r83238N50882
43152A090211O29120j831573l053793j92098L229381K005206k599105m510779
43144e233430j793248J495553K444390K669248L426759K814746P3492k035715
43136C861795j798017j352817k197024j956726J012005L478529J824945k026844
43128H45846l287170j069423J337180J709115Q69816J29915k22539j48447K02667
43119C66960J32848n10543p24470l5458N61282M55890L71395L49351p62436k431490
$$ plain form
43109 -2226671 -4303176 -3810714 -2116996 -2265506 -3726979 -3051698 -44262 1185431 -1312663
43100 -1312663 -4164171 -4172178 -2974125 -3315918 -4295276 -3954747 -3701218 -5905541 -8927165
43091 -8927165 -8820984 -5223896 -1724530 -590984 -546591 3036 622565 519200 244380
43082 244380 721069 1925866 3105553 3487826 2842256 2039756 2428906 3798760 4027267
43073 4027267 1998478 -358154 -559403 1103191 2583373 3175555 3338571 2599158 457937
43064 457937 -1194963 445064 5070247 9173830 10108197 8020415 4066149 -461721
43056 -461721 -3221343 -2361801 236037 448439 -2137465 -3022748 502363 4636294 4133930
43047 4133930 -141346 -2465256 -102464 3785718 5214705 3981517 2120265 610879
$$ packed form
43109b226671k076505M92462J693718j48510j461473O75281L007436J229693k498094
43100a312663k851508q007J198053l41793r79358L40529K53529k204323l021624
43091h927165J06181L597088L499366J133546M4393N49627O19529j03365k74820
43082B44380M76689J204797J179687L82273o45570q02500L89150J369854K28507
43073D027267k028789k356632k01249J662594J480182N92182J63016p39413k141221
43064D57937j652900J640027M625183M103583R34367k087782l954266m527870
43056d61721k759622Q59542K597838K12402k585904q85283L525111M133931n02364
43047D133930m275276k323910K362792L888182J428987j233188j861252j509386
$$ plain form
43039 610879 -353566 324843 3491987 7370530 8607406 6169017 2669955 1135074 1644301
43030 1644301 2110900 1387767 253810 -272951 -254813 -386090 -1196326 -2762026 -4390575
43021 -4390575 -4707383 -3019696 -460191 1268292 1990765 2568694 2764325 1620269 -77160
43012 -77160 -177910 1433746 2367135 1597317 1056036 1860298 1905318 -367154 -2418123
43003 -2418123 -984384 2883929 5469295 5607398 4847626 3683248 1487751 -524992
42995 -524992 -394742 637155 -584627 -3478473 -3582387 796868 5781494 7518088 6950241
42986 6950241 6754992 6741094 5199794 2612589 1130419 1601608 3177238 4688332 4904979
42977 4904979 2974281 62769 -1216432 -492884 -637175 -3323458 -6056464 -6067558 -4760408
$$ packed form
43039F10879r64445O78409L167144L878543J236876k438389l499062j534881N09227
43030A644301M66599p23133j133957n26761J8138j31277q10236j565700j628549
43021d390575l16808J687687K559505J728483P22473N77929J95631j144056j697429
43012g7160j00750J611656R33389p69818n41281Q04262M5020k272472k050969
43003b418123J433739L868313K585366J38103p59772j164378k195497k012743
42995e24992J30250J031897j221782k893846j03914M379255M984626J736594n67847
42986F950241j95249j3898j541300k587205j482170M71189J575630J511094K16647
42977D904979j930698k911512j279201P23548j44291k686283k733006j1094J307150
$$ plain form
42968 -4760408 -5019390 -5992722 -4477495 -570003 2058525 1461263 -648471 -2546047 -4456621
42959 -4456621 -6038634 -5514896 -3013492 -1694062 -3277437 -4956017 -3477543 -418460
42951 -418460 -183461 -3706936 -7481587 -8772968 -8418575 -7573244 -5075713 -398301 3306692
42942 3306692 2550515 -1124621 -2694063 -623333 1282515 -6541 -2422650 -2853194
42934 -2853194 -2313727 -3561069 -5677177 -5290286 -2432559 -903069 -2395448 -4062129
42926 -4062129 -2991573 137506 3193834 5455075 6758473 6381460 4570211 3146561
42918 3146561 3037139 3018663 2073837 918964 153683 -660320 -945696 979227 4409266
42909 4409266 5804684 3871449 1938217 2870247 4929067 5610050 6064607 7851868 8608441
$$ packed form
42968d760408k58982r73332J515227L907492K628528n97262k109734j897576j910574
42959d456621j582013N23738K501404J319430j583375j678580J478474L059083
42951d18460K34999l523475l774651j291381L54393Q45331K497531M677412L704993
42942C306692p56177l675136j569442K070730J905848j289056k416109m30544
42934b853194N39467j247342k116108L86891K857727J529490j492379j666681
42926d062129J070556L129079L056328K261241J303398l77013j811249j423650
42918C146561j09422j8476r44826j154873p65281q14003k85376J924923L430039
42909D409266J395418j933235j933232R32030K058820O80983M54557J787261P56573
$$ plain form
42900 8608441 5809178 2292965 2609509 5532184 5854541 2656221 -106125 -983035 -2796783
42891 -2796783 -6123831 -7031066 -3520063 747867 1848889 749815 474704 1493836
42883 1493836 2420802 2477096 1168438 -1821186 -4685441 -4337804 -938433 1404435 232953
42874 232953 -2101993 -2786077 -2634066 -3427293 -4481669 -4734162 -5231124 -6445448 -5962402
42865 -5962402 -2298034 1446029 1462131 -1153667 -2339575 -1082145 84032 -558188 -2338433
42856 -2338433 -4051942 -4520883 -2489923 1256363 3134840 1075678 -2032349 -2370460
42848 -2370460 -728292 -176582 -100624 2602517 7320184 9825460 8617978 6471825 5327131
42839 5327131 4286688 3386758 4591293 7570336 8819501 6861014 4518393 4113749
$$ packed form
42900H608441k799263l516213L16544K922675L22357l198320k762346q76910j813748
42891b796783l327048r07235L511003M267930J101022j099074k75111J019132
42883A493836R26966N6294j308658k989624k864255L47637L399371K342868j171482
42874B32953k334946o84084J52011p93227j054376k52493m96962j214324M83046
42865e962402L664368L744063J6102k615798j185908J257430J166177o42220j780245
42856b338433j713509m68941K030960L746286J878477k059162l108027l38111
42848b370460J642168N51710P5958K703141M717667K505276j207482k146153j144694
42839E327131j040443q99930J204535K979043J249165j958487k342621m04644
$$ plain form
42831 4113749 4075296 2505926 711037 667424 1839590 2885614 3901583 4768923 4013259
42822 4013259 1714019 858057 3119400 5788283 5775199 4326800 4552195 6260293 6781168
42813 6781168 5553728 4427666 4213385 4056532 3682378 3491008 2980801 1610113 490791
42804 490791 742478 1225893 720719 1020248 4163698 7504176 6082311 185865 -4051081
42795 -4051081 -2915331 287253 1037065 65855 792330 3259788 4594924 3994126 3377858
42786 3377858 3459972 2622983 187378 -2020109 -2329338 -1246085 324264 2851686 6448593
42777 6448593 8853078 7553056 3615476 1066417 1793240 2989699 1068357 -3233306
42769 -3233306 -5584790 -3376094 1648341 6079770 8218016 8228511 6785796 4694868
$$ packed form
42831D113749l8453j569370j794889m3613J172166J046024J015969Q67340p55664
42822D013259k299240q55962K261343K668883j3084j448399K25395J708098N20875
42813F781168j227440j126062k14281j56853l74154j91370n10207j370688j119322
42804D90791K51687M83415n05174K99529L143450L340478j421865n896446m236946
42795d051081J135750L202584P49812r71210P26475K467458J335136o00798o16268
42786C377858Q2114q36989k435605k207487l09229J083253J570349K527422L596907
42777F448593K404485j300022l937580k549059P26823J196459j921342m301663
42769c233306k351484K208696N024435M431429K138246J0495j442715k090928
$$ plain form
42761 4694868 2640641 333146 -3034149 -6780711 -8691703 -8007332 -6845507 -7239501
42753 -7239501 -8340560 -8227584 -6808814 -4814790 -1658686 2846400 6033827 5171014
42745 5171014 2079108 1288859 3659632 5664986 5400519 4998699 5664450 4704985 357468
42736 357468 -3908343 -3631015 224362 2780619 2031960 659939 1352906 3222032 3356745
42727 3356745 266964 -4362936 -6455868 -2942376 4380425 9593691 8849141 4513743
42719 4513743 1375456 506453 -352294 -1779484 -1779622 301716 2463158 3203524 3073259
42710 3073259 2462669 754651 -1320677 -1282740 1570516 4381920 4125495 1178257 -1821207
42701 -1821207 -3122720 -2565183 -651619 1531691 2516809 1925572 1090427 1461311 3214374
$$ packed form
42761D694868k054227k307495l367295l746562j910992O84371J161825l93994
42753g239501j101059J12976J418770J994024L156104M505086L187427q62813
42745E171014l091906p90249K370773K005354k64467m01820O65751r59465m347517
42736C57468m265811K77328L855377K556257p48659j372021O92967J869126J34713
42727C356745l089781m629900k092932L513492P322801N213266p44550m335398
42719D513743l138287q69003q58747j427190j38K081338K161442P40366j30265
42710C073259o10590j708018k075328L7937K853256K811404k56425k947238k999464
42701a821207j301513N57537J913564K183310R85118n91237q35145L70884J753063
$$ plain form
42692 3214374 5761056 8280509 9388219 8074242 5629354 4665823 5374696 5004257 2239869
42683 2239869 -462416 -743677 35263 -412945 -1188627 -125731 1872810 2101373 723836
42674 723836 428587 1733181 2369605 1579170 1327239 2442025 3069660 2278622 1890727
42665 1890727 2924054 3258925 1217291 -1049484 -506412 2257757 4238433 4338103 3658176
42656 3658176 2523215 309023 -2100722 -2722142 -1710767 -1571460 -3349777 -4844379
42648 -4844379 -3709847 -580526 2054231 2653826 1204309 -1598051 -4365152 -5344880
42640 -5344880 -4284299 -3213107 -3864834 -4988801 -3978817 -771976 1930214 2460682
42632 2460682 2070290 2343251 2900929 3064932 3822728 5930276 7429661 5854324 2425901
$$ packed form
42692C214374K546682K519453J107710j313977k444888r63531P08873l70439k764388
42683B239869k702285k81261P78940m48208p75682J062896J998541K28563j377537
42674G23836k95249J304594O36424p90435k51931J114786O27635p91038l87895
42665A890727J033327L34871k041634k266775N43072K764169J980676R9670o79927
42656C658176j134961k214192k409745o21420J011375J39307j778317j494602
42648d844379J134532L129321K634757N99595j449517k802360k767101r79728
42640e344880J060581J071192o51727j123967J009984L206841K702190N30468
42632B460682l90392K72961N57678J64003P57796K107548J499385j575337l428423
$$ plain form
42623 2425901 1127906 3365695 6489754 8392747 10268092 12866331 13185504 8367689
42615 8367689 1062204 -3089655 -2825613 -2305478 -4482867 -7231814 -7444966 -5666482 -4391911
42606 -4391911 -4157489 -3833846 -3158330 -2485261 -1162217 1455855 4214110 5679344 6674862
42597 6674862 8740183 10623498 9403971 5340544 2315321 2203937 1891876 -1753989
42589 -1753989 -6324888 -6629634 -2056327 2354776 2640647 612047 298722 2116157 3065263
42580 3065263 1600663 -391558 -517602 1457638 4408699 7240283 8345034 5594559
42572 5594559 -981276 -7357674 -8696590 -4605386 495963 2675651 2534516 3118484
42564 3118484 5264399 6703889 5512086 2935853 1951061 3378611 4474243 2262468
$$ packed form
42623B425901j297995K237789L124059J902993J875345K598239L19173m817815
42615H367689p305485m151859K64042N20135k177389k748947k13152J778484J274571
42606d391911K34422L23643O75516O73069J323044K618072K758255J465234R95518
42597F674862K065321J883315j219527m063427l025223j11384l12061l645865
42589a753989m570899l04746M573307M411103K85871k028600l13325J817435R49106
42580C065263j464600j992221j26044J975240K951061K831584J104751k750475
42572E594559o575835o376398j338916M091204N101349K179688j41135N83968
42564C118484K145915J439490j191803k576233r84792J427550J095632k211775
$$ plain form
42556 2262468 -2097018 -3959994 -1036203 3179896 3844268 1384792 621819 3423844
42548 3423844 5903121 4395177 972180 204935 2533276 4175365 2758488 -154060
42540 -154060 -2190502 -3022022 -3323949 -2956152 -1271736 1874716 6032043 10226902 13018744
42531 13018744 13517582 12399999 10856694 8705596 4991252 466885 -2252054 -1610716
42523 -1610716 1085402 3298135 3538334 1739376 -1151779 -3300663 -3120742 -1230468
42515 -1230468 -162922 -1202441 -2562316 -1754446 1133775 3701149 4144467 2772580
42507 2772580 999878 -103543 -331355 -157453 -68012 190749 1330428 3182613 4267058
42498 4267058 3319615 822324 -1609691 -3024672 -3694017 -4116760 -4151640 -3312802 -1679089
$$ packed form
42556B262468m359486j862976K923791M216099O64372k459476p62973K802025
42548C423844K479277j507944l422997p67245K328341J642089j416877k912548
42540a54060k036442q31520l01927L67797J684416L146452M157327M194859K791842
42531A3018744M98838j117583j543305k151098l714344m524367k718939O41338
42523a610716K696118K212733K40199j798958k891155k148884J79921J890274
42515a230468J067546j039519j359875Q07870K888221K567374M43318j371887
42507B772580j772702j103421k27812J73902Q9441K58761J139679J852185J084445
42498D267058r47443k497291k432015j414981o69345m22743l4880Q38838J633713
$$ plain form
42489 -1679089 -248984 -23249 -555957 -82172 2101536 3949409 2754493 -1115861 -4103660
42480 -4103660 -3522376 -399841 2321782 3137030 2752939 2660003 3809580 5830562 6932804
42471 6932804 5613306 2971691 1945598 3494239 5103891 4127838 990912 -2173634
42463 -2173634 -4241858 -4758804 -2847681 1057309 3886887 3246128 1098776 1160950 3341624
42454 3341624 4149793 2396923 741138 951536 1353852 397538 -619291 -387545 -190427
42445 -190427 -1227159 -1862653 -452493 1002540 -734553 -5124104 -8308012 -8091067 -5684642
42436 -5684642 -2722679 608882 4026455 6189641 6313734 5313294 4740677 5587540 8011064
42427 8011064 10831073 11562991 8832945 4764336 2904594 3576390 3615845 1321729 -925770
$$ packed form
42489a679089J430105K25735n32708M73785K183708J847873j194916l870354k987799
42480d103660N81284L122535K721623Q15248l84091r2936J149577K020982J102242
42471F932804j319498k641615j026093J548641J609652r76053l136926l164546
42463b173634k068224n16946J911123L904990K829578o40759k147352O2174K180674
42454C341624Q08169j752870j655785K10398M02316r56314j016829K31746J97118
42445a90427j036732o35494J410160J455033j737093m389551l183908K16945K406425
42436e684642K961963L331561L417573K163186J24093j000440n72617Q46863K423524
42427H011064K820009P31918k730046m068609j859742O71796L9455k294116k247499
$$ plain form
42418 -925770 -350814 2224641 4030957 4265447 4180107 4459421 4701247 4725262 4339520 2453603
42408 2453603 -1412979 -5100919 -5502357 -2342372 1608209 4032324 4757831 4065326 1959233
42399 1959233 -198707 -19657 2432321 3716952 1568423 -1390739 -900348 3102511
42391 3102511 6533902 6600023 4506410 2515692 999600 -358865 -569783 1398726 4311353
42382 4311353 5612555 4557423 2779769 1575308 367852 -1154420 -916740 3430512
42374 3430512 10529162 15592866 15422272 11431741 6647730 1738167 -3719840 -7600174
42366 -7600174 -6505312 -1026562 3496382 2898528 -1404262 -5229193 -6471353 -5407379
42358 -5407379 -2592827 869601 2556847 1095752 -1491899 -2224097 -1106124 -286162
$$ packed form
42418i25770N74956K575455J806316K34490q5340K79314K41826K4015l85742j885917
42408B453603l866582l687940m01438L159985L950581K424115P25507o92505k106093
42399A959233k157940J79050K451978J284631k148529k959162M90391M002859
42391C102511L431391O6121k093613j990718j516092j358465k10918J968509K912627
42382D311353J301202j055132j777654j204461j207456j522272K37680M347252
42374C430512P098650N063704j70594l990531m784011m909563n458007l880334
42366g600174J094862N478750M522944n97854m302790l824931j242160J063974
42358e407379K814552L462428J687246j461095k587651p32198J117973Q19962
$$ plain form
42350 -286162 -327521 -184390 -56907 -948552 -1744573 -342619 2119605 1958310 -1286889
42341 -1286889 -3521927 -2018423 884354 2041516 2148919 3370420 4989792 4690795
42333 4690795 2612589 1240177 2180230 5139324 8898493 11412161 10580671 7184225
42325 7184225 5392307 7758813 11251129 11179785 7711293 5115854 5491979 7017146 8241299
42316 8241299 10171802 13157145 15017117 13962116 11218531 9226350 8662307 8448578
42308 8448578 7776654 7243990 8197846 10752125 12246286 9164065 1926140 -3957705 -3853479
42299 -3853479 297215 3052590 2853441 2646878 4002710 5114200 5005027 5281053 6457546
42290 6457546 6550999 4931922 3818078 4107177 3509894 1102571 -50940 2193124 4912648
$$ packed form
42350b86162m1359J43131J27483q91645p96021J401954K462224j61295l245199
42341a286889k235038J503504K902777J157162J07403J221501J619372k98997
42333D690795k078206j372412R40053K959094L759169K513668q31490l396446
42325G184225j791918K366506L492316p1344l468492k595439L76125J525167J224153
42316H241299J930503K985343J859972j055001k743585j992181n64043k13729
42308H448578o71924n32664R53856K554279J494161l082221p237925n883845J04226
42299c853479M150694K755375j99149k06563J355832J111490j09173K76026J176493
42290F457546R3453j619077j113844K89099n97283k407323j153511K244064K719524
$$ plain form
42281 4912648 4380465 1649960 116264 -114848 -1288627 -3181684 -3558997 -2526376 -2324102
42272 -2324102 -3162523 -3057806 -1724387 -990263 -1082267 55604 3090180 5943059 6827787
42263 6827787 6029338 4171494 1472985 -613661 140961 3536831 6575555 7313206 6822117
42254 6822117 6423318 5522035 3559641 1746122 1153341 1089290 1112841 2787123 7375630
42245 7375630 13149946 16912904 17190319 14457500 9680652 4544451 1700812 2280658
42237 2280658 3879084 3420639 1556393 1654036 4501874 6873774 6233136 4393982 4878290
42228 4878290 8279612 12065088 14011487 14059761 13217120 12320201 11966169 12323481 12715249
42219 12715249 12407486 11979803 12747066 14473588 15045166 13328760 11168198 11140900 13086238
$$ packed form
42281D912648n32183k730505j533696k31112j173779j893057l77313J032621K02274
42272b324102q38421J04717J333419P34124r2004J137871L034576K852879Q84728
42263F827787p98449j857844k698509k086646P54622L395870L038724P37651m91089
42254F822117l98799r01283j962394j813519n92781o4051K3551J674282M588507
42245G375630N774316L762958K77415k732819m776848n136201k843639N79846
42237B280658J598426m58445j864246R7643K847838K371900o40638j839154M84308
42228D878290L401322L785476J946399M8274q42641q96919l54032L57312L91768
42219A2715249l07763m27683P67263J726522N71578j716406k160562k7298J945338
$$ plain form
42210 13086238 14509825 14163324 13495173 14283657 16315732 17976426 18059948 16590302 14835328
42201 14835328 14622567 16301313 17276433 14471421 8904011 5730726 8419319 14667797
42193 14667797 19657382 21557124 21771609 21377803 20089975 18071853 16219883 14852344
42185 14852344 14186542 15645032 20302620 26184338 29533439 29073342 27105221 26402738
42177 26402738 28028845 31971340 37367094 41872178 43383322 42947628 43726393 46840783
42169 46840783 50810976 55196365 61371271 68919743 75131374 79852724 87031378 98710146
42161 98710146 110915086 119137335 125224108 134543216 147926781 160923704 170521461 178329657
42153 178329657 186655904 195065213 201768878 205454352 204747376 198608096 188610729 178584135
$$ packed form
42210A3086238J423587l46501o68151P88484K032075J660694Q3522j469646j754974
42201A4835328k12761J678746R75120k805012n567410l173285K688593O248478
42193A4667797M989585J899742K14485l93806j287828k018122j851970j367539
42185A4852344o65802J458490M657588N881718L349101m60097j968121p02483
42177B6402738J626107L942495N395754M505084J511144m35694P78765L114390
42169D6840783L970193M385389O174906P548472O211631M721350P178654J1678768
42161I8710146J2204940Q222249O086773R319108J3383565J2996923R597757P808196
42153A78329657Q326247Q409309O703665L685474p06976o139280r997367j0026594
$$ plain form
42145 178584135 170511852 162519996 152219204 140325661 129351679 120033633 111021006
42138 111021006 101653105 93278068 87396776 83490876 79531180 74628821 70438656 69016893
42130 69016893 69444017 68112295 63176892 57213958 53877486 53086156 51636816 47888358
42122 47888358 43374150 39878163 37448514 35746595 34956371 34511512 33109281 31055362
42114 31055362 30510396 32059260 33010145 30871847 26934561 24400858 24091138 24009565 22384436
42105 22384436 19187614 15201656 11575596 10057469 11646785 14751982 16340388 15379944
42097 15379944 13833880 13798996 14886391 15138143 13686730 11705791 10968854 11824302 12598670
42088 12598670 11274561 8033566 5527292 5911421 8267604 10049498 10398474 10391016 10467298
$$ packed form
42145A78584135q072283p991856j0300792j1893543j0973982r318046r012627
42138A11021006r367901q375037n881292l905900l959696m902359m190165j421763
42130F9016893M27124j331722m935403n962934l336472p91330j449340l748458
42122D7888358m514208l495987k429649j701919p90224m44859j402231k053919
42114C1055362n44966J548864R50885k138298l937286k533703l09720q1573j625129
42105B2384436l196822l985958l626060j518127J589316L105197J588406r60444
42097A5379944j546064l4884J087395K51752j451413j980939p36937Q55448P74368
42088A2598670j324109l240995k506274L84129K356183J781894L48976p458P6282
$$ plain form
42079 10467298 9952217 9454721 11049259 14544719 15882060 11824615 4987933 1299855
42071 1299855 2736571 5419175 5362671 3274592 2208933 2806665 3220941 2587961 2168977
42062 2168977 3230676 5565931 8088951 9467320 8413815 5091614 2253415 3041964
42054 3041964 7087144 10481046 10378638 8033289 6430017 6687206 8110490 10062507
42046 10062507 11853952 12111468 10546962 9518856 11367949 14593109 15258911 12241646
42038 12241646 8378462 5903346 3667576 318738 -2377139 -1724936 1960282 5891170
42030 5891170 8264238 9023161 8022703 4971732 1228188 -543285 871942 4150978
42022 4150978 7307493 9351498 10071543 9790088 9696294 10905070 12708361 13244056 12413103
$$ packed form
42079A0467298n15081m97496J594538L495460J337341m057445o836682l688078
42071A299855J436716K682604n6504k088079j065659N97732M14276o32980m18984
42062B168977J061699K335255K523020J378369j053505l322201k838199P88549
42054C041964M045180L393902j02408k345349j603272K57189J423284J952017
42046A0062507J791445K57516j564506j028106J849093L225160O65802l017265
42038A2241646l863184k475116k235770l348838k695877O52203L685218L930888
42030E891170K373068P58923j000458l050971l743544j771473J415227L279036
42022D150978L156515K044005P20045k81455r3794J208776J803291N35695q30953
$$ plain form
42013 12413103 12397329 14318702 16109490 15253487 12355855 10152914 9781280 9957699 9506331
42004 9506331 8800535 8596679 9025787 9898095 10491653 8937453 3755409 -3247284 -7467987
41995 -7467987 -6364943 -2634772 -969796 -2466238 -4034820 -3012368 -289622 1791995
41987 1791995 2985388 4982316 8137318 10007778 8119146 3546978 323110 819503
41979 819503 2970997 3326268 1902636 1920389 4902865 8677529 11141171 13309446 16582318
41970 16582318 19255476 18801283 16258691 14828620 14613845 12655980 8733597 7065655
41962 7065655 10290162 15054169 16403526 14268458 12538521 13220970 14678439 14887915
41954 14887915 13427383 10449265 6490786 3519192 3646739 6316225 8937145 10685632
$$ packed form
42013A2413103j5774J921373J790788q56003k897632k202941l71634J76419m51368
42004I506331p05796k03856M29108Q72308N93558j554200n182044p002693m220703
41995g467987J103044L730171J664976j496442j568582J022452K722746K081617
41987A791995J193393J996928L155002J870460j888632m572168l223868M96393
41979H19503K151494L55271j423632J7753K982476L774664K463642K168275L272872
41970A6582318K673158m54193k542592j430071k14775j957865l922383j667942
41962G065655L224507M764007J349357k135068j729937O82449J457469K09476
41954A4887915j460532k978118l958479k971594J27547K669486K620920J748487
$$ plain form
41946 10685632 13233563 16968074 19216103 18031075 15719808 16281067 20413643 25281030
41938 25281030 28699351 31354201 34720008 38762022 42598114 46207355 50358006 55333272
41930 55333272 60668032 66116112 72272336 80153039 90601876 104220947 121444731 142465963
41922 142465963 167503945 197157994 231106791 264972741 289341535 294807143 279620287
41915 279620287 251223521 219180980 187939855 157733718 130234725 109431110 96515248
41908 96515248 87152427 75939834 62298376 50230653 42862482 38916878 34946362 29923459
41900 29923459 26349722 26516357 28781456 29114291 26124508 22419852 20271720 18496409
41892 18496409 15600076 13544385 14961347 18051794 18397579 15629097 14048666 15912403
$$ packed form
41946A0685632K547931L734511K248029j185028k311267N61259M132576M867387
41938B5281030L418321K654850L365807M042014L836092L609241M150651M975266
41930E5333272N334760N448080O156224P880703J0448837J3619071J7223784K1021232
41922A42465963K5037982K9654049L3948797L3865950K4368794N465608j5186856
41915B79620287k8396766l2042541l1241125l0206137k7498993k0803615j2915862
41908I6515248r362821j1212593j3641458j2067723p368171l945604l970516n022903
41900B9923459l573737J66635K265099L32835k989783l704656k148132j775311
41892A8496409k896333k055691J416962L090447L45785k768482j580431J863737
$$ plain form
41884 15912403 18299810 18247588 16962618 16439202 15448028 12192347 8297895 6635113 7054810
41875 7054810 7614178 8370243 10484811 12912967 13605300 13056180 13079549 12916871 10476941
41866 10476941 6941153 5845789 7432887 8309358 7432764 7760964 10258054 10941382 7015604
41857 7015604 2248761 2265106 6791496 10579339 10744532 9353906 9148348 10286251 11823681
41848 11823681 13462969 14652470 14012771 11165538 8170962 7929495 11261540 16012561
41840 16012561 19088362 19398535 18672703 18967905 19682360 18285032 14249555 10614490 10534901
41831 10534901 13562093 16689145 17989835 17681855 16597669 15553535 15695887 17477672
41823 17477672 19417371 19641088 18561748 18237857 19121252 19473046 18351991 17172319 17543159
$$ packed form
41884A5912403K387407n2222j284970n23416r91174l255681l894452j662782M19697
41875G054810N59368P56065K114568K428156O92333n49120K3369j62678k439930
41866A0476941l535788j095364J587098Q76471q76594L28200K497090O83328l925778
41857G015604m766843J6345M526390L787843J65193j390626k05558J137903J537430
41848A1823681J639288J189501o39699k847233k994576k41467L332045M751021
41840A6012561L075801L10173p25832K95202P14455j397328m035477l635065p9589
41831A0534901L027192L127052J300690l07980j084186j044134J42352J781785
41823A7477672J939699K23717j079340l23891Q83395L51794j121055j179672L70840
$$ plain form
41814 17543159 19244236 21096091 22221022 21759427 19300160 16706026 17373555 21800064
41806 21800064 25685080 24884305 20947393 18830092 19833982 20294363 17672687 14380076
41798 14380076 13767342 15162113 15621740 14878348 15392451 17993832 20399111 20498887 18805835
41789 18805835 16864656 15173467 13696232 12743395 12064119 10510705 8166316 7621619
41781 7621619 11132718 16991530 20707573 19953975 16754674 14435202 13874670 13504005 11985499
41772 11985499 9950639 9292734 11026419 13788336 14941097 13753008 12668109 14081222
41764 14081222 16576566 16527922 13357869 10597338 10915311 12697115 13131213 12293687 11850405
41755 11850405 11633950 10422817 8919567 8853301 9738641 9641869 8850373 9394791 10834277
$$ packed form
41814A7543159J701077J851855J124931m61595k459267k594134O67529M426509
41806B1800064L885016q00775l936912k117301J003890M60381k621676l292611
41798A4380076o12734J394771M59627p43392N14103K601381K405279R9776j693052
41789A8805835j941179j691189j477235r52837o79276j553414k344389n44697
41781G621619L511099N858812L716043p53598l199301k319472n60532l70665j518506
41772A1985499k034860o57905J733685K761917J152761j188089j084899J413113
41764A4081222K495344m8644l170053k760531L17973J781804M34098q37526m43282
41755A1850405k16455j211133j503250o6266Q85340r6772p91496N44418J439486
$$ plain form
41746 10834277 10380733 8167438 8285426 12420348 16247010 15390481 11857905 10482069
41738 10482069 11335773 10618631 7920587 7083081 9344279 10935523 9460802 8132330
41730 8132330 10684506 15620347 19036785 20549920 22619093 25786671 28482622 30438497
41722 30438497 32382292 32937830 29921454 24866890 22193743 22992240 23483552 21083522
41714 21083522 18174745 17577398 17790533 16018179 13303565 12768717 14200668 14285556 11795400
41705 11795400 9083048 8308268 9219774 11029239 13578415 15923509 16443155 15440927
41697 15440927 15365073 17308626 19407549 19898246 19568595 19646255 19463306 18358870 18005616
41688 18005616 20024864 22394576 21402884 17119481 13912259 14626832 16743280 15980743
$$ packed form
41746A0834277m53544k213295J17988M134922L826662q56529l532576j375836
41738A0482069Q53704p17142k698044q37506K261198J591244j474721j328472
41730H132330K552176M935841L416438J513135K069173L167578K695951J955875
41722C0438497J943795N55538l016376n054564k673147P98497M91312k400030
41714B1083522k908777n97347K13135j772354k714614n34848J431951Q4888k490156
41705A1795400k712352p74780R11506J809465K549176K345094N19646j002228
41697A5440927p5854J943553K098923M90697l29651P7660j82949j104436l53254
41688A8005616K019248K369712r91692m283403l207222P14573K116448p62537
$$ plain form
41680 15980743 12077256 8902197 9408480 12441043 14867447 15344514 14988774 15178755 16084515
41671 16084515 17363031 18919130 20159271 19502595 16145045 12158941 11227327 14532405
41663 14532405 18905722 20097157 17494110 14737338 15745348 20812795 26808872 30789504
41655 30789504 32900061 35427838 39346242 42995953 44975238 47152441 52778916 61745407
41647 61745407 70122629 75470123 80585675 90152893 105040972 122254230 140038217 160622990
41639 160622990 187334950 220529315 256806746 290601697 315561177 325849806 318427737
41632 318427737 295071005 261893407 226315447 193833018 166823667 145499392 129253670
41625 129253670 116950119 106765717 97053249 87706969 79872283 73936235 68666156 62915338
$$ packed form
41680A5980743l903487l175059N06283L032563K426404M77067l55740J89981R05760
41671A6084515J278516J556099J240141o56676l357550l986104r31614L305078
41663A4532405M373317J191435k603047k756772J008010N067447N996077L980632
41655C0789504K110557K527777L918404L649711J979285K177203N626475Q966491
41647F1745407Q377222N347494N115552R567218J4888079J7213258J7783987K0584773
41639A60622990K6711960L3194365L6277431L3794951K4959480J0288629p422069
41632C18427737k3356732l3177598l5577960l2482429k7009351k1324275j6245722
41625A29253670j2303551j0184402r712468r346280p834686n936048n270079n750818
$$ plain form
41617 62915338 57310381 53357002 51479483 50843265 50598750 50352499 49853267 49265253 49526512
41608 49526512 51465065 54618680 57641206 59734956 61198931 63072654 66848963 73742764
41600 73742764 83249687 93166813 102250150 112192855 125632688 142932051 162741027 185420808
41592 185420808 213830122 250044909 292080262 333501780 365260735 379164598 372330420
41585 372330420 348859301 315806577 277874202 237641402 199396991 168495522 146136792
41578 146136792 128480111 112534874 99626492 91021386 83680288 73919555 63061938
41571 63061938 55512426 52203399 49632568 45237412 40318937 36938981 34642519 31609020
41563 31609020 27534134 24168872 23405172 25019295 26144220 23815151 18698430 14926837
$$ packed form
41617F2915338n604957l953379j877519o36218k44515k46251m99232n88014K61259
41608D9526512J938553L153615L022526K093750J463975J873723L776309O893801
41600G3742764R506923R917126R083337R942705J3439833J7299363J9808976K2679781
41592A85420808K8409314L6214787M2035353M1421518L1758955J3903863o834178
41585C72330420k3471119l3052724l7932375m0232800l8244411l0901469k2358730
41578A46136792j7656681j5945237j2908382q605106p341098r760733j0857617
41571F3061938p549512l309027k570831m395156m918475l379956k296462l033499
41563C1609020m074886l365262p63700J614123J124925k329069n116721l771593
$$ plain form
41555 14926837 14949913 16228805 15177649 12726362 12719925 15609305 17588992 16399501 14278400
41546 14278400 13825832 14243903 13756866 13066817 13698288 14651547 13601016 10733685 8840226
41537 8840226 9490532 11046512 11030323 9268348 7943275 8897398 11420569 13065609 12671144
41528 12671144 11758236 12124730 12959903 12046251 9384671 7401480 7378915 8076626 8514398
41519 8514398 9450894 10788098 10262375 6988262 4103553 5063544 8771181 11289971 11311597
41510 11311597 10793384 10807415 10271925 9113221 9315681 11550910 13373052 12452199 9807817
41501 9807817 8207486 8655935 10037207 11403919 13175560 16307934 21107602 26681379
41493 26681379 31206577 33192913 32772518 31354737 30063323 29150929 28640362 28333296 27201373
$$ packed form
41555A4926837K3076J278892j051156k451287o437K889380J979687j189491k121101
41546A4278400m52568M18071m87037o90049O31471R53259j050531k867331j893459
41537H840226O50306J555980j6189j761975j325073R54123K523171J645040l94465
41528A2671144r12908L66494Q35173r13652k661580j983191k2565O97711M37772
41519H514398R36496J337204n25723l274113k884709R59991L707637K518790K1626
41510A1311597n18213J4031n35490j158704K02460K235229J822142r20853k644382
41501I807817j600331M48449J381272J366712J771641L132374M799668N573777
41493B6681379M525198J986336m20395j417781j291414r12394n10567l07066j131923
$$ plain form
41484 27201373 24211563 20170601 17503716 17668784 19761053 21886103 22686891 21395291
41476 21395291 18099457 14532594 12830799 12648799 11313409 7983624 5690547 7373435
41468 7373435 11413517 13443433 11861101 9357058 9218380 12024835 15991264 18841071
41460 18841071 19031280 16520024 12964736 10620175 10812746 13414091 16963964 19038691
41452 19038691 18024883 15521774 15313437 18446527 21211924 20286280 17927606 18600165
41444 18600165 21705542 22142032 18213649 14293048 14088707 15553291 15113663 13318570
41436 13318570 12718161 12816852 11345094 9076202 8967087 10727261 10445090 6610126 2997065
41427 2997065 3655399 7492799 10120652 9623478 8140739 8239153 9953454 11950674 13970543
$$ packed form
41484B7201373k989810m040962k666885J65068K092269K125050Q00788j291600
41476B1395291l295834l566863j701795j82000j335390l329785k293077J682888
41468G373435M040082K029916j582332k504043j38678K806455L966429K849807
41460A8841071J90209k511256l555288k344561J92571K601345L549873K074727
41452A9038691j013808k503109k08337L133090K765397r25644k358674O72559
41444A8600165L105377M36490l928383l920601k04341J464584m39628j795093
41436A3318570o00409R8691j471758k268892j09115J760174k82171l834964l613061
41427B997065O58334L837400K627853m97174j482739R8414J714301J997220K019869
$$ plain form
41418 13970543 16667557 19472358 20204504 17638951 13593569 11171732 11151511 11516491 10735006
41409 10735006 9926816 11050799 14381726 18839464 23473503 27222291 28431296 26525342
41401 26525342 23555985 22296220 23149308 24506983 25532138 26523885 26894171 25297621
41393 25297621 22147844 19651089 18524046 16844644 13330969 9743267 8361479 8655936
41385 8655936 8467470 7493257 7428153 8899843 10229995 9662391 7507555 5534076 5085753
41376 5085753 6257279 8217110 9682656 9399916 6945481 3433176 1085671 1401927
41368 1401927 3494176 4789368 3821835 1786392 745803 1074256 1781868 2661348 4332031
41359 4332031 6255407 6756333 5700456 5380517 7568300 10941710 12671028 11663360
$$ packed form
41418A3970543K697014K804801P32146k565553m045382k421837k0221L64980p81485
41409A0735006q08190J123983L330927M457738M634039L748788J209005j905954
41401B6525342k969357j259765Q53088J357675J025155R91747L70286j596550
41393B5297621l149777k496755j127043j679402l513675l587702j381788K94457
41385H655936j88466r74213o5104J471690J330152n67604k154836j973479m48323
41376E085753J171526J959831J465546k82740k454435l512305k347505L16256
41368A401927K092249J295192r67533k035443j040589L28453P07612Q79480J670683
41359D332031J923376N00926j055877l19939K187783L373410J729318j007668
$$ plain form
41351 11663360 9137669 6780388 5428007 4961163 4525714 3324722 1811144 1353215
41343 1353215 2198545 2935160 2748151 2784066 4072267 5552437 5784947 5262329 5063188
41334 5063188 4516998 2714144 1331151 2802035 5873828 6370163 3162007 236870
41326 236870 1193740 4227410 4852873 2012978 -913669 -567163 2844533 6356223 7312776
41317 7312776 5538368 3133437 2157359 2549116 2946612 3239756 4686427 7172710 8418736
41308 8418736 7172341 5451560 5836496 7812592 8765916 7665213 5658189 3663820
41300 3663820 1652291 115671 -25925 754309 897181 334573 810326 2887862 4422798
41291 4422798 3110601 -751131 -5025190 -8077878 -9391792 -8993107 -7477730 -5889561
$$ packed form
41351A1663360k525691k357281j352381m66844m35449j200992j513578m57929
41343A353215Q45330P36615j87009L5915J288201J480170K32510n22618j99141
41334E063188n46190j802854j382993J470884L071793M96335l208156k925137
41326B36870R56870L033670O25463k839895k926647L46506L411696L511690R56553
41317G312776j774408k404931r76078L91757L97496K93144J446671K486283J246026
41308H418736j246395j720781L84936J976096R53324j100703k007024j994369
41300C663820k011529j536620j41596P80234J42872n62608M75753K077536J534936
41291D422798j312197l861732m274059l052688j313914L98685J515377J588169
$$ plain form
41283 -5889561 -4654224 -3367461 -2329140 -3042479 -5867156 -8177695 -6655838 -1206906
41275 -1206906 4783378 7949387 7509400 4709534 1434421 -311470 865660 4430188
41267 4430188 7867482 8703667 6576494 3288697 1110348 965961 1957040 2759401 3532403
41258 3532403 5683577 9309398 12101027 12083048 10419543 9647872 9847593 8981533 6892708
41249 6892708 6112779 7890945 10050489 10217249 8897670 7580379 5886707 2938180
41241 2938180 21040 -658749 986179 3277321 5210357 6361966 5516637 2160474
41233 2160474 -1403995 -2441665 -1848706 -2628205 -4601897 -4557675 -2190796 -1505062 -4398885
41224 -4398885 -6908175 -4910089 -382850 1774366 898439 340703 1343967 1618040 128980
$$ packed form
41283e889561J235337J286763J038321p13339k824677k310539J521857N448932
41275a206906N990284L166009m39987k799866l275113j745891J177130L564528
41267D430188L437294Q36185k127173l287797k178349j44387R91079Q02361P73002
41258C532403K151174L625821K791629j7979j663505p71671J99721q66060k088825
41249F892708p79929J778166K159544J66760j319579j317291j693672k948527
41241B938180k917140o79789J644928K291142J933036J151609q45329l356163
41233B160474l564469j037670N92959p79499j973692M4222K366879O85734k893823
41224d398885k509290J998086M527239K157216q75927n57736J003264K74073j489060
$$ plain form
41215 128980 -784914 643833 2641224 2590425 578555 -1434815 -2474966 -2980783 -3409945
41206 -3409945 -3873901 -4541866 -5161683 -4550951 -1760771 2164321 4522364 3675931 1218498
41197 1218498 683667 3574849 7220715 7772770 5241318 3709643 5702456 8372516
41189 8372516 7302896 2650339 -1234205 -1671313 -114918 1331080 2602980 3830044
41181 3830044 3865929 2658481 2639966 5192166 7519264 6043745 1888976 -315326 1010323
41172 1010323 2343282 448872 -3162758 -4984694 -4404301 -3389237 -2837896 -2206360 -2126611
41163 -2126611 -4046948 -6710611 -6297954 -1900400 1879713 592867 -3713220 -5318663
41155 -5318663 -3004751 -1290407 -3235477 -6288670 -6949686 -5674417 -4425412 -2686208
$$ packed form
41215A28980r13894J428747J997391n0799k011870k013370j040151n05817m29162
41206c409945m63956o67965o19817O10732K790180L925092K358043q46433k457433
41197A218498n34831K891182L645866N52055k531452j531675J992813K670060
41189H372516j069620m652557l884544m37108J556395J445998J271900J227064
41181C830044L5885j207448j8515K552200K327098j475519m154769k204302J325649
41172A010323J332959j894410l611630j821936N80393J015064N51341O31536P9749
41163b126611j920337k663663M12657M397554L780113j286846m306087j605443
41155e318663K313912J714344j945070l053193o61016J275269J249005J739204
$$ plain form
41147 -2686208 366829 2190939 -120285 -4312114 -4968421 -880427 3785981 5898733
41139 5898733 6462747 6360388 3887104 -814158 -3027994 720551 6516695 7023749 813081
41130 813081 -5921005 -7009065 -2640702 2465958 4586713 3407974 681407 -1731402
41122 -1731402 -2710908 -1980946 -142172 1316053 744373 -1977730 -4633439 -4680849 -2195840
41113 -2195840 395268 1649113 2539997 3998673 4843596 3467850 332689 -2533755
41105 -2533755 -3660544 -2857125 -930340 394164 -467566 -2909320 -4359281 -3461112 -1511767
41096 -1511767 177524 2180826 4646729 5518569 3599332 1363654 1555057 2497055 492392
41087 492392 -3837332 -5587194 -2295064 2857220 5457221 4518861 1703918 -1307796
$$ packed form
41147b686208L053037J824110k311224m191829o56307M087994M666408K112752
41139E898733N64014j02359k473284m701262k213836L748545N796144N07054o210668
41130H13081o734086j088060M368363N106660K120755j178739k726567k412809
41122a731402r79506P29962J838774J458225n71680k722103k655709m7410K485009
41113b195840K591108J253845Q90884J458676Q44923j375746l135161k866444
41105b533755j126789Q03419J926785J324504q61730k441754j449961Q98169J949345
41096a511767J689291K003302K465903Q71840j919237k235678J91403R41998k004663
41087D92392m329724j749862L292130N152284K600001r38360k814943l011714
$$ plain form
41079 -1307796 -3187506 -2974263 -1412491 -696172 -1546120 -1988021 -269350 2394378 3362793
41070 3362793 1886112 -313788 -1104310 270095 2844864 4708771 4550377 2714554
41062 2714554 381918 -1856113 -3683279 -4076080 -2418904 -273581 89420 -981335
41054 -981335 -901313 1039468 2354277 1078662 -1406330 -2573626 -1927562 -601871 625503
41045 625503 1468428 1499491 590539 -973331 -3356666 -6590247 -8650118 -6510507 -512490
41036 -512490 4521742 4461072 434982 -3574116 -5769974 -6788709 -6612047 -4418945 -1062715
41027 -1062715 1082014 1025474 29309 -513072 -410126 160145 1252700 2590464 3391066
41018 3391066 2972632 1152142 -1519590 -3613146 -3921519 -3196179 -3381588 -4467657 -4072436
$$ packed form
41079a307796j879710K13243J561772P16319q49948m41901J718671K663728R68415
41070C362793j476681k199900p90522J374405K574769J863907j58394j835823
41062B714554k332636k238031j827166l92801J657176K145323L63001j070755
41054i81335Q0022J940781J314809j275615k484992j167296O46064J325691J227374
41045F25503Q42925L1063r08952j563870k383335l233581k059871K139611N998017
41036e12490N034232o0670m026090m009098k195858j018735J76662K193102L356230
41027a062715K144729n6540r96165n42381J02946N70271J092555J337764Q00602
41018C391066m18434j820490k671732k093556l08373P25340j85409j086069L95221
$$ plain form
41009 -4072436 -1365937 908548 356054 -1322417 -1167389 372289 808568 91700 15702
41000 15702 209782 -1088699 -2553469 -538053 4878974 8680961 7225974 2379302 -2147074
40991 -2147074 -5168980 -6767797 -5966153 -2628286 455503 352208 -2237792 -4186264
40983 -4186264 -3949629 -2552771 -1520032 -1462063 -1895338 -1256914 1760589 5806560 7436361
40974 7436361 5541528 3424260 4460553 7319575 7986313 5408601 2403421 1414818
40966 1414818 1948806 2314206 1796981 768082 149603 880979 2683967 3622316 2193633
40957 2193633 -575002 -2479897 -2909523 -2649874 -1812383 -183478 931841 -140313 -2419672
40948 -2419672 -2998376 -1202638 463817 174554 -934109 -1286046 -1128962 -814287 830673
$$ packed form
41009d072436K706499K274485n52494j678471J55028J539678M36279p16868p5998
41000A5702J94080j298481j464770K015416N417027L801987j454987m846672m526376
40991b147074l021906j598817Q01644L337867L083789j03295k590000j948472
40983d186264K36635J396858J032739N7969m33275O38424L017503M045971J629801
40974G436361j894833k117268J036293K859022O66738k577712l005180r88603
40966A414818N33988L65400n17225j028899o18479P31376J802988R38349j428683
40957B193633k768635j904895m29626K59649Q37491J628905J115319j072154k279359
40948b419672n78704J795738J666455k89263j108663l51937J57084L14675J644960
$$ plain form
40939 830673 4376795 7766147 8535719 6873501 4618598 2475761 276838 -1126435
40931 -1126435 -697571 577410 632075 -772488 -2271666 -3789502 -6603856 -10116987 -11211739
40922 -11211739 -8141144 -3136674 348224 1560451 2152096 3233428 4499126 5605149
40914 5605149 6648929 7319327 6814398 4718985 1295031 -2754242 -6073783 -6883541 -4639994
40905 -4639994 -1099029 1493359 2879615 4101839 4909633 3989441 1859505 1056437 2434968
40896 2434968 3533061 2255434 200494 23375 1012205 296937 -2149743 -3081683 -1101483
40887 -1101483 901109 -35077 -2776780 -4251749 -3870111 -3182043 -2329116 7816 3090894
40878 3090894 3583084 -189018 -5452146 -8079568 -7194136 -5089508 -3567978 -2436463
$$ packed form
40939H30673L546122L389352P69572j662218k254903k142837k198923j403273
40931a126435M28864J274981N4665j404563j499178j517836k814354l513131j094752
40922a1211739L070595N004470L484898J212227N91645J081332J265698J106023
40914E605149J043780O70398n04929k095413l423954m049273l319541q09758K243547
40905d639994L540965K592388J386256J222224Q07794r20192k129936q03068J378531
40896B434968J098093j277627k054940j77119R88830p15268k446680r31940J980200
40887a101483K002592r36186k741703j474969L81638O88068Q52927K336932L083078
40878C090894M92190l772102n263128k627422Q85432K104628J521530J131515
$$ plain form
40870 -2436463 -1495656 -1800820 -3802330 -5525392 -4268342 -2412 4215899 5672860
40862 5672860 4922215 4481195 5174490 5039097 2152116 -2502008 -5877420 -6118874 -4036750
40853 -4036750 -1531024 290377 1034384 174581 -2511061 -5775633 -7187149 -5153940
40845 -5153940 -527740 4016169 6225276 6049363 5399824 6099974 7990633 9325800 9190401
40836 9190401 8842227 9769859 10832493 8937572 3246554 -2618183 -4024568 -491887
40828 -491887 4021965 5786003 4574554 2002328 -1346052 -5485528 -8918425 -9273642
40820 -9273642 -6345160 -2836473 -1299424 -1431470 -1287544 -262099 405266 -241012 -1573343
40811 -1573343 -2512575 -2976712 -3585982 -4488597 -5120986 -4864534 -3475088 -1210679 898278
$$ packed form
40870b436463R40807l05164k001510j723062J257050M265930M218311J456961
40862E672860p50645m41020O93295j35393k886981m654124l375412k41454K082124
40853d036750K505726J821401P44007q59803k685642l264572j411516K033209
40845e153940M626200M543909K209107j75913o49539P00150J890659J335167j35399
40836I190401l48174R27632J062634j894921n691018n864737j406385L532681
40828d91887M513852J764038j211449k572226l348380m139476l432897l55217
40820i273642K928482L508687J537049j32046J43926J025445O67365o46278j332331
40811a573343r39232m64137o09270r02615o32389K56452J389446K264409K108957
$$ plain form
40802 898278 1345303 -293622 -2200916 -1913964 591260 2621366 2258027 886007 1022411
40793 1022411 2715808 3953107 4097853 4625871 6104994 6675399 4747718 1669668 270430
40784 270430 1660341 4603374 7178054 7958891 6487808 3883012 2275290 2442811 2781180
40775 2781180 1830954 772265 1698607 4266054 6072644 5826442 4057530 1167629 -2787422
40766 -2787422 -6497181 -8203906 -8384378 -8995451 -9611777 -7342532 -1686463 3630936 5497769
40757 5497769 5251928 5334548 4831053 1633791 -2851135 -4972551 -4075367 -2961191 -3252421
40748 -3252421 -3565414 -2598844 -942298 927773 3563602 6272838 6527713 3371571 -478663
40739 -478663 -1737289 -453160 803794 625462 -1191 359383 1713702 2615046 1491807
$$ packed form
40802H98278M47025j638925j907294K86952K505224K030106l63339j372020J36404
40793A022411J693397J237299J44746N28018J479123N70405j927681l078050j399238
40784B70430J389911K943033K574680P80837j471083k604796j607722J67521L38369
40775B781180r50226j058689R26342K567447J806590k46202j768912k889901l955051
40766b787422l709759j706725j80472o11073o16326K269245N656069N317399J866833
40757E497769k45841Q2620n03495l197262m484926k121416Q97184J114176k91230
40748c252421l12993R66570J656546J870071K635829K709236K54875l156142l850234
40739d78663j258626J284129J256954j78332o26653L60574J354319R01344j123239
$$ plain form
40730 1491807 -1539667 -3991158 -3208373 242833 2712923 1860497 -458881 -950947 817950
40721 817950 2721508 3697719 4626000 5615338 4948978 1906369 -1060312 -674946 3255746
40712 3255746 7660883 9659538 8901282 6536038 3542869 955418 309813 2045170
40704 2045170 3963567 3355812 937267 554911 3992991 8120401 8957422 6841351 5100778
40695 5100778 4821408 4021050 1684399 -683257 -2066241 -3362955 -4639011 -3951509 -807209
40686 -807209 1767652 1091990 -1091820 -1051061 1701663 4242822 4435772 2639335 -281395
40677 -281395 -3875517 -6843252 -7325505 -5258843 -2786006 -1695951 -1789732 -2188348 -2815426
40668 -2815426 -3807698 -4419022 -3372354 -148634 4209346 7541953 8280862 6891843 4841233
$$ packed form
40730A491807l031474k451491P82785L451206K470090q52426k319378m92066J768897
40721H17950J903558R76211R28281R89338o66360l042609k966681L85366L930692
40712C255746M405137J998655p58256k365244k993169k587451o45605J735357
40704B045170J918397o07755k418545l82356L438080M127410Q37021k116071j740573
40695E100778k79370q00358k336651k367656j382984j296714j276056O87502L144300
40686h07209K574861o75662k183810M0759K752724K541159J92950j796437k920730
40677b81395l594122k967735m82253K066662K472837J090055r3781l98616o27078
40668b815426r92272o11324J046668L223720M357980L332607P38909j389019k050610
$$ plain form
40659 4841233 2186476 -1954236 -6009256 -5957680 -963843 3642875 2578740 -2014069
40651 -2014069 -3718688 -1373322 -305721 -3630939 -7666926 -8118802 -6279135 -5972412
40643 -5972412 -7769468 -9596110 -10456679 -10203899 -7797279 -3295825 73706 -575807 -3253701
40634 -3253701 -3450381 -384703 2378012 2312938 822858 470121 1980376 4548848 7020290
40625 7020290 8184816 7466325 5715870 4329425 3827397 4162113 5380516 6643799 6010589
40616 6010589 3122399 694247 1086638 2913228 3645586 3713071 4507136 4135390 -69186
40607 -69186 -5660219 -7102380 -4022872 -2033217 -4130075 -6745565 -6502721 -5482424 -6395961
40598 -6395961 -7281819 -5331336 -2299513 -1465468 -2027548 -1252416 -38059 -1451920 -5053667
$$ packed form
40659D841233k654757m140712m055020N1576M993837M606718j064135m592809
40651b014069j704619K345366J067601l325218m035987m51876J839667L06723
40643e972412j797056j826642q60569K52780K406620M501454L369531o49513k677894
40634c253701j96680L065678K762715o5074j490080l52737J510255K568472K471442
40625G020290J164526p18491j750455j386445n02028L34716J218403J263283o33210
40616F010589k888190k428152L92391J826590P32358O7485P94065l71746m204576
40607f9186n591033j442161L079508J989655k096858k615490K42844J020297r13537
40598f395961q85858J950483L031823Q34045n62080P75132J214357j413861l601747
$$ plain form
40589 -5053667 -7353224 -7256452 -6825500 -7057434 -6893689 -6147377 -5637334 -4760228 -2768766
40580 -2768766 -1924042 -4839048 -8755660 -7695529 -1438439 2825183 82186 -5875605
40572 -5875605 -8445446 -6762242 -4382949 -2703325 -502918 1589028 1061085 -1964308
40564 -1964308 -4042461 -3107705 -1061455 -655006 -1998227 -3376980 -3886040 -3827121 -3431271
40555 -3431271 -2580621 -1589626 -1215690 -1599287 -1741821 -536617 1777584 3642065 3733725
40546 3733725 2037634 -662146 -3445753 -4990797 -3970117 -1043415 592673 -1383054
40538 -1383054 -4914558 -5702322 -2885408 -198983 -798630 -3276033 -4149398 -2351850 540043
40529 540043 3137152 5261021 6758273 7050787 5887003 3618348 942063 -1056222
$$ packed form
40589e053667k299557R6772M30952k31934J63745P46312N10043Q77106J991462
40580b768766Q44724k915006l916612J060131O257090M263622k742997n957791
40572e875605k569841J683204K379293J679624K200407K091946n27943l025393
40564a964308k078153R34756K046250M06449j343221j378753n09060N8919L95850
40555c431271Q50650R90995L73936l83597j42534J205204K314201J864481R1660
40546C733725j696091k699780k783607j545044J020680K926702J636088j975727
40538a383054l531504p87764K816914K686425n99647k477403q73365J797548K891893
40529E40043K597109K123869J497252K92514j163784k268655k676285j998285
$$ plain form
40521 -1056222 -1209494 630068 3236904 5199369 5840593 4820878 2115814 -1030326
40513 -1030326 -2573427 -2081381 -1370635 -1640011 -1430825 966733 4309603 5635151 4098708
40504 4098708 1656624 161821 -405684 -703643 -673976 -23278 922395 1440291 1183072
40495 1183072 625042 803377 2190015 3668399 3410918 1135602 -1416551 -2634072 -2457580
40486 -2457580 -1161248 1563789 5135561 7376158 7029385 5707270 5495679 5853008 5037441
40477 5037441 3519784 3302208 4273868 3962785 1173889 -2367078 -4438387 -4587818 -3708360
40468 -3708360 -3004674 -3442532 -4545917 -3969858 -397243 3312475 2614672 -2563914 -6998833
40459 -6998833 -6712049 -3719383 -2433229 -3599714 -4333012 -2827522 -315107 1420576
$$ packed form
40521a056222j53272J839562K606836J962465O41224j019715k705064l146140
40513a030326j543101M92046P10746k69376K09186K397558L342870J325548j536443
40504D098708k442084j494803n67505k97959K9667O50698R45673N17896k57219
40495A183072n58030J78335J386638J478384k57481k275316k552153j217521J76492
40486b457580J296332K725037L571772K240597l46773j322115k11591L57329q15567
40477E037441j517657k17576R71660l11083k788896l540967k071309j49431Q79458
40468c708360P03686m37858j103385N76059L572615L709718o97803n178586m434919
40459f998833K86784K992666J286154j166485p33298J505490K512415J735683
$$ plain form
40451 1420576 2299576 3340945 5170072 7500555 9261666 9152224 6895674 4070522
40443 4070522 2860739 3572701 3997166 1916358 -1965257 -4495697 -3913625 -2342112 -3216326
40434 -3216326 -6581551 -8741574 -7042562 -3152004 -464603 26290 -321631 -338437 612385
40425 612385 3465582 7952147 11068309 9954959 6094973 3853796 4818702 6399828
40417 6399828 6246382 4998651 3976660 3166268 2668656 3427073 5138801 5842467 4842799
40408 4842799 3674400 3075037 1813774 -67748 -37973 2742476 5046060 4130748 1984529
40399 1984529 1861613 2960719 2272012 -13795 -997792 -90721 394585 -493366 -1013294
40390 -1013294 34734 1658953 2555396 2162124 -55823 -3678992 -5808009 -3491927
$$ packed form
40451A420576Q79000J041369J829127K330483J761111j09442k256550k825152
40443D070522j209783P11962M24465k080808l881615k530440N82072J571513q74214
40434c216326l365225k160023J699012L890558K687401M90893l47921j6806R50822
40425F12385K853197M486565L116162j113350l859986k241177R64906J581126
40417F399828j53446j247731j021991q10392m97612P58417J711728P03666r99668
40408D842799j168399n99363j261263j881522K9775K780449K303584r15312k146219
40399A984529j22916J099106o88707k285807r83997R07071M85306q87951n19928
40390a013294J048028J624219Q96443l93272k217947l623169k129017K316082
$$ plain form
40382 -3491927 1963918 5911712 5963180 3925633 1933574 -5071 -1785366 -2072583 -1052089
40373 -1052089 -1158635 -2950878 -3116951 759615 5797512 7282105 4985413 2896816
40365 2896816 3545368 5633377 6984395 6937667 5577443 3176466 1078724 956875 2293417
40356 2293417 2446529 228793 -2323516 -3069821 -2989452 -4250270 -6078038 -5226171 -850176
40347 -850176 3544444 4405429 2642478 1829428 2977046 3803546 3293951 3940317 7644254
40338 7644254 11556875 10908194 5373961 -197638 -1814189 -599127 79971 -496536 -483294
40329 -483294 816117 1885536 1669231 1116961 1229416 1186912 -245257 -2437434 -3591845
40320 -3591845 -3347503 -3070342 -3347666 -2765968 -28995 3840742 6516607 6870455 5460462
$$ packed form
40382c491927N455845L947794N1468k037547j992059j938645j780295k87217J020494
40373a052089j06546j792243j66073L876566N037897J484593k296692k088597
40365B896816O48552K088009J351018m6728j360224k400977k097742j21849J336542
40356B293417J53112k217736k552309p46305Q0369j260818j827768Q51867M375995
40347h50176M394620Q60985j762951q13050J147618Q26500n09595O46366L703937
40338G644254L912621o48681n534233n571599j616551J215062O79098n76507J3242
40329d83294J299411J069419k16305n52270J12455m2504j432169k192177j154411
40320c591845K44342K77161k77324N81698K736973L869737K675865L53848j409993
$$ plain form
40311 5460462 3279872 1310469 731908 1954266 3539468 3580069 2240309 1560812 2680430
40302 2680430 4693210 6321171 7082085 6615344 4699883 2413276 1446296 1715350 1551852
40293 1551852 745299 998545 2450096 2488018 -302918 -3555122 -4554532 -3855736 -3024428
40284 -3024428 -1192491 2909610 7307322 8788369 7498897 6087854 5073159 2665239
40276 2665239 -1093028 -3525858 -2875478 228589 4660227 9107327 10904899 8287469
40268 8287469 3988527 2797086 4973201 5944504 3361127 257957 -323736 377397 350880
40259 350880 804663 3436928 6562829 7354321 6036252 4855672 4419623 3824003 3161306
40250 3161306 3320407 4172673 4979149 5633073 5922959 5023999 3372342 3238812 5487551
$$ packed form
40311E460462k180590j969403n78561J222358J585202M0601j339760o79497J119618
40302B680430K012780J627961P60914m66741j915461k286607r66980K69054j63498
40293A551852q06553K53246J451551L7922k790936l252204r99410O98796Q31308
40284c024428J831937M102101M397712J481047j289472j411043j014695k407920
40276B665239l758267k432830O50380L104067M431638M447100J797572k617430
40268H287469m298942j191441K176115R71303k583377l103170n81693P01133k6517
40259C50880M53783K632265L125901P91492j318069j180580m36049n95620o62697
40250C161306J59101Q52266Q06476O53924K89886q98960j651657j33530K248739
$$ plain form
40241 5487551 7681289 7612720 6625765 6735899 6591281 3829911 -44940 -1129099 1082966
40232 1082966 3105550 2693794 1236671 535580 372896 78637 -196539 -683669 -2154644
40223 -2154644 -4023533 -4375724 -2718147 -797051 70914 588660 1561600 2240985 1732753
40214 1732753 647463 195180 627437 1509809 2756358 4519901 6361453 6988111 4975304
40205 4975304 318391 -4522675 -6411134 -5338477 -4940528 -7559207 -10412981 -9255708
40197 -9255708 -4562250 -703146 442307 1130534 2704293 3111076 1060210 -1065612
40189 -1065612 -948589 -107237 -1094301 -3106857 -3424055 -1738681 -29164 1015228 2554628
40180 2554628 4916426 6925311 7940903 8370649 8048100 6200944 3381354 1495831
$$ packed form
40241E487551K193738o8569r86955J10134j44618k761370l874851j084159K212065
40232A082966K022584m11756j457123p01091j62684k94259k75176m87130j470975
40223b154644j868889l52191J657577J921096Q67965N17746R72940O79385n08232
40214A732753j085290m52283M32257Q82372J246549J763543J841552O26658k012807
40205D975304m656913m841066j888459J072657L97949k618679k853774J157273
40197i255708M693458L859104J145453O88227J573759M06783k050866k125822
40189a065612J17023Q41352r87064k012556l17198J685374J709517J044392J539400
40180B554628K361798K008885J015592M29746l22549j847156k819590j885523
$$ plain form
40172 1495831 1310448 1571007 1267218 1179451 2197700 3456266 3479028 2377840 1542102
40163 1542102 1482825 1301285 427280 -250251 393892 1985865 2877109 1990280 -34348
40154 -34348 -1503903 -1149868 893340 3083781 3581820 2077124 497295 957857 2831659
40145 2831659 3156622 676884 -1981270 -1728780 436931 536229 -2883542 -6649951 -7075141
40136 -7075141 -4219258 -829570 1419830 2838922 3612147 2776448 -164242 -3640822
40128 -3640822 -4939400 -2873653 670717 2320815 732972 -1870519 -2419723 -865231
40120 -865231 -32541 -1585355 -3817527 -4256622 -2904023 -1441861 -364122 1137167 2812912
40111 2812912 2955091 844454 -1929516 -3387383 -3334239 -2845452 -2554774 -2501088 -3021138
$$ packed form
40172A495831j85383K60559l03789q7767J018249J258566K2762j101188q35738
40163A542102n9277j81540q74005o77531O44143J591973Q91244q86829k024628
40154c4348j469555L54035K043208K190441M98039j504696j579829M60562J873802
40145B831659L24963k479738k658154K52490K165711R9298l419771l766409m25190
40136g075141K855883L389688K249400J419092P73225q35699k940690l476580
40128c640822j298578K065747L544370J650098j587843k603491n49204J554492
40120h65231Q32690j552814k232172m39095J352599J462162J077739J501289J675745
40111B812912J42179k110637k773970j457867N3144M88787K90678N3686n20050
$$ plain form
40102 -3021138 -4531439 -6505063 -7631621 -7077084 -4976899 -2024595 404464 124559
40094 124559 -4021623 -9699872 -12284205 -9725312 -4820220 -1365613 231758 1489905
40086 1489905 1798515 -721307 -4833604 -6570207 -4856607 -3205222 -4125308 -5147921
40078 -5147921 -3035567 699272 1849425 -444618 -3101045 -3914273 -3864326 -4535591 -5728270
40069 -5728270 -6117489 -4754768 -1911384 506501 252310 -2187978 -3285202 -1233149
40061 -1233149 789829 -901395 -4463330 -5064311 -2540237 -1593638 -3990502 -5709692
40053 -5709692 -3673224 -634369 -377014 -1741873 -1080839 1816030 3894621 3473237 1535082
40044 1535082 -682616 -2716291 -4159388 -5044625 -6165171 -7315155 -6615393 -3653812
$$ packed form
40102c021138j510301j973624j126558N54537K100185K952304K429059k79905
40094A24559m146182n678249k584333K558893M905092L454607J597371J258147
40086A489905L08610k519822m112297j736603J713600J651385r20086j022613
40078e147921K112354L734839J150153k294043k656427q13228M9947o71265j192679
40069e728270l89219J362721K843384K417885k54191k440288j097224K052053
40061a233149K022978j691224l561935o00981K524074R46599k396864j719190
40053e709692K036468L038855K57355j364859O61034K896869K078591m21384j938155
40044A535082k217698k033675j443097q85237j120546j149984O99762K961581
$$ plain form
40036 -3653812 -1554392 -2996086 -5514434 -4356889 479114 3883196 2741160 -312902
40028 -312902 -1608253 -1476767 -2166921 -3361216 -3134129 -2145865 -3253491 -6678578 -8785800
40019 -8785800 -7089880 -3925660 -2872060 -3370369 -2008178 1612566 3895756 2651380
40011 2651380 427 -1507386 -2292115 -3085496 -2327284 447037 1706791 -1147753 -4397365
40002 -4397365 -2932445 1122071 1206298 -2693205 -3357752 1791773 5808787 3057368 -1855914
39993 -1855914 -1686704 2103795 2459940 -2023228 -6108984 -6917438 -7236530 -9401667 -11344477
39984 -11344477 -10252744 -6487158 -2583940 -790464 -1915171 -4458688 -5261365 -3248068
39976 -3248068 -1552494 -3256697 -6360873 -6431417 -3171171 -389377 19459 -65005 917537
$$ packed form
40036c653812K099420j441694k518348J157545M836003L404082j142036l054062
40028c12902j295351J31486o90154j194295K27087R88264j107626l425087k107222
40019h785800J695920L164220J053600m98309J362191L620744K283190j244376
40011B651380k650953j507813p84729p93381P58212K774321J259754k854544l249612
40002d397365J464920M054516Q4227l899503o64547N149525M017014k751419m913282
39993a855914J69210L790499L56145m483168m085756q08454l19092k165137j942810
39984a1344477J091733L765586L903218J793476j124707k543517q02677K013297
39976c248068J695574j704203l104176p0544L260246K781794M08836q4464R82542
$$ plain form
39967 917537 2324261 3787351 5603419 6187744 3187979 -2014719 -4850932 -3717376
39959 -3717376 -1754979 -1224012 -229159 2842563 5429879 4379295 828561 -1466629
39951 -1466629 -1059994 382838 1053266 726704 143217 -11088 177842 -157476 -1357174
39942 -1357174 -2422542 -2654529 -2881508 -3071810 -627448 5353809 9816375 7081135 103397
39933 103397 -1826192 4054153 9837276 8629350 4218898 4264566 8691595 10977864 8203956
39924 8203956 3714483 845027 -587942 -1430050 -1249844 -184498 255286 -899679 -3093485
39915 -3093485 -5231066 -6262240 -5317781 -2644241 284715 2573410 4583197 6067207
39907 6067207 5803648 4301977 4164123 5937397 6595960 4516338 2647002 3502138 4417267
$$ packed form
39967I17537J406724J463090J816068N84325k999765n202698k836213J133556
39959c717376J962397N30967R94853L071722K587316j050584l550734k295190
39951a466629M06635J442832O70428l26562n83487j54305J88930l35318j199698
39942a357174j065368k31987k26979j90302K444362N981257M462566k735240o977738
39933A03397j929589N880345N783123j207926m410452M5668M427029K286269k773908
39924H203956m489473k869456j432969q42108J80206J065346M39784j154965k193806
39915c093485k137581j031174R44459K673540K928956K288695K009787J484010
39907F067207k63559j501671j37854J773274O58563k079622j869336Q55136R15129
$$ plain form
39898 4417267 2191276 -457033 1415562 6522718 8559557 5597119 2562396 3458921
39890 3458921 6190819 6906949 5361863 3651773 2533495 1242806 -699402 -2902999
39882 -2902999 -4301680 -3743039 -1672239 -629729 -2170620 -4178169 -3717767 -1607890
39874 -1607890 -1104416 -2791647 -4229361 -4233023 -3827270 -3119127 -1129142 1014339 571601
39865 571601 -2566762 -5670736 -7471383 -8906136 -9493064 -7422896 -3810625 -2086609
39857 -2086609 -2190366 -408316 3661179 5505626 3189952 729290 987066 1053765 -1204317
39848 -1204317 -1816262 2376072 6325462 3284021 -4409429 -8272235 -5756024 -2313952
39840 -2313952 -1900044 -2353034 -1197326 159310 156393 173089 1432760 2424353 1628830
$$ packed form
39898D417267k225991k648309J872595N107156K036839k962438l034723Q96525
39890C458921K731898P16130j545086j710090j118278j290689j942208k203597
39882b902999j398681N58641K070800J042510j540891k007549M60402K109877
39874a607890N03474j687231j437714l662M05753P08143J989985K143481m42738
39865E71601l138363l103974j800647j434753n86928K070168L612271J724016
39857b086609j03757J782050M069495J844447k315674k460662K57776O6699k258082
39848a204317o11945M192334L949390l041441p693450l862806K516211L442072
39840b313952M13908m52990J155708J356636k917J6696J259671R91593p95523
$$ plain form
39831 1628830 -17764 -1157765 -1935915 -2357476 -1271052 1263624 2733116 1124723
39823 1124723 -2343624 -4795684 -4734974 -2627555 116981 1939518 2337584 2925273 5694517
39814 5694517 9575068 10615327 6714071 530805 -3678501 -4785803 -4792565 -5041004 -4328148
39805 -4328148 -1089059 3648760 6487035 5175605 1430856 -854159 -345790 373907
39797 373907 -969259 -2732368 -1965048 915386 2809046 2553169 1998614 2630834 3804282
39788 3804282 4476559 4293069 2955931 953154 602859 3378104 6421042 5378657 955028
39779 955028 -1536378 -46014 1459691 54965 -1187164 1327307 5458716 6978362
39771 6978362 6351361 6958342 8611276 7977775 4520461 1171892 -666058 -2289796 -3704789
$$ packed form
39831A628830j646594j140001p78150m21561J086424K534676J469492j608393
39823A124723l468347k452060O0710K107419K744536J822537L98066N87689K769244
39814E694517L880551J040259l901256o183266m209306j107302o762k48439P12856
39805d328148L239089M737819K838275j311430l744749k285015N08369P19697
39797C73907j343166j763109P67320K880434J893660k55877n54555O32220J173448
39788C804282O72277j83490j337138k002777l50295K775245L042938j042385m423629
39779I55028k491406J490364J505705j404726j242129K514471M131409J519646
39771F978362o27001O06981J652934o33501l457314l348569j837950j623738j414993
$$ plain form
39762 -3704789 -2913644 -72242 1625821 556802 -1243484 -1971863 -2788086 -4925248 -6945649
39753 -6945649 -6912840 -5087842 -2696770 -94760 2182333 2720690 1548010 1220131 3488122
39744 3488122 6515311 7452037 6139671 4053538 1309151 -2388770 -5022450 -3881497
39736 -3881497 202859 3240357 3110355 1595326 773757 52526 -1811711 -3909491 -4466475
39727 -4466475 -3816495 -4074095 -6059265 -8015262 -7553630 -4008882 1143104 5396570 6693103
39718 6693103 4703794 1201429 -1166350 -891102 1537268 4533656 6624189 6799168
39710 6799168 4709090 1290907 -1476828 -2508894 -2890464 -4037517 -5125881 -4320081
39702 -4320081 -2509273 -3066551 -6722744 -9469144 -7898630 -4278149 -3057600 -4127960
$$ packed form
39762c704789P91145K841402J698063j069019j800286p28379q16223k137162k020401
39753f945649L2809J824998K391072K602010K277093N38357j172680l27879K267991
39744C488122L027189R36726j312366k086133k744387l697921k633680J140953
39736c881497M084356L037498j30002j515029q21569p21231j864237k097780n56984
39727d466475O49980k57600j985170j955997M61632L544748N151986M253466J296533
39718F693103j989309l502365k367779K75248K428370K996388K090533J74979
39710F799168k090078l418183k767735j032066l81570j147053j088364Q05800
39702d320081J810808n57278l656193k746400J570514L620481J220549j070360
$$ plain form
39694 -4127960 -3735928 -1247900 -25732 -939768 -119803 4569958 9188817 9173926 5848190
39685 5848190 3800135 4260255 4990429 4976934 5138477 5256118 3985086 1639712 -164335
39676 -164335 -1240915 -2298020 -2419641 -387968 2071432 1976267 -257688 -1589467 -1659528
39667 -1659528 -3141882 -6320123 -7695822 -5313536 -1465562 1495639 4087233 6470298
39659 6470298 6319133 2779916 -745629 -944906 834900 1272916 -106770 -1789937 -3622735
39650 -3622735 -5995247 -7484582 -6603234 -4604761 -3713830 -3885711 -3842948 -3575827 -3102398
39641 -3102398 -891431 3106352 4949888 1356695 -4621845 -6982208 -4894299 -2934734
39633 -2934734 -3736725 -5188100 -5127673 -4085953 -2496331 370171 3365353 3452264 358190
$$ packed form
39694d127960L92032K488028J222168r14036Q19965M689761M618859j4891l325736
39685E848190k048055M60120P30174j3495J61543J17641j271032k345374j804047
39676a64335j076580j057105j21621K031673K459400r5165k233955j331779p0061
39667a659528j482354l178241j375699K382286L847974K961201K591594K383065
39659F470298j51165l539217l525545j99277J779806M38016j379686j683167j832798
39650c622735k372512j489335Q81348J998473Q90931j71881M2763K67121M73429
39641c102398K210967L997783J843536l593193n978540k360363K087909J959565
39633b934734q01991j451375O0427J041720J589622K866502K995182Q6911l094074
$$ plain form
39624 358190 -2452521 -3098010 -3882596 -6606300 -8884436 -7797907 -4352875 -1586646 -468073
39615 -468073 -154687 -414251 -1503038 -3122551 -5113033 -7503811 -8835538 -6966082 -2821248
39606 -2821248 -207208 -136662 948968 4669613 6561114 2685661 -3059993 -3780551 311926
39597 311926 2641476 415596 -2192573 -1821760 -888696 -2251166 -3785719 -2092069 1427491
39588 1427491 2152501 -1460753 -6386863 -9219221 -9193499 -7206511 -4276838 -1683776 -978828
39579 -978828 -2610989 -4985331 -5782700 -4400579 -2648082 -2634050 -4221481 -5219864 -4010269
39570 -4010269 -1012592 2609461 6310269 9430172 10510102 8831524 5802562 3336165
39562 3336165 1542418 -465166 -2214627 -2192262 -173897 2467789 4450161 4945716 2996976
$$ packed form
39624C58190k810711o45489p84586k723704k278136J086529L445032K766229J118573
39615d68073L13386k59564j088787j619513j990482k390778j331727J869456M144834
39606b821248K614040P0546J085630L720645J891501l875453n745654p20558M092477
39597C11926K329550k225880k608169L70813R33064j362470j534553J693650L519560
39588A427491P25010l613254m926110k832358K5722J986988K929673K593062P04948
39579i78828j632161k374342p97369J382121J752497J4032j587431r98383J209595
39570d010269K997677L622053L700808L119903J079930j678578l028962k466397
39562C336165j793747k007584j749461K2365K018365K641686J982372M95555j948740
$$ plain form
39553 2996976 -1108551 -4316288 -3521324 -53941 1485577 -404869 -2040870 -258139
39545 -258139 2926157 3762390 2238405 868689 -177451 -2843849 -6541037 -7550976
39537 -7550976 -3942860 1798517 6202513 8372917 8710231 6627398 2105413 -1944791
39529 -1944791 -1920678 1895531 5370510 5502031 3266209 908918 -1193962 -3340472 -4140992
39520 -4140992 -1980559 1859993 4105861 3606441 2333078 1920212 1563926 372109 -380148
39511 -380148 891445 3382491 4901177 4721110 3840911 3121898 2750478 2989601 3859835
39502 3859835 4362195 3393824 1189975 -1233890 -3473140 -5347128 -6035468 -5312065 -4803058
39493 -4803058 -5856074 -6727025 -4464137 427582 3884266 3360077 488353 -2085321
$$ packed form
39553B996976m105527l207737P94964L467383J539518j890446j636001J782731
39545b58139L184296Q36233j523985j369716j046140k666398l697188j009939
39537g550976L608116N741377M403996K170404L37314k082833m521985m050204
39529a944791K4113L816209L474979J31521k235822k357291k102880k146510q00520
39520d140992K160433L840552K245868m99420j273363m12866l56286j191817p52257
39511c80148J271593K491046J518686j80067q80199p19013l71420K39123Q70234
39502C859835N02360r68371k203849k423865k239250j873988o88340P23403N09007
39493d803058j053016q70951K262888M891719L456684n24189k871724k573674
$$ plain form
39485 -2085321 -3863769 -5110424 -4821557 -2305569 800121 2308164 2321931 2392565 2668251
39476 2668251 1885655 -201155 -2263654 -3265433 -3375015 -2975389 -2200172 -1719722 -2656207
39467 -2656207 -5004147 -6895687 -6219691 -2876292 902210 2514107 1237150 -1478838
39459 -1478838 -3861057 -5503289 -6825162 -7445224 -6261066 -3230656 47840 1954786
39451 1954786 2174007 1089754 -1044208 -3671404 -5575927 -5801058 -4497407 -2537040
39443 -2537040 -950759 -795637 -2327773 -3970748 -3663985 -1915809 -1657366 -3755925 -4618431
39434 -4618431 -560117 6604428 10994815 9482292 4802454 1736487 2270361 4975796
39426 4975796 7258675 7307418 5115216 2430257 971295 519022 -233371 -1122762 -569269
$$ packed form
39485b085321j778448j246655K88867K515988L105690J508043J3767P0634K75686
39476B668251p82596k086810k062499j001779j09582L99626P75217M80450r36485
39467b656207k347940j891540O75996L343399L778502J611897j276957k715988
39459a478838k382219j642232j321873o20062J184158L030410L278496J906946
39451A954786K19221j084253k133962k627196j904523k25131J303651J960367
39443b537040J586281J55122j532136j642975L06763J748176K58443k098559q62506
39434d618431M058314P164545M390387j512523m679838l065967N33874K705435
39426D975796K282879M8743k192202k684959j458962m52273p52393q89391N53493
$$ plain form
39417 -569269 1478119 2678643 1490570 -454037 -654004 881425 2260114 2725172 3045882
39408 3045882 3321469 2482703 298264 -1752605 -2224156 -1217055 281327 1529356 2108358
39399 2108358 1963649 1891483 2891242 4383726 4260100 1699755 -1147555 -1653468 -97758
39390 -97758 1014191 551483 -110669 411404 1620598 2268314 2013874 1317974 707048
39381 707048 618114 1018722 936952 -425954 -1903968 -1291938 1406319 3439187 2889990
39372 2889990 930416 -662691 -2108050 -3895071 -4509292 -2549997 206858 730841
39364 730841 -1003678 -2367494 -2068600 -1016473 242468 1794143 2275663 36572 -3197398
39355 -3197398 -3360929 244280 3624701 3802053 2495308 2294944 2500455 1401136 -22560
$$ packed form
39417e69269K047388J200524j188073j944607j99967J535429J378689M65058L20710
39408C045882K75587q38766k184439k050869m71551J007101J498382J248029N79002
39399B108358j44709p2166R99759J492484j23626k560345k847310n05913J555710
39390i7758J111949m62708o62152N22073J209194O47716k54440o95900o10926
39381G07048q8934M00608q1770j362906j478014O12030K698257K032868n49197
39372B889990j959574j593107j445359j787021o14221J959295K756855N23983
39364G30841j734519j363816K98894J052127J258941J551675M81520k239091l233970
39355c197398j63531L605209L380421J77352j306745k00364K05511j099319j423696
$$ plain form
39346 -22560 259126 1897814 3260326 4328360 5638517 5759357 2966871 -1361632 -3952819
39337 -3952819 -3834905 -2828695 -2327384 -2105140 -1971001 -2031168 -1385419 948125 3619555
39328 3619555 3774955 804079 -2566229 -3371173 -1192360 2184024 4406868 3968446 1542998
39319 1542998 -194099 448232 1755259 818218 -2413808 -5359682 -6607298 -7031116 -7214801
39310 -7214801 -6400855 -4427855 -2279838 -87936 3099950 6789853 8563634 7201050
39302 7201050 4321490 1893685 107009 -1051824 -187644 3520905 7894511 9361821
39294 9361821 6912750 3298897 2123707 4070252 6096624 4777355 682795 -1789302
39286 -1789302 -129659 2278550 318149 -5695713 -10257514 -9939637 -6889387 -4506482
$$ packed form
39346b2560K81686J638688J362512J068034J310157J20840k792486m328503k591187
39337c952819J17914J006210N01311K22244J34139o0167O45749K333544K671430
39328C619555J55400k970876l370308q04944K178813L376384K222844m38422k425448
39319A542998j737097O42331J307027r37041l232026k945874j247616m23818j83685
39310g214801Q13946J973000K148017K191902L187886L689903J773781j362584
39302G201050k879560k427805j786676j158833Q64180L708549M373606J467310
39294I361821k449071l613853j175190J946545K026372j319269m094560k472097
39286a789302J659643K408209j960401o013862m561801L17877L050250K382905
$$ plain form
39278 -4506482 -3434124 -3405052 -5376944 -9072131 -11044856 -8307549 -2397534 2580991
39270 2580991 4543755 3965177 1680703 -1132085 -2167192 -153212 2856289 3841667
39262 3841667 2775162 1790255 1196601 -760746 -4325901 -7291967 -8145899 -7823127 -7622969
39253 -7622969 -7300603 -6080091 -4151995 -2435082 -1802851 -2786403 -4992608 -6731206 -6423614
39244 -6423614 -4591804 -3351161 -3716850 -4429992 -3715865 -1394108 946705 1318162 -978068
39235 -978068 -4419535 -6335959 -5553771 -3522606 -2220679 -1760076 -960657 630777 2456613
39226 2456613 3782142 3608356 929508 -3294766 -5673471 -4115391 -1117481 -761934
39218 -761934 -2993585 -3817864 -1236510 2092785 2955662 1617668 386502 247619 491184
$$ packed form
39278d506482J072358K9072j971892l695187j972725K737307N910015M978525
39270B580991J962764n78578k284474k812788j035107K013980L009501R85378
39262C841667j066505r84907n93654j957347l565155k966066q53932L22772K00158
39253g622969L22366J220512J928096J716913O32231r83552k206205j738598L07592
39244f423614J831810J240643l65689p13142P14127K321757K340813L71457k296230
39235i78068l441467j916424P82188K031165J301927M60603P99419J591434J825836
39226B456613J325529j73786k678848m224274k378705J558080K997910L55547
39218g61934k231651q24279K581354L329295Q62877j337994j231166j38883K43565
$$ plain form
39209 491184 230159 -1051723 -3364800 -5615654 -6158423 -4714524 -2750631 -1462898 -626091
39200 -626091 118688 385848 168735 282713 753223 223369 -1890286 -3858904 -3490450
39191 -3490450 -794851 1981993 2337151 -652853 -5231341 -7517563 -4925034 380933
39183 380933 3240841 1451302 -1951439 -3146311 -1929483 -359663 496061 441565 -1023530
39174 -1023530 -3288628 -3813872 -1367420 1408801 1450736 -48131 456511 3226448 4974869
39165 4974869 3969237 2012499 998447 552942 -196914 -1135525 -2184437 -3496145 -4060027
39156 -4060027 -2468547 369668 1719496 846763 -151054 23020 213982 -296253 -380066
39147 -380066 -67258 -1797775 -6378940 -10356504 -10106865 -6516543 -3060309 -1218751 -497283
$$ packed form
39209D91184k61025j281882k313077k250854n42769J443899J963893J287733Q36807
39200f26091P44779K67160k17113J13978M70510n29854k113655j968618L68454
39191c490450K695599K776844L55158k990004m578488k286222K592529N305967
39183C80933K859908j789539l402741j194872J216828J569820Q55724n4496j465095
39174a023530k265098n25244K446452K776221M1935j498867N04642K769937J748421
39165D974869j005632j956738j014052m45505p49856r38611j048912j311708n63882
39156d060027J591480K838215J349828q72733r97817J74074J90962n10235q3813
39147c80066L12808j730517m581165l977564K49639L590322L456234J841558P21468
$$ plain form
39138 -497283 -986834 -2654688 -3563935 -2176488 -403441 -1107491 -3540997 -4720696 -4467700
39129 -4467700 -5157277 -6840825 -6837251 -4446230 -1866465 225373 3551067 7374819 7453193
39120 7453193 2376453 -3030884 -3768614 -845268 1779528 3228748 4831558 5948260
39112 5948260 5234544 4336749 5620358 7154234 4740316 -1131868 -4971739 -3669909
39104 -3669909 -83276 1931954 2271618 2683836 3461762 4195794 5274193 6558095 6666171
39095 6666171 5425917 4948718 6321192 7307400 5658966 2873416 1873560 2192659 608239
39086 608239 -3643195 -7153441 -6570914 -2549017 1569702 3756122 4722133 5678708 5903473
39077 5903473 3616023 -707839 -3477589 -2096720 924537 502677 -4233122 -8515613
$$ packed form
39138d97283m89551j667854r09247J387447J773047p04050k433506j179699K52996
39129d467700o89577j683548L574K391021K579765K091838L325694L823752P8374
39120G453193n076740n407337p37730K923346K624796J449220J602810J116702
39112E948260p13716q97795J283609J533876k413918n872184l839871J301830
39104c669909L586633K015230L39664M12218P77926P34032J078399J283902J08076
39095F666171j240254m77199J372474R86208j648434k785550r99856L19099j584420
39086F08239m251434l510246N82527M021897M118719K186420R66011R56575K24765
39077E903473k287450m323862k769750J380869L021257m21860m735799m282491
$$ plain form
39069 -8515613 -8298435 -5102414 -2617959 -1413538 -200787 -124427 -3377224 -8006775 -8501419
39060 -8501419 -2750984 4857865 8950277 9126768 8366072 7663971 5299214 875732 -2797216
39051 -2797216 -2913053 -222744 1964689 1704265 -60507 -1849006 -3752496 -6002820
39043 -6002820 -6821745 -4093404 868187 3684286 2013696 -1645219 -3480213 -2879408
39035 -2879408 -1834094 -1514255 -1565851 -1734480 -2020441 -1827139 -835627 -200749 -1204791
39026 -1204791 -3337923 -5248331 -6670936 -7749706 -7707053 -6286794 -5186922 -5579048 -5653118
39017 -5653118 -3669524 -1931245 -3707638 -7186750 -7281590 -3405595 -321834 -464800 -884862
39008 -884862 302240 99654 -3346302 -6013818 -4051027 -646068 -1350979 -5189706 -6365992
$$ packed form
39069h515613K17178L196021K484455J204421J212751P6360l252797m629551m94644
39060h501419N750435P608849M092412J76491p60696p02101k364757m423482l672948
39051b797216j15837K690309K187433k60424j764772j788499j903490k250324
39043f002820q18925K728341M961591K816099j670590l658915j834994O00805
39035b879408J045314L19839n1596j68629k85961J93302R91512O34878j004042
39026a204791k133132j910408j422605j078770M2653J420259J099872l92126p4070
39017e653118J983594J738279j776393l479112r4840L875995L083761j42966m20062
39008h84862J187102k02586l445956k667516J962791L404959p04911l838727j176286
$$ plain form
38999 -6365992 -3554086 -1461772 -2929446 -4992761 -4252839 -1586096 673138 2682497
38991 2682497 5658502 8925040 10771295 10618338 8506688 4125220 -1590232 -5312605
$$ packed form
38999f365992K811906K092314j467674k063315P39922K666743K259234K009359
38991B682497K976005L266538J846255j52957k111650m381468n715452l722373
$$ [...]
##END NTUPLES=NMR SPECTRUM
##END=
