##TITLE=31Pdec_SR62_k
 CDCl3, 124 sc
 2.2.2021
##JCAMPDX= 6.0         $$ Bruker NMR JCAMP-DX V2.0
##DATA TYPE= NMR SPECTRUM
##DATA CLASS= NTUPLES
##ORIGIN= UXNMR, Bruker Analytische Messtechnik GmbH
##OWNER= root
$$ XWIN-NMR		Version 3.5
$$ Tue Feb  2 12:24:16 2021 Russian Standard Time (UT+4h)  she@DPX200
##.OBSERVE FREQUENCY= 81.013821
##.OBSERVE NUCLEUS= ^31P
##.ACQUISITION MODE= SIMULTANEOUS
##.ACQUISITION SCHEME= undefined
##.AVERAGES= 124
##.DIGITISER RES= 17
##SPECTROMETER/DATA SYSTEM= spect
##.PULSE SEQUENCE= zgpg30
##.SOLVENT NAME= CDCl3
##.SHIFT REFERENCE= (INTERNAL, CDCl3, 0, 182.463)
##AUDIT TRAIL= $$ (NUMBER, WHEN, WHO, WHERE, WHAT)
$$ ##TITLE= Audit trail, XWIN-NMR		Version 3.5
$$ ##JCAMPDX= 5.01
$$ ##ORIGIN= Bruker BioSpin GmbH
$$ ##OWNER= she
$$ F:/spectra/data/she/nmr/P31/1/pdata/1/auditp.txt
$$ ##AUDIT TRAIL=  $$ (NUMBER, WHEN, WHO, WHERE, WHAT)
(   1,<2021-02-02 12:19:41.14 +0400>,<she>,<DPX200>,
      <continue with go, POWCHK disabled, PULCHK disabled
       configuration hash MD5:
       00 E9 B6 7A A2 85 ED C7 34 08 36 98 17 FE 4E 26
       data hash MD5: 32K
       B0 76 55 14 F5 34 2D 89 8D 0E 8E 8C 27 90 72 5D>)
(   2,<2021-02-02 12:22:22.81 +0400>,<she>,<DPX200>,
      <Start of raw data processing
       efp BC_mod = 2 LB = 1 FT_mod = 6 PKNL = 1 PHC0 = -1696.686 PHC1 = -24.39859 SI = 64K 
       data hash MD5: 64K
       DE C1 95 E4 11 58 80 8E 19 B2 B8 89 57 F1 45 34>)
(   3,<2021-02-02 12:22:53.78 +0400>,<she>,<DPX200>,
      <pk PHC0 = -47.79735 PHC1 = 0 
       data hash MD5: 64K
       C9 13 5C CB A3 95 FA 8E 48 5B FC F2 D8 F1 C5 4B>)
$$ ##END=
$$ 
$$ hash MD5
$$ 0F 59 D1 B5 A4 36 DF AD 3F 82 5D 57 D7 A5 22 86
##$RELAX= 
##$RELAX= 
##$RELAX= 
##$RELAX= 
##$RELAX= 
##$RELAX= 
##$RELAX= 
##$RELAX= 
$$ Bruker specific parameters
$$ --------------------------
##$DU= <F:/spectra>
##$EXPNO= 1
##$NAME= <P31>
##$PROCNO= 1
##$TYPE= <nmr>
##$USER= <she>
##$AMP= (0..31)
100 100 100 100 100 100 100 100 100 100 100 100 100 100 100 100 100 100 
100 100 100 100 100 100 100 100 100 100 100 100 100 100 
##$AQSEQ= 0
##$AQ_mod= 1
##$AUNM= <au_zg>
##$AUTOPOS= <>
##$BF1= 81.014009
##$BF2= 200.13
##$BF3= 200.13
##$BF4= 200.13
##$BF5= 200.13
##$BF6= 200.13
##$BF7= 200.13
##$BF8= 200.13
##$BYTORDA= 1
##$CFDGTYP= 0
##$CFRGTYP= 5
##$CHEMSTR= <none>
##$CNST= (0..31)
1 1 145 1 1 1 1 1 1 1 1 1 1 1 1 1 1 1 1 1 1 1 1 1 1 1 1 1 1 1 1 1 
##$CPDPRG= <waltz16>
##$CPDPRG1= <>
##$CPDPRG2= <waltz16>
##$CPDPRG3= <>
##$CPDPRG4= <mlev>
##$CPDPRG5= <mlev>
##$CPDPRG6= <mlev>
##$CPDPRG7= <mlev>
##$CPDPRG8= <mlev>
##$CPDPRGB= <>
##$CPDPRGT= <>
##$D= (0..31)
0 1 0 0 0 0 0 0 0 0 0 0.03 2e-05 3e-06 0 0 0 0 0 0 0 0 0 0 0 0 0 0 0 0 
0 0 
##$DATE= 1612253777
##$DBL= (0..7)
120 120 120 11 120 120 24 19 
##$DBP= (0..7)
150 150 150 150 150 150 150 150 
##$DBP07= 0
##$DBPNAM0= <>
##$DBPNAM1= <>
##$DBPNAM2= <>
##$DBPNAM3= <>
##$DBPNAM4= <>
##$DBPNAM5= <>
##$DBPNAM6= <>
##$DBPNAM7= <>
##$DBPOAL= (0..7)
0.5 0.5 0.5 0.5 0.5 0.5 0.5 0.5 
##$DBPOFFS= (0..7)
$$ [...]
##$SUBNAM2= <"">
##$SUBNAM3= <"">
##$SUBNAM4= <"">
##$SUBNAM5= <"">
##$SUBNAM6= <"">
##$SUBNAM7= <"">
##$SUBNAM8= <"">
##$SUBNAM9= <"">
##$SW= 369.568048894756
##$SWIBOX= (0..15)
0 1 3 0 0 0 0 0 0 0 0 0 0 0 0 0 
##$SW_h= 29940.119760479
##$TD= 32768
##$TD0= 1
##$TE= 0
##$TE2= 300
##$TE3= 300
##$TEG= 300
##$TL= (0..7)
0 120 53 12 22 120 120 120 
##$TP= (0..7)
150 150 150 150 150 150 150 150 
##$TP07= 0
##$TPNAME0= <>
##$TPNAME1= <>
##$TPNAME2= <>
##$TPNAME3= <>
##$TPNAME4= <>
##$TPNAME5= <>
##$TPNAME6= <>
##$TPNAME7= <>
##$TPOAL= (0..7)
0.5 0.5 0.5 0.5 0.5 0.5 0.5 0.5 
##$TPOFFS= (0..7)
0 0 0 0 0 0 0 0 
##$TUNHIN= 0
##$TUNHOUT= 0
##$TUNXOUT= 0
##$USERA1= <user>
##$USERA2= <user>
##$USERA3= <user>
##$USERA4= <user>
##$USERA5= <user>
##$V9= 5
##$VALIST= <valist>
##$VCLIST= <CCCCCCCCCCCCCCC>
##$VD= 0
##$VDLIST= <DDDDDDDDDDDDDDD>
##$VPLIST= <PPPPPPPPPPPPPPP>
##$VTLIST= <TTTTTTTTTTTTTTT>
##$WBST= 1024
##$WBSW= 4
##$XGAIN= (0..3)
0 0 0 0 
##$XL= 0
##$YL= 0
##$YMAX_a= 17507
##$YMIN_a= -8252
##$ZGOPTNS= <>
##$ZL1= 120
##$ZL2= 120
##$ZL3= 120
##$ZL4= 120
##$ABSF1= 0
##$ABSF2= 0
##$ABSG= 0
##$ABSL= 0
##$ALPHA= 0
##$AQORDER= 0
##$ASSFAC= 0
##$ASSFACI= 0
##$ASSFACX= 0
##$ASSWID= 0
##$AUNMP= <proc_1d>
##$AZFE= 0.1
##$AZFW= 0.5
##$BCFW= 0
##$BC_mod= 2
##$BYTORDP= 0
##$COROFFS= 0
##$CY= -3
##$DATMOD= 1
##$DC= 0
##$DFILT= <>
##$DTYPP= 0
##$F1P= 0
##$F2P= 0
##$FCOR= 1
##$FTSIZE= 65536
##$FT_mod= 6
##$GAMMA= 0
##$GB= 0
##$INTBC= 1
##$INTSCL= 5.30512e-09
##$ISEN= 30
##$LB= 1
##$LEV0= 0
##$LPBIN= 0
##$MAXI= 10000
##$MC2= 0
##$MEAN= 0
##$ME_mod= 0
##$MI= 50
##$NCOEF= 0
##$NC_proc= -10
##$NLEV= 6
##$NOISF1= 182.463
##$NOISF2= 159.3651
##$NSP= 0
##$NTH_PI= 0
##$NZP= 0
##$OFFSET= 182.463
##$PC= 4
##$PHC0= -1744.483
##$PHC1= -24.39859
##$PH_mod= 1
##$PKNL= yes
##$PPARMOD= 0
##$PSCAL= 0
##$PSIGN= 0
##$REVERSE= no
##$SF= 81.014009
##$SI= 65536
##$SIGF1= 159.3651
##$SIGF2= -187.1042
##$SINO= 113.3802
##$SIOLD= 16384
##$SREGLST= <1H.CDCl3>
##$SSB= 0
##$STSI= 65536
##$STSR= 0
##$SW_p= 29940.119760479
##$SYMM= 0
##$S_DEV= 0
##$TDeff= 32768
##$TDoff= 0
##$TI= <>
##$TILT= no
##$TM1= 0
##$TM2= 0
##$TOPLEV= 0
##$USERP1= <user>
##$USERP2= <user>
##$USERP3= <user>
##$USERP4= <user>
##$USERP5= <user>
##$WDW= 1
##$XDIM= 65536
##$YMAX_p= 446295015
##$YMIN_p= -344645429
$$ End of Bruker specific parameters
$$ ---------------------------------
##NTUPLES= NMR SPECTRUM
##VAR_NAME=  FREQUENCY,     SPECTRUM/REAL,   SPECTRUM/IMAG
##SYMBOL=    X,             R,               I
##VAR_TYPE=  INDEPENDENT,   DEPENDENT,       DEPENDENT
##VAR_FORM=  AFFN,          ASDF,            ASDF
##VAR_DIM=   65536,         65536,           65536
##UNITS=     HZ,            ARBITRARY UNITS, ARBITRARY UNITS
##FACTOR=    0.456856943014862, 1,           1
##FIRST=     14782.0589164895, 0,            0
##LAST=      -15158.0608439895, 0,           0
##MIN=       -15158.0608439895, -344645429,  0
##MAX=       14782.0589164895, 446295015,    0
$$ Real data points
##PAGE= N=1
##DATA TABLE= (X++(R..R)), XYDATA
$$ [...]
27387 77851898 38403631 440304 -7044801 -3420472 -21942800 -47108926 -37355105
27380 -37355105 -5721649 -10533725 -52469545 -55691720 11967281 69315358 29494471
27373 29494471 -73577664 -131310311 -100486856 -34265592 6625600 12710195 1707106
27366 1707106 -12584719 -21670539 -24410642 -28007208 -29177208 -10652306 23844951 39322892
27358 39322892 22565330 11221295 30743227 39608755 -7574062 -73757246 -85063069
27351 -85063069 -44373295 -22950318 -41962766 -42810405 8973579 65944805 75417522
27344 75417522 48838992 17479225 -20686787 -61992515 -58642128 17363257 104778639
27337 104778639 112774831 35955957 -46316306 -75975941 -65477867 -44507596 -19875410
27330 -19875410 -3659541 -24315172 -77463779 -107494879 -76312212 -20060723 2518626
27323 2518626 -7540063 -7130443 6801394 -4420871 -36877362 -26277351 51450608
27316 51450608 116979521 81057599 -30147595 -105166907 -90141791 -38169593 -12364866
27309 -12364866 -4987847 19627417 53909646 62262572 39383967 13838501 5856173
27302 5856173 8790668 3627022 -24101721 -68390023 -95360574 -76579552 -38720737
27295 -38720737 -42693791 -95049182 -125707272 -86487998 -24099909 -6281305 -19613609
27288 -19613609 -7090831 25514795 21751558 -19944435 -37583193 -10165747 8060869
27281 8060869 -20661342 -62072236 -75539444 -71870320 -70385406 -56073520 -20878267
27274 -20878267 3026482 -3733149 -5779562 28727843 67781612 64571314 32422077
27267 32422077 15103219 8685431 -27036534 -91578491 -133600242 -117010251 -56062245
27260 -56062245 12324643 56309228 57067703 24089654 -4395356 -5109693 1278740 -6029363
27252 -6029363 -2821583 37447580 83102028 84368904 55545525 51943839 75517562 76045272
27244 76045272 46270726 36194784 55680697 42632404 -35174483 -114940400 -123623517
27237 -123623517 -74976285 -32590525 -19828602 -17449959 -16141391 -20326688 -23600846
27230 -23600846 -23131674 -35778301 -62785789 -65818145 -17838974 48853386 84777521
27223 84777521 84770225 68082169 33942156 -12474204 -27823287 10083296 40000970 -10721320
27215 -10721320 -109403011 -152401955 -108599377 -46205694 -14592395 12214702 55671515
27208 55671515 83479120 76278683 68376817 78786170 67911828 9590811 -54579429
27201 -54579429 -82717098 -96806601 -125344005 -138197949 -102215732 -52666635 -39352354
27194 -39352354 -42506284 -15207482 27563777 42335713 48255941 93879947 150565968
27187 150565968 137795236 58142084 11463523 53317993 123279832 142942942 109089506
27180 109089506 56382993 876311 -37424453 -22481999 37817885 75041529 50977812
27173 50977812 12265782 7711395 10453159 -17041165 -38337717 -3828201 45262623
27166 45262623 26059533 -50434793 -84785250 -32844736 39877221 63457046 45772830
27159 45772830 20548965 -17020440 -77214076 -129175648 -139146450 -125519989 -129752769
27152 -129752769 -150695340 -149488644 -112012030 -70953339 -62597850 -83157712 -92426769
27145 -92426769 -52511778 33167614 114390477 137879461 102328062 56511608 38803837
27138 38803837 41402621 45315758 59808174 97112123 129445287 113655172 56797528
27131 56797528 17912319 33150198 70832584 80063268 59116272 48657318 71269691
27124 71269691 108108120 132913745 139604562 128859471 94387444 40014480 -9380047
27117 -9380047 -36847693 -59853111 -100896439 -139852392 -129770641 -65107510 -1448925
27110 -1448925 8355829 -28154030 -66989914 -83238450 -77212725 -48772883 -3107750
27103 -3107750 27729621 9114104 -45788031 -83318548 -78546982 -69496552 -103755807
27096 -103755807 -169411650 -202243248 -159006198 -68970828 -6866936 -15676743 -60435258
27089 -60435258 -68127741 -15888820 37445264 22254398 -55360248 -123145619 -130267684
27082 -130267684 -95173849 -66216463 -66457460 -87494152 -110728193 -117879605 -98043430
27075 -98043430 -59303591 -22208037 4875611 28117896 41237775 20088366 -41277354
27068 -41277354 -109350076 -145239286 -146461834 -137126946 -129114591 -114409907 -90873424
27061 -90873424 -75287282 -85451907 -116819319 -140833617 -129836580 -89190288 -58771231
27054 -58771231 -68217505 -94850936 -87556372 -33031550 27689678 54887638 53587712
27047 53587712 48636507 46289149 42870287 47069251 65134251 78688651 63589613 22262579
27039 22262579 -21961080 -51764273 -60605301 -46591619 -21342136 -7862811 -7235135
27032 -7235135 13690657 73167503 130329091 125486501 57108598 -14440823 -37757081
27025 -37757081 -17073548 9384122 11663199 -10282579 -27081797 -7948221 35181342
27018 35181342 48687827 6159963 -47636975 -56974166 -34080884 -29137411 -42991658
27011 -42991658 -34236561 -5734857 -10666374 -60552698 -98308191 -89275170 -74808803
27004 -74808803 -99764570 -144576285 -171512858 -185350433 -198627007 -184217390 -121274779
26997 -121274779 -52676450 -35382529 -58082917 -65778782 -44169523 -19650031 5499236
26990 5499236 50010084 93038860 86455173 35086849 1964142 18525647 45831231
26983 45831231 43945118 26183474 18623312 14237866 -437847 -13544951 -17798015 -37903986
26975 -37903986 -89418405 -135717314 -127070733 -69755474 -20631077 -17690294 -43952213
26968 -43952213 -59562371 -48786124 -32253398 -42006924 -83446689 -122467063 -122824416
26961 -122824416 -94865138 -83629752 -104198574 -119257274 -94207640 -42169429 8000853
26954 8000853 56475728 112064310 151386439 138930054 78616096 12655164 -24543964
26947 -24543964 -25183720 6284108 54048469 86775190 86339956 75140546 83271476 97515741
26939 97515741 81168134 38358197 12667752 17424648 13861903 -26283844 -76503844
26932 -76503844 -93326084 -65917275 -11741838 44119174 69815659 45407961 3193694
26925 3193694 10692853 83973410 154147700 153715663 99183144 46672803 4641926 -49823847
26917 -49823847 -94768450 -76664668 1531428 70872760 85388077 64801722 37316143
26910 37316143 -1008723 -47025619 -66431978 -43658765 -12613610 -3293539 3103565
26903 3103565 30764858 60281610 63495015 50869140 40117560 14851382 -32714057
26896 -32714057 -54608346 -10778347 46352038 30494340 -46526383 -86989222 -54635611
26889 -54635611 -17673615 -22490999 -21218972 25005065 59336588 22149536 -36259395
26882 -36259395 -26213891 41441563 80254390 68096031 65177066 98121828 122523478
26875 122523478 114988701 112084030 126542443 105700430 20588062 -67402604 -82519361
26868 -82519361 -31483530 23662302 48665163 45419333 15924271 -28155200 -48648714
26861 -48648714 -27449646 -8572657 -41683607 -101022864 -113967465 -60348372 7097021
26854 7097021 35328930 17519338 -25378167 -59534967 -39081815 53283938 160652128
26847 160652128 197428922 151256473 93570405 78347226 80200264 52462980 -342571
26840 -342571 -37908662 -38763396 -12655292 17309976 27196720 11699018 1834954 32694960
26832 32694960 86341393 108013888 90447184 89831805 133170162 165954992 134828398
26825 134828398 73360584 49330462 62728436 59971603 28667781 12489569 35810917
26818 35810917 72001691 93110785 102591358 108024297 102200493 85745768 77996408 92057013
26810 92057013 118750755 138922363 133796010 89338192 15754064 -42668414 -44714386
26803 -44714386 3878905 65881214 117871115 148794960 132287622 50961836 -53906188
26796 -53906188 -107602661 -86464332 -35595242 3916143 37756765 73850185 84356154
26789 84356154 43495749 -27128835 -78210715 -79072314 -32331099 31815209 65598766
26782 65598766 38652841 -23336577 -62144619 -55843748 -30745096 -3485369 37254563
26775 37254563 77447647 66830967 -4040560 -67854048 -64269884 -14275770 33815247
26768 33815247 83234055 152449556 201674062 174687288 96929828 53767105 69472544
26761 69472544 78449635 30343938 -39868842 -72325942 -61399586 -40969478 -26314091
26754 -26314091 -6201837 24979732 55274281 69883801 62806696 35633667 -9292754
26747 -9292754 -71031017 -136354910 -166958697 -129472261 -51313154 -9349783 -33081930
26740 -33081930 -58918312 -27167867 17535314 -4464260 -66504875 -60077834 36946391
26733 36946391 118212774 107497057 64590672 74708120 113282920 102237070 44597627
26726 44597627 9680590 11721201 -4152429 -57414349 -97319000 -89752248 -69508257
26719 -69508257 -74820672 -82082739 -45555142 29740992 94094622 118508653 122278868
26712 122278868 135436935 155205249 150878648 107437716 51297993 19862420 10797394
26705 10797394 -14201270 -68721111 -113890532 -110170762 -69172355 -26987574 6443233
26698 6443233 35142689 42079610 18058246 7615154 61726243 145056711 158716961
26691 158716961 74363696 -17508286 -25459426 32873891 81043268 92929019 93616914
26684 93616914 87740696 56685696 15301661 6178457 31390059 42314809 9292613
26677 9292613 -41558073 -72862589 -76992612 -59353589 -22211375 14279881 13859578 -24652947
26669 -24652947 -50709361 -29682047 918055 -16809011 -72697834 -98641702 -62035881
26662 -62035881 -3259068 28068751 33679142 44569813 69471888 91934005 101562611
26655 101562611 102779000 99496302 90614421 77494262 61046576 35039214 -2407214
26648 -2407214 -32166435 -26219271 17003071 61003298 65893877 32379389 3575918
26641 3575918 20988789 81898584 142437885 159690080 125475704 60656025 -10693712
26634 -10693712 -70732177 -100491002 -84599309 -32038194 19667033 33906135 8461265
26627 8461265 -24533435 -31023568 -8211487 9265738 -21958690 -108748979 -203363724
26620 -203363724 -241941189 -204855209 -128655940 -58614089 -9305740 21817730 29321322
26613 29321322 11387033 -11731519 -20107431 -26493172 -57376249 -105324169 -130272814
26606 -130272814 -110780342 -65801522 -21534290 11462935 18384577 -24978643 -110434157
26599 -110434157 -177484856 -170719770 -105386379 -45806003 -28591995 -39494152 -58199659
26592 -58199659 -83718191 -108273100 -107837343 -80744151 -62921192 -75636205 -85195438
26585 -85195438 -52740383 -5026526 -5912645 -58567730 -88377162 -41929285 41162052
26578 41162052 85549827 72768177 37129405 -375624 -39940792 -58975138 -22745063
26571 -22745063 51596477 95614860 75391619 32438815 16283945 22340073 29089351
26564 29089351 49964083 97784443 132183914 104260394 37693615 4474076 23782312
26557 23782312 43899897 29550159 8049819 10827888 22117941 13837341 -10114316
26550 -10114316 -33426572 -55930360 -74122775 -66722820 -31755269 -8700686 -28469237
26543 -28469237 -64527668 -68833916 -37174983 -4671023 5768350 -5249093 -37748375
26536 -37748375 -88463339 -131954793 -142803671 -130594160 -119259512 -102208729 -58913072
26529 -58913072 -8464432 3640371 -22564386 -32920522 767885 38349089 36151429
26522 36151429 14265794 20908355 56436649 76986750 64386843 51270385 69790173
26515 69790173 104511955 111492530 70225527 2696752 -55648650 -93247508 -124711010
26508 -124711010 -158459406 -174476091 -145939150 -77473383 -6100938 35968851 44129095
26501 44129095 27195218 -7544123 -46501204 -68783080 -71474280 -82493315 -126419792
26494 -126419792 -181251265 -189279956 -118101177 -2771120 79495204 78565265 16469254
26487 16469254 -38916674 -46660992 -29611082 -30270844 -48435363 -52257871 -42318829 -59197852
26479 -59197852 -113814311 -154086526 -131827571 -69372142 -22226572 -3481286 9903569
26472 9903569 18971364 6893709 -10355898 544480 23009320 4354675 -48835023
26465 -48835023 -58068370 11558169 87417689 89469963 38691890 4925894 -4903381
26458 -4903381 -29760394 -60610207 -55072592 -32894730 -57887915 -113322447 -96472006
26451 -96472006 22240864 126511721 108326450 25705183 21791921 126824626 229060667
26444 229060667 230316895 150137397 67053603 22263303 4212359 -15827996 -56637058
26437 -56637058 -111135139 -147734208 -145673458 -123112314 -104935812 -77242855 -13799883
26430 -13799883 62120810 92412516 63699886 25338420 20247102 42523772 72652206
26423 72652206 106808777 135354264 138037308 120638027 114436779 120913643 102933246
26416 102933246 53415104 22821813 45651431 86048219 95722618 83378411 81632280
26409 81632280 83405064 63563459 34859562 27973519 35319449 25816986 737112 -13573126
26401 -13573126 -15644882 -23356434 -28517066 -4923391 43714945 87461209 114857248
26394 114857248 131022446 121854607 71619379 12430543 1224146 40483899 71562569
26387 71562569 57938024 29064640 26852452 50919129 75803059 87250548 82038862
26380 82038862 59307805 27776532 1086767 -18868476 -31164218 -13641761 52104772
26373 52104772 133306672 165512916 129279908 71877494 45167960 57547009 91689224
26366 91689224 127404345 137742649 106412730 62557555 56294056 87558131 104564089
26359 104564089 85346442 67358032 75344947 77957351 50528004 27345453 46664730
26352 46664730 87715778 109936911 116640928 129505059 133935265 106260437 71257298
26345 71257298 74823383 112009290 134661306 123609734 105269322 100100173 100080014 98665049
26337 98665049 101630652 101973146 79319984 34418339 -1019076 2486764 43606745 93146400
26329 93146400 112314752 78571261 12620892 -30668850 -19632178 14580228 15584619
26322 15584619 -30054954 -80664889 -86810428 -37164058 30843673 58072492 22241313
26315 22241313 -24998884 -13475284 45299693 65440682 16364985 -21935056 16647529
26308 16647529 71081009 43876182 -44563660 -90754400 -70191371 -56275006 -80907599
26301 -80907599 -88938812 -54827516 -36983973 -67306762 -79937949 -17910909 62480505
26294 62480505 73092129 28055724 11526673 39518541 39196911 -34334832 -131916095
26287 -131916095 -180813567 -173589766 -160110814 -175736481 -201456973 -191959843 -133251150
26280 -133251150 -64738851 -36375835 -50832183 -67574815 -59531610 -34855100 -1322418
26273 -1322418 48137631 98276103 105081243 59113487 18487992 37524876 89573577
26266 89573577 104590979 62729434 4236780 -37846505 -62691505 -65500529 -32500397
26259 -32500397 16997850 31972041 -4921190 -49494725 -58081545 -48666886 -70792124
26252 -70792124 -131842108 -183529365 -178755191 -121017497 -55335047 -23727840 -33850756
26245 -33850756 -63079147 -84819217 -87932210 -75041609 -53457208 -34343397 -31544849
26238 -31544849 -49019633 -73329468 -89076176 -96701916 -102638440 -98534032 -69498512
26231 -69498512 -22065803 17064941 35099111 46199755 61893817 68156222 47281682
26224 47281682 7877804 -25168900 -41044874 -45184690 -39023122 -18744714 8822558
26217 8822558 30375775 45726861 60796588 60954676 22295661 -39357985 -64585814
26210 -64585814 -22762643 37101010 44708078 2876635 -18260783 22719312 93029014
26203 93029014 143776099 168943785 184999562 188935620 167987342 127670616 81269181
26196 81269181 29340201 -24893892 -58802720 -57415976 -40767333 -34537198 -28832116
26189 -28832116 375783 41042573 54416032 30831307 642788 -10801884 -5982036
26182 -5982036 8562300 34111149 59234339 57491674 19704849 -30351183 -60482432
26175 -60482432 -55374658 -18146041 32621009 66820996 64046853 31141863 -16355316
26168 -16355316 -77449746 -144873717 -179030317 -145778465 -73205775 -22907625 -5007682
26161 -5007682 25215853 79739102 109817302 90504758 71050225 94783585 117435741
26154 117435741 66740844 -42652749 -117793148 -107379532 -57642303 -35830294 -42551560
26147 -42551560 -29809817 16288839 48410280 22625443 -33353060 -47347149 -791876
26140 -791876 35297589 -10286960 -109691108 -169234953 -149169551 -98934850 -71581073
26133 -71581073 -57992327 -25111979 26723559 72118482 93526684 84008116 46313518
26126 46313518 4612767 -14833899 -25392740 -62734339 -116045961 -128794785 -87397785
26119 -87397785 -49834711 -53389942 -54655369 -8952241 45162255 40448586 -20135223
26112 -20135223 -77108464 -93441294 -67010410 -2745588 68340705 81007896 15213314
26105 15213314 -48776614 -26741570 48859281 84213793 70221822 75552806 107593104
26098 107593104 92539458 12680709 -41286061 -1143847 75227193 84671126 6932673
26091 6932673 -94847946 -155560879 -147542005 -79381158 811403 28881315 -12345628
26084 -12345628 -71771418 -91409676 -64322078 -18280612 23223069 44550667 37090234
26077 37090234 16672979 11767739 17886329 -1315170 -50002706 -78100126 -51092914
26070 -51092914 -7004319 -10169255 -70444336 -135529709 -147633283 -91620292 -6019900
26063 -6019900 43759705 26444686 -16266627 -21493134 6727041 8589355 -27298439
26056 -27298439 -33735681 33752636 124045451 161174844 140428756 105672550 70311987
26049 70311987 17319842 -44248732 -76364820 -61270669 -19930334 12880479 12645132
26042 12645132 -18502155 -42880885 -20395874 32867417 53172816 15955292 -28168253
26035 -28168253 -31548373 -15682848 -20243361 -33749723 -26246810 -10690746 -15107048 -27015460
26027 -27015460 -22929471 -21397290 -46154578 -68403863 -54357436 -41489109 -87413360
26020 -87413360 -159676737 -162436322 -72351078 32729777 86447509 96429107 84036757
26013 84036757 45246177 -3112152 -15603593 7918172 8546729 -34534409 -60400736
26006 -60400736 -25861410 15114125 -8544057 -74384067 -102001897 -68404560 -25318935
25999 -25318935 -18382870 -42957941 -71153469 -79097935 -54971934 -14708766 2057821
25992 2057821 -18252960 -37924423 -26579796 -17306468 -55122103 -111163045 -110736035 -43674841
25984 -43674841 14703362 4309717 -51564083 -97611858 -117866319 -127704330 -132712357
25977 -132712357 -129809397 -126760478 -131523408 -136071992 -130175545 -116107136 -95611958 -63707673
25969 -63707673 -31806491 -30921288 -68044663 -104205888 -104916050 -87912413 -84534720 -78197822
25961 -78197822 -32644257 31218567 48343888 5887264 -34497479 -32874102 -30889843
25954 -30889843 -75068489 -129154060 -120878037 -49136041 16007112 31360845 22819689
25947 22819689 26670710 39337484 40236358 25801029 2984694 -22958057 -40776669
25940 -40776669 -38086894 -23970987 -23041847 -40654419 -60009118 -77082093 -104641544
25933 -104641544 -134008363 -132177299 -93432059 -55382651 -41641101 -27122452 10436258
25926 10436258 42359420 32727534 1106301 -4418496 21543518 44100280 51150283
25919 51150283 65366309 90839153 91858844 41171863 -37498190 -90433436 -84366835
25912 -84366835 -32140351 18820457 23973306 -18623748 -66916021 -82541253 -71237826
25905 -71237826 -63079722 -66933724 -67368722 -58003806 -51903805 -59650739 -78230553 -102526030
25897 -102526030 -129990790 -151650671 -152273688 -124051472 -76678537 -35868131 -28033241
25890 -28033241 -51893819 -68459035 -44465242 -5622097 -9174435 -54568751 -69706573
25883 -69706573 -12616473 61596270 77404433 40615418 11289491 9862521 12318366
25876 12318366 14997665 35376719 56461863 36244610 -23693760 -74874384 -91887562
25869 -91887562 -94562141 -96337649 -81524744 -42270275 5618810 47668520 71473817
25862 71473817 50349558 -22214632 -89190187 -82540634 -18931991 20557404 7791745
25855 7791745 -5862808 12767606 32807094 30786443 30470166 43274519 43932855 36629330
25847 36629330 65430814 118428522 106696385 -2108539 -107650305 -107478840 -36695025
25840 -36695025 3850225 -15872 10690687 43151950 42810948 -5110713 -52113633
25833 -52113633 -64054369 -52167047 -30104120 -4981647 -5765316 -54346423 -108777292
25826 -108777292 -98870397 -23315372 44781486 53075798 18725054 -18226382 -36191086
25819 -36191086 -24450882 12116021 34969691 7647298 -46024060 -65157531 -31650152
25812 -31650152 22132690 78039342 142116207 189742747 172406345 97487987 37415902
25805 37415902 33927013 49144428 37876928 14139826 14372840 42305142 82094315
25798 82094315 123143796 143257994 113021197 49573414 20256452 54189109 92558140
25791 92558140 69914602 5237576 -38588220 -52596292 -77951305 -120375354 -131218409
25784 -131218409 -82098857 -12350825 18149297 709855 -14486953 22123671 97706948
25777 97706948 142055927 106377204 27344105 -17861405 -16866329 -33652951 -98419904
25770 -98419904 -142263263 -88380898 29703700 100265381 69451707 -7031821 -44161379
25763 -44161379 -12931407 56649085 114797956 122641954 75377729 8741498 -33998301
25756 -33998301 -42075376 -28840015 1922919 47916008 76401308 47048403 -25279705
25749 -25279705 -72844946 -56083640 -4325402 42994582 91492045 150835214 175397870
25742 175397870 105600783 -36713971 -149132464 -162099434 -112819277 -81908658 -87693640
25735 -87693640 -81010148 -31841356 22351204 27356941 -17575294 -63922797 -76588768
25728 -76588768 -69031741 -75189442 -105203031 -138908758 -153347601 -143197866 -114323830
25721 -114323830 -70462138 -17212481 26272442 37415200 19710162 7141641 23139922
25714 23139922 46060672 38806769 7548396 70909 38843869 85698175 89048642
25707 89048642 42396765 -19587016 -56744424 -37022644 50989655 164961995 217654774
25700 217654774 165397437 71481799 34849510 69104395 105212503 104475364 100661541
25693 100661541 118813051 122375947 77552818 17474594 -3036078 18784722 46796839
25686 46796839 63054239 69617625 58963231 29367045 13798071 46181155 104557455
25679 104557455 130908922 108674934 82046939 91438693 122928199 133777456 103609652
25672 103609652 48045596 -619049 -15989318 5081465 37313944 45929120 15696867
25665 15696867 -41376532 -102124540 -146701789 -162929173 -151489377 -128286396 -111085603
25658 -111085603 -101743023 -88092514 -62745224 -33870393 -17570863 -22343045 -38945176
25651 -38945176 -46499371 -35695742 -24166795 -36061560 -65562183 -76779263 -44687910
25644 -44687910 18514520 80930361 117647105 118729752 94694694 79333099 99604790
25637 99604790 133950102 131292855 83023353 38409761 28349297 16906401 -35444069
25630 -35444069 -98845610 -113909730 -79608745 -48473083 -47860824 -58260610 -64124614
25623 -64124614 -74147195 -86368542 -78941726 -47278351 -16265603 -6990850 -18093502
25616 -18093502 -39681329 -56977627 -46757636 -5668830 25448728 6800125 -38833770
25609 -38833770 -58763753 -56868463 -83970767 -137912493 -147626455 -82846488 -9393611
25602 -9393611 6677825 -12239556 -14587087 -10297504 -33615140 -57848874 -28877916
25595 -28877916 34651412 56183493 18948353 -5508050 34500223 97946072 118107693
25588 118107693 91222184 57024583 27991897 -12482131 -58547859 -77675555 -60549031
25581 -60549031 -36533554 -26637965 -11928698 28578274 69957046 63835120 4030155
25574 4030155 -62259565 -94866848 -100726353 -98348091 -76494550 -21765494 36662352
25567 36662352 54229546 33037786 12481703 4288950 -10802223 -20456147 19772137
25560 19772137 101351741 142182653 95820536 27341579 22035717 62081945 66542729
25553 66542729 25932982 11041112 49258364 78226043 48888804 2704009 1455680
25546 1455680 32585725 38978471 12034181 -1606647 22709811 52619020 49277546
25539 49277546 18784868 -4527017 -8840833 -18656595 -56114300 -99816724 -97092542
25532 -97092542 -24102492 78036611 143294769 150694471 134708890 130495640 136730478
25525 136730478 137906687 133084277 124631565 100889855 52930840 -4072547 -45839269
25518 -45839269 -66116081 -72072156 -62307535 -29218393 19807144 59490738 66581162
25511 66581162 37726147 -5691172 -26341680 417307 55728525 90733050 84960233
25504 84960233 71991297 85031520 98527824 62424856 -14587872 -63883835 -50021650
25497 -50021650 -20850331 -35985842 -78501386 -81259858 -28890621 13335971 -15763187
25490 -15763187 -93900595 -145500662 -133689086 -94216922 -81094005 -104699273 -132710855
25483 -132710855 -132632636 -96824017 -37396228 22439580 54447925 43557383 5681479
25476 5681479 -26354370 -38406630 -43349771 -53954751 -68696187 -89083310 -123137548
25469 -123137548 -157300626 -155626474 -113569471 -83226470 -104147668 -131252570 -87774311
25462 -87774311 14926580 74065223 29616176 -56444938 -89569070 -62395131 -37648159
25455 -37648159 -48525123 -74801832 -98446325 -120162002 -121610924 -70443498 21314751
25448 21314751 90458231 95372636 59766189 25141104 -3100902 -35774897 -59487632
25441 -59487632 -52497047 -22598907 3366184 15779950 19963026 10422444 -20659284
25434 -20659284 -56194962 -68511772 -61081671 -65539207 -92526864 -114172632 -104819187
25427 -104819187 -73393783 -42378011 -18357141 -984958 237583 -16800337 -26351465
25420 -26351465 -727938 46731115 73476927 67533657 66693443 101036148 139342215
25413 139342215 122087178 40278437 -48844028 -89760214 -86129424 -76866975 -76522869
25406 -76522869 -63602591 -21775975 28540091 45520070 7634483 -59347587 -99566612
25399 -99566612 -84387773 -51605464 -62615646 -114997797 -136224800 -87144896 -25784597
25392 -25784597 -19681519 -35683053 6403380 90029528 107560569 23150960 -66360816
25385 -66360816 -75711458 -48542823 -64508054 -103669717 -92019897 -32019489 10314665
25378 10314665 22002111 47902723 86517919 78563551 12796827 -43163118 -42098357
25371 -42098357 -12948099 7839019 26768566 41442131 10668514 -73728083 -141586091
25364 -141586091 -125194609 -46841905 18480998 31752609 2938837 -43695518 -73152612
25357 -73152612 -45714948 33319223 99017947 102061159 65797792 30598910 -13334786
25350 -13334786 -84309765 -144206814 -145099789 -112140150 -106747531 -124667001 -105201572
25343 -105201572 -34775178 33125929 65225834 85187316 109563412 110518348 64962923
25336 64962923 -7451673 -73034142 -110104488 -99951997 -39655456 27731755 45197898
25329 45197898 13979510 -13727492 -17710183 -27455563 -50615744 -53043537 -28961439
25322 -28961439 -18945053 -29084025 -7241507 58795304 96412532 60083580 16166934
25315 16166934 38891121 81961351 49036106 -45420046 -89110009 -35196224 44773558
25308 44773558 80602904 88140570 107560295 129732391 123928811 90809635 52939241
25301 52939241 24899964 14641504 23700533 31301377 10954140 -25777490 -37793873
25294 -37793873 -16348281 2493343 -1135630 -4374298 5229805 288674 -33331930 -61461567
25286 -61461567 -57799357 -52918047 -82512030 -123270724 -130573672 -109169843 -90289127
25279 -90289127 -63736883 1888320 84201811 122287099 108716397 97436483 107314233
25272 107314233 89874205 24483978 -22187597 15031881 101172099 153334822 156995266
25265 156995266 160449085 171714074 139935985 49368645 -38358372 -65833030 -50509029
25258 -50509029 -37974219 -30052621 -6009628 17592589 3660632 -42856142 -80862388
25251 -80862388 -97144577 -114138072 -130735421 -109630152 -43520000 14054945 17173728
25244 17173728 -8768244 -9527380 19696921 42246164 47431207 58554141 75935019
25237 75935019 63604964 9761628 -38934325 -30621147 26757399 78407946 87229375
25230 87229375 64455632 44160331 46211665 63708989 75760455 70396428 54858639
25223 54858639 39212097 16845812 -21745299 -59465858 -63882094 -33546769 -2307287
25216 -2307287 16016793 50704207 113945012 155058962 124412658 59647071 44167556
25209 44167556 82183045 85178517 4563034 -89252487 -106424084 -63068523 -42187598
25202 -42187598 -62614800 -65983376 -29170389 -7699529 -40362116 -78626780 -60501640
25195 -60501640 -9267961 1439295 -40725905 -70425223 -38916369 27234544 73039641
25188 73039641 77278121 49418506 3302593 -36666981 -31808055 30138683 102065316
25181 102065316 119571364 74210413 17394633 -6640299 -972276 13734999 31517820
25174 31517820 43293660 17710904 -64075059 -165118870 -217461548 -191262255 -115393638
25167 -115393638 -32648856 33614651 65097963 42218656 -23472668 -81199754 -97831834
25160 -97831834 -100988551 -129459228 -161365849 -142393024 -78252994 -37123204 -44167057
25153 -44167057 -35195832 43970458 140759344 158522429 90931160 28189590 31158422
25146 31158422 61364312 54172523 9781680 -22713994 -19257817 -722511 6577318
25139 6577318 -2669254 -23581526 -53623800 -87417026 -110361209 -105635847 -70772128
25132 -70772128 -28803715 -14583146 -37982812 -67637023 -70367150 -61599266 -87565202
25125 -87565202 -152322627 -195051034 -159724416 -65181337 16000630 33732332 -2535613
25118 -2535613 -48104511 -64720028 -48409578 -31592632 -48193148 -88411957 -107089741
25111 -107089741 -86682384 -61776213 -59644208 -51354807 -1439019 60096304 66527106
25104 66527106 4520098 -73982336 -125002016 -145512796 -132907571 -73201048 10485833
25097 10485833 54735330 36515109 12338218 36130427 76828476 68717623 16018233
25090 16018233 -13621235 8100810 34116694 19067879 -19904579 -43876583 -52426147
25083 -52426147 -67171063 -80222540 -61483439 -13373035 18345279 431499 -43955957
25076 -43955957 -64094527 -41990754 -5494214 14332470 18499905 25725063 38425590
25069 38425590 39094189 16781351 -16144722 -34673718 -20124625 28704010 89661721
25062 89661721 121958544 95034656 23849408 -36740306 -47108513 -25736925 -22740854
25055 -22740854 -55288297 -88093952 -81714034 -41910209 -7755915 -1816310 -10012610
25048 -10012610 -8032808 10921956 38424447 62476769 67731259 43344834 8014608
25041 8014608 8622306 64432842 122893751 109116429 22078206 -57589342 -67438291 -30344224
25033 -30344224 -1540116 6569456 8390721 -6806872 -54319672 -101641248 -96234800
25026 -96234800 -40565995 14980347 51012319 89968408 122246449 91965603 -12999381
25019 -12999381 -116140234 -141790139 -106987870 -80040989 -84400868 -93205260 -91053196
25012 -91053196 -86014761 -73520847 -39481151 2965038 21527064 10029791 -8314110
25005 -8314110 -20212094 -31409428 -39727786 -34831819 -26301863 -37649140 -67221550 -85850762
24997 -85850762 -79134811 -62169093 -45074131 -15259133 31402997 68417241 69694327
24990 69694327 48888079 46880196 80760487 116994086 103145539 29371705 -48850573
24983 -48850573 -65250877 -18766089 29489577 39019622 31829885 31829180 7617581 -77321086
24975 -77321086 -186069189 -236445528 -197722222 -110981482 -24142513 40122255 59741923
24968 59741923 19422447 -50103015 -93020827 -98239632 -98584078 -98928808 -69590894 -22117077
24960 -22117077 -17255640 -67654667 -102790341 -72314303 -19678036 -3288960 -6031859
24953 -6031859 15924287 49004931 58214241 63522937 102634998 148977467 146950003 107621103
24945 107621103 88077050 89861576 65123115 21399861 27022852 93909852 143497934
24938 143497934 126065023 96077806 116762462 152958311 125554433 35596849 -31827558
24931 -31827558 -15621120 58892631 121762103 125294670 70104067 -5277776 -55296656
24924 -55296656 -64098197 -53311970 -47503580 -41987224 -15754274 33089680 76848633
24917 76848633 80077399 31358507 -36130823 -59464708 -3473870 92771255 149460944
24910 149460944 131748432 78436954 40428206 22971789 4926893 -15878009 -23368553
24903 -23368553 -10089974 19955037 59588057 89514181 78433512 15731068 -66763390
24896 -66763390 -123510159 -134088183 -101943018 -38249270 30830446 64267560 45810808
24889 45810808 10277712 499685 10171006 1514028 -30542970 -49940344 -34699209
24882 -34699209 -4322555 15165012 22570869 27061711 29049437 29688982 38159070 53999964
24874 53999964 58475067 39257933 12426446 5270662 23508821 45790056 45109140 8981635
24866 8981635 -51544990 -100895490 -95319129 -20651870 79970752 130104865 86989672
24859 86989672 -15018689 -96414781 -108528693 -69699297 -28222061 -8811967 -6279016
24852 -6279016 -11453897 -16644426 -3399216 44461164 111079124 156114500 158593595 132741803
24844 132741803 97732807 58813871 25342267 15972916 29509241 37636531 25079480
24837 25079480 11944325 17959282 32291781 40652197 51974341 69369170 64317284
24830 64317284 16476365 -44794174 -77380004 -83326792 -88494373 -88725741 -65420466 -35109250
24822 -35109250 -25399384 -13883412 41727613 111922706 107207774 2855518 -113703835
24815 -113703835 -153982068 -130533943 -106035598 -91038777 -51264846 11848205 50937960
24808 50937960 41669033 14734733 8029261 17310754 10802314 -19914811 -39152049 -4955241
24800 -4955241 72428626 126608060 107835442 44818465 1733085 -15037766 -57321198
24793 -57321198 -137565807 -190985600 -167144079 -110575971 -102512326 -152189204 -195042774
24786 -195042774 -182562679 -127731227 -67024541 -19287492 10663845 15590825 -13695884
24779 -13695884 -75607909 -143506294 -170379248 -131930900 -66148948 -35289767 -41800500
24772 -41800500 -27883117 26858124 68163141 61283456 54537275 89027600 108372534
24765 108372534 45174509 -47769244 -56935949 22308015 85188289 84740423 84266199 121643570
24757 121643570 138573555 96660870 61205190 96760022 160072273 175749058 151899858
24750 151899858 137683251 123524144 75141914 22326872 16499259 30970339 3871812
24743 3871812 -41024001 -25697909 35473968 38713493 -38775983 -87734312 -34138212
24736 -34138212 46013421 48258669 -10112286 -45678048 -47768099 -65203083 -96401321
24729 -96401321 -91528325 -45686688 -139857 39741530 99033706 147734859 116613384
24722 116613384 17263607 -45886777 -19997785 24523842 16705147 -2206052 38362920
24715 38362920 108491901 124202458 86162424 73465656 110114954 132977011 104115624
24708 104115624 68276381 68306365 76614688 54490725 22771724 22158397 41770255 38270031
24700 38270031 3876607 -27378469 -27082337 6085011 56065189 91062388 74044563
24693 74044563 4320574 -66152037 -89443976 -80312062 -86028581 -112724085 -121121070
24686 -121121070 -89352464 -40410585 -3708254 17359680 31001854 35168197 20360163
24679 20360163 -18657386 -75864380 -130685886 -160572565 -166657624 -169290830 -165093655
24672 -165093655 -119348961 -29921366 36259551 20453271 -38528796 -54158041 -19013355
24665 -19013355 -9062531 -55528265 -91443593 -58643905 461559 10866299 -23394094
24658 -23394094 -36512048 -2733407 39426994 55942922 55614259 52138984 31400354
24651 31400354 -21087977 -81948326 -102983609 -62743998 5135884 42727243 26754557
24644 26754557 -13925640 -44502400 -66932830 -95453611 -111945017 -87464062 -39244722
24637 -39244722 -15643830 -20251516 -5896785 39263025 57965907 9999388 -59747479
24630 -59747479 -86169581 -75319048 -76051916 -91538025 -81994306 -41221763 -7309838
24623 -7309838 5552090 30590901 87663522 139333487 130109911 49753561 -54954614
24616 -54954614 -120482974 -117849902 -74943969 -42654025 -31038221 1873170 81175008
24609 81175008 161798780 177311939 124140140 59842369 28408607 24128293 21717490
24602 21717490 4562186 -33420877 -79080289 -96564730 -66061310 -20593660 -8726251
24595 -8726251 -27054478 -29777748 -618872 30775429 46473088 66330263 103995662
24588 103995662 138620112 148109995 138066277 122016278 99786712 67695823 28799506
24581 28799506 -10625214 -34685234 -18624474 31392030 54962369 3504175 -79074290
24574 -79074290 -101541313 -51651090 -10925973 -33241272 -81311425 -107522598 -121789653
24567 -121789653 -137334277 -119929553 -50044087 19600145 32401365 11795122 14355408
24560 14355408 34973557 24326824 -24854923 -72494994 -94379159 -93906584 -68869776
24553 -68869776 -22882491 7760875 -2862399 -15850813 23091771 92165557 115866457
24546 115866457 73108039 18322303 -5442616 -10729752 -17920621 -24803336 -32614794
24539 -32614794 -45158687 -36259871 20493731 83907997 78130127 8293319 -33223823
24532 -33223823 -3218380 29327810 871428 -42694825 -24625453 40799666 82104393
24525 82104393 85755586 96470997 122322001 117546300 62137381 -2757982 -30446606
24518 -30446606 -18188353 5481458 12056405 -7602660 -30368782 -17978254 28473807
24511 28473807 53940552 23146325 -20317348 -17136975 12942474 3457346 -48764929
24504 -48764929 -81009673 -70617025 -63778519 -82756803 -83307970 -38800482 2575250
24497 2575250 -9188016 -51599300 -76455069 -81223507 -82802357 -67709424 -28361535
24490 -28361535 -7873194 -39265098 -69945800 -22861287 82748533 148960788 134168767
24483 134168767 93996698 80263204 77549305 64390601 63955036 91582366 109238237
24476 109238237 81276586 33956271 11898011 8426312 -12997431 -52558413 -75511132
24469 -75511132 -63720028 -26863042 21585827 63017261 67899764 33607750 11858253
24462 11858253 51387812 122668758 148268720 105048769 46926378 23271756 26156365
24455 26156365 31525503 42251601 63276471 73058533 53879712 26960015 26473974 52158714
24447 52158714 72754441 68991665 53932623 52288675 68693423 76574391 44071263
24440 44071263 -18634599 -50797862 -6738077 77339461 118339622 88003336 37024915
24433 37024915 10476683 -8591271 -46350347 -81106278 -84167323 -80264915 -112575207
24426 -112575207 -168026758 -192004396 -169416519 -139700210 -129833805 -120128765 -87264862
24419 -87264862 -41275996 -3448311 22603262 42821090 59776628 79564255 109586290
24412 109586290 140787896 155592942 160757593 182534614 214963305 205500774 120067466
24405 120067466 307490 -76082217 -80175036 -47170021 -17315322 1317103 10090853
24398 10090853 888952 -20215649 -21371270 12127484 41126075 13728571 -63038015
24391 -63038015 -127390277 -138956102 -112855223 -70572943 -5186529 74645747 110766690
24384 110766690 60082262 -28742241 -61930630 -18712609 33431503 42503539 27857286
24377 27857286 16927016 -6895188 -54173960 -81476271 -47008094 19150042 51894975
24370 51894975 36848355 14041306 13972637 33312308 59551582 78646030 71085755 38447746
24362 38447746 18180942 33694390 51379518 33695907 10833121 37594772 93254236
24355 93254236 97627177 31715475 -29327347 -23784047 19762060 42209699 34369090
24348 34369090 20076716 4583732 -16436847 -26261606 -6287586 30351247 53141170
24341 53141170 49245273 25953892 -5308043 -32594980 -47696631 -55125229 -57521233
24334 -57521233 -33825318 33136614 104958220 110177204 34114563 -58418778 -109137325
24327 -109137325 -126889738 -137631127 -129082602 -89034356 -53904701 -65078368 -104273414
24320 -104273414 -120205341 -97858329 -60341622 -27519416 -15715132 -50186109 -126089403
24313 -126089403 -178295581 -144658497 -47055314 38261046 73827661 72280013 35749268
24306 35749268 -45480746 -136185175 -170728801 -142316276 -118924892 -147523908 -193138501
24299 -193138501 -198715010 -160003442 -110702547 -71332051 -46759947 -46539750 -73631415
24292 -73631415 -108025924 -125573114 -121144792 -99082225 -59157488 -7821304 35241109
24285 35241109 59425115 77165868 100870426 121069908 121902669 103613495 75437384
24278 75437384 40745965 4603588 -17930548 -19740780 -18653595 -36656414 -64485553
24271 -64485553 -65072433 -18237467 49181854 88640210 82387630 56706436 36961518
24264 36961518 9499609 -45758415 -98285422 -89258274 -20415565 30083762 10345202
24257 10345202 -34055034 -36545101 -12579426 -20762824 -53019221 -47315437 -2919254
24250 -2919254 4765366 -57765573 -127421541 -139007602 -105546881 -64996586 -11078661
24243 -11078661 68917711 136284401 141415983 94145910 43459082 9061608 -23824981
24236 -23824981 -62672385 -100994815 -134887764 -152751165 -132191402 -79431279 -40856461
24229 -40856461 -37891198 -27257353 25434159 71333081 44024090 -27358063 -48875568
24222 -48875568 1177132 43311069 14916540 -52563364 -96592018 -104637810 -102082746
24215 -102082746 -102580450 -100315613 -84973967 -49439215 -6339204 6049786 -27647641
24208 -27647641 -54136829 -11453054 66206183 76720665 33959 -59994484 -22458952
24201 -22458952 57871891 81409274 40017759 -8018419 -40953514 -66373852 -56145634
24194 -56145634 12140603 73291933 40358792 -50457119 -68132412 22835136 108034264
24187 108034264 98754491 56428248 71394265 107409344 68414510 -32920360 -84296165
24180 -84296165 -36574681 41403957 77513168 78162628 72805673 55141083 21041720
24173 21041720 5073649 27782101 46381182 10594809 -55854195 -80017700 -37215491
24166 -37215491 19891448 31830970 -2218649 -37563130 -37861997 -4736717 32168606
24159 32168606 45404575 35317931 27546670 42068103 68994793 79956392 57445111
24152 57445111 8596423 -40853912 -62367715 -49297278 -32872651 -53702813 -104989699
24145 -104989699 -129210810 -94349728 -47321663 -53252817 -98511885 -104471307 -39599899
24138 -39599899 32093990 33680954 -32495113 -101287378 -123901296 -100654259 -55834172
24131 -55834172 -14225274 3763083 -8623055 -37209028 -62364336 -77569911 -80677004
24124 -80677004 -57469821 4024640 83769689 134643385 125619241 71602909 15873142
24117 15873142 -11418359 -14333498 -15866241 -28772429 -47226199 -66242358 -95254306
24110 -95254306 -138007012 -167398556 -144220315 -65178272 27439381 89784071 110465367
24103 110465367 96416772 55120854 9188804 -658799 39173862 82637609 74159219
24096 74159219 27607677 17757501 83791963 173022016 200814511 146697401 66987177
24089 66987177 21091111 12334284 8706534 -347962 6513684 37759613 61853183 45183910
24081 45183910 2484503 -17946002 4137914 42065272 66778511 78821073 86629003
24074 86629003 86637390 83782596 99079531 128772434 125357487 56883749 -35743815 -82054214
24066 -82054214 -68383687 -37586336 -13594941 21076091 69834671 97924517 82532065
24059 82532065 43698425 2784049 -50389338 -119762816 -166118585 -145229634 -64443022
24052 -64443022 28965290 98915482 131515030 115257911 50568832 -26629114 -68849632
24045 -68849632 -70047946 -67200375 -84614910 -103434918 -94905403 -59690321 -20574527
24038 -20574527 6570878 21144294 30199678 44359318 69927135 93655387 87071124
24031 87071124 40864768 -13504152 -33931133 -16094286 5530486 5513870 -2534701 7850690
24023 7850690 35042211 49620098 29637689 -17444287 -65225675 -88417762 -73884497
24016 -73884497 -27199319 25084760 50380954 38182703 11392336 3547432 24727487
24009 24727487 52257287 54570405 23898991 -14328681 -27066119 -8924758 15813361
24002 15813361 29066128 40382455 58366752 60559899 24899646 -17174096 -3864065
23995 -3864065 69824500 130896618 118280532 55609534 1396071 -35655508 -81506954
23988 -81506954 -123291572 -116287284 -63413162 -25897658 -37234428 -58021146 -43452285
23981 -43452285 -11958603 -8834633 -32361068 -41363034 -24444240 -18980532 -54606373
23974 -54606373 -107166761 -125626601 -93762467 -49256591 -36466876 -47742490 -29130433
23967 -29130433 46284406 129388030 145430471 85440952 15106651 -8965675 3171541
23960 3171541 11300716 3366450 -4463276 2338713 32493337 91772845 162091622 195999158
23952 195999158 162431052 87543386 24616960 -5880440 -21974387 -40213805 -61521161
23945 -61521161 -88897806 -125483471 -154690974 -151428849 -115692998 -69642582 -21366109
23938 -21366109 38534570 99854182 125844943 100184369 56458543 40372459 57923245
23931 57923245 79304287 82309572 72266273 63868024 61129958 58743358 53646301 49409020
23923 49409020 50054555 52753572 51487873 48510929 52502771 58984876 46273951 8172455
23915 8172455 -19776505 5630137 73199647 117550406 93918073 31169590 -5475635
23908 -5475635 13436460 64444354 108680091 121746116 96719577 46703021 5715295
23901 5715295 2749523 28078932 42812721 26379253 -4377594 -28661368 -50044570
23894 -50044570 -76401261 -93586027 -83888973 -57841531 -40482610 -32553751 -14026492
23887 -14026492 16043444 36490229 47107354 78538694 139287395 183549049 161939362
23880 161939362 84690833 4424759 -46740915 -68522128 -56948129 -5685291 54802979
23873 54802979 66657697 12805701 -56982455 -88038133 -80997037 -69610241 -65896278
23866 -65896278 -55946306 -32606386 -3438858 24872151 47078511 52286399 36742395
23859 36742395 15803251 3523802 -11240687 -46541163 -91127860 -110338471 -89054545
23852 -89054545 -49936720 -26287812 -31494670 -57519960 -90207730 -119998668 -142267454
23845 -142267454 -150197328 -132284946 -87378552 -39242789 -15101160 -5694274 25052569
23838 25052569 77611468 99301277 59067240 7488087 14307913 64194174 72971294
23831 72971294 9508946 -57348222 -55759955 -6133006 17469924 -10919566 -49226957
23824 -49226957 -55444246 -34633634 -15031104 -7939362 -3260880 13361684 51732422
23817 51732422 114008339 185438643 231246690 218186267 147207021 57948274 -7296310
23810 -7296310 -39838859 -58456876 -76989593 -93676577 -104987014 -106699660 -84313128
23803 -84313128 -31908440 17970878 21942285 -4316185 11256217 95231743 172080161
23796 172080161 154761339 59841152 -21316453 -42730060 -33699386 -21699812 4572150
23789 4572150 47958968 81896357 95114866 105555226 113595539 93975193 52115697
23782 52115697 30592473 32912776 2233032 -82415750 -146564476 -115462386 -25799848
23775 -25799848 23759158 5518453 -22900825 -22218937 -16543795 -28967907 -37431710 -18323822
23767 -18323822 13024682 32377641 42974885 55566608 58385917 35631484 650737
23760 650737 -16667502 -11654473 -11972277 -37488305 -67053760 -59134020 -4906165 54618496
23752 54618496 77096162 72390649 82308453 110253266 108437578 51689494 -11020933
23745 -11020933 -13018265 41748759 84208406 66337371 7068863 -46859225 -71936674
23738 -71936674 -71084682 -53210377 -26576867 -622751 17603732 25912688 23771858 10038114
23730 10038114 -16947705 -56652624 -96229368 -106516968 -68820216 -9896380 17446648
23723 17446648 2333294 -6422584 26506835 65877485 60207067 25630092 24328892
23716 24328892 72348414 122881529 140008475 135461235 123776299 94426657 50663450
23709 50663450 31612331 65229106 129064291 183066789 214422430 226527852 213156026
23702 213156026 175774260 145175293 150253419 175047222 177674369 147384279 114645163
23695 114645163 103664423 101173286 83760447 60171521 66973368 116912232 162070310
23688 162070310 129653814 7069715 -124980935 -170629727 -124459122 -68589761 -64180139
23681 -64180139 -85707869 -80041636 -50766288 -44640641 -73996114 -96396214 -73311631
23674 -73311631 -16832665 32082384 50972504 49568739 47812876 50895818 43320590 4525270
23666 4525270 -66760439 -142760955 -183925785 -167782049 -104008409 -27652914 21634001
23659 21634001 24032173 -6084962 -31061239 -23312917 7490571 22759436 -3352446
23652 -3352446 -48671169 -59574916 -14528713 39362170 38377296 -12686877 -44723568
23645 -44723568 -22896443 6870319 -294497 -12177179 16777014 48340808 13239396
23638 13239396 -54965349 -40197397 82073654 187370099 166178245 63511807 -8901256
23631 -8901256 -28362783 -45655719 -66030627 -46342070 6772721 29876850 -84425
23624 -84425 -37975510 -51390196 -61047762 -83949396 -99658049 -96848408 -98590976 -115890617
23616 -115890617 -125559753 -120042219 -130713032 -171381370 -203750778 -193149321 -157656289
23609 -157656289 -126299350 -89881013 -36457741 2740005 -3506440 -24875988 -9780196
23602 -9780196 28616891 27662562 -26196177 -74533867 -74939904 -58060226 -71334252 -107716326
23594 -107716326 -124615360 -107765253 -81136123 -64973262 -54546266 -40154657 -26129836
23587 -26129836 -23435974 -33871790 -47166699 -51137165 -43366299 -32284629 -25358626 -20043929
23579 -20043929 -12363963 -9128806 -18800529 -31717055 -27080874 -6302988 -2350841 -39571356
23571 -39571356 -91555243 -97403484 -25565153 85688324 157393349 141457933 65139620
23564 65139620 3443136 4009973 42021433 55601594 19277595 -34584062 -65983082
23557 -65983082 -72131073 -68833714 -54221778 -21989640 4039528 -10695961 -53916337
23550 -53916337 -65848370 -12448847 70096391 124338808 137486440 130465142 106828177
23543 106828177 56700059 4198323 2869940 68844923 151808414 192036443 181693876
23536 181693876 149358792 107186878 44294583 -35922456 -101435324 -120422773 -89942159
23529 -89942159 -33826879 16441531 38563532 30338770 10223807 2335145 16893882
23522 16893882 43692019 60618355 49073528 10426456 -29311731 -42132248 -30916335
23515 -30916335 -26412176 -42987331 -54724710 -32167394 13324245 46449792 57748550
23508 57748550 65279067 70477452 50255822 4530275 -23385429 -257863 44605826
23501 44605826 51313445 5916455 -43177250 -46067498 -4129818 45967178 80968318
23494 80968318 107424777 137962843 168653602 184330372 178201863 158745926 136853784
23487 136853784 111208005 72860530 26280157 -1450332 16179948 70711250 118876178
23480 118876178 126492510 104198089 85661036 77136876 53561975 9711236 -15188637
23473 -15188637 12311978 66660727 93947091 83515943 68823581 61529773 36129936
23466 36129936 -7043114 -20302279 12591532 24713956 -47236644 -152347625 -172882138
23459 -172882138 -80026995 26517173 51676737 14800770 -7801783 4064498 12495718
23452 12495718 526738 -7387401 3004745 15407628 20466423 30992046 46565546
23445 46565546 40200237 2258412 -31857628 -28063538 -9558007 -30985747 -99374291
23438 -99374291 -154491635 -140026983 -70319568 -7473619 12267102 6026790 5713676
23431 5713676 19582698 38825773 60153753 85072880 105911572 107156807 80307234
23424 80307234 33212959 -11036053 -24695937 2428311 46295485 67926443 57298874
23417 57298874 43673764 52871366 72158424 73582738 55852202 41316767 41424294 45703074
23409 45703074 37849931 6634488 -47381310 -98625251 -106927374 -64787896 -17128767
23402 -17128767 -7213798 -25036775 -45663406 -91347001 -195085156 -312730955 -344645429
23395 -344645429 -263137648 -156904964 -119392698 -144263874 -164943249 -150028085 -116098781
23388 -116098781 -81260199 -51384297 -31109903 -13623331 19648226 61946976 72939811
23381 72939811 37956124 1794617 6392782 29686602 30697707 19544621 26929818
23374 26929818 35624235 10617729 -22707528 -7509321 41401101 42356863 -31138985
23367 -31138985 -105213421 -108668322 -58429573 -9378692 23651647 51036475 62834347
23360 62834347 49064514 34807141 46289630 61373469 37710038 -23176594 -80444577
23353 -80444577 -112245890 -127591667 -123426323 -75443470 13632901 91008633 105180237
23346 105180237 65048523 24777619 15665877 15771386 -7595627 -45272667 -54686364
23339 -54686364 -13270129 57611443 122108760 160695447 166646053 139046241 95015234
23332 95015234 64612235 52909306 29798540 -19627185 -61508667 -61913578 -42085768
23325 -42085768 -42608183 -55226761 -42237057 -7877671 8951024 5546798 13945973 27796541
23317 27796541 2613194 -55907533 -77404355 -31746883 18833214 14004830 -18885298
23310 -18885298 -23723238 -7633732 -15142702 -49670782 -79978450 -95903753 -103057854
23303 -103057854 -88324509 -45184859 -10782506 -23604885 -63002164 -81806851 -78219930
23296 -78219930 -81464301 -87848035 -72569580 -49172465 -51589465 -65418087 -43646713
23289 -43646713 11051559 45554818 40174555 27540910 22353416 2382758 -26184687
23282 -26184687 -15643107 44890557 101916687 117929435 118578538 127698284 119494484 79519861
23274 79519861 53077654 75920115 104791823 79491216 17632563 -16599304 -10341789
23267 -10341789 -1725752 354568 25437879 71562604 90836352 57578710 542156
23260 542156 -45458769 -74574561 -84088087 -62367867 -27301871 -34081506 -106985639 -188429125
23252 -188429125 -194016700 -108777352 -109629 57215103 41299562 -24943256 -105229771
23245 -105229771 -161156935 -161979556 -110393143 -47720139 -10965946 7237587 31860614
23238 31860614 49482264 21500039 -39317810 -56762179 8372251 85906222 79596567
23231 79596567 951029 -45416665 -7509901 52453944 60339412 26800238 1249491
23224 1249491 -16435617 -59444292 -118349132 -141644917 -106222259 -42310421 12517308
23217 12517308 48955847 72266303 80938710 67199169 27549359 -24771763 -55252840
23210 -55252840 -37808208 29416 -5256201 -64667071 -101575523 -46646486 62342961
23203 62342961 129223684 126194744 107521980 106477054 94680482 58436464 41372004
23196 41372004 71779346 104102510 83659567 31694400 11924906 34509270 47733922
23189 47733922 19894579 -19462090 -29280464 -10729180 6639268 8571390 4325465
23182 4325465 1039664 -9579424 -34292632 -59572830 -63153029 -46014914 -39816567 -70237170
23174 -70237170 -119600296 -141802635 -113866742 -58557375 -15482528 -4494405 -19668262
23167 -19668262 -44214901 -65173909 -81557163 -97991605 -104249960 -74872652 -10056522
23160 -10056522 38367075 21296695 -29518476 -27744649 45670596 98007831 43334436
23153 43334436 -71113906 -113690399 -31011325 93349128 148124661 113435528 51195696
23146 51195696 15891602 8622385 2585975 -16960484 -38243139 -33380619 13787251
23139 13787251 79520208 107675855 62563533 -26360812 -87317781 -75805278 -9676214
23132 -9676214 63776278 114239693 132399126 112492282 61079503 15333137 16239815
23125 16239815 52208263 59168861 -595250 -81134366 -104136873 -55814635 2167266
23118 2167266 18698140 13382884 33581260 79300584 103001387 78903817 42533629
23111 42533629 45431746 83374824 94703430 39942652 -36579438 -53257960 3458428
23104 3458428 56082415 33923349 -40135579 -91230433 -92232632 -75963594 -63264269
23097 -63264269 -36713622 5430417 22646367 -11165325 -58642831 -59992125 -6677945
23090 -6677945 51416752 64798133 35218803 13263766 48692830 131954983 189448130
23083 189448130 159720515 70096542 4218829 -5574833 -7256116 -39406336 -67597913
23076 -67597913 -45007408 8259187 34569269 19720858 -3310596 -13654773 -18823070
23069 -18823070 -20256072 -4854282 29033317 66606485 93134995 93106333 49540516 -26101680
23061 -26101680 -83358106 -90535242 -84817161 -118941671 -173263545 -177986049 -120205993
23054 -120205993 -66790926 -65869700 -81950851 -58440464 -1613872 34918018 24797473
23047 24797473 -5134055 -13104525 14190307 50913913 56502251 18878421 -27244184
23040 -27244184 -39538921 -19814656 -3602542 -3897597 2721522 32904659 73053606
23033 73053606 104539780 120928397 116250660 90966012 72758705 88414891 106447349
23026 106447349 59322720 -54133364 -139497471 -118100528 -27678759 32500966 26361672
23019 26361672 1743988 5891822 32370451 50962663 49223543 36034356 28384260
23012 28384260 39006607 62424839 77137890 73467075 67185607 70849898 68284411 38111575
23004 38111575 -11907136 -55067470 -76247270 -72938226 -44220679 -2565007 21243466
22997 21243466 11244890 -11707508 -24254754 -32761599 -41877233 -22959348 37764105
22990 37764105 83926801 45626122 -53574501 -110471440 -73403169 -663065 31169360
22983 31169360 19841449 6289353 1423138 -9657828 -22950630 -23302982 -19577080 -29705772
22975 -29705772 -41461794 -28097646 2354091 13591744 -608661 -3919783 23651563
22968 23651563 50302082 42302067 24287177 51552340 126763120 182750831 164549825
22961 164549825 101746533 71170507 100240195 140272248 136906810 93741184 51301367
22954 51301367 30602021 22655526 16733088 11061326 3199153 -5507016 -561109 27480790
22946 27480790 58945446 62868666 37938878 12566992 4486281 5912587 11924479 34010205
22938 34010205 70953280 89626163 58333063 -7670568 -52425790 -35978699 20594816
22931 20594816 54557370 32488800 -6391003 -1777030 32329685 7912238 -111146547
22924 -111146547 -227521717 -217872142 -101267212 -22194891 -58777854 -129333623 -123997951
22917 -123997951 -54189768 -9836742 -22604819 -49259630 -63312993 -82631972 -107056116
22910 -107056116 -98649945 -40979847 31845825 80670893 94823835 71764187 11502070
22903 11502070 -51302396 -58150989 518346 61709611 71003954 52657610 61979451
22896 61979451 99949720 122899936 116526355 106815240 103559807 86366998 54275490
22889 54275490 40152162 55803614 62498630 23377566 -43252120 -90363320 -99657807
22882 -99657807 -85297586 -59350647 -24089994 13177405 46468341 83657940 126066846
22875 126066846 146645311 121521060 76635349 64867946 94974215 121478022 112981005
22868 112981005 91432272 88051897 98189977 103982391 108937350 120506107 125349057
22861 125349057 113643466 104098425 110253651 104519737 57890863 -539536 -12324535
22854 -12324535 26408938 58568407 49729795 31132987 41331378 65324394 60956096
22847 60956096 20792553 -22585300 -42368970 -45424835 -56337839 -86519875 -120794382
22840 -120794382 -133708691 -121308519 -108761066 -115269300 -121400988 -90699422 -16995937
22833 -16995937 71393163 146717704 194290470 198773582 155506860 96718372 68051639
22826 68051639 71192203 65694802 34715159 6270777 -4780549 -27926856 -81792548
22819 -81792548 -130102010 -131645776 -103086134 -90030619 -96199711 -82143829 -24151781
22812 -24151781 57268913 119420436 127044714 78236275 22477771 25994602 89526811
22805 89526811 130925573 89172183 14340609 -956955 43417493 58951584 5763178
22798 5763178 -46894666 -21944947 61098564 121150245 117885762 79359791 47863412
22791 47863412 35665319 32897344 35841572 57744428 111424990 181809392 227384407
22784 227384407 221451840 180623661 135248262 87564943 27070555 -27804947 -44012358
22777 -44012358 -26084560 -12839229 -20295205 -29198903 -31863915 -42468471 -49841335 -14397384
22769 -14397384 62149781 113878916 93154310 33984207 -5745569 -23505622 -44594758
22762 -44594758 -53460749 -18064140 36645234 50227067 22014779 18039698 66681622
22755 66681622 107986582 79478425 6115529 -36925246 -21306588 17366613 41459887
22748 41459887 45770702 33508146 28962 -46081938 -75182937 -70866232 -56262323
22741 -56262323 -64709098 -90604066 -90944997 -40090705 33271961 74994783 62353188
22734 62353188 18559354 -25543492 -65734705 -111747672 -153805064 -160985935 -116234385
22727 -116234385 -41202101 22448315 53010964 63874345 81090800 113720837 148433454
22720 148433454 166154333 157136245 122887058 72675883 21464132 -14606620 -27188969
22713 -27188969 -21398381 -10957454 -5789172 -2492158 11383003 38645190 60004233
22706 60004233 52111767 20682871 -1772666 -1023680 -1455925 -20552338 -29148107 3061879
22698 3061879 40976665 20897540 -45775839 -70788641 -11672675 67220855 91260470
22691 91260470 69568973 41066919 -8996154 -98451152 -161151223 -113486422 4843976
22684 4843976 58037925 -6441659 -97210131 -119451116 -85108466 -44611703 3103048
22677 3103048 70215638 118498260 111189575 80112644 72088690 66037992 15000847 -56293181
22669 -56293181 -71697784 -14354266 47224922 45865683 -20568609 -108059361 -160689436
22662 -160689436 -132199519 -26755518 79645383 106699518 61225140 15708009 464930
22655 464930 -20900733 -59483863 -56746888 26907478 131334320 160136702 101131665
22648 101131665 33178282 19904551 40953517 38985323 3332301 -18488251 13258101
22641 13258101 75248952 106760979 83140021 39922565 16877759 5902381 -21029560
22634 -21029560 -53746020 -51839285 -5337186 49661756 80738403 92358822 99790636
22627 99790636 98627019 76663683 38073395 2083276 -11857295 6852843 51264202
22620 51264202 92762638 99704329 65590942 11397281 -35699257 -55546428 -39513364
22613 -39513364 -2464142 19937285 10220950 -3744419 13985904 56344091 91226763
22606 91226763 113103007 130906953 118314377 39493176 -70691790 -120422708 -80397357
22599 -80397357 -29497921 -44879839 -100124990 -119480812 -88068006 -50684055 -31455576
22592 -31455576 -16704761 -5796475 -23031409 -76280617 -143292644 -199428634 -226751153
22585 -226751153 -202810918 -120819004 -22942715 24635311 1463569 -47801970 -70857714
22578 -70857714 -60699308 -42905879 -32665651 -21581588 -541725 17450811 7413029
22571 7413029 -28340495 -43485785 2185023 76030177 94806097 30319401 -46865173
22564 -46865173 -58647953 -15916736 17543211 22480169 28988872 45876512 49268886
22557 49268886 36804342 33678640 42061614 40013394 34446165 55319211 86690170 68262436
22549 68262436 -9830089 -74044769 -63531530 -6675673 35472854 49869619 49867535 24143783
22541 24143783 -31591745 -70223740 -49606247 -8597634 -14958422 -52796795 -41992867
22534 -41992867 29253971 77567567 55885097 30383631 73725595 145504227 151909960
22527 151909960 87323520 34457371 31094819 17703462 -58626814 -153033312 -181648426
22520 -181648426 -133238978 -71361462 -42975472 -35386686 -23101244 -9179446 -2618798
22513 -2618798 8378608 32064488 44531253 16605751 -40629558 -85187262 -95511000
22506 -95511000 -87241207 -79064480 -68346724 -48745742 -29931851 -25153559 -31138786 -32196903
22498 -32196903 -17434599 12587682 48393929 75706913 85931914 87796002 99884771
22491 99884771 126040075 145124353 129366761 68787183 -18800291 -91522074 -104238518
22484 -104238518 -47993611 29025417 62597120 41581932 14863784 22586234 47395759
22477 47395759 49504418 24525828 2666671 7234716 35362379 65341680 65311023 14780072
22469 14780072 -59494223 -90004420 -39883905 49116056 108426328 121500074 116756108
22462 116756108 107982443 92741153 91367825 122452608 143553905 90046615 -12879477
22455 -12879477 -54856913 6236967 68261198 21644959 -96194926 -160209164 -132955817
22448 -132955817 -91012498 -88893616 -91126118 -60008169 -27886492 -34726842 -51748368
22441 -51748368 -26457189 28175223 49018601 17131298 -16753283 -9478117 14397577
22434 14397577 3863023 -40581662 -60444939 -10218557 85568059 156947203 161581277
22427 161581277 120168516 80850604 65915710 64063360 61058257 56000071 47282818
22420 47282818 22142892 -29209945 -96124130 -150417198 -164742827 -130390005 -65398239
22413 -65398239 -5886047 19382040 11431459 -1579880 11724374 61471538 124653062
22406 124653062 155587606 124811060 56064565 6320883 -2323555 -5466230 -30930906
22399 -30930906 -43660051 1983669 79151381 115399385 95138818 72524812 76108631
22392 76108631 68327157 23829821 -18055151 -20829420 -13760308 -34267136 -56130439
22385 -56130439 -39938061 -17230922 -47022242 -107501733 -113509254 -44640833 21594063
22378 21594063 23831658 -5484598 -10193571 584938 -17149076 -58760639 -69845910
22371 -69845910 -18954982 62731369 112316947 89100282 6906313 -73938892 -97682474
22364 -97682474 -65639844 -25395972 -6282942 8554298 38072546 65434651 66959318
22357 66959318 51997806 45620224 50595660 53961926 54201331 52080669 29339586 -27882437
22349 -27882437 -90260972 -106528488 -69283852 -30548806 -40572730 -91754419 -134766899
22342 -134766899 -135068651 -101922509 -71117129 -68178869 -83006510 -76727214 -21782487
22335 -21782487 59937132 108654827 86612178 21426262 -22541504 -15416693 11079593
22328 11079593 15393509 6877150 29201634 87977325 130398307 113412030 62194481
22321 62194481 30830098 26209353 11367183 -24120257 -42600335 -15145399 38213874
22314 38213874 79586779 92936177 76819322 28099131 -44163976 -109571827 -141457737
22307 -141457737 -136859310 -103121797 -49623835 -3543282 596229 -29107008 -33451954
22300 -33451954 24514845 101400739 123008752 74217624 5711461 -32780377 -28386960
22293 -28386960 14163500 84173734 153309459 186382777 174805719 140089346 101048142
22286 101048142 55487339 -4359481 -73645622 -131391677 -144997197 -90362907 12550958
22279 12550958 94315247 92710580 16286135 -65179441 -92050732 -64210172 -26530567
22272 -26530567 -20820410 -48044152 -68203668 -44363108 10871103 50870142 58715501
22265 58715501 63440560 83045885 94376142 83830428 81231913 103859413 111447806
22258 111447806 69682154 19486472 18815030 46075338 35375045 -11624548 -29868137
22251 -29868137 -1012552 23299178 16529179 16382829 49123145 86120985 100617172
22244 100617172 102658769 92388739 44326518 -30834462 -72344278 -54691512 -29951822
22237 -29951822 -47108579 -83325547 -94477166 -80741880 -60557621 -31599998 -1445567
22230 -1445567 -5134368 -45103466 -64824291 -32089402 4028006 -6161443 -31868257
22223 -31868257 -28094879 -27980163 -84296280 -157972610 -158171098 -75669761 9222057 41857832
22215 41857832 36467448 13679453 -20637665 -34644273 5472438 60620763 51182070
22208 51182070 -18265281 -51207358 -6695919 29108059 -29264929 -135105622 -172589293
22201 -172589293 -109521127 -20954896 19693752 13858780 2570563 2978238 -3316062
22194 -3316062 -35481870 -80837014 -102934485 -85032294 -52602243 -37056619 -32962101
22187 -32962101 -18879906 -4897956 -18034452 -47904615 -55812471 -39966437 -39331695
22180 -39331695 -61240908 -59691402 -10254900 41716440 41236664 -4377865 -46050392
22173 -46050392 -55613700 -38888977 -13736144 -2592538 -21786072 -54761579 -63008536
22166 -63008536 -43977563 -42789509 -80056963 -108915177 -83258467 -32341107 -17526831
22159 -17526831 -40763251 -50904536 -26735411 1887136 13230372 21999466 39445777
22152 39445777 47337110 27095416 -13739954 -55215265 -82121773 -81324505 -45606998
22145 -45606998 11681242 64514937 102129492 132541472 156452040 156964613 120811485
22138 120811485 56129724 -12504983 -55249857 -49996049 -5494368 30540521 11190029
22131 11190029 -55452938 -110613459 -109819398 -67397713 -30493902 -25701570 -41549794
22124 -41549794 -51895945 -44311305 -27358072 -14822181 -5373313 14997813 47181375
22117 47181375 69230767 64460876 44902050 27390770 1129757 -50044391 -101459563
22110 -101459563 -106233610 -69140018 -58967722 -119465810 -199790118 -212604639 -144862411
22103 -144862411 -68650027 -45158893 -60989577 -70925135 -62750292 -50084545 -28792329
22096 -28792329 17928782 78231308 114395925 112941837 98999293 88911655 61807220
22089 61807220 1920588 -58913109 -76165594 -54420113 -36559597 -38070002 -32490924
22082 -32490924 -5234798 19605249 21148540 13894731 14722804 8129843 -24827472 -63659177
22074 -63659177 -68430291 -32728103 13586079 48294446 71887926 78470828 46616278
22067 46616278 -22649439 -80986242 -74547663 -11444934 33675227 -2130165 -94631416
22060 -94631416 -155915598 -137487659 -84318673 -65852454 -79077622 -63592314 -3955922
22053 -3955922 40103058 23392568 -16595918 -18257615 15782987 35934999 26896228
22046 26896228 19565123 30182700 37015278 22858532 1532564 -7246152 940072 25333172
22038 25333172 61515786 85440850 65633852 3964880 -58508871 -87079434 -85872512
22031 -85872512 -79899140 -87614350 -116315794 -157092716 -174381746 -130453853 -38566214
22024 -38566214 34077336 39819164 7356739 361692 35740893 73001548 77743932
22017 77743932 64356777 68914260 100463352 130601475 123246597 69490308 -2419853
22010 -2419853 -51746919 -65561064 -71416165 -100193476 -139163841 -139346028 -77867231 2211104
22002 2211104 33945041 4184186 -34661319 -37903325 -27003026 -49247191 -97663467
21995 -97663467 -114024347 -75297074 -32792430 -41354511 -84588331 -105942415 -89431051
21988 -89431051 -66306196 -54773578 -41173488 -22016589 -18214704 -33985069 -40697546
21981 -40697546 -21251218 2188440 7386164 9306782 29447546 51506581 43217198
21974 43217198 11290416 -624632 29939620 75432067 93847277 73155883 32735627
21967 32735627 -3225570 -22433975 -23919646 -13440060 18942 8777486 9343525 -479098
21959 -479098 -25537537 -67166506 -107883122 -111542444 -58736875 14205524 35952439
21952 35952439 -20779402 -99281257 -125557753 -100713315 -87946840 -112090694 -123484653
21945 -123484653 -80843933 -22392261 -13395276 -52204428 -77802217 -60040163 -33156381
21938 -33156381 -34165131 -51489317 -53033184 -31773096 1105883 42259523 83637884
21931 83637884 90971016 35470218 -51199472 -92036468 -53876703 5112948 3522047
21924 3522047 -64560000 -129377600 -134164929 -87123579 -24514893 35360733 83795111
21917 83795111 105598375 101804228 100376256 111383314 98713739 38116036 -22162424
21910 -22162424 -16934543 30830268 28619356 -52730341 -133434256 -140251580 -104000587
21903 -104000587 -95940944 -120131501 -130807850 -121122360 -124523302 -143486087 -145618992
21896 -145618992 -129338676 -126952049 -131820852 -89097566 12059653 94929684 88857669
21889 88857669 25802388 -7220376 15479773 45362908 49233032 49086129 63086136
21882 63086136 63916890 27289886 -17561952 -26518882 -6937050 -2264258 -20140217 -21487288
21874 -21487288 12484714 44242632 31718134 -13899704 -47872486 -48463916 -27198589
21867 -27198589 992374 27456932 37457516 17052071 -27991651 -80203622 -131640068
21860 -131640068 -176362055 -192898432 -164729500 -113155501 -77618361 -65238323 -52097197
21853 -52097197 -30237134 -12773886 6947675 51015514 101692062 104892291 51779891
21846 51779891 3897401 4435665 17190505 -2131330 -26306348 -10790661 13803530
21839 13803530 -18195923 -94849521 -136275859 -116957306 -98597318 -123512667 -149419648
21832 -149419648 -125616323 -73387161 -43800948 -39028121 -25607604 3279409 29256171
21825 29256171 56300979 107426626 173947745 209230044 186788531 139826652 124921667
21818 124921667 154477341 180278138 151150389 81685803 44463221 79855534 132152073
21811 132152073 108946066 226753 -102045246 -114855914 -56823091 -8061635 -11167772
21804 -11167772 -44259387 -68210339 -63202923 -30297236 9305198 21758997 -4711064
21797 -4711064 -37860185 -39766495 -19221638 -16249283 -40162738 -57461133 -43128665
21790 -43128665 -9894667 22012686 52872582 86798227 112478905 118055868 108606429
21783 108606429 96511551 88860646 90164324 97922634 91563828 53421801 7941178
21776 7941178 3386833 37306848 43294665 -13949598 -72441438 -55758217 7900808
21769 7900808 19329654 -48337808 -115456747 -115883458 -74532949 -33167117 26933101
21762 26933101 128154325 216566251 216158889 140008089 75287983 63339767 59689415
21755 59689415 18070335 -45475531 -87134461 -84750873 -37798790 35727689 86060478
21748 86060478 63396121 -11998890 -54052432 -14732785 54140495 74883096 43304711
21741 43304711 13545284 11448990 10815738 -13297551 -47795299 -62341328 -46201935
21734 -46201935 -22429794 -28846841 -71305824 -98138149 -54620737 31892338 69858561
21727 69858561 27011612 -21068495 -6274297 26331804 -6490126 -89719177 -131593366
21720 -131593366 -101287548 -60313080 -57365072 -71474183 -72690739 -67441408 -61285118
21713 -61285118 -38294671 -1895233 18897615 26246302 59611864 119022266 141709966
21706 141709966 93122039 28331996 17209504 51654181 75205527 68201633 51111259
21699 51111259 29895744 -6770332 -46703527 -57328742 -28934730 16256179 54024405
21692 54024405 72499400 64358016 28154999 -26430517 -86688657 -139629103 -163229518
21685 -163229518 -141284841 -95408375 -66988226 -52926121 -3949054 86462191 141235034
21678 141235034 94360841 -11209465 -73778854 -55177175 -1231650 36509977 42994746
21671 42994746 19780048 -17647382 -27521399 19594959 89481210 116699320 84460443
21664 84460443 28307067 -28474360 -87652347 -130234104 -121765248 -71993116 -31233101
21657 -31233101 -15711138 5634513 35807557 25954260 -43293185 -114915407 -131040016
21650 -131040016 -109712187 -102924696 -115719760 -114033669 -86955929 -55996977 -37625181
21643 -37625181 -33016876 -42213238 -58155205 -60322708 -41215833 -23246369 -23566581 -22388529
21635 -22388529 2736054 30877456 23710185 -15064451 -45204435 -48556383 -43243046
21628 -43243046 -38446728 -12738297 50601012 132410245 194185918 210856793 183823746
21621 183823746 138596044 111988742 122929999 149641509 149442208 105607273 43864687
21614 43864687 2553564 -408481 28061211 67526099 95207343 99225866 86559466
21607 86559466 70439488 50673614 17885850 -23275503 -49689700 -43002315 -7599547
21600 -7599547 36619673 69662884 79406546 67081687 48585661 39579123 36131829 21577030
21592 21577030 -4007572 -15685695 5220480 42385561 59471987 39484865 -783191
21585 -783191 -32047119 -37828654 -20459603 5335169 20793735 16107850 4369223 15298507
21577 15298507 61020287 109107195 107798636 48769451 -9329573 -651455 67555833
21570 67555833 117301302 90591987 18316576 -18841870 13332856 68367978 81091995
21563 81091995 41387564 -6464221 -23509499 -13015768 3109074 21169965 48184365
21556 48184365 67183292 42347199 -26703517 -80949742 -63385957 4503358 42927062
21549 42927062 14754372 -30040236 -29058975 6997052 18054371 -16389596 -55845875
21542 -55845875 -64274244 -53916115 -49548705 -44482375 -19188702 17564089 36673193
21535 36673193 29696709 15939897 11477678 14858849 23571904 39051385 48511006 27304519
21527 27304519 -24778062 -69393095 -72203779 -44731326 -20449090 -2330182 32864030
21520 32864030 80375574 95493345 50854175 -22782605 -74682593 -93475232 -105946786
21513 -105946786 -131630215 -163044316 -182363515 -175533753 -136742382 -80051750 -39307979
21506 -39307979 -32883375 -33617529 967157 70705767 129873345 140588763 103579728
21499 103579728 39436958 -27011725 -61689581 -41455725 5244760 14420974 -34591416
21492 -34591416 -88821242 -96031887 -75977278 -80792458 -112320989 -127345401 -111265260
21485 -111265260 -93816075 -89743310 -74783135 -37453706 -11536940 -27965312 -63974711
21478 -63974711 -73556163 -51070449 -30493621 -29062509 -27025966 -8695634 8328033
21471 8328033 3277536 -11169350 -10424353 -5788561 -35237417 -98117811 -133060018 -89273120
21463 -89273120 357949 55173959 50033188 40660835 76477933 130878274 145899578
21456 145899578 113112780 71098833 43810225 27809590 32948845 83909140 167984054
21449 167984054 223420340 205052989 134808676 64618977 14652592 -24321945 -50768810
21442 -50768810 -54081949 -47533642 -58034639 -77555318 -62883744 -1647580 52743547
21435 52743547 40912249 -26681703 -86593080 -106866820 -118751649 -157833670 -205410733
21428 -205410733 -208422310 -141282266 -31184026 66537589 105906535 79117749 26524408
21421 26524408 5857339 31473619 54628103 25491162 -37375663 -68613719 -39653748
21414 -39653748 14651023 53651039 75720019 92633326 96082575 74371126 36887997
21407 36887997 -2945993 -48726782 -101125399 -136798432 -135049267 -110366867 -90336634
21400 -90336634 -75068073 -49734810 -24675558 -22840944 -29126211 3873455 84423325
21393 84423325 151448555 142488805 71738830 12567531 11101444 44259070 65874608
21386 65874608 69041208 83507045 120949535 148597173 128076191 64746404 1064532
21379 1064532 -30345513 -28429590 -8598280 5580357 -20032621 -101906983 -197257389
21372 -197257389 -227862202 -166134728 -66122475 11231698 64969640 115767704 144669684
21365 144669684 123882221 81372017 73710729 105974152 136106572 150386815 170149177
21358 170149177 182843980 139787917 45086628 -19893805 -232515 54897754 61543433
21351 61543433 9112733 -43917728 -50960635 -10844702 53939012 108792636 115935397
21344 115935397 73883812 33838152 38332067 59432829 40710658 -12990506 -39366260
21337 -39366260 -12104808 20642956 6302416 -43929438 -78917965 -71759442 -38230867
21330 -38230867 -9530695 -5478197 -23596593 -41646207 -38745428 -19485068 -5507830
21323 -5507830 -229076 19211598 64356137 107406571 109167876 67212938 19332498
21316 19332498 1050216 13481494 33090735 37711194 16118169 -32723301 -90124195
21309 -90124195 -111864433 -60465473 40530264 106168543 74238596 -17709795 -72293591
21302 -72293591 -49319888 -5461588 -7727183 -51046291 -89023662 -105364821 -107998731
21295 -107998731 -79837141 2946022 105901092 148791557 102000636 26361208 -8052655
21288 -8052655 -6765086 -22590937 -68798698 -100884745 -79729563 -20837861 26916663
21281 26916663 34691107 18056850 14935672 43963647 85854663 108287197 104652154
21274 104652154 96960538 102233300 113541832 118632196 116834738 105103989 66961559
21267 66961559 -1962724 -67213865 -80436135 -34917341 21170630 35124294 4329632
21260 4329632 -26366544 -17646357 20725992 42410798 18593677 -29284087 -58466989
21253 -58466989 -57290765 -50415366 -55455841 -61694101 -59814440 -62453795 -74222628 -69211236
21245 -69211236 -31895304 276943 -20045125 -72449174 -85899364 -42206066 -9470704
21238 -9470704 -44003466 -103622647 -103978454 -33968723 37498858 61430044 63475398 88531480
21230 88531480 132408299 152188752 121804801 56781193 -3936982 -27254032 -6867024
21223 -6867024 34505738 68069932 83859329 84702609 65982089 25745937 -10292703
21216 -10292703 -8966106 18228628 19536133 -24497984 -67945758 -61924574 -16467424
21209 -16467424 28813833 61541589 84992894 81353582 39248105 -855306 13017485
21202 13017485 63688440 80695959 39376943 -11407888 -29640284 -31622278 -44490987
21195 -44490987 -61229584 -70208799 -81652368 -94501251 -82694352 -47179937 -33252269
21188 -33252269 -55287936 -54778043 10732715 82175417 74924365 10108815 -12994421
21181 -12994421 34486326 76052941 53480121 2920381 -21849285 -28934400 -44832595
21174 -44832595 -49045752 -9952787 49420625 77297988 65327817 47759785 42843316
21167 42843316 38716578 27546527 11215624 -21562620 -81821736 -143830362 -162632147
21160 -162632147 -134511338 -102937274 -95441535 -93193567 -78999607 -74432741 -97839467
21153 -97839467 -117712432 -91906619 -37613548 -14342694 -36471021 -50181650 -15703352
21146 -15703352 28554404 19977067 -34640046 -65228534 -35861616 7324077 2564369
21139 2564369 -44208120 -69804602 -32691566 44611675 106990973 118894494 86247680
21132 86247680 46138784 37472247 65389718 91401714 74395052 23641284 -10558196
21125 -10558196 -7886306 -12476330 -69388969 -144833668 -153955728 -76222708 -1072348
21118 -1072348 -25791056 -131982554 -207490909 -185349861 -111049921 -56939722 -22407617
21111 -22407617 34406150 99180854 105952230 45016479 2518297 55135301 163833948
21104 163833948 219342852 177425901 102876099 76742742 100800628 116166340 93690611
21097 93690611 72573157 102703564 169838177 203752939 164044648 91413485 50281087
21090 50281087 40089055 5770028 -65559156 -110918606 -78369058 -2959829 44934977
21083 44934977 55467668 72801006 110065138 128075939 102386572 61590353 42440285
21076 42440285 44532688 48822591 50621320 52184567 45234767 23312959 -2641542 -18271500
21068 -18271500 -23787618 -24770871 -17319890 3831468 31872682 54590801 67135726 70074844
21060 70074844 64482137 57407696 61014618 74599911 76723425 50144022 10862387 -3686967
21052 -3686967 19414159 45573759 28550898 -31670368 -82525474 -80451900 -43272645
21045 -43272645 -17984947 -7777082 28673551 99393166 148116723 128490454 67807983
21038 67807983 16236297 -30240958 -98852249 -157408710 -136742543 -39439370 40775629
21031 40775629 30296685 -43729205 -105743849 -118838924 -93321379 -49047782 -2665728
21024 -2665728 32354630 57583781 82981318 98279583 79486714 32861162 -3141497
21017 -3141497 -10897248 -8821531 -3000784 25530082 65572854 65987375 15785850 -21642714
21009 -21642714 1272257 45641695 59331431 66205748 109918239 152550468 119282927
21002 119282927 24712268 -36045548 -21857045 13514223 24631109 33573801 59594777
20995 59594777 69447275 43611729 27861655 61152438 97966632 67147078 -16029879
20988 -16029879 -60563314 -21039678 44698739 54572410 2809729 -43133094 -29026910
20981 -29026910 29017275 75196125 80986829 64685499 53108206 50310473 51181898 58702220
20973 58702220 67179515 50895598 -311639 -48271220 -43792514 8167837 52960762
20966 52960762 54455795 27700223 3568820 -6161038 -3717768 3463200 -965339 -27155848
20958 -27155848 -55295889 -55796040 -35420147 -26755540 -26163080 10178502 85961069 127729981
20950 127729981 71677124 -40929878 -104258200 -74629316 -12924474 2094852 -35731082
20943 -35731082 -70998485 -61242177 -17766150 17639391 16901627 -15281961 -54486263
20936 -54486263 -79969342 -86065671 -76326152 -52168635 -11795009 37359216 71024219
20929 71024219 68312259 45875952 51794821 102801255 144120338 110428114 21521250
20922 21521250 -33334938 -17351435 4913305 -29226884 -87439291 -105668363 -93618579
20915 -93618579 -101625931 -114337852 -67995726 30237775 89648967 62667009 8160701
20908 8160701 -2706544 21546859 32711296 18844035 -3573515 -29560468 -53589894
20901 -53589894 -51076066 -12612830 28468071 35703003 13989112 -9630840 -21951827
20894 -21951827 -19103043 811179 19203521 8791111 -15759836 -6571497 33159952
20887 33159952 34828946 -23586600 -58846514 -3943959 70317960 47427527 -56180714
20880 -56180714 -108216280 -49425696 36899973 63294743 53688408 77787115 139523353
20873 139523353 185442682 182901530 142190977 85886603 34276627 6053438 6018534
20866 6018534 21221711 41317591 66193449 86976160 86377084 69643076 65208261 76609293
20858 76609293 63986523 733730 -74238845 -93860808 -42980078 27676439 66149845
20851 66149845 74390411 93149168 146813147 213302459 245789022 217551308 141258542
20844 141258542 48220299 -37393498 -98320996 -117775094 -95165595 -59607464 -43676781
20837 -43676781 -45848339 -40805101 -23152856 -12069943 -10192584 8064329 51743585
20830 51743585 86819566 81344280 58491195 71394490 127947659 171744171 150505806
20823 150505806 83199713 37638368 48429252 82677939 94745206 89391862 103749466
20816 103749466 139009532 147835482 98756203 22884341 -22070825 -15609691 12647691
20809 12647691 17262839 -26180607 -97535221 -136133319 -97113289 -16584435 16976869
20802 16976869 -21645348 -52972192 -6019263 73366050 88345638 32133859 -12677028
20795 -12677028 -2594822 20585757 20511646 24241604 58996147 94688958 92033554 64010899
20787 64010899 48047625 47726731 38881640 12457886 -17570095 -33126286 -21603140
20780 -21603140 13270688 39602776 26193108 -4362069 10631535 85856877 152684421
20773 152684421 142538733 71207861 5096182 -24817136 -33939435 -36125628 -35270105
20766 -35270105 -51816880 -106325831 -173548002 -194661960 -146760546 -70689193 -18649683
20759 -18649683 1956926 19492434 51498229 84854293 96781011 81515334 51543486
20752 51543486 18619849 -16366587 -53105029 -84581313 -108834749 -132653141 -147297390
20745 -147297390 -119123573 -34720932 56347557 83227888 38658949 -14404970 -23577326
20738 -23577326 4482245 41758764 80352004 118714920 143407803 144500274 122890352
20731 122890352 76597786 14444161 -18956400 14145295 71305488 66360241 -1901389
20724 -1901389 -33531613 24643020 96160324 96903887 61030849 65078537 93496149 80455037
20716 80455037 40755097 48444303 104472778 133119743 108562691 83677573 81942832
20709 81942832 57114392 -14204230 -83926697 -107773505 -98365044 -76427876 -39551161
20702 -39551161 -8308728 -31088073 -103746972 -148091958 -112290715 -37654304 10964252
20695 10964252 22846088 11124260 -31065814 -92566803 -119089631 -84006971 -36597741
20688 -36597741 -23877945 -14988270 31066615 71584325 37744241 -43879799 -75984015
20681 -75984015 -28187899 31511881 47453211 44428615 68645212 121274389 171128562
20674 171128562 186435131 141817739 42693141 -45149854 -44620416 31940339 81998756
20667 81998756 41965714 -30733581 -43098340 8906944 53854024 55330246 46143045
20660 46143045 54469907 56120805 25254754 -9121667 963034 45027353 56542433
20653 56542433 3859731 -54989359 -38757990 50495199 124471016 115210827 48390223
20646 48390223 -6244217 -23141114 -26856463 -32879038 -26584846 1445777 37296512
20639 37296512 68289835 96235223 117469686 116068964 87858713 48139620 5223415
20632 5223415 -48548304 -104160863 -120247991 -66905456 28459180 106298649 141706520
20625 141706520 162112840 196453863 228870982 216382087 144633722 53843122 5215130
20618 5215130 22303137 68095341 83571511 48287532 -2261092 -18792607 11483245
20611 11483245 60401101 93994673 100464602 87104044 64553458 42089023 31273833
20604 31273833 40956773 63527852 74274026 55520327 20119372 -1340528 619721
20597 619721 3084863 -12853601 -30391449 -20113603 15881518 47412081 60477369
20590 60477369 70733806 87876637 93968538 70715799 25816801 -23924586 -74107408
20583 -74107408 -116988451 -126104478 -86764618 -28377085 6400907 16648398 32642600
20576 32642600 56675531 58406968 33925285 20303187 32081627 32167743 -536456 -21596667
20568 -21596667 9394062 48096363 25040375 -33532050 -29932608 50546265 98109304
20561 98109304 34335587 -65450061 -76135392 8066 46030898 2168169 -64143126
20554 -64143126 -75244154 -52511522 -64208833 -113738562 -136790172 -94166314 -20286664
20547 -20286664 25687536 25585584 3989478 -19336703 -55900257 -120809375 -194321801
20540 -194321801 -234651274 -229733189 -207573831 -182834367 -129707334 -41901807 14524265
20533 14524265 -30509827 -138745470 -187560065 -121863844 -19952474 22468493 14544445
20526 14544445 25720047 64683560 72233251 19293792 -52903183 -94741622 -97400962
20519 -97400962 -68687023 -8679182 65226475 106127035 86831100 44582505 42456061
20512 42456061 87930846 118712566 80211487 -3647265 -58121030 -46609003 -2656950
20505 -2656950 30898197 56122542 83873868 78678950 116602 -107978654 -140950691
20498 -140950691 -70047320 7748338 405719 -53450839 -53015074 9324330 41731243
20491 41731243 -7607961 -84177744 -115335722 -98020925 -69358763 -43765016 -19738678
20484 -19738678 -13564724 -42883313 -91420507 -120769288 -109718395 -65382416 -10737928
20477 -10737928 21013439 -1817335 -76347203 -150862102 -167615698 -121688970 -62448339
20470 -62448339 -34924029 -32888061 -17926107 21506631 46655055 17358897 -45321371
20463 -45321371 -75013761 -46063106 -8545449 -13016217 -36565219 -27795310 3976365
20456 3976365 7382057 -15999536 -9769928 35175429 53143400 8976562 -38919741
20449 -38919741 -28501004 12299074 22630003 13099443 41518197 111682733 168984654
20442 168984654 185504597 181259172 163161285 110891358 34949609 -12236989 -5407067
20435 -5407067 20800052 28663828 22458853 14069027 -12098929 -66284890 -117356529 -124317384
20427 -124317384 -84950876 -28985173 16293046 32141390 6350262 -45715927 -79138177
20420 -79138177 -69448225 -47589643 -54230638 -77064367 -72004394 -35942785 -14413613
20413 -14413613 -34556316 -70910122 -89047997 -88246664 -83334221 -72824681 -47438311
20406 -47438311 -10772666 28648148 69069492 99755780 92037365 33777238 -37560228
20399 -37560228 -66502776 -43612769 -12272011 -10078003 -29890135 -44804542 -42760778
20392 -42760778 -20582686 30654808 108103266 179266115 209425919 202815860 193637692
20385 193637692 198562892 201454625 185922958 157229202 122980205 75532634 11621615
20378 11621615 -44130118 -56253203 -19137177 30478330 45748210 14275484 -29326328
20371 -29326328 -41732235 -27746407 -44714750 -128297104 -225148128 -240183244 -159182977
20364 -159182977 -79471613 -89681874 -158061003 -186177286 -144754729 -92745153 -69931875
20357 -69931875 -46052552 -380937 18255182 -33125756 -101184629 -93489093 -12369227
20350 -12369227 40804672 6664965 -52904125 -50602682 4925670 38010864 24197108
20343 24197108 13672641 41506398 77902640 84458602 65885489 36219326 -18553517
20336 -18553517 -98793224 -147700401 -109128978 -16511517 33750607 737050 -60297678
20329 -60297678 -84207324 -70544175 -52235106 -40288968 -33085566 -40038516 -56250322
20322 -56250322 -45967074 5211076 47785406 26065067 -40135716 -82543875 -81158611
20315 -81158611 -77529869 -92589517 -92359019 -53920351 -13197583 -14682111 -48696260 -71807867
20307 -71807867 -66579233 -50653716 -40289458 -30304019 -5588530 39337441 85466360
20300 85466360 94613322 50751999 -3497504 -4983782 46217893 81090197 59357360
20293 59357360 27056478 38705433 65450486 42136774 -17560519 -27032819 46404170
20286 46404170 127801223 134971440 79770926 29659670 7830450 -15199288 -46589390
20279 -46589390 -44963998 15456119 91228733 109285256 49172063 -37050107 -87260132
20272 -87260132 -92905956 -90157599 -100920287 -105567768 -79972539 -40692410 -32949485 -74546724
20264 -74546724 -126586665 -128348186 -60525448 27993245 61048394 11493091 -64463405
20257 -64463405 -82880522 -24170968 49599923 75935921 62288425 54374881 63380585
20250 63380585 64964763 55862309 62817730 92361808 116451832 120176186 122813690 133313701
20242 133313701 124173293 76317176 16775885 -19282628 -35839299 -52137295 -58582881
20235 -58582881 -37891511 -11424147 -18583780 -57246595 -86519697 -86174114 -74355930
20228 -74355930 -67070777 -58707589 -44068899 -22114234 21282312 90623187 140324057
20221 140324057 111821397 24522545 -28836071 -5767709 24007442 -16997402 -99019837
20214 -99019837 -133642171 -101042915 -60394356 -50654746 -48864046 -25794040 17218307
20207 17218307 72301894 130599851 156029130 110499456 22058805 -26096219 1963096
20200 1963096 53786100 75892354 86860766 121572856 153558139 133716302 75765190
20193 75765190 39070392 41321605 51125744 62818004 110903786 192770460 236388471
20186 236388471 183043888 67848865 -19317053 -33708908 -4730050 21477577 33716086
20179 33716086 46967187 67278890 80490235 70763659 41566322 14009998 3746847
20172 3746847 4500495 495762 -9284113 -10318288 4130333 20426019 19283859 -3749086
20164 -3749086 -33482324 -44309766 -18351800 31971021 60936302 28869671 -47193935
20157 -47193935 -98990220 -78074160 -11965947 26003341 -1888841 -62097917 -95265415
20150 -95265415 -80205300 -42462965 -9801479 21188343 67042781 119529199 144730341
20143 144730341 121827430 66939490 10489243 -34351916 -66741368 -76008638 -50361483
20136 -50361483 -6665380 16046299 6309808 4755618 57574001 151001595 213488758
20129 213488758 191101452 108891309 44180175 42264608 74981374 89105617 76665879
20122 76665879 73516771 96429835 116330031 104594928 74193915 51445258 31314451
20115 31314451 -8404968 -64331272 -111455003 -138745425 -147830449 -128154314 -75541797
20108 -75541797 -29520358 -40044234 -87938532 -91905311 -19035731 60282838 64330880
20101 64330880 6155496 -38927343 -41203902 -35352088 -45656691 -53001467 -43546924 -38775152
20093 -38775152 -55693914 -73207166 -62101434 -23749904 21935264 64876535 97480966
20086 97480966 97367299 48532554 -23907424 -66440052 -50727660 808605 46226618
20079 46226618 65484699 65205863 59579270 61898540 84569690 125538055 153021375 124654289
20071 124654289 35724128 -61405698 -100737936 -65211307 -79599 32230006 6761595
20064 6761595 -44661941 -60168806 -4379281 89426371 143303605 115072040 45040143
20057 45040143 7126729 27293684 72765830 105746316 111160506 77608837 -3803868
20050 -3803868 -108806881 -182795081 -191697847 -147612953 -79058176 -8675159 32498456
20043 32498456 12870708 -53465266 -104122077 -99310483 -65386012 -44869424 -40420384
20036 -40420384 -38802563 -49868023 -78610883 -93193392 -71031074 -47988471 -66583453
20029 -66583453 -100146858 -91973752 -52363467 -43557781 -71216257 -68952648 -7554823
20022 -7554823 52683205 51006823 7853059 -21968144 -28478135 -34041779 -40008599 -34543026
20014 -34543026 -29297565 -42358630 -58167549 -43611931 3681900 54881024 89924136
20007 89924136 108594195 109175888 87457132 56498830 39625728 38688061 30440839 1197060
19999 1197060 -31053002 -37840842 -14268578 16735204 32558642 37451880 54304742
19992 54304742 87587838 105799321 76405427 13360940 -31874724 -30586242 -7599770
19985 -7599770 -3989276 -29237522 -63617271 -90122248 -104146842 -100356234 -70624613
19978 -70624613 -18809556 31128725 47154689 13631197 -50641771 -101567028 -105509778
19971 -105509778 -66131496 -13117964 25067595 28603785 -14280601 -90325858 -154497919
19964 -154497919 -168985239 -143905331 -113180047 -81966032 -36644422 1511623 -13422455
19957 -13422455 -77058324 -120913505 -97562471 -37623723 5217752 26090795 50836298
19950 50836298 78877401 86612515 71494836 57733931 66031503 99186369 144371272
19943 144371272 172593876 156295991 107080754 73220250 78262784 87266921 58947745
19936 58947745 4978074 -32871785 -40698978 -33940909 -21676393 -6171300 -3137406
19929 -3137406 -25217802 -52542758 -52238838 -25622270 -12337425 -47076368 -121710395
19922 -121710395 -182445017 -166399840 -68059372 30573897 39458578 -21991861 -44295584
19915 -44295584 15727476 71244198 42175795 -22255676 -32037711 -1138813 -6010068
19908 -6010068 -44588098 -48172854 -13796859 -10124864 -48309089 -56930982 -7783550 33480201
19900 33480201 17513054 -16458208 -21747849 -19646818 -43770953 -74151019 -79209687
19893 -79209687 -71604521 -73816312 -71184944 -41254167 8204388 62888801 121244518
19886 121244518 161425340 139899630 59295481 -11497861 -24227609 -10950358 -17461844
19879 -17461844 -28579911 -9362776 24452617 32500481 12411341 -13175535 -40642399
19872 -40642399 -70865786 -84040645 -74449841 -75284756 -101712717 -106782510 -47361278 40703392
19864 40703392 90082494 93659360 91533331 97167165 97751556 99806414 108708574 87091393
19856 87091393 3470062 -95151160 -128789154 -89494129 -34553822 7281614 46960380
19849 46960380 67943160 38715233 -4004009 23474396 124901536 200098134 178922242
19842 178922242 106580096 60348284 50909989 51555129 63876027 97380725 124921890
19835 124921890 112598634 70023028 31309088 8323123 -6351424 -15240530 -23376137
19828 -23376137 -43459416 -66871187 -58636296 -10055259 33723714 31506139 3834579
19821 3834579 -1982980 21273346 48044534 71967749 104492998 131535169 116878895
19814 116878895 53318389 -21769147 -67244906 -70967578 -41735743 4316760 42433281
19807 42433281 47786329 19716018 -13770267 -26628594 -23329276 -26981945 -42472640
19800 -42472640 -45620858 -17663617 20229483 27753635 995094 -20110448 -12847826
19793 -12847826 -10275865 -49733103 -107005007 -123819391 -89600264 -50364655 -37887520
19786 -37887520 -37051827 -31540356 -35454417 -60005831 -86097437 -92307349 -81075067 -59300348
19778 -59300348 -23186826 18270510 35435455 18915279 4726527 32701994 93461979
19771 93461979 134121401 106898383 9324406 -103043400 -145316880 -79222657 32712480
19764 32712480 84758136 47259985 -12327945 -33637665 -31626088 -38501706 -39757773
19757 -39757773 -12596468 21603820 35912703 50215592 89988306 124744774 107070231
19750 107070231 51675019 17127823 21925430 33565456 32429997 32592628 39904420 37252059
19742 37252059 16789722 -8003133 -22091345 -14016359 25376921 78997885 100139087
19735 100139087 70969369 37271736 37525281 31096882 -34602975 -112361203 -100856904
19728 -100856904 213976 75547979 55598424 2389295 -4860196 14455573 1569921
19721 1569921 -33413553 -38588112 -15780515 -13601571 -42888290 -65867770 -65764815 -69107412
19713 -69107412 -90696580 -103371794 -80310275 -36276803 -6517702 -295560 7361028
19706 7361028 39585665 82566341 95724082 62343224 17942834 7806302 24086686
19699 24086686 18548413 -19166485 -38393735 -4193223 40790389 28603086 -42624252
19692 -42624252 -109986919 -128637677 -115135203 -107183708 -112435934 -108156885 -73110387
19685 -73110387 -9122262 62273730 120788343 163982525 194918072 195281591 135248231
19678 135248231 23845923 -75680577 -108493398 -90882578 -80592481 -97356233 -111641847
19671 -111641847 -108911902 -116668579 -148180053 -161096714 -112786472 -36685686 -14984657
19664 -14984657 -70001487 -124668629 -95647267 1883131 76958683 77142428 39857771
19657 39857771 26460074 45511314 62354585 55308006 34451013 22678525 41607432
19650 41607432 96671621 151158393 140758809 52423525 -32111618 -21138910 68327612
19643 68327612 130433563 108354012 53153383 31803447 36766601 20150815 -27498025
19636 -27498025 -72057780 -81415545 -46086029 20285171 76843863 80284334 37069968
19629 37069968 771259 -3262191 -10105697 -43380567 -58826513 -7697416 80429486
19622 80429486 134299415 136238103 126205025 129475493 135651046 137037711 133718680 109158196
19614 109158196 53049266 -157529 -9598864 3594736 -14603520 -59728338 -74526652
19607 -74526652 -49344448 -42344468 -80792119 -115601627 -107515107 -90411068 -102165012
19600 -102165012 -111672255 -73786966 -12819503 13638315 5638372 9789182 31879211
19593 31879211 26589007 -22361767 -70198964 -77303337 -62766679 -65372555 -81781732
19586 -81781732 -76295450 -39786366 -7157304 -9456589 -29717115 -25429089 11991669
19579 11991669 44224981 37581024 408016 -47094829 -107377599 -173390481 -191557998
19572 -191557998 -117461131 -250872 56513349 28434576 -3652044 17727218 47793008
19565 47793008 31483091 -1747040 -3948568 -6761697 -63444284 -133841671 -130260691
19558 -130260691 -63834149 -40051787 -98020497 -154136467 -137046806 -87062300 -69860935
19551 -69860935 -68632658 -31794904 24885195 40005155 4646401 -27366321 -17255617
19544 -17255617 22694515 63628366 84555269 66834069 7719768 -57997650 -84240951
19537 -84240951 -64362183 -29428693 -536108 27001769 55127681 71104348 67300698
19530 67300698 48110721 18337603 -11245563 -14149364 23290129 67398521 69179720
19523 69179720 33844280 18906742 53610379 100404154 113192803 94247801 67826994
19516 67826994 34127928 -13543614 -51924946 -51586875 -26777592 -21666973 -47817924
19509 -47817924 -69581991 -56412110 -19684573 12829048 34356197 54968034 75568068
19502 75568068 83425878 69158018 37570490 2997826 -20541303 -26084127 -15515870
19495 -15515870 2872978 17718872 17720810 -1459597 -28844858 -40879198 -18370506 38371845
19487 38371845 108291719 156280822 145541750 64219058 -48766299 -121654247 -115760261
19480 -115760261 -69025511 -55296367 -101802251 -164896916 -187262937 -156898261 -101047572
19473 -101047572 -43787925 7611340 42153847 39264153 -2292009 -43169641 -33117922
19466 -33117922 34134781 110519768 145614406 134918547 105770788 74672230 43256366
19459 43256366 22079681 21344225 20458498 -11075687 -54234321 -48544329 17446947 69184873
19451 69184873 38403935 -43199388 -89405612 -71438121 -31721164 -5638059 9185666
19444 9185666 11752276 -9919898 -35878695 -22283677 28622224 58536398 37531505
19437 37531505 10426772 26741140 65357989 68368072 22377136 -31125785 -48791367
19430 -48791367 -19326856 39816075 94623580 116917467 112042904 106810775 98861782
19423 98861782 49380363 -52848420 -154442732 -196167274 -180131945 -144133068 -98123825
19416 -98123825 -31782215 33167837 49937360 7746469 -50654016 -76797901 -57521986
19409 -57521986 -11713657 28898372 38374734 17728894 -4082164 -2614722 18721576
19402 18721576 45415884 67737775 67362094 24546426 -36567130 -52287822 -8243568
19395 -8243568 20033697 -28786877 -97075366 -81898305 12691834 84128044 84219334 68426536
$$ [...]
##END NTUPLES=NMR SPECTRUM
##END=
