##TITLE=31Pdec_SR61_k
 d2o, 124 sc
 2.06.2021
##JCAMPDX= 6.0         $$ Bruker NMR JCAMP-DX V2.0
##DATA TYPE= NMR SPECTRUM
##DATA CLASS= NTUPLES
##ORIGIN= UXNMR, Bruker Analytische Messtechnik GmbH
##OWNER= root
$$ XWIN-NMR		Version 3.5
$$ Wed Jun  2 12:30:52 2021 Russian Standard Time (UT+4h)  she@DPX200
##.OBSERVE FREQUENCY= 81.013821
##.OBSERVE NUCLEUS= ^31P
##.ACQUISITION MODE= SIMULTANEOUS
##.ACQUISITION SCHEME= undefined
##.AVERAGES= 124
##.DIGITISER RES= 16
##SPECTROMETER/DATA SYSTEM= spect
##.PULSE SEQUENCE= zgpg30
##.SOLVENT NAME= DMSO
##.SHIFT REFERENCE= (INTERNAL, DMSO, 0, 248.564)
##AUDIT TRAIL= $$ (NUMBER, WHEN, WHO, WHERE, WHAT)
$$ ##TITLE= Audit trail, XWIN-NMR		Version 3.5
$$ ##JCAMPDX= 5.01
$$ ##ORIGIN= Bruker BioSpin GmbH
$$ ##OWNER= she
$$ F:/spectra/data/she/nmr/P31/1/pdata/1/auditp.txt
$$ ##AUDIT TRAIL=  $$ (NUMBER, WHEN, WHO, WHERE, WHAT)
(   1,<2021-06-02 12:29:08.46 +0400>,<she>,<DPX200>,
      <continue with go, POWCHK disabled, PULCHK disabled
       configuration hash MD5:
       00 E9 B6 7A A2 85 ED C7 34 08 36 98 17 FE 4E 26
       data hash MD5: 32K
       BA E0 B6 C7 AD 2F 66 5F 4D 23 79 B8 E4 3B 42 FA>)
(   2,<2021-06-02 12:30:05.98 +0400>,<she>,<DPX200>,
      <Start of raw data processing
       efp BC_mod = 2 LB = 1 FT_mod = 6 PKNL = 1 PHC0 = -6066.676 PHC1 = 481.27 SI = 64K 
       data hash MD5: 64K
       14 10 D6 77 B4 EF 40 D7 7E 86 80 61 75 20 2C E9>)
(   3,<2021-06-02 12:30:26.35 +0400>,<she>,<DPX200>,
      <pk PHC0 = 39.98792 PHC1 = -85.6 
       data hash MD5: 64K
       77 3A 04 3D DE 78 F3 1B 7E 3D 79 69 51 87 AF 16>)
(   4,<2021-06-02 12:30:28.82 +0400>,<she>,<DPX200>,
      <abs ABSG = 5 
       data hash MD5: 64K
       3B 4D CA CB 06 F4 D4 47 F7 11 1C 7D F7 FB 53 7D>)
$$ ##END=
$$ 
$$ hash MD5
$$ 94 AE 23 AA F5 04 60 89 D4 14 0B CA B1 2B 56 12
##$RELAX= 
##$RELAX= 
##$RELAX= 
##$RELAX= 
##$RELAX= 
##$RELAX= 
##$RELAX= 
##$RELAX= 
$$ Bruker specific parameters
$$ --------------------------
##$DU= <F:/spectra>
##$EXPNO= 1
##$NAME= <P31>
##$PROCNO= 1
##$TYPE= <nmr>
##$USER= <she>
##$AMP= (0..31)
100 100 100 100 100 100 100 100 100 100 100 100 100 100 100 100 100 100 
100 100 100 100 100 100 100 100 100 100 100 100 100 100 
##$AQSEQ= 0
##$AQ_mod= 1
##$AUNM= <au_zg>
##$AUTOPOS= <>
##$BF1= 81.014009
##$BF2= 200.13
##$BF3= 200.13
##$BF4= 200.13
##$BF5= 200.13
##$BF6= 200.13
##$BF7= 200.13
##$BF8= 200.13
##$BYTORDA= 1
##$CFDGTYP= 0
##$CFRGTYP= 5
##$CHEMSTR= <none>
##$CNST= (0..31)
1 1 145 1 1 1 1 1 1 1 1 1 1 1 1 1 1 1 1 1 1 1 1 1 1 1 1 1 1 1 1 1 
##$CPDPRG= <waltz16>
##$CPDPRG1= <>
##$CPDPRG2= <waltz16>
##$CPDPRG3= <>
##$CPDPRG4= <mlev>
##$CPDPRG5= <mlev>
##$CPDPRG6= <mlev>
##$CPDPRG7= <mlev>
##$CPDPRG8= <mlev>
##$CPDPRGB= <>
##$CPDPRGT= <>
##$D= (0..31)
0 1 0 0 0 0 0 0 0 0 0 0.03 2e-05 3e-06 0 0 0 0 0 0 0 0 0 0 0 0 0 0 0 0 
0 0 
##$DATE= 1622622359
##$DBL= (0..7)
120 120 120 11 120 120 24 19 
##$DBP= (0..7)
150 150 150 150 150 150 150 150 
##$DBP07= 0
##$DBPNAM0= <>
##$DBPNAM1= <>
##$DBPNAM2= <>
$$ [...]
##$SUBNAM3= <"">
##$SUBNAM4= <"">
##$SUBNAM5= <"">
##$SUBNAM6= <"">
##$SUBNAM7= <"">
##$SUBNAM8= <"">
##$SUBNAM9= <"">
##$SW= 501.771253377433
##$SWIBOX= (0..15)
0 1 3 0 0 0 0 0 0 0 0 0 0 0 0 0 
##$SW_h= 40650.406504065
##$TD= 32768
##$TD0= 1
##$TE= 0
##$TE2= 300
##$TE3= 300
##$TEG= 300
##$TL= (0..7)
0 120 53 12 22 120 120 120 
##$TP= (0..7)
150 150 150 150 150 150 150 150 
##$TP07= 0
##$TPNAME0= <>
##$TPNAME1= <>
##$TPNAME2= <>
##$TPNAME3= <>
##$TPNAME4= <>
##$TPNAME5= <>
##$TPNAME6= <>
##$TPNAME7= <>
##$TPOAL= (0..7)
0.5 0.5 0.5 0.5 0.5 0.5 0.5 0.5 
##$TPOFFS= (0..7)
0 0 0 0 0 0 0 0 
##$TUNHIN= 0
##$TUNHOUT= 0
##$TUNXOUT= 0
##$USERA1= <user>
##$USERA2= <user>
##$USERA3= <user>
##$USERA4= <user>
##$USERA5= <user>
##$V9= 5
##$VALIST= <valist>
##$VCLIST= <CCCCCCCCCCCCCCC>
##$VD= 0
##$VDLIST= <DDDDDDDDDDDDDDD>
##$VPLIST= <PPPPPPPPPPPPPPP>
##$VTLIST= <TTTTTTTTTTTTTTT>
##$WBST= 1024
##$WBSW= 4
##$XGAIN= (0..3)
0 0 0 0 
##$XL= 0
##$YL= 0
##$YMAX_a= 6509
##$YMIN_a= -6604
##$ZGOPTNS= <>
##$ZL1= 120
##$ZL2= 120
##$ZL3= 120
##$ZL4= 120
##$ABSF1= 248.5645
##$ABSF2= -253.2056
##$ABSG= 5
##$ABSL= 3
##$ALPHA= 0
##$AQORDER= 0
##$ASSFAC= 0
##$ASSFACI= 0
##$ASSFACX= 0
##$ASSWID= 0
##$AUNMP= <proc_1d>
##$AZFE= 0.1
##$AZFW= 0.5
##$BCFW= 0
##$BC_mod= 2
##$BYTORDP= 0
##$COROFFS= 0
##$CY= -3
##$DATMOD= 1
##$DC= 0
##$DFILT= <>
##$DTYPP= 0
##$F1P= 0
##$F2P= 0
##$FCOR= 1
##$FTSIZE= 65536
##$FT_mod= 6
##$GAMMA= 0
##$GB= 0
##$INTBC= 1
##$INTSCL= 5.30512e-09
##$ISEN= 30
##$LB= 1
##$LEV0= 0
##$LPBIN= 0
##$MAXI= 10000
##$MC2= 0
##$MEAN= 0
##$ME_mod= 0
##$MI= 50
##$NCOEF= 0
##$NC_proc= -6
##$NLEV= 6
##$NOISF1= 182.463
##$NOISF2= 159.3651
##$NSP= 0
##$NTH_PI= 0
##$NZP= 0
##$OFFSET= 248.5645
##$PC= 4
##$PHC0= -6026.688
##$PHC1= 395.67
##$PH_mod= 1
##$PKNL= yes
##$PPARMOD= 0
##$PSCAL= 0
##$PSIGN= 0
##$REVERSE= no
##$SF= 81.014009
##$SI= 65536
##$SIGF1= 159.3651
##$SIGF2= -187.1042
##$SINO= 113.3802
##$SIOLD= 16384
##$SREGLST= <1H.CDCl3>
##$SSB= 0
##$STSI= 65536
##$STSR= 0
##$SW_p= 40650.406504065
##$SYMM= 0
##$S_DEV= 0
##$TDeff= 32768
##$TDoff= 0
##$TI= <>
##$TILT= no
##$TM1= 0
##$TM2= 0
##$TOPLEV= 0
##$USERP1= <user>
##$USERP2= <user>
##$USERP3= <user>
##$USERP4= <user>
##$USERP5= <user>
##$WDW= 1
##$XDIM= 65536
##$YMAX_p= 516757295
##$YMIN_p= -160369163
$$ End of Bruker specific parameters
$$ ---------------------------------
##NTUPLES= NMR SPECTRUM
##VAR_NAME=  FREQUENCY,     SPECTRUM/REAL,   SPECTRUM/IMAG
##SYMBOL=    X,             R,               I
##VAR_TYPE=  INDEPENDENT,   DEPENDENT,       DEPENDENT
##VAR_FORM=  AFFN,          ASDF,            ASDF
##VAR_DIM=   65536,         65536,           65536
##UNITS=     HZ,            ARBITRARY UNITS, ARBITRARY UNITS
##FACTOR=    0.620285442955139, 1,           1
##FIRST=     20137.2065510759, 0,            0
##LAST=      -20513.1999529892, 0,           0
##MIN=       -20513.1999529892, -160369163,  0
##MAX=       20137.2065510759, 516757295,    0
$$ Real data points
##PAGE= N=1
##DATA TABLE= (X++(R..R)), XYDATA
$$ [...]
##PAGE= N=2
##DATA TABLE= (X++(I..I)), XYDATA
12982b978547m318403P65130O111335M787004j236969l134056K628164Q911252
$$ -2978547 -7296950 -6531820 -420485 4366519 3129550 -4506 2623658 11534910
12974A1534910P334669m79948n689114m535748k056437k899635m604279l194655
$$ 11534910 18869579 18389631 12700517 8164769 6108332 3208697 -1395582 -4590237
12966d590237l38933k7182j548330j230911Q61957J433289J12723j18603J548467
$$ -4590237 -4929170 -4956352 -6504682 -7735593 -6873636 -5440347 -5327624 -5446227 -3897760
12957c897760K544540J495306j10482j062712j523174j015858R72065K553385
$$ -3897760 -1353220 142086 31604 -1031108 -2554282 -3570140 -2598075 -44690
12949d4690J372059j240573j771565K00699J951636K011425O85341k322483n968121
$$ -44690 1327369 86796 -1684769 -1484070 467566 2478991 3164332 841849 -5126272
12940e126272n472726J684508Q655142N935045m582298j0534470n651694K936515
$$ -5126272 -10598998 -8914490 -259348 5675697 1093399 -9441071 -15092765 -12156250
12932a2156250O639710O060959N275375L560155p30038m161251l017769J61702
$$ -12156250 -5516540 544419 5819794 9379949 8649911 4488660 1470891 1632593
12924A632593R48130O7109K72523J55976k426608m176022q52843M328476M393816
$$ 1632593 2580723 2647832 2920355 3076331 649723 -3526299 -4379142 -50666 4343150
12915D343150l42834k624015P1078J992905n58631k718870N98567N421858M166103
$$ 4343150 4000316 1376301 1447379 3440284 2881653 162783 761350 6183208 10349311
12906A0349311k475344o115123l083881O70801l21319k530105n98343K040680
$$ 10349311 7873967 1758844 -1325037 -654236 -975555 -3505660 -4104003 -2063323
12898b063323j507115p810179n711128N394854J1578153M657255m585972l143807
$$ -2063323 -3570438 -11380617 -17091745 -11696891 -118738 4538517 -47455 -3191262
12890c191262L941427L393742l242495k895097N490428Q499612J063979n345202
$$ -3191262 750165 4143907 901412 -1993685 3496743 11996355 13060334 7715132
12882G715132k498964K141674K96688l690689l569556l083300o430457p364413
$$ 7715132 5216168 7357842 7654530 3963841 394285 -2689015 -9119472 -16483885
12874a6483885K03598R081078Q690870J762043j046432J714637K611500o04013
$$ -16483885 -16280287 -7199209 1491661 3253704 2207272 3921909 6533409 5929396
12866E929396k979991k692685k849461l713911k261951R10392J983088N22866
$$ 5929396 2949405 256720 -2592741 -6306652 -8568603 -7658211 -5675123 -5152257
12858e152257q11618j481040k030405q05177K184834K270704k173546m240085
$$ -5152257 -5963875 -7444915 -9475320 -10280497 -8095663 -5824959 -7998505 -12238590
12850a2238590J087278O789249M182468k146628j920923K851046J596652n494376
$$ -12238590 -11151312 -4362063 -179595 -2326223 -4247146 -1396100 200552 -5293824
12842e293824p092040j43811N225126L096473K74302K723469N653665L184625
$$ -5293824 -12385864 -12529675 -7304549 -4208076 -3933774 -1210305 4443360 7627985
12834G627985j913709m141626l089007n44191K991815N038320J674373n034949
$$ 7627985 5714276 1572650 -1516357 -2060548 931267 5969587 7643960 2609011
12826B609011p233043k157537M030070N776122M093994R60057l738040p083914
$$ 2609011 -4624032 -6781569 -2751499 3024623 7118617 8078674 4340634 -2743280
12818b743280m146673K450981L348013l018771o363654l74133O944828N626542
$$ -2743280 -6889953 -4438972 -1090959 -4109730 -10473384 -10847517 -3902689 1723853
12810A723853j824119n946021l591337J565903O030987P289403K927752m747916
$$ 1723853 -100266 -6046287 -9637624 -8071721 -2040734 5248669 8176421 3428505
12802C428505q218897m608337p71150k854867o396075l378674N523420J2314030
$$ 3428505 -4790392 -9398729 -10169879 -13024746 -19420821 -22799495 -17276075 -4962045
12794d962045J1809374N199840k897743o682554k762584M579768O481572J126641
$$ -4962045 6847329 12047169 9149426 2466872 -295712 4284056 10765628 11892269
12786A1892269l724932l041308j549722l816903n875630l281889M82302J088537
$$ 11892269 8167337 5126029 3576307 -240596 -6116226 -9398115 -8915813 -7827276
12778g827276J335253M203622N442291J658910j605362P02614L002232j151505
$$ -7827276 -6492023 -2288401 3153890 4812800 3207438 3910052 6912284 5760779
12770E760779o284165l971222J711851J147757l356235j792280M827049N553297
$$ 5760779 -523386 -4494608 -2782757 -1635000 -4991235 -6783515 -1956466 3596831
12762C596831j070376m102553J063770N416866K142759k889686k400223R19607
$$ 3596831 2526455 -1576098 -512328 4904538 7047297 4157611 1757388 2676995
12754B676995J010411j462298k147613n32815R94994J574007J439173K72091j565456
$$ 2676995 3687406 2225108 77495 -455320 539674 2113681 3552854 3824945 2259489
12745B259489k803851k985750j788738J960744O783281P010211N34508n355530
$$ 2259489 -544362 -3530112 -5318850 -3358106 3425175 10435386 10969894 5614364
12737E614364l535150J190374l11073n411703l863226L327252M050508l902506
$$ 5614364 2079214 3269588 2958515 -2453188 -6316414 -2989162 1061346 -2841160
12729b841160p605269l63123O570031K536564n281909m703820J628867K565880
$$ -2841160 -10446429 -10809552 -4239521 -1702957 -6984866 -11688686 -10059819 -7493939
12721g493939k181967k788271L437540P942576M344484l360852p233533l772002
$$ -7493939 -9675906 -12464177 -9026637 -1084061 3260423 -100429 -7333962 -11105964
12713a1105964M340633J0139908P245829k721152r765580p058882L20476L382338
$$ -11105964 -6765331 3374577 10620406 7899254 -1866326 -8925208 -8604732 -5222394
12705e222394J903396K046617M699954M871818J377812j493839k087263l124654
$$ -5222394 -3318998 -1272381 3427573 8299391 9677203 8183364 6096101 2971447
12697B971447m608142k893418J495363K834682l68716k265143L76018K147408
$$ 2971447 -1636695 -4530113 -3034750 -200068 -568784 -2833927 -2457909 -310501
12689c10501j853866o867570n179693J957932O334702M788348K161512K416536
$$ -310501 -2164367 -9031937 -14211630 -12253698 -5918996 -1130648 1030864 3447400
12681C447400L380087K009807m44536j343673r35076p39692m36917O43669J053606
$$ 3447400 6827487 8837294 8392758 7049085 6114009 5374317 4937400 5581069 6634675
12672F634675o50015k839089k922738j316645k35801K61189J409112J974106k6679
$$ 6634675 5984660 3145571 222833 -1093812 -1329613 -1068424 340688 2314794 2288115
12663B288115k056315Q97914P561669R491151K424432o458726p586584j732835
$$ 2288115 231800 1129714 8691383 18182534 20606966 14148240 6561656 4828821
12655D828821K104472m13832m394624m045868j06716K762489K342037M16157l24607
$$ 4828821 6933293 6519461 2124837 -1921031 -2027747 734742 3076779 3492936 3168329
12646C168329N61907J048975l92251k133731j607033J87647J28069p05465K109800
$$ 3168329 3730236 4779211 4386960 2253229 646196 833843 961912 256447 2366247
12637B366247P007161N426713m498812j0889222l687209Q676110R787512r88184
$$ 2366247 9373408 14800121 10301309 -587913 -4275122 4400988 14188500 13200316
12629A3200316q576972n566862j098643l094115n653377j458040M856230N338164
$$ 13200316 4623344 -943518 -2042161 -5136276 -10789653 -12247693 -7391463 -2053299
12621b053299K169810K175360M031485J545691m071525n397067o21176M592362
$$ -2053299 116511 2291871 6323356 7869047 3797522 -1599545 -2220721 2371641
12613B371641O242312N189439J915498m006356q867318o903462Q66831O351357
$$ 2371641 8613953 13803392 15718890 11712534 2845216 -4058246 -3191415 3159942
12605C159942N080336J458090P83969J521293n28336m381582n133202j504306
$$ 3159942 8240278 9698368 10482337 12003630 11475294 7093712 1960510 456204
12597D56204K134871J616594j891920l715609j316244L117934N479049M055173
$$ 456204 2591075 4207669 2315749 -1399860 -2716104 401830 5880879 9936052
12589I936052N37934k373769l193317k005083k03762K21329j247983k401164r33608
$$ 9936052 10473986 8100217 4906900 2901817 2698055 2919384 1671401 -729763 -1663371
12580a663371J850135K361247j29352k465063k300195q74822j12778M0808k361
$$ -1663371 186764 2548011 2418659 -46404 -2346599 -3221421 -3334199 -3293391 -3295752
12571c295752q21850k028848j719297L27882J606675Q40823R9945R05900J313580
$$ -3295752 -4117602 -6146450 -7865747 -7537865 -5931190 -5090367 -4990422 -4084522 -2770942
12562b770942m45679k260174j296049J349868K409884J140369p85310k463907
$$ -2770942 -3216621 -5476795 -6772844 -5422976 -3013092 -1872723 -2658033 -5121940
12554e121940l705820l200129j99036K648500J592278k784626n250597k189062
$$ -5121940 -8827760 -12027889 -12226925 -9578425 -7986147 -10770773 -16021370 -18210432
12546a8210432L553018N755022K527594q58379J376432O964610P520277K93077
$$ -18210432 -14657414 -8902392 -6374798 -7233177 -5856745 1107865 8628142 8921219
12538H921219o847910o144617r55231M59783j719894p50166L447394L798404n13582
$$ 8921219 2073309 -4071308 -5026539 -4566756 -6286650 -7036816 -3589422 208982 -304600
12529c04600j706255K376403L400158k502058o311771q62888O204890M591253
$$ -304600 -2010855 365548 3765706 1263648 -5048123 -5911011 293879 4885132
12521D885132j971665l047872Q99169J258883k367298k037878L505828O269233
$$ 4885132 2913467 -134405 764764 2023647 -343651 -2381529 1124299 7393532
12513G393532K351781k886470m533293l705184k112552L08312J327297j543573
$$ 7393532 9745313 6858843 2325550 -1379634 -3492186 -3183874 -1856577 -3400150
12505c400150m335980q96644N618048N618458j168089l997780J647981O662164
$$ -3400150 -7736130 -8632774 -3014726 2603732 1435643 -2562137 -914156 5748008
12497E748008L635288j424432n66354K363317n97615o942677p744560k501334
$$ 5748008 9383296 7958864 7392510 9755827 9158212 2215535 -5529025 -8030359
12489h030359P34231j096125k161435J374865M843230K900217j767209k222487
$$ -8030359 -7296128 -8392253 -10553688 -9178823 -4335593 -1435376 -3202585 -5425072
12481e425072K646321O205874K807158m401247p149700l014936J270786k54218
$$ -5425072 -2778751 3427123 6234281 1833034 -5316666 -8331602 -7060816 -7315034
12473g315034l645807j207760N730041P825042J958512l550032j252050M779906
$$ -7315034 -10960841 -12168601 -6438560 1386482 3344994 -205038 -1457088 3322818
12465C322818N852967J260286k184968o28397K588296K623127j045421m760265
$$ 3322818 9175785 10436071 8251103 7622706 10211002 12834129 11788708 7028443
12457G028443m565269l28308L216660J330050m192369o395318k390510K563366
$$ 7028443 2463174 2134866 5351526 6681576 2489207 -3906111 -6296621 -3733255
12449c733255K575472j079449l089989j832117J75380J435180K870592M824926
$$ -3733255 -1157783 -2237232 -5327221 -7159338 -6983958 -5548778 -2678186 2146740
12441B146740N843833M264203m64296o738966j0155286o790878R47435N103210
$$ 2146740 7990573 12254776 11790480 5051514 -5103772 -11894650 -10947215 -5844005
12433e844005J730603l499465k944708K610179N781498K960159k075476m374741
$$ -5844005 -4113402 -7612867 -10557575 -7947396 -2165898 794261 -1281215 -5655956
12425e655956l157607m62180K020453L635943M294742M066637K630100j79722
$$ -5655956 -8813563 -9275743 -7255290 -3619347 675395 4742032 7372132 7192410
12417G192410k864725l318595k229649k441675l518026j228790M538447O396382
$$ 7192410 4327685 1009090 -1220559 -3662234 -7180260 -8409050 -3870603 2525779
12409B525779l49274q126965n636736N563586J1764111N656497m160168o041599
$$ 2525779 2176505 -5950460 -11587196 -6023610 5740501 11396998 7236830 1195231
12401A195231o79758K432576n25699l973813k587257J681361L745050K276681
$$ 1195231 515473 2948049 2422350 -1551463 -4138720 -2457359 1287691 3564372
12393C564372q8152j200999j409011j646765j564888k33949K154455M115040M327831
$$ 3564372 3476220 2275221 866210 -780555 -2345443 -2579392 -424937 3690103 8017934
12384H017934K820015O56683j189784k530180l696783m642206m416454k161569
$$ 8017934 10837949 11494632 10304848 7774668 4077885 -564321 -4980775 -7142344
12376g142344J081709K624377J297141n69618r2276J894929J963759m91081j916202
$$ -7142344 -6060635 -3436258 -2139117 -2708735 -2801011 -906082 1057677 566596 -1349606
12367a349606Q3678K751011J871885k010269l808063m18261M845562N523435m02697
$$ -1349606 -1265928 1485083 3356968 1346699 -2461364 -2879625 1965937 7489372 7086675
12358G086675p181577p140059j30571N467580L277378k416174k855545K342225
$$ 7086675 -94902 -7234961 -7365532 -1897952 1379426 -1036748 -3892293 -1550068
12350a550068M976659J159029k953700j384364K429983J933017k121972m017946
$$ -1550068 3426591 4585620 1631920 247556 2677539 4610556 2488584 -1529362
12342a529362k494771r75415l10352J715747M174821L095526j404854m079738
$$ -1529362 -4024133 -4999548 -5309900 -3594153 580668 3676194 2271340 -1808398
12334a808398k172631J131850K531664K773825K820837R34396l129116n295187
$$ -1808398 -3981029 -2849179 -317515 2456310 5277147 6211543 3082427 -2212760
12326b212760k577057J816801K889943J002632L43131J879752K422077L84358
$$ -2212760 -4789817 -2973016 -83073 919559 1262690 3142442 5564519 5948877
12318E948877j760545j651222m04837l98553j855620l024528k461075k70239J950954
$$ 5948877 4188332 2537110 2132273 1733720 -121900 -3146428 -5607503 -5877742 -3926788
12309c926788K189906L10684q85964J043282L770528K186583l888872p521051
$$ -3926788 -1736882 -1426198 -2312162 -1268880 2501648 4688231 799359 -6721692
12301f721692l337547M415003P069297L176301p22478p95303o23051k967758l766704
$$ -6721692 -10059239 -5644236 1425061 4601362 3878884 3083581 2460530 -507228 -4273932
12292d273932N33711N131357L421553k025918k977238J564716M365280K017713
$$ -4273932 -3740221 1391136 4812689 2786771 -190467 1374249 5739529 7757242
12284G757242o08218K4461M13829k291741m416167k671528m91626j590623k882395
$$ 7757242 7149024 7173485 7587314 5295573 879406 -1792122 -2283748 -3874371 -6756766
12275f756766m30020K549164J100760k157104j388886J853953J322506k440305
$$ -6756766 -7186786 -4637622 -3536862 -5693966 -7082852 -5228899 -3906393 -6346698
12267f346698k770881J238844L121262M98181j221273Q36107K074600k48267j377140
$$ -6346698 -9117579 -7878735 -4757473 -4259292 -5480565 -4644458 -2569858 -2818125 -4195265
12258d195265J850020M013780R1169m889275l097851L628036O742615L665522
$$ -4195265 -2345245 1668535 1759704 -3129571 -6227422 -2599386 4143229 7808751
12250G808751m13804j863006k034035j697631N63144L363536K428149k498366
$$ 7808751 7394947 5531941 3497906 1800275 2363419 5726955 8155104 5656738
12242E656738n981097m489172j186210m81432j527859l96793L497784O220427
$$ 5656738 -324359 -4813531 -5999741 -6481173 -8009032 -8405825 -4908041 1312386
12234A312386M081949j926680o597823n704814j079086J248855o36990j167353
$$ 1312386 5394335 3467655 -3130168 -8834982 -9914068 -8665213 -9302203 -10469556
12226a0469556M158284J0069123P774877j467030p018756m189847m20771k405423
$$ -10469556 -6311272 3757851 11532728 10065698 3046942 -1142905 -1563676 -3969099
12218c969099n186271r51797P212732R138325K528555m435110n331127k833089
$$ -3969099 -9155370 -10107167 -2894435 6243890 8772445 4337335 -993792 -3826881
12210c826881k138234l172040k506361O26170L332530K723146p66302l147163
$$ -3826881 -5965115 -9137155 -11643516 -11017346 -7684816 -4961670 -5727972 -8875135
12202h875135o69824M861713O559939J021349n815103n653134R91132N945098
$$ -8875135 -9544959 -4683246 1876693 2898042 -2917061 -8570195 -7579063 -1633965
12194a633965M886690J475846m76062k150054m562716m443250M44907O003450
$$ -1633965 3252725 4728571 4252509 2102455 -2460261 -6903511 -6458604 -455154
12186d55154O294828J076536m451594n712494k316987K577880M771510K703856
$$ -455154 5839674 6916210 2464616 -3247878 -5564865 -2986985 1784525 4488381
12178D488381n51374j191508j74691r57738k447593l01234M142797L799578k602952
$$ 4488381 3937007 2745499 2570808 1613070 -834523 -1135757 3007040 6806618 4203666
12169D203666o736166l083484K251600J407044l068531l451915Q51176M283946
$$ 4203666 -2532500 -5615984 -3364384 -1957340 -5025871 -8477786 -7626610 -3342664
12161c342664M649841L809122J910368j545200l622811k149241r40374l476863
$$ -3342664 1307177 5116299 7026667 5481467 1858656 -290585 -1230959 -4707822
12153d707822n106343j87304O621753O333547K19433k641644p28428r11090m123464
$$ -4707822 -9814165 -10001469 -3379716 2953831 3173264 531620 -196808 -1107898 -5231362
12144e231362l114912L400389O841582K911284j684099j353152J62367r23531
$$ -5231362 -8346274 -4945885 1895697 4806981 3122882 1769730 1932097 1008566
12136A008566j014149K673098N460764L408883K10150l62912j036578l765399
$$ 1008566 -5583 2667515 8128279 11537162 11747312 11384400 10347822 6582423
12128F582423m009432O11641L734182J79147m654493l625696M40650O64825j997424
$$ 6582423 2572991 3184632 6918814 7097961 2443468 -1182228 -741578 -76753 -2074177
12119b074177j921742P66792J901505J635739K663558L381500P48072k994549
$$ -2074177 -3995919 -3229127 -1327622 308117 2971675 6353175 7101247 4106698
12111D106698l575004j452719R43000M189917P447550M905990m988579j2509530
$$ 4106698 531694 -921025 21975 4211892 11659442 16565432 11576853 -932677
12103i32677q638964Q83760M057108O89543K48175M899835P311065M177410k9944
$$ -932677 -9571641 -8687881 -4630773 -3941230 -3693055 1206780 8517845 12695255 12665311
12094A2665311k709740n425535o530488k436038L292080K791628l327995o328441
$$ 12665311 9955571 4530036 -2000452 -4436490 -1144410 1647218 -1680777 -8009218
12086h009218l105905P17929J978092L352213M705095K388357j385921q046M974955
$$ -8009218 -11115123 -10397194 -8419102 -5066889 -361794 2026563 640642 632596 5607551
12077E607551M777595j119759l372381L72558J099330m373920o472486k62034
$$ 5607551 10385146 9265387 5893006 6265564 7364894 2990974 -3481512 -3743546
12069c743546M429601l29484o675958m714851J126670J666653p75742J222799
$$ -3743546 686055 356571 -6319387 -11034238 -9907568 -8240915 -9016657 -7793858
12061g793858N204520L637960j841331l711367j813098j453078k098494L60403
$$ -7793858 -2589338 1048622 -792709 -4504076 -6317174 -7770252 -9868746 -9508343
12053i508343L387767J569340k046916j41095N256037N221042q61852m330172
$$ -9508343 -6120576 -4551236 -6598152 -6739247 -1483210 3737832 2875980 -1454192
12045a454192j726470J028886J55057q67657L66438J312027R91517J576624J883334
$$ -1454192 -3180662 -2151776 -1996719 -2864376 -2497938 -1185911 -194394 1382230 3265564
12036C265564j682783o179790l939716M296790Q239264L614862j345079J01314
$$ 3265564 1582781 -4597009 -8536725 -4239935 3999329 7614191 6269112 6370426
12028F370426K863320M75033l348556k339277N61987r16227l989215j171278N665460
$$ 6370426 9233746 9708779 6360223 4020946 4582933 3666706 -322509 -1493787 4171673
12019D171673O735445J78931l996072P85773P131333M707132l866125o440409
$$ 4171673 10907118 11086049 7089977 7875750 15007083 19714215 15848090 9407681
12011I407681P13513O943270K516036o795337p691840J090659O735820J423018
$$ 9407681 10121194 17064464 19580500 12785163 5093323 6183982 12919802 14342820
12003A4342820o335832n416353J175698K870311p98541j166878L108432L696762
$$ 14342820 8006988 2590635 3766333 6636644 5838103 4671225 7779657 11476419
11995A1476419j991964n813338l267508q02573k765502k771343L375402O950571
$$ 11476419 9484455 3671117 403609 -398964 -3164466 -5935809 -2560407 4390164
11987D390164o8906r190557o722514M642259R919556M672071r88636r76282q41345
$$ 4390164 4321258 -4869299 -11591813 -6949554 2970002 7642073 6653437 5677155 4835810
11978D835810m009672m642448P21K516118j575884m340343J562250Q981939O449478
$$ 4835810 826138 -3816310 -3815589 -1299471 -2875355 -7215698 -5653448 3328491 9777969
11969I777969l500705p906474k694004K871159J397464k912965k739813J541828
$$ 9777969 6277264 -1629210 -4323214 -1452055 -54591 -2967556 -5707369 -4165541
11961d165541M022604K203229m49670J43409L262015M222073O80648l365109k575717
$$ -4165541 -142937 2060292 1610622 1754031 5016046 9238119 9918767 6553658 3977941
11952C977941J587289K623406o06819j984324Q39881J624844k906275n242384
$$ 3977941 5565230 8188636 7581817 5597493 6437374 8062218 5155943 -86441
11944h6441N29508O264617J622541p274623n713031N486005R923392J168684p898684
$$ -86441 443067 6707684 8330225 1055602 -4657429 828576 10751968 11920652 4021968
11935D021968o305321k60423P86162l96844K043123L940721k91116m702908q71112
$$ 4021968 -2283353 -2543776 -1757614 -2154458 -111335 3829386 3538270 -1164638 -2035750
11926b035750O266854N316115k715159o021147q42242M161984K700062j619235
$$ -2035750 4231104 9547219 6832060 810913 -31329 4130655 6830717 5211482
11918E211482m123228n124412m824292j363219L211942L139852j798964m318247
$$ 5211482 1088254 -4036158 -8860450 -10223669 -7011727 -3871875 -5670839 -9989086
11910i989086j24118N723332O102347N94234n480444o794277j683010N928323
$$ -9989086 -10113204 -4389872 1712475 2306709 -3173735 -9968012 -11651022 -5722699
11902e722699Q433538K972689l344019k529539K087151J038941n365036o991005
$$ -5722699 2710839 5683528 2339509 -190030 1897121 2936062 -2428974 -9419979
11894i419979p05368M346016J965307j778205l53603K356399Q30925j204623J873340
$$ -9419979 -10125347 -5779331 -3814024 -5592229 -5945832 -3589433 -2758508 -3963131 -2089791
11885b089791O022490L698224k654915l720410J941735N985663L255158j778526
$$ -2089791 3932699 7630923 4976008 1255598 3197333 9182996 12438154 10659628
11877A0659628l141945r89515J449806L154625M190334K903072j911473p304107
$$ 10659628 7517683 6528168 7977974 11132599 15322933 18226005 16314532 9010425
11869I010425q057266l213807J414900j70852n628537o259970Q72556P618467
$$ 9010425 953159 -2260648 -845748 -1016600 -6645137 -12905107 -12032551 -4414084
11861d414084N960912K7542n30739L769761L120767m847911r993852m975675L840598
$$ -4414084 1546828 1574370 1043631 4813392 7934159 3086248 -6907604 -11883279 -8042681
11852h042681O505641K872607o46188j545624j575587j245823m19616q20816k573704
$$ -8042681 -1537040 1335567 689379 -856245 -2431832 -3677655 -4097271 -4918087 -7491791
11843g491791j981332K303332N198053K631548j327233p18743K885173L470847
$$ -7491791 -9473123 -7169791 -1971738 659810 -667423 -1386166 1499007 4969854
11835D969854j23646l954830n226375l585591O77908M906394M439599l95822k432533
$$ 4969854 4846208 891378 -4334997 -7920588 -7242680 -2336286 2103313 1707491 -725042
11826g25042J760873N200265J208662n293218n819736k010634j078074k181275
$$ -725042 1035831 6236096 7444758 2151540 -3668196 -5678830 -6756904 -8938179
11818h938179R52690O560899O330136k84751m914218l891059j906331j212675
$$ -8938179 -7985489 -1424590 4905546 4620795 -293423 -4184482 -6090813 -7303488
11810g303488J423986N067429L418864l248646n758947k20515N307523L592761
$$ -7303488 -5879502 -812073 2606791 -641855 -6400802 -6621317 -1313794 2278967
11802B278967j395303k743349r39418M46019J967866M293715L508968k243524
$$ 2278967 883664 -1859685 -2799103 -2353084 -385218 3908497 7417465 5173941
11794E173941o814712m161845J852528L002377j301543m557799l315593j34954
$$ 5173941 -1640771 -5802616 -3950088 -947711 -2249254 -6807053 -10122646 -10257600
11786a0257600K178844L390206L450266K026301J52709r56478j838105k998081
$$ -10257600 -8078756 -4688550 -1238284 788017 940726 -15752 -1853857 -4851938
11778d851938l119026j629581n26520q48163m22522J660158K021380j311026l858462
$$ -4851938 -7970964 -9600545 -10127065 -10975228 -11397750 -9737592 -7716212 -9027238 -12885700
11769a2885700q07851M674558N410606P25869l307853l211542j288227L53244
$$ -12885700 -13693551 -9018993 -3608387 -2882518 -6190371 -9401913 -10690140 -10336896
11761a0336896K359144L794513J774599k413603k876751J949167N368707J848256
$$ -10336896 -7977752 -4183239 -2408640 -4822243 -7698994 -5749827 -381120 1467136
11753A467136m105448m062395K211393O883733N157866J33037l703024n677507
$$ 1467136 -2638312 -6700707 -4489314 2394419 7552285 7685322 3982298 -1695209
11745a695209n634268j370322O295754J0207349M536307o078999j0930508o505262
$$ -1695209 -7329477 -8699799 -2404045 7803304 12339611 6260612 -4669896 -11175158
11737a1175158K77900K804504K636386L899579N376157L245493j534553m051377
$$ -11175158 -10897258 -8092754 -5456368 -1556789 3819368 7064861 5530308 1478931
11729A478931k399945Q00546L216017M733202M660725J492540l383414n503694
$$ 1478931 -921014 -120468 3095549 7828751 12489476 13982016 10598602 5094908
11721E094908k820457J256929K360837P73958K25860K068849L202053N21385m131795
$$ 5094908 2274451 3531380 5892217 6666175 6892035 8960884 12162937 12684322 8552527
11712H552527n428248j258050L935778M374776L07893k619077j044962K341132
$$ 8552527 3124279 1866229 5802007 10176783 10484676 7865599 6820637 9161769
11704I161769L331120J189173k121803m560809m384833j035995K798267L284149
$$ 9161769 12492889 13682062 11560259 6999450 2614617 1578622 4376889 7661038
11696G661038J010090M91048K507939K065123l147296p790636o718025k693018
$$ 7661038 8671128 9162176 11670115 13735238 10587942 2797306 -3920719 -6613737
11688f613737j048122j254583K68056L023854M421725N178459O333412M767174
$$ -6613737 -7661859 -8916442 -8648386 -5624532 -1202807 3975652 10309064 15076238
11680A5076238j223685n844488l343819K006949K284274j283784j880141k26230
$$ 15076238 13852553 8008065 4664246 6671195 8955469 7671685 5791544 5565314
11672E565314k450348o880616o044486j364044j597825n356819r68212J1853902
$$ 5565314 3114966 -3765650 -9810136 -11174180 -12772005 -18128824 -19097036 -7243134
11664g243134J6594951M622494r598774r569944m33034K464875j381391p16567
$$ -7243134 9351817 13974311 4375537 -5194407 -5627441 -3162566 -4543957 -5260524
11656e260524N173997N168785l096743p708050j458595O823612O391479J97651
$$ -5260524 -86527 5082258 1985515 -5722535 -7181130 -357518 6033961 6231612
11648F231612j650694K122620L324104k239237q387234p651444j777500J177072
$$ 6231612 4580918 6703538 10027642 7788405 -598829 -8250273 -10027773 -8850701
11640h850701j369633k981357J595384P660540P293578J716497o33293K271934
$$ -8850701 -10220334 -13201691 -11606307 -3945767 3347811 5064308 4431015 6702949
11632F702949L132343j792739n721109k327000L744303M237415k30773k577798
$$ 6702949 9835292 8042553 2321444 -5556 3738747 7976162 7745389 5167591
11624E167591o01203J538669J248622J47699m55218j107531j488270n00566J269207
$$ 5167591 4566388 6105057 7353679 7501378 7046160 5938629 4450359 3949793 5219000
11615E219000K338881K405348J278065j645976m360841k774630K248847L388646
$$ 5219000 7557881 9963229 11241294 9595318 5234477 2459847 4708694 8097340
11607H097340k553486p866850m541478L130064N000928M79894k148013K57239
$$ 8097340 5543854 -2322996 -6864474 -3734410 1266518 1746412 -401601 -144362
11599a44362K634394K344507K504162L488713J205046l578219l930735J326502
$$ -144362 2490032 4834539 7338701 10827414 12032460 8454241 4523506 5850008
11591E850008L710981j629122p351835n514166k10178j00608l910068l185343
$$ 5850008 9560989 7931867 580032 -4934134 -5144312 -5244920 -9154988 -12340331
11583a2340331L228610P281370M357764o82843k089616r63813j129870k266421
$$ -12340331 -9111721 -1830351 2527413 1844570 -245046 -1208859 -2338729 -4605150
11575d605150j250250K255440N093677M645597J481153j632697k395367j127027
$$ -4605150 -5855400 -3599960 1493717 6139314 7620467 5987770 3592403 2465376
11567B465376m55427j969564l611555k292065J116834K254279m61960l118606
$$ 2465376 2009949 40385 -3571170 -5863235 -4746401 -2492122 -2954082 -6072688
11559f072688j773770K086920M293756L961185L293378L023354K045740Q08950
$$ -6072688 -7846458 -5759538 -1465782 2495403 5788781 8812135 10857875 11666825
11551A1666825P44825L86245l236959q451818r095235k922035M483841O869816
$$ 11666825 12411650 12797895 9560936 1109118 -7986117 -10908152 -6424311 445505
11543D45505M441279R89685j866138l794511l127620J20280J800896q26512l918360
$$ 445505 4886784 5876469 4010331 215820 -2911800 -2791520 -990624 -1817136 -5735496
11534e735496k604317J073785J673085o55607j351310J56353N11042J527K368305
$$ -5735496 -8339813 -7266028 -5592943 -6248550 -7599860 -7443507 -6932465 -6930938 -4562633
11525d562633O784152P600835L319065j162734k640722l061895l404521j437765
$$ -4562633 2221519 9822354 13141419 11978685 9337963 6276068 2871547 1433782
11517A433782K069928K170287k031046m626536j880443K324240L531604K856503
$$ 1433782 3503710 5673997 3642951 -983585 -2864028 -539788 2991816 5848319
11509E848319K187713k68509m839488o725584l004949J596371J401779j937716
$$ 5848319 8036032 7767523 2928035 -3797549 -6802498 -5206127 -3804348 -5742064
11501e742064l099738j288372L46575M18963j43281o51180j72544K567346N841060
$$ -5742064 -8841802 -10130174 -9783599 -9364636 -9507917 -10159097 -10331641 -7764295 -1923235
11492a923235N102916m63594n401024m864275j77303M677564P370033O090772
$$ -1923235 3179681 2716087 -2684937 -7549212 -7726515 -3048951 4321082 10411854
11484A0411854J22736n942196n270780R17983L507811o62171l695439j07811L979623
$$ 10411854 10534590 4592394 -678386 239597 3747408 3085237 -610202 -718013 3261610
11475C261610J817233k801380l501816k241987l235582l584065J91328L236577
$$ 3261610 5078843 2277463 -1224353 -3466340 -6701922 -10285987 -10094659 -6858082
11467f858082M82641k723262P04190O086323M259327k404324m041322k618J471856
$$ -6858082 -6375441 -9098703 -8394513 -2308190 1951137 -453187 -4494509 -4497127 -3025271
11458c025271j588550k679644O87220L731735L700020K335587l37081m991214
$$ -3025271 -4613821 -7293465 -6606245 -2874510 825510 3161097 2824016 -2167198
11450b167198p088978k047036N234365O250310K231893O90988J314334j973470
$$ -2167198 -9256176 -11303212 -6068847 181463 2413356 3104344 4418678 2445208
11442B445208o844187m778525K789880N242441Q13241j055643K294168J879281
$$ 2445208 -4398979 -9177504 -6387624 -1145183 -331942 -1387585 906583 2785864
11434B785864n348984r154998k995133M905386N232926J034442l33636J175859
$$ 2785864 -2563120 -11718118 -14713251 -9807865 -4574939 -3540497 -3874133 -2698274
11426b698274K297068L425794M759506L270966q16533k375442o54513j249117
$$ -2698274 -401206 3024588 7784094 11055060 10238527 7863085 7208572 5959455
11418E959455m660836l579445L035084M847805l298582j0828861o763387L899633
$$ 5959455 1298619 -2280826 754258 5602063 2303481 -8525380 -15288767 -11389134
11410a1389134R004311O315777J949358j058983k823663j568972K120260J893179
$$ -11389134 -2384823 3930954 5880312 4821329 1997666 428694 2548954 4442133
11402D442133m636547q949791l736954M241870L795147l431566o460066k137931
$$ 4442133 -194414 -9144205 -12881159 -8639289 -4844142 -8275708 -14735774 -16873705
11394a6873705K380014K529501J362013J833780K742550L001292L315346L209262
$$ -16873705 -14493691 -11964190 -10602177 -8768397 -6025847 -3024555 290791 3500053
11386C500053J433221j028851k225853k119131j190309J074319L528706L145273
$$ 3500053 4933274 3904423 1678570 -440561 -1630870 -556551 2972155 6117428
11378F117428K76983q04588O04963l1114l546970m425131j303144p37221m592125
$$ 6117428 6394411 5589823 6194786 6163672 2616702 -1808429 -3111573 -3848794 -8440919
11369h440919m231956M328459J0272572M178384n376652m802726L040667N375635
$$ -8440919 -12672875 -8344416 1928156 6106540 729888 -4072838 -1032171 4343464
11361D343464J159292j84656K340007Q61391m203919l498303L567507O252679
$$ 4343464 5502756 5318100 7658107 8519498 4315579 817276 4384783 10637462
11353A0637462N16025m842110l861185j718337k644127k239888K222301N007135
$$ 10637462 11153487 6311377 2450192 731855 -1912272 -4152160 -1929859 3077276
11345C077276J946327k095355j829482O89079K183219L851337N809217L941932
$$ 3077276 5023603 2928248 1098766 1787845 3971064 7822401 13631618 17573550
11337A7573550k327551o724247n624043l246005k675818m16056M394819M745153
$$ 17573550 15245999 8521752 2897709 -348296 -3024114 -3440170 954649 5699802
11329E699802k408833p718014k582267O274036O309900j722504n832098j338015
$$ 5699802 3290969 -4427045 -7009312 -735276 5574624 3852120 -1979978 -3317993
11321c317993M316399N123272L885331L874626K634682j883128o275513p301413
$$ -3317993 998406 6121678 10007009 13881635 16516317 14633189 8357676 1056263
11313A056263o927995p259364n399949J146538P707291P646641K613334O10967
$$ 1056263 -5871732 -13131096 -18531045 -17384507 -9677216 -2030575 582759 1193726
11305A193726L572876M201098j903800p922038n597761J676556L683544j179940
$$ 1193726 4766602 8967700 7063900 -858138 -6455899 -4779343 -1095799 -2275739
11297b275739m557250k254249K30217j017612j498670J882325L519333n35653
$$ -2275739 -6832989 -9087238 -8857021 -9874633 -11373303 -9490978 -5971645 -6507298
11289f507298l103756L086246J1232303R274406j010013o500138k722689J762492
$$ -6507298 -9611054 -6524808 4707495 13981901 12971888 6471750 3749061 5511553
11281E511553J419958P32490K177307L40129o242568q992113k749988M261681
$$ 5511553 6931511 7664001 9841308 10181437 3938869 -5053244 -7803232 -3541551
11273c541551K718542l289749l514197K485657O476280M957367K000946O52516
$$ -3541551 -823009 -4112758 -7626955 -5141298 1334982 6292349 8293295 8945811
11265H945811M5345K78889K540611M428629J936410l505522o020587l892759j528763
$$ 8945811 8991156 9270045 11810656 16239285 18175695 14670173 8649586 4756827 3228064
11256C228064j973987k980679k097658o53401l69819j16905J358360K677278K328626
$$ 3228064 1254077 -1726602 -3824260 -4477661 -4847480 -4964385 -3606025 -928747 1399879
11247A399879J281603O92981n00324k869044l535892L09412N787478O339059L06318
$$ 1399879 2681482 3374463 2874139 5095 -3530797 -3221385 2566093 8905152 9211470
11238I211470n896095n358140R43317O140540O255560L396834O69603j807559
$$ 9211470 3315375 -2042765 -1099448 5041092 11296652 14693486 15363089 13555530
11230A3555530m392364n195893k739587R15026K479513J418039n63860k282328
$$ 13555530 9163166 3967273 1227686 2142712 4622225 6040264 5476404 3194076
11222C194076l117696k299842o43376q09654l099772l656235l11366K837179J376369
$$ 3194076 76380 -2223462 -2866838 -3676492 -6776264 -10432499 -10743865 -7906686 -6530317
11213f530317j794936p93559L424277M626278J676409l84489K16417k96409k599978
$$ -6530317 -8325253 -9118812 -5694535 -1068257 608152 223663 440080 143671 -2456307
11204b456307j966064K224347L163720k161347o137449j549970O896828R724860
$$ -2456307 -4422371 -2198024 965696 -1195651 -7333100 -8883070 -1986242 7738618
11196G738618O352133L195806J813742j543465o033428n791902o69541J543872
$$ 7738618 14090751 17286557 19100299 17556834 11523406 5731504 5061963 6605835
11188F605835k943950p200742l899431L177309M528785j039790m892035j328194
$$ 6605835 3661885 -3538857 -7438288 -4260979 267806 -771984 -5664019 -6992213
11180f992213M447114M321664j012727l605129k26289L219972J289288k331695
$$ -6992213 -2545099 1776565 763838 -2841291 -3067580 152392 1441680 -890015
11172h90015p75577M554384N350739r56073o898588n707542l49569K245270J216975
$$ -890015 -1665592 2888792 8239531 7283458 384870 -5322672 -5672241 -3426971 -2209996
11163b209996O83312J775549J840919M50230M49314K534935L504339J251869k073050
$$ -2209996 -1526684 248865 2089784 2540014 2989328 5524263 9028602 10280471 8207421
11154H207421l422285k600989j212204j24243N23173N36837K86438Q01739K099186
$$ 8207421 4785136 2184147 971943 847700 1370873 1907710 2194148 2995887 5095073
11145E095073K489603O21572k534919m566371l969332j236938J742741L067827
$$ 5095073 7584676 8206248 5671329 1104958 -2864374 -4101312 -2358571 709256
11137G09256K288225P27758k07228p56360j767145k424636j164907Q36696q7120
$$ 709256 2997481 3725239 3518011 2761651 994506 -1430130 -2595037 -1758341 -1845461
11128a845461m531539p209626l015482N346590R770258O871082J569272o10415
$$ -1845461 -6377000 -13586626 -16602108 -11255518 -1485260 5385822 6955094 6344679
11120F344679l78211j091296k545233k816840l117752n138659n620179l67458
$$ 6344679 5966468 4875172 2329939 -486901 -3604653 -8743312 -14363491 -14730949
11112a4730949O886376P288789k7315n375942k325643L365933L664241K40476
$$ -14730949 -7844573 -555784 -583099 -5959041 -8284684 -4918751 -1254510 -1014034
11104a014034m45576J405153Q88748j523160q11217K909159L917702K42542l901786
$$ -1014034 -1459610 -54457 834291 -688869 -1500086 1409073 5326775 5569317 1667531
11095A667531n449174n242237l082147K402138P719374O248296j397764o055815
$$ 1667531 -3781643 -9023880 -12106027 -9703889 -1984515 4263781 2866017 -3189798
11087c189798k477799L593034M707631J652869o13778j148987j537362q62652
$$ -3189798 -5667597 -2074563 2633068 4285937 3672159 2523172 985810 123158
11079A23158J923105L961932K347376n60823o65302J288423J353751j283809l842709
$$ 123158 2046263 6008195 8355571 7794748 7129446 8417869 9771620 8487811 4645102
11070D645102m115592j644036K911415O213765L405749m791970r609335m439396
$$ 4645102 529510 -1114526 1796889 8010654 11416403 6624433 -2984902 -7424298
11062g424298N270520Q642311L836537j096120q57245J235064Q91892q95115j898789
$$ -7424298 -2153778 6488533 10325070 9228950 8371705 9606769 10498661 9603546 7704757
11053G704757l079339n384072o317032l331053J996673N885727O326378L379413
$$ 7704757 4625418 -758654 -7075686 -10406739 -8410066 -2524339 3802039 7181452
11045G181452j812004o290195o302190j694754K680377K468889q44783k444955
$$ 7181452 5369448 -920747 -7222937 -8917691 -6237314 -3768425 -4613208 -7058163
11037g058163n90281K079223K765440J469425j22907o50552K25492J702998K305361
$$ -7058163 -7648444 -5569221 -2803781 -1334356 -1457263 -2107815 -1882323 -179325 2126036
11028B126036J483836N05785P21035J494416J269950J79363k71340N1972k80030
$$ 2126036 3609872 4115657 4836692 6331108 7601058 7780421 7509081 7561053 7281023
11019G281023j294914r76283J105567J949042p35551m299009m154868k25838K908125
$$ 7281023 5986109 5009826 6115393 8064435 7328884 3029875 -1124993 -1350831 1557294
11010A557294K368233J77840p23257m99481q02557j672744k060679j711341r51727
$$ 1557294 3925527 4103367 3380110 2880629 2078072 405328 -1655351 -3366692 -4318419
11001d318419j23496j00460j188313r05613L667970R902674J0379926K704998
$$ -4318419 -4441915 -4542375 -5730688 -6636301 -2968331 6934343 17314269 20019267
10993B0019267n649051o623427k053869L32708j717587l876730l485059k123168
$$ 20019267 14370216 7746789 5692920 6025628 4308041 431311 -3053748 -5176916
10985e176916o38832J798661L589493J976622j078351n63842L200223M285731
$$ -5176916 -5815748 -4017087 -427594 1549028 470677 -93165 3107058 7392789
10977G392789O53093k627898j774854N17737J051854J033152J567717K57516l433941
$$ 7392789 8045882 5417984 3643130 4160867 5212721 6245873 7813590 8071106 4637165
10968D637165m753341n02311M956475N435287J305421k279636k603330q30553
$$ 4637165 -116176 -618487 4337988 9773275 11078696 8799060 6195730 5365177
10960E365177J087748J478606m93886k687709j646106J472260J219654l255714
$$ 5365177 6452925 7931531 7437645 4749936 3103830 4576090 5795744 2540030
10952B540030n447834j630662K473687Q06097l194824l019332k01174n21656k898770
$$ 2540030 -2907804 -4538466 -2064779 -1258682 -4453506 -7472838 -7674012 -8195668 -11094438
10943a1094438j434086L483281N541637L382870K030249L054095K299557j003024
$$ -11094438 -12528524 -9045243 -3503606 -120736 1909513 4963608 7263165 6260141
10935F260141j648116K039461M166126R34027k738005j476225J675045R65321
$$ 6260141 4612025 6651486 10817612 11751639 9013634 7537409 9212454 10177775
10927A0177775j959024r95214L565091M733247p5950m383295k184327K729418
$$ 10177775 8218751 7223537 10788628 15521875 15445925 11062630 8878303 11607721
10919A1607721K092083m324971p693811k891956L494379K496269l840795n397626
$$ 11607721 13699804 9374833 1681022 -1210934 2283445 4779714 938919 -4458707
10911d458707P44660O046893L574256k391342m315071k337743r51150j57996K277669
$$ -4458707 -3714047 2332846 5907102 3515760 -799311 -3137054 -4088204 -4246200 -1968531
10902a968531L593242j05376m747175k512192M896642O819471l91290p120811
$$ -1968531 1624711 1519335 -3227840 -5740032 -843390 5976081 5584791 -1536020
10894a536020m526273L064373N883950K798415K40110P29544M61071k313150l576676
$$ -1536020 -6062293 -2997920 2886030 5684445 5924555 6654099 7115170 4802020 1225344
10885A225344r7913N075583O414847K704871k227809m303387l034017j200450
$$ 1225344 1127431 6203014 12617861 15322732 13094923 8791536 5757519 4557069
10877D557069j771568m776607o725663l946661K748163P808703O863292K019805
$$ 4557069 2785501 -1991106 -8716769 -12663430 -9915267 -2106564 4756728 6776533
10869F776533j063926r14755j372623m013020m224348J238162O632219L519583
$$ 6776533 5712607 4797852 3425229 -587791 -4812139 -3573977 3058242 6577825
10861F577825o580848j2565973p606203L282061J0891485J1159932N052008m215939
$$ 6577825 -3023 -12568996 -20175199 -16893138 -6001653 5158279 10210287 5994348
10853E994348j0389048p104425L332235R505261M811452l219768l964420Q92163
$$ 5994348 -4394700 -11499125 -8166890 1338371 6149823 2930055 -1034365 -142202
10845a42202J521180l639041n764651k11663O217432N764685L98327k538044q67666
$$ -142202 1378978 -2260063 -8024714 -8236377 -2018945 3745740 4144067 1606023 738357
10836G38357J025648n01023l521929l435436R40454N381479N104722Q76982k125540
$$ 738357 1764005 1262982 -2258947 -5694383 -4753929 627550 5732272 6609254 4483714
10827D483714j717326j189207k780342l261551K34490M017413K775897j918533
$$ 4483714 2766388 1577181 -1203161 -4464712 -4230222 -212809 2563088 644555
10819F44555l797390j200025J451707J064525n39459r51847o18297q18668j335663
$$ 644555 -3152835 -4352860 -2901153 -1836628 -2376087 -3327934 -3946231 -4764899 -6100562
10810f100562j098905O21922L573469N933258N661311L382521J516856j46573
$$ -6100562 -7199467 -6577545 -3004076 2929182 8590493 11973014 13489870 13343297
10802A3343297l782372p222800m736823K594240M908750j943310p545563j569838
$$ 13343297 9560925 2338125 -2398698 195542 5104292 3160982 -4384581 -5954419
10794e954419R002437Q925800k515165j0423194n760421M042225Q103211N326046
$$ -5954419 3048018 11973818 9458653 -964541 -6724962 -2682737 5420474 10746520
10786A0746520R29873j901071k568781j137002P23676Q86172P0638J01738k62561
$$ 10746520 11676393 9775322 7206541 6069539 6793215 7679387 7750025 7851763 7589202
10777G589202k570995l605998J16401M666179L631685r20997j746880O07874r75114
$$ 7589202 5018207 1412209 1528610 6194789 9826474 8905477 7158597 7766471 6791357
10768F791357o105557o223608N7487L403301o01971m303669j835839J332117l38806
$$ 6791357 685800 -5537808 -5480321 -2077020 -2678991 -6982660 -8818499 -7486382 -7825188
10759g825188j996737K371430Q470946Q128518J273855n721034q547379o202120
$$ -7825188 -9821925 -7450495 1020451 9148969 10422824 4701790 -3845589 -10047709
10751a0047709N00174O542622N142419k495596o607390k599653K554181K493393
$$ -10047709 -9547535 -3004913 2137506 -358090 -6965480 -9565133 -7010952 -4517559
10743d517559O71262J134117L96726l153411k114942P014595J3241688O071959
$$ -4517559 -3846297 -2712180 -2315454 -5468865 -7583807 -569212 12672476 18744435
10735A8744435o612928r516934k664678J701969N37902J997919P360307P398744
$$ 18744435 12131507 2614573 -50105 1651864 2189766 4187685 11547992 18946736
10727A8946736q27855p859963o749666k271453p47612j151509j101232k145576
$$ 18946736 18118881 10258918 3509252 1237799 490187 -661322 -1762554 -3908130
10719c908130l874125j448063N357539Q544802L497871k873070k443380J841191
$$ -3908130 -7782255 -9230318 -3872779 4672023 8169894 5296824 2853444 4694635
10711D694635J886162k063451k960920J76400M91487m424950p006954r84477P721035
$$ 4694635 6580797 4517346 1556426 1732826 2224313 -2200637 -9207591 -10192068 -2471033
10702b471033Q105614k68031o163787k380660M475775M470761r76254k456706
$$ -2471033 5634581 5366550 -797237 -3177897 1297878 5768639 4792385 2335679
10694B335679K055999M413479k82111o374997p278422m701588l266799k470657
$$ 2335679 4391678 8805157 8523046 2148049 -5130373 -9831961 -13098760 -15569417
10686a5569417k5675K138516J612321P65654J974733K113103j298579l121771
$$ -15569417 -15595092 -13456576 -11844255 -11078601 -9103868 -6990765 -8289344 -11411115
10678a1411115J797223P904320N727448k707216n915698l73730M830361K791695
$$ -11411115 -9613892 -1709572 4017876 1310660 -4605038 -4978768 -148407 2643288
10670B643288j946174k928961j559747j613101j241678K636085O832462N715015
$$ 2643288 697114 -2231847 -3791594 -5404695 -6646373 -4010288 2822174 8537189
10662H537189p7034m493462m061657m85913L083515M166435J133609m140460n382972
$$ 8537189 8460155 3966693 -94964 -580877 2502638 6669073 7802682 3662222 -1720750
10653a720750R25749Q258882O307279m381112j0879560m653419O327476Q520121
$$ -1720750 -795001 7463881 13771160 9390048 -1489512 -6142931 184545 8704666
10645H704666J426425l276824K85397M873314K983087k172389l788535k239464
$$ 8704666 10131091 6854267 7139664 12012978 14996065 12823676 9035141 6795677
10637F795677j793078k021825j67912J880621Q34850q97599O25962K484895n32205
$$ 6795677 5002599 2980774 2812862 4693483 5528333 4630734 5256696 7741591 7209386
10628G209386n283054m037513K355319N457591L053119J026380J047696j624319
$$ 7209386 1926332 -2111181 244138 5701729 8754848 9781228 10828924 9204605
10620I204605o188891m924542K369234N238921m88193m923074m92238N607287
$$ 9204605 3015714 -1908828 460406 5699327 5211134 288060 -204178 5403109
10612E403109M229372r86101j903332P5117p86306k609484k48866M003424M381507
$$ 5403109 9632481 8646380 6743048 6818165 6031859 3422375 3173509 7176933 11558440
10603A1558440J663515J8499j298261m210122n036443p46125L105402L38286m698664
$$ 11558440 13221955 13240454 11942193 7732071 2695628 1949503 5054905 5393191 694527
10594F94527l768221J882035M772807L695414K788320J940810j383984l996457
$$ 694527 -3073694 -1191659 3581148 7276562 10064882 12005692 10621708 6625251
10586F625251j276661L004279J656724l314053l521224J962042N758577M162308
$$ 6625251 5348590 8352869 10009593 6695540 3174316 5136358 10894935 15057243
10578A5057243L96844l075154o131339n845085O35928Q136878P477682j625205
$$ 15057243 15454087 12378933 6247594 402509 1038437 9175315 16652997 15027792
10570A5027792r236814p688354O70232Q310118R898970N269487q59374l230361
$$ 15027792 5790978 -1897376 -1227144 7082974 16981944 22251431 21392057 18161696
10562A8161696k342470k956183n113170l650247R69029J091046m244540n085461
$$ 18161696 15819226 12863043 7749873 4099626 5068655 6159701 1915161 -3170300
10554c170300K770195Q706041M102815l403547l300800J331878K456513J193973
$$ -3170300 -400105 8305936 12408751 9005204 5704404 7036282 9492795 10686768
10546A0686768J114174j196354o165480m368169O422357J1058431j02624j2525001
$$ 10686768 11800942 10604588 4439108 70939 6493296 17551727 17449103 4924102
10538D924102r855009m8398J492155m86833N521108J1369003L816874o827438
$$ 4924102 -4930907 -4979305 -3487150 -3973983 1547125 12916128 16733002 9905564
10530I905564k340484R318501O738359o430827q308172K072849N852793K81908
$$ 9905564 7565080 16883581 23621940 17191113 8882941 10955790 16808583 17090491
10522A7090491m5748N179091K779858m163358j368493N115130j967301j4211181
$$ 17090491 17044743 22223834 25003692 20840334 19471841 24586971 22619670 8408489
10514H408489q247328R984765J2891836N96390j553451P143761L579133q979742
$$ 8408489 161161 10145926 23037762 23634152 22080701 29224462 32803595 23823853
10506B3823853m059019J3000131R856142r455747p830267J2688515J1087454j1207419
$$ 23823853 19764834 32764965 42621107 33165360 25335093 38023608 49111062 37903643
10498C7903643p305541K1837567K0023095j4215994j1807834L4613506L9323027
$$ 37903643 30598102 52435669 72458764 58242770 46434936 81048442 120371469
10491A20371469j3971003j0133091R3371453J32154977l5980358k64156337k77703100
$$ 120371469 106400466 96267375 189638828 321793805 285813447 21657110 -256045990
10484b56045990o2127934J17711727R5182859o493833j7480794L5025433L6890434
$$ -256045990 -318173924 -200462197 -105279338 -111773171 -129253965 -94228532 -57338098
10477e7338098o372087j2766578J7289480J9779100o713017j0048586J1199197
$$ -57338098 -63710185 -76476763 -59187283 -39408183 -46121200 -56169786 -44970589
10470d4970589J2851829n489209m572370J4080868J1795967j0652137j3183195
$$ -44970589 -32118760 -37607969 -42180339 -28099471 -16303504 -26955641 -40138836
10463d0138836R068656J8150873K425570p397014K644175R279418k51347p990502
$$ -40138836 -31070180 -12919307 -10493737 -17890751 -15246576 -5967158 -6218505 -14209007
10455a4209007l308118N20066k347763L81411R600647Q758795m154903r932554
$$ -14209007 -17517125 -16997059 -19344822 -18963411 -9362764 -603969 -4758872 -14691426
10447a4691426j370972N744320J985691k622229j566858k210078o542102n308637
$$ -14691426 -16062398 -10318078 -8332387 -10954616 -12521474 -14731552 -21273654 -26582291
10439b6582291K493393N907467K367552J148443L773635J991213k837641j74795
$$ -26582291 -24088898 -18181431 -15813879 -14665436 -10891801 -8900588 -11738229 -11913024
10431a1913024P873712P395040k263084o603229j904407l15569n479744o115562
$$ -11913024 -4039312 3355728 1092644 -5510585 -7414992 -7730561 -13210305 -19325867
10423a9325867J035808M440885K04402n05639O296205Q670230O19505o781979
$$ -19325867 -18290059 -13849174 -13644772 -14150411 -7854206 816024 1435529 -5346450
10415e346450n039108j071614j621706j803480J960300L525513J80044p68554
$$ -5346450 -10385558 -11457172 -13078878 -14882358 -12922058 -9396545 -9216501 -9985055
10407i985055L507539N001839M71845j664591K269834L220665l601870q662794
$$ -9985055 -6477516 -1475677 -1003832 -2668423 -398589 2822076 -779794 -9442588
10399i442588m576654J276443O08849k163762l93065K477288J310656m41749J485667
$$ -9442588 -14019242 -12742799 -12133950 -14297712 -14690777 -12213489 -10902833 -11344582 -9858915
10390i858915L566705K211433Q47202J660750J0532n488797p432856j810971M342718
$$ -9858915 -6292210 -4080777 -3233575 -1572825 -1562293 -7051090 -14483946 -16294917 -11952199
10381a1952199M926462L913465M935264L031689m294855q781053m144508K794990
$$ -11952199 -7025737 -3112272 1822992 4854681 559826 -8221227 -12365735 -9570745
10373i570745L686095J662456K607793L204154j027653m816098k284047J095250
$$ -9570745 -5884650 -4222194 -1614401 1589753 562100 -4253998 -6538045 -5442795
10365e442795j960900o466675l569560L440270M962729J576744R21120K380073
$$ -5442795 -7403695 -13870370 -17439930 -13999660 -9036931 -7460187 -6539067 -4158994
10357d158994p18079o169036m769232L214325P165576L015493j458872n52115
$$ -4158994 -4877073 -11046109 -15815341 -12601016 -5435440 -2419947 -3878819 -4430934
10349d430934J653793R01329k09554Q49996J336596l20351l46005L189103N410521
$$ -4430934 -2777141 -1875812 -2085366 -1235370 101226 -219125 -565130 2623973 8034494
10340H034494K116303k960450l803510j201692p26483l897122o379998m297521
$$ 8034494 10150797 7190347 3386837 2185145 1458662 -2438460 -8818458 -13115979
10332a3115979J428352O907261Q661826N237504j909628q294313r056303l414305
$$ -13115979 -11687627 -4780366 3881460 9118964 7209336 -1084977 -10141280 -13555585
10324a3555585L771497O020352J394643n548501q253422m532428J656246M533481
$$ -13555585 -9784088 -3763736 -2369093 -7917594 -16171016 -20703444 -19047198 -14513717
10316a4513717K367389r88318o56702L174286N111877J781933k714241j945794
$$ -14513717 -12146328 -13134646 -13791348 -10617062 -5505185 -3723252 -6437493 -8383287
10308h383287L248950N357251J214044l290766k362718J298936J759409j030101
$$ -8383287 -5134337 222914 1436958 -1853808 -4216526 -2917590 -1158181 -2188282
10300b188282k859706k591517k105218j471133K62176J629183J266571J409726
$$ -2188282 -5047988 -7639505 -9744723 -11215856 -10953680 -9324497 -8057926 -6648200
10292f648200L727466M765234J329434l048980l658228k897089n245446p586362
$$ -6648200 -2920734 1844500 3173934 124954 -3533274 -6430363 -11675809 -19262171
10284a9262171l832521L423632N964459L058060J259099K315919K171097J296817
$$ -19262171 -23094692 -19671060 -13706601 -10648541 -9389442 -7073523 -4902426 -3605609
10276c605609M093058P640404L860094n237786p696812n78217M410717l43160
$$ -3605609 487449 8127853 11987947 6750161 -946651 -1524868 2885849 2542689
10268B542689o602909m517632K536508N766068M399500K766827J403227j015891
$$ 2542689 -4060220 -8577852 -6041344 -275276 4124224 6891051 8294278 7278387
10260G278387k900827l183598l597190l121644K137248R303063Q656121j153532
$$ 7278387 4377560 1193962 -2403228 -5524872 -3387624 5915439 14571560 13418028
10252A3418028q296587n248272j16633j677689m348444L12023O932526M989289
$$ 13418028 5121441 -126831 -243464 -1921153 -6269597 -5957574 974952 5964241
10244E964241k823712n093901j84559L214141J365474j080334j463653j851124
$$ 5964241 3140529 -1953372 -2137931 1076210 2441684 1361350 -102303 -1953427
10236a953427k325967j228672q32769l838660o140619k166376M673986O228899
$$ -1953427 -4279394 -5508066 -6340835 -10179495 -16320114 -18486490 -13812504 -7583605
10228g583605K378934R0881J359742J783137J53492m0445J607001J757821J18724
$$ -7583605 -5204671 -5113790 -3754048 -1970911 -1817419 -1857864 -250863 1506958 1625682
10219A625682p69974j260437k640935j996285K643756N360632L76315o326846
$$ 1625682 855708 -404729 -3045664 -5041949 -2398193 2962439 3338754 -2988092
10211b988092m799484K266179L667300j290703k452275K246338L116270k937471
$$ -2988092 -7787576 -5521397 -1854097 -3144800 -5597075 -3350737 -234467 -3171938
10203c171938n892702k68959M943946J932895l001181j637226J930792J49164
$$ -3171938 -9064640 -9333599 -4389653 -2456758 -5457939 -7095165 -5164373 -5015209
10195e015209l583484j248469M930009N813265L67966l545367k291989o23512
$$ -5015209 -8598693 -9847162 -4917153 896112 1264078 -2281289 -4573278 -5196790
10187e196790j943744k618441J320796P255447R010641M383500k436421n375669
$$ -5196790 -7140534 -9758975 -8438179 -1182732 7827909 12211409 9774988 4399319
10179D399319k888392M39070l59694m070087n203926k167525O02629k52445k230856
$$ 4399319 1510927 1949997 1590303 -2479784 -7683710 -9851235 -9248606 -9501051 -11731907
10170a1731907j728442L92517J329549J286752K022748K561159M79712l193723
$$ -11731907 -13460349 -13067832 -11738283 -10451531 -8428783 -5867624 -5387912 -8581635
10162h581635m040282K9892N352783O160420J054367n196717o740361k838295
$$ -8581635 -12621917 -12592025 -7239242 -1078822 -24455 -5221172 -11961533 -14799828
10154a4799828K162982M400473L654896J113976k263218m039754j450383L322453
$$ -14799828 -12636846 -8236373 -4581477 -3467501 -5730719 -9770473 -11220856 -7898403
10146g898403L891337p42702k796204K729435Q612504N242319m321542q324763
$$ -7898403 -4007066 -4749768 -7545972 -4816537 3795967 9038286 4716744 -3608019
10138c608019l046605L920899O094060M273801M32043m865297q004534m773115
$$ -3608019 -6654624 -2733725 3360335 7634136 8066179 3200882 -4803652 -9576767
10130i576767J233745J918081k201697k308354L323376N790199J287567j738089
$$ -9576767 -8343022 -6424941 -8626638 -10934992 -7611616 -1821417 -533850 -2271939
10122b271939K461708O356420K120691m902696n886051l137028l714560n354633
$$ -2271939 189769 6546189 8666880 3764184 -2121867 -5258895 -8973455 -14328088
10114a4328088j314789N340883N339742r47520l730298J47944L046997J67853
$$ -14328088 -15642877 -10301994 -4962252 -5909772 -9640070 -9492126 -6445129 -6277276
10106f277276l273572j985128J247843J966477J533173K999982M567659K545568
$$ -6277276 -9550848 -11535976 -10288133 -8321656 -6788483 -3788501 779158 3324726
10098C324726k031867m333836k188516J448798K276920n89551l667043k854385
$$ 3324726 1292859 -3040977 -5229493 -3780695 -1503775 -2093326 -5760369 -8614754
10090h614754J624854N164497M549378J776612K76995j38535j466742l019630
$$ -8614754 -6989900 -1825403 2723975 4500587 4777582 4639047 3172305 152675
10082A52675k862943j987304k402090k429362P45011M550378L296883k348990
$$ 152675 -2710268 -4697572 -7099662 -9529024 -8784013 -4233635 -936752 -3285742
10074c285742m588962M54550O651787O351195K43673n358157p188314o264613
$$ -3285742 -7874704 -7420154 -768367 5582828 5826501 468344 -6719970 -12984583
10066a2984583l479759O34698L234117J550717k193979k746183J100663N483819
$$ -12984583 -16464342 -15829644 -12595527 -11044810 -13238789 -15984972 -14884309 -9400490
10058i400490P662263Q490542P842577L186294m364177p842012l294436K856208
$$ -9400490 -1738227 6752315 14594892 17781186 13417009 5574997 2280561 5136769
10050E136769J557619n732857q656036k763080M438930M581219p03640m078733
$$ 5136769 6694388 961531 -7694505 -10457585 -6018655 -1437436 -2141076 -6219809
10042f219809k915588m04451Q00869J077467J354280K046187L464546M437197
$$ -6219809 -9135397 -9539848 -8738979 -7661512 -6307232 -4261045 -796499 3640698
10034C640698K313972k675536n508513k651272K070606K458599j116279k945094
$$ 3640698 5954670 3279134 -2229379 -4880651 -2810045 -351446 -1467725 -4412819
10026d412819r04237J439061J293316k22185j606201k484607j323639K991975
$$ -4412819 -5317056 -3877995 -2584679 -2806864 -4413065 -6897672 -8221311 -5229336
10018e229336O721322M205167l323877p593351m182962J827875L918465K622081
$$ -5229336 1491986 5697153 2373276 -5220075 -9403037 -7575162 -3656697 -1034616
10010a034616K131164K794054J780514j303311l788260l765919j591425J340938
$$ -1034616 1096548 3890602 5671116 4367805 579545 -3186374 -4777799 -3436861
10002c436861L197277K456280n8140j259418N00621L113560L283668J32517m350889
$$ -3436861 -239584 2216696 2158556 899138 1399759 4513319 7796987 7929504 3578615
9993C578615o861131m760517J089553N460181L776148j703188m240911j698547
$$ 3578615 -3282516 -8043033 -6953480 -1493299 2282849 579661 -3661250 -5359797
9985e359797R74235k71926k735092k029504Q34772J489938q35208k445577p38144
$$ -5359797 -4385562 -4657488 -7392580 -9422084 -8587312 -7097374 -7932582 -10378159 -11116303
9976a1116303K495266L874618K753934J652171K552884L743898J823936l090915
$$ -11116303 -8621037 -4746419 -1992485 -340314 2212570 5956468 7780404 4689489
9968D689489o582481n616592k392265n27177l36919n83787j546562k716566j037360
$$ 4689489 -1892992 -7509584 -9901849 -10429026 -10765945 -11349732 -12896294 -15612860 -16650220
9959a6650220L900354O526167K813740k345556j935658K266861L243209L64046
$$ -16650220 -12749866 -6223699 -3409959 -5755515 -7691173 -5424312 -2181103 -1817057
9951a817057j261275r35289k260946m155821k263867J072603p92133n850230m483758
$$ -1817057 -3078332 -4013621 -6274567 -10430388 -12694255 -11621652 -12413785 -18264015 -22747773
9942b2747773M447577J0188619O327924m63016k243290n1297K351920N020247
$$ -22747773 -18300196 -8111577 -1783653 -2246669 -4489959 -4541256 -2189336 2830911
9934B830911O925372L896348l254889p273225n730470m680904o845015o320976
$$ 2830911 9756283 13652631 10397742 3124517 -2605953 -7286857 -14131872 -20452848
9926b0452848j28393N411301N579318M315148M617389K539408l049252n609595
$$ -20452848 -20581241 -15169940 -9590622 -5275474 -658085 1881323 -1167929 -6777524
9918f777524k464959l19083k798701l962383o60489J181179o40163O27248N810567
$$ -6777524 -9242483 -9561566 -12360267 -16322650 -16983139 -15801960 -16442123 -15814875 -10004308
9909a0004308N226509k478025m229271M141764P439281k472856r723286j178411
$$ -10004308 -4777799 -7255824 -11485095 -7343331 95950 -2376906 -12100192 -13278603
9901a3278603R505009N453504m154014k376757M461933P08708p782938n281858
$$ -13278603 -3773594 1679910 -2474104 -4850861 -388928 319780 -7463158 -12745016
9893a2745016K959087R67022o511261l106235O808816N813597l561216n003990
$$ -12745016 -9785929 -8818907 -15330168 -18436403 -11627587 -5813990 -9375206 -14379196
9885a4379196n03197l414275p491717R81679Q997370l448976j8271517m712477
$$ -14379196 -14882393 -18296668 -25788385 -24806706 -15809336 -19258312 -37529829 -42242306
9877d2242306J5585771p749037n8305607n4050942K7883175R8267243P5737381
$$ -42242306 -26656535 -34405572 -92711179 -146762121 -118878946 -20611703 55125678
9870E5125678N34809l2585021q736032J1298372k6294j0164279r12297K968457
$$ 55125678 55660487 23075466 14339434 25637806 25611512 15447233 14534936 17503393
9862A7503393j0408756j5416795J686347J6325893Q915435m238602l778123J758606
$$ 17503393 7094637 -8322158 -6635811 9690082 18605517 14366915 10588792 12347398
9854A2347398j503398o677536l062734K803052J608405j355223P74474K311932
$$ 12347398 10844000 4166464 1103730 3906782 5515187 4159964 4934438 7246370
9846G246370j903322m424274P48451N959375L725927l49892L92033J394197k517533
$$ 7246370 5343048 918774 1667225 7626600 11352527 11002635 11394668 12788865 10271332
9837A0271332n994600l097831J975322L125415J532695n53646m546905p859181
$$ 10271332 4276732 1178901 3154223 6279638 7812333 7258687 2711782 -5147399
9829e147399l630453N539137O951734j978042p305087q94218N995494K349225
$$ -5147399 -8777852 -3238715 3713019 1734977 -5570110 -6464328 -468834 1880391
9821A880391m133128j596935N777388O945956K859202J134055O53057l423163
$$ 1880391 -2252737 -3849672 1927716 8873672 11732874 12866929 13519986 10096823
9813A0096823o472224j376045O663602O643457q61633n966789n471819l979351
$$ 10096823 3624599 2248554 8912156 15555613 14693980 8727191 3255372 -723979
9805g23979k504150J260584L942248M24788m896282l036619M346621O577300P10683
$$ -723979 -3228129 -1967545 1974703 2399491 -2496791 -5533410 -1186789 5390511 6101194
9796F101194m891984m628143k343742j971652j387299J350475L657400L349074
$$ 6101194 1209210 -3418933 -5762675 -7734327 -9121626 -7771151 -4113751 -764677
9788g64677J741783P8799j579427j441304J971475M871250K082042l885417m938418
$$ -764677 977106 1055905 -523522 -1964826 6649 4877899 6959941 3074524 -1863894
9779a863894M89064M921314L295422l71605p25410J101878J369844J63148m67184
$$ -1863894 -1374830 3546484 6841906 6470301 5744891 6846769 8216613 8379761 7912577
9770G912577j021089k864258m358949k568671K053637N434969M327706l59315
$$ 7912577 6891488 4027230 -331719 -2900390 -846753 4588216 8915922 8556607
9762H556607m712334n748891l931623j503097Q95191M042775O814987O211091
$$ 8556607 3844273 -1904618 -5836241 -7339338 -6444147 -2401372 4413615 10624706
9754A0624706J827997k782489m737256m664540l595646j106078J524741J144914
$$ 10624706 12452703 9670214 4932958 268418 -3327228 -4433306 -2908565 -1763651
9746a763651j467613r41475L828885N972576R00369n477285n277624k36924K622953
$$ -1763651 -3231264 -4172739 -343854 5628722 6529091 1051806 -4225818 -4462742 -1839789
9737a839789K263518K251300K168735l24313k000951J386976N347301K085546
$$ -1839789 423729 2675029 4843764 4519451 2518500 3905476 9252777 11338323
9729A1338323n602777p297878j790540J197483k111177l537394J931209O890481
$$ 11338323 5735546 -1562332 -3352872 -2155389 -4266566 -7803960 -5872751 1017730
9721A017730M077612j733460k325191J258761K855975J979071K104679K421720
$$ 1017730 5095342 3361882 1036691 2295452 5151427 7130498 9235177 11656897
9713A1656897o90050o205528q975113o447714m97850N511305Q082587M989723
$$ 11656897 10966847 4761319 -4213794 -10661508 -11159358 -5648053 2434534 7424257
9705G424257j151238l983142j442594J114773p12902l484504j902615K716738
$$ 7424257 6273019 2289877 847283 1962056 1249154 -2235350 -4137965 -1421227
9697a421227N175487L853654L38684m561085q959232p969031l0108P947231Q329663
$$ -1421227 3754260 7607914 7946598 3385513 -5573719 -13542750 -13572858 -5625627 2704036
9688B704036L116705L3938P86280M89122k771733n371135m791131k083369K066915
$$ 2704036 5820741 5854679 6640959 7130081 4358348 -1012787 -5803918 -7887287 -5820372
9679e820372P162385R083028L649416n332637q675029m006355J232499J002457
$$ -5820372 1342013 10425041 14074457 8741820 66791 -3939564 -2707065 -1704608
9671a704608j611098r13893K876900N533351N061605K352484j339368m459688
$$ -1704608 -3315706 -4229599 -1352699 4180652 9242257 11594741 10255373 5795685
9663E795685n088077l254606j443434j306650j852950j658011n43521J205237
$$ 5795685 707608 -2546998 -3990432 -5297082 -7150032 -8808043 -9351564 -8146327
9655h146327K584371J196413l536241o994149m001956L031556O104833K653288
$$ -8146327 -5561956 -4365543 -7901784 -14895933 -18897889 -15866333 -9761500 -7108212
9647g108212j321378q87767J292913J041505o71593j117702p49700m43009J525669
$$ -7108212 -8429590 -9317357 -8024444 -6982939 -7654532 -8772234 -9521934 -9964943 -8439274
9638h439274N123757N667213O54484m271793k193323M809948Q190264M249638
$$ -8439274 -3315517 2351696 3006180 -1265613 -3458936 1351012 9541276 13790914
9630A3790914k483534o338570o050335l490251j020605l05254r32447o57631J030519
$$ 13790914 11307380 4968810 -1081525 -4571776 -5592381 -5897635 -6830082 -7487713 -6457194
9621f457194J423732r54154l047642j681612J364034K460688J746689J485150
$$ -6457194 -5033462 -5987616 -9035258 -10716870 -9352836 -6892148 -5145459 -3660309
9613c660309J337965q9985j283509l30912P40055o17333j854529R23979N319850
$$ -3660309 -2322344 -2412329 -3695838 -4026750 -3286695 -3904028 -5758557 -4834578 485272
9604D85272N380821J151947j381533J7367J050531j162007l760901l700199k180797
$$ 485272 5866093 7018040 5636507 5653874 6704405 5542398 1781497 -1918702 -4099499
9595d099499j400875j306670j277637j233010j95092K398089L882744J381454
$$ -4099499 -5500374 -6807044 -8084681 -9317691 -9512783 -7114694 -3231950 -1850496
9587a850496k572473k630597J257065M018177L612680K585017J484936j722046
$$ -1850496 -4422969 -7053566 -5796501 -1778324 1834356 4419373 5904309 4182263
9579D182263m862351k557667L828951N730893J28936n482135m822385j210704
$$ 4182263 -680088 -3237755 591196 6322089 6451025 968890 -3853495 -5064199
9571e064199N54777K156613N340087N578686j15530n671102m345327R12864L340793
$$ -5064199 -4509422 -2352809 2987278 8565964 8450434 2779332 -1565995 -653131 2687662
9562B687662L077261L578576K747881k594846p602481n292993J106634K240181
$$ 2687662 5764923 9343499 12091380 9496534 1894053 -3398940 -2292306 -52125
9554e2125k495350m756937j567172R57146m66418r04289L022404O714045N338109
$$ -52125 -2547475 -7304412 -8871584 -7914438 -8380856 -9285145 -6262741 451304 5789413
9545E789413J405301J36346J880814K901299P25124l528600o069078l537683K301899
$$ 5789413 7194714 7331060 9211874 12113173 12838297 9309697 3240619 -297064 2004835
9536B004835M567781k31194o214764o019274j648972j03516r63402J855102O974897
$$ 2004835 6572616 6341422 126658 -5892616 -7541588 -7645104 -8608506 -6753404 221493
9527B21493N737234k511071o754530o14890P708410Q027252K207577j499991j153628
$$ 221493 5958727 3447656 -3306874 -3921764 3786646 11813898 14021475 12521484 11367856
9518A1367856l68528j21740R60792J647115J61313j570278j391447j568812m379598
$$ 11367856 10999328 10877588 11838380 13485495 13646808 12076530 10685083 9116271 4736673
9509D736673o249841k556199M069136O632806L674147K24598o17319j261295l949530
$$ 4736673 -1513168 -4069367 -231 6632575 10306722 10531320 9914001 8652706 4703176
9500D703176o285398m614497N08675M208212K560699k449056m425629m18558M462764
$$ 4703176 -1582222 -6196719 -5688044 -1479832 1080867 -1368189 -5793818 -6212376 -1749612
9491a749612L679141j181789l023373o52951l1514k911606k976069K773526P272194
$$ -1749612 1929529 747740 -2275633 -2928584 -2960098 -5871704 -8847773 -6074247 1197947
9482A197947M237942j484341j941649J538471K320358M9168o70063K88585m50121
$$ 1197947 5435889 3951548 2009899 3548370 5868728 5917896 5247833 5536418 5086297
9473E086297j753097n5118K159987o89419o385347o476122L50442N556438L671443
$$ 5086297 3333200 3278082 5438069 4748650 -1636697 -8112819 -7762377 -2205939 1465504
9464A465504l35911m053L321451M398665K102704p01872j923851j664327j089159
$$ 1465504 1129593 1125540 4446991 8845656 10948360 10246488 8322637 6658310 5569151
9455E569151j554604k936560k854313k60416J381263j240387m705576k777585
$$ 5569151 4014547 1077987 -1776326 -2036742 -655479 -1895866 -6601442 -9379027
9447i379027L368830N514128K70203n809561n423765N74305O051934O679054J912991
$$ -9379027 -6010197 -496069 -225866 -6035427 -11459192 -10884887 -4832953 1846101 3759092
9438C759092n374635r025543m214037N452211J0084017N479117j655489l317591
$$ 3759092 -1615543 -10641086 -14855123 -9402912 681105 6160222 4504733 1187142
9430A187142j63464J943377R07079q30055j479767j209027l0927J683222J762820
$$ 1187142 1023678 2967055 3874134 3044079 1564312 355285 324358 2007580 3770400
9421C770400j376803n499889o235207j993970M000165O526502L305538k211740
$$ 3770400 2393597 -3106292 -9341499 -11335469 -7335304 -808802 2496736 284996
9413B84996m003725o42363K806083K111096l53342r98282j776353n128109o448431
$$ 284996 -3718729 -4361092 -1555009 556087 202745 -795537 -2571890 -7699999 -14148430
9404a4148430p88557N975377M223620k412486q76874R063294J1893330R87438
$$ -14148430 -14936987 -8961610 -4737990 -7150476 -8027350 1035944 12929274 13916712
9396A3916712r551072p036238L63771o79395n905870k756652O202356P330561
$$ 13916712 4365640 -2670598 -2306827 -2986222 -8892092 -11648744 -5446388 1884173
9388A884173o12553m754465M41224N994090M686156M96912j616643l204191n439672
$$ 1884173 1271620 -3482845 -3041621 2952469 7638625 8135537 6518894 3314703 -2124969
9379b124969n069964j438601J096063J044060J973707M434310M178390O80156
$$ -2124969 -7194933 -8633534 -7537471 -6493411 -4519704 -85394 4092996 4773152
9371D773152j408884j425814l673460o808848l260715O517016J0527152K482463
$$ 4773152 3364268 1938454 -1735006 -8543854 -11804569 -5287553 5239599 7722062
9363G722062p535001p458548M20383N810437N446209K874033l54836m161621n586597
$$ 7722062 187061 -7271487 -6851104 -1040667 4405542 7279575 6924739 2763118 -2823479
9354b823479l298098j891298m121294m310489K070867Q128732N233550j773026
$$ -2823479 -6121577 -8012875 -12134169 -16444658 -14373791 -6245059 -1011509 -2784535
9346b784535j088963O843599R357466J057544q706982j0422287n971165j638130
$$ -2784535 -3873498 2970101 12327567 13385111 4678129 -5744158 -11715323 -13353453
9338a3353453J449527M557958N780687L047294j332718l585649l151081j571028
$$ -13353453 -11903926 -7345968 -1565281 1482013 149295 -3436354 -6587435 -8158463
9330h158463L88823K090603K263090J048977M77639J356534J992871J101767m07448
$$ -8158463 -7769640 -5679037 -3415947 -2366970 -1889331 -532797 1460074 2561841 2154393
9321B154393j365597j659178j172566o630J39186k155927m678508l575943R12138
$$ 2154393 788796 -870382 -2042948 -2049578 -1910392 -4066319 -8744827 -12320770 -11408632
9312a1408632M355627M342663K890583J730905m74985m127450n750859k297331
$$ -11408632 -7053005 -2710342 180241 1911146 1436161 -2691289 -8442148 -10739479
9304a0739479L734751O407404K866615l809862p743633n593925M80000M988083
$$ -10739479 -7004728 -597324 2269291 -1540571 -9284204 -14878129 -14398129 -9410046
9296i410046M834286K217908J022831K000911L291820L673011K655695n34408
$$ -9410046 -4575760 -2357852 -1335021 665890 3957710 7630721 10286416 9752008
9288I752008m722481n725075j699606K554957J727242j498144m31970M182807
$$ 9752008 5029527 -695548 -2395154 159803 1887045 388901 -43069 4139738
9280D139738M436477k039309p400842m819790K032767M997770K154118j878066
$$ 4139738 8576215 6536906 -863936 -5683726 -3650959 1346811 3500929 1622863
9272A622863l000224r79391K123234L847094L093297J462405J027196O48281k199803
$$ 1622863 -1377361 -2356752 -233518 3613576 6706873 8169278 9196474 9844755 7644952
9263G644952n890931n628392r98568K455572J040065k505250m259797m063757
$$ 7644952 1754021 -3874371 -4872939 -2417367 -1377302 -3882552 -8142349 -12206106
9255a2206106k878266k35625K861588L305788J040350O6329J610037J791866p20533
$$ -12206106 -15084372 -15319997 -12458409 -9152621 -8112271 -8045942 -6435905 -4644039 -5364572
9246e364572j074073L188685O233608K714942l015915l611043k71388K97714k511563
$$ -5364572 -6438645 -3249960 2983648 5698590 2682675 -928368 -1199756 -902042 -3413605
9237c413605l038559L04546K530575O83075j776722j175119Q16742M59104k279657
$$ -3413605 -6452164 -6147618 -3617043 -2933968 -4710690 -5885809 -5069067 -4609963 -6889620
9228f889620l802585j782022J712359K829660J427291J456145L895347L087577
$$ -6889620 -10692205 -12474227 -10761868 -7932208 -6504917 -5048772 -1153425 1934152
9220A934152m392783j0656686n537617O406536R806073J455153m124352K044060
$$ 1934152 -2458631 -13115317 -18652934 -12246398 -2440325 -985172 -5109524 -3065464
9212c065464Q673407L292962o556770n889874L049889N596899r08818m845477
$$ -3065464 5607943 8900905 2344135 -3545739 -495850 5101049 4192231 -653246
9204f53246j012204K879938J695196p3034L64713q77148m150993l290810K601942
$$ -653246 -1665450 1214488 2909684 2836650 3201363 2324215 -1826778 -5117588 -2515646
9195b515646N419093J111861l449781j921753K181933K901153N93624j684273
$$ -2515646 2903447 4015308 565527 -1356226 825707 3726860 4320484 2636211
9187B636211l340439l561692n72302K911770J192669m089515l824856M181210
$$ 2636211 -704228 -4265920 -4838222 -1926452 -733783 -4823298 -8648154 -4466944
9179d466944R809189N175791l934905p552234m734400o14928K701655N200100
$$ -4466944 5342245 10518036 6583131 -969103 -5703503 -6318431 -3616776 1583324
9171A583324M906598J589824n56380M52108N72840k428360l975857j193843P79356
$$ 1583324 6489922 8079746 7523366 7975474 8548314 6119954 2144097 950254 1729610
9162A729610k293124n618548l753895k83619o55457j735290J941060O797792N359248
$$ 1729610 -563514 -6182062 -9935957 -10219576 -10875033 -12610323 -10669263 -3871471 1487777
9153A487777r38059m030419j793664Q54898J309485J067144P1447k429014l168673
$$ 1487777 549718 -3480701 -5274365 -4419467 -3109982 -2042838 -1971391 -4400405 -7569078
9144g569078R67043N931288N563525J496670j67257L16922k002579o055272n605209
$$ -7569078 -6602035 -670747 4892778 6389448 6222191 6539113 4536534 -1518738 -7123947
9135g123947m48634K814747J629673Q2322N2836j145701l109989j383210L779050
$$ -7123947 -7572581 -4757834 -3128161 -3045839 -2993003 -4138704 -7248693 -8631903 -4852853
9126d852853O058405K908289r79855k211510k803406l401831p74508M458479N764672
$$ -4852853 1205552 4113841 3133986 922476 -1880930 -5282761 -6057269 -1598790 4165882
9117D165882R87325k713999L11959M945434L260119l263653o449862l444939M58080
$$ 4165882 5153207 2439208 2751167 7696601 10956720 7693067 1243205 -2201734 -1743654
9108a743654J40115l129272m209193k15928O085364Q366521L347616m659577q091419
$$ -1743654 -1603539 -4732811 -8942004 -9157932 -3072568 5293953 8641569 3981992 -4109427
9099d109427m966606k43355J736754K013855L097525M494341M363315K547597
$$ -4109427 -9076033 -9319388 -7582634 -5568779 -2471254 2023087 6386402 8933999
9091H933999m8469k678246m075732l087493q82406Q7554k24274K15598J478353
$$ 8933999 8885530 6207284 2131552 -955941 -1838347 -1750793 -1975067 -1759469 -281116
9082b81116J690609J159931J923548K667222m86415o437522q044099j881555N728270
$$ -281116 1409493 2569424 4492972 7160194 6673779 236257 -7807842 -9689397 -3961127
9073c961127O703918J715364j891778m60694K403088K106736j049926l376377
$$ -3961127 2742791 4458155 2566377 2105683 4508771 6615507 5565581 2189204
9065B189204l017197j907314k470240l623898j935686L070426P324931P303194
$$ 2189204 -827993 -2735307 -5205547 -8829445 -10765131 -7694705 -369774 6933420
9057F933420M005272k512l988224o572828m193813L087726Q212537N744724L61885
$$ 6933420 10938692 10936180 6947956 375128 -3818685 -730959 7481578 13226302 13588187
9048A3588187m80894J179005j848338p769075p376406J29922M758808J640609
$$ 13588187 13107293 14286298 12437960 4668885 -2707521 -2577599 2181209 3821818
9040C821818k132802p39598J337900o58979k889963j218953O91267n43812l07828
$$ 3821818 1689016 949418 2287318 1628339 -1261624 -2480577 -1789310 -2333122 -2640950
9031b640950M824769P952692K108649o671813p595730j736662J016118j571778
$$ -2640950 2183819 10136511 12245160 5573347 -2022383 -3759045 -2742927 -4314705
9023d314705k481020R81760L603449K887559K606065L795724J889485m058224
$$ -4314705 -6795725 -5813965 -2210516 677043 3283108 7078832 8968317 4910093
9015D910093p754501n228569r65249k16984j120455P87092M651800N793054K650361
$$ 4910093 -2844408 -8072977 -9038226 -9255210 -10375665 -9588573 -4936773 856281 3506642
9006C506642j520557k689529K22748M450951N464893J647613l144369m050330
$$ 3506642 1986085 -703444 -480696 3970255 9435148 11082761 7938392 3888062
8998C888062j599409k37948j186298j499542l65165o02244k224671n57281N529533
$$ 3888062 2288653 2050705 864407 -635135 -1000300 -1602544 -3827215 -4384496 1145037
8989A145037Q778145K680375p574997r926495j099249Q448085P573684j612751
$$ 1145037 9923182 12603557 5028560 -4897935 -5997184 2450901 10024585 8411834
8981H411834o924112j888980O191718O021015k851201r445623n778488K903461
$$ 8411834 1487722 -401258 5790460 11811475 8960274 -485349 -6263837 -3360376
8973c360376N554933k01674o165623n391214l85181K426436J882964J718256L263353
$$ -3360376 2194557 1992883 -4172740 -9563954 -9949135 -7522699 -5639735 -3921479 -658126
8964f58126L352674Q7101l199415k346338J217362J895890k199039o159105m812239
$$ -658126 2694548 2781649 -417766 -2764104 -1546742 349148 -1849891 -8008996 -12821235
8955a2821235L53920L818571L778442L191153L553138K397324j556909m932724
$$ -12821235 -12467315 -8648744 -4870302 -1679149 1873989 4271313 2714404 -2218320
8947b218320m137774m17164K382293K934271K549246J995309J110714L91628L92648
$$ -2218320 -6356094 -6773258 -4390965 -1456694 1092552 3087861 4198575 4590203 4982851
8938D982851M33204r6425l92081j51206j114878m145133o322233m107392J356773
$$ 4982851 5416055 5319630 4927549 4776343 3661465 -483668 -6805901 -10913293 -9556520
8929i556520N136015M548562J735143K7429m0742m30491k531382n007806m763756
$$ -9556520 -4420505 128057 1863200 1890629 1849887 1419396 -1111986 -6119792 -10883548
8920a0883548n96415M504374O322773M422183J801904j43936k628762n003663
$$ -10883548 -11479963 -6975589 -652816 3769367 5571271 5427335 2798573 -2205090
8912b205090m122331j67316J815004n72758k677617j8533M457064N326800K996497
$$ -2205090 -6327421 -6494737 -4679733 -5252491 -7930108 -7948641 -3491577 1835223 4831720
8903D831720J332651M39647j643304k755105M48919M808439L640855k604032o079863
$$ 4831720 6164371 6604018 4960714 2205609 2654528 7462967 11103822 8499790 2419927
8894B419927l026821J288699J072706k524676m952722m383955j734819J566941
$$ 2419927 -606894 681805 1754511 -770165 -5722887 -10106842 -11841661 -10274720
8886a0274720L686980L262562J372832K2874j061722k773773l100055j69449K568551
$$ -10274720 -6587740 -3325178 -1952346 -1929472 -2991194 -5764967 -8865022 -9034471 -6465920
8877f465920O24383k947888j090187M933592N918065m55083m898584j067541M471884
$$ -6465920 -5841537 -8789425 -9879612 -4946020 972045 516962 -4381622 -5449163 -977279
8868i77279L398497j317482j814871J384993J719341j693845l626365j942908
$$ -977279 2421218 1103736 -711135 673858 2393199 699354 -2927011 -4869919
8860d869919O07405K348586L460891K366819j800979m684738j795589L249103
$$ -4869919 -4262514 -1913928 1546963 3913782 2112803 -2571935 -4367524 -1118421
8852a118421L224737r39053j412209L350824N833821J920146k648761k005592
$$ -1118421 2106316 1167263 -244946 3105878 8939699 10859845 8211084 6205492
8844F205492J370022K625757K236521K227453N60364m233357p317896l635159
$$ 6205492 7575514 10201271 12437792 14665245 15225609 10992252 3674356 39197
8836C9197K922233L481661l561981j0420611j0132684l725888L356267P333358
$$ 39197 2961430 6443091 2881110 -7539501 -17672185 -21398073 -18041806 -10708448
8828a0708448P386956M662809J749269R27195J834348K223253R50332j324238
$$ -10708448 -3321492 1341317 3090586 4017781 5852129 8075382 9025714 7701476
8820G701476l560577m400422k120275K601090N165038J982640l900255o119644
$$ 7701476 4140899 -259523 -2379798 221292 5386330 7368970 3468715 -2650929
8812b650929l300146M46142K686826M581407N325924J575583n295167q061493
$$ -2650929 -5951075 -5504933 -2818107 1763300 7089224 8664807 3369640 -4691853
8804d691853l571134K174999L220441J837939K117875J864710j561638l221272
$$ -4691853 -8262987 -6087988 -2867547 -1029608 1088267 2952977 1391339 -1829933
8796a829933J720173O663282J892353p840354p776780L534540R969888K238768
$$ -1829933 -109760 6553522 8445875 605521 -7171259 -3636719 6333169 8571937
8788H571937p427020m641770M795380N389117k887572n684597J846084P907888
$$ 8571937 1144917 -3496853 1298527 6687644 3800072 -1884525 -38441 7869447
8780G869447L497271m277831m604649J027307L355403j2097k902440j291792J474190
$$ 7869447 11366718 7088887 2484238 3511545 6866948 6854851 3952411 2660619 4134809
8771D134809P71416k714590m372009j667780K721021L757773j86291n131049n984596
$$ 4134809 4906225 2191635 -2180374 -3848154 -1127133 2630640 2444349 -2686700 -8671296
8762h671296k421174J489071K745169J877265K61231j636227k592662o69251L263656
$$ -8671296 -11092470 -9603399 -6858230 -4980965 -4719734 -6355961 -8948623 -9617874 -6354218
8753f354218M886516J762119k703228l265105L80837L348584J716697l028676
$$ -6354218 -1467702 294417 -2408811 -5673916 -5293079 -1944495 -227798 -3256474
8745c256474n816922l175195L272187P856218O064222n35657n350421l663559
$$ -3256474 -9073396 -12248591 -8976404 -1120186 4944036 4408379 -942042 -4605601
8737d605601K319357O361154N170857Q89260k759115m459188m788163l784951
$$ -4605601 -2286244 4074910 9245767 10135027 7375912 2916724 -1871439 -5656390
8729e656390j087041K064834L096950J143223j510245k119118p86657R5921r27873
$$ -5656390 -6743431 -4678597 -1581647 -438424 -1948669 -4067787 -4854444 -4758523 -5686396
8720e686396l028545m440891l726570k97252M412043O763242M422988J28273q55508
$$ -5686396 -8714941 -13155832 -16882402 -17179654 -12767611 -6004369 -1581381 -1453108 -2308616
8711b308616K342875M828283K754193j539734l254614j324462J702833L828439
$$ -2308616 34259 4862542 7616735 6077001 2822387 1497925 3200758 7029197
8703G029197M696373L911632J187230k293446m669435n165789m039452j972705
$$ 7029197 11725570 15637202 16824432 14530986 9861551 4695762 656310 -1316395
8695a316395l57896k58460k15781K176802N368975M337535j720839o419165m625681
$$ -1316395 -1674291 -1932751 -2148532 28270 5397245 9734780 8013941 1594776 -3030905
8686c030905L4524R39332j660619k453058m06195L97369j459013k616488j197738
$$ -3030905 -2996381 -2057049 -3717668 -6170726 -6576921 -6179552 -7638565 -10255053 -11452791
8677a1452791N41808J074586K098099M317249M796297R17898n255046q213298
$$ -11452791 -10910983 -9836397 -7738298 -3421049 1375248 2293146 -2961900 -11175198
8669a1175198m058198M972589J0504598N630228n496282j0175690l114172N634274
$$ -11175198 -15233396 -10260807 243791 5874019 377737 -9797953 -12912125 -7277851
8661g277851M917155j309860j743084L019772K223063n225087p575701j03685
$$ -7277851 -2360696 -3670556 -5413640 -2393868 -170805 -5395892 -12971593 -13075278
8653a3075278O149401K311097m184281k857902K691299K453968k497735k762730
$$ -13075278 -6925877 -4614780 -8799061 -11656963 -8965664 -6511696 -9009431 -11772161
8645a1772161L004073O546995L852119k5527p40156l37847j247004j772276j47172
$$ -11772161 -8768088 -2221093 1631026 1605499 865343 527496 -719508 -2491784 -2638956
8636b638956K147208L333193L727258L664333K217655q69602m232367o162143
$$ -2638956 -491748 2841445 6568703 10233036 12450691 11581089 7348722 1186579
8628A186579n349697j637655K160846J849485j829742j942359M969628J1410893
$$ 1186579 -4163118 -5800773 -3639927 -1790442 -3620184 -5562543 -592915 10817978
8620A0817978P664535m097909j1949746r867747l359881J251266M509203P642213
$$ 10817978 18482513 14384604 2434858 -7432889 -10792770 -9541504 -5032301 2609912
8612B609912O938882L28109o124064n341628L11995K460218j095782m325070k974945
$$ 2609912 9548794 9876903 3752839 -1588789 -1276794 1183424 87642 -4237428 -7212373
8603g212373j3109P50882O77935K320586L724705J533221k593159l784249j352257
$$ -7212373 -7225482 -6474600 -5796665 -3476079 248626 1781847 -811312 -4595561 -5947818
8594e947818O71980N53186J037743L071301L001322o28052k753098O01204M622620
$$ -5947818 -5275838 -4722652 -3684909 -613608 2387714 1759662 -993436 -392232 4230388
8585D230388K257608m279132o183893j277086L481518L300677J214383K42866
$$ 4230388 6487996 2208864 -3975029 -5252115 -1770597 1530080 2744463 2987329
8577B987329j914104o165461p379549k381542L151073K552621j367140j042750
$$ 2987329 1073225 -5092236 -12471785 -14853327 -11702254 -9149633 -10516773 -11559523
8569a1559523L511198M997728Q26614k718039K1395O173114Q857518N958601J194151
$$ -11559523 -8048325 -3050597 -2223983 -4942022 -4920627 1252487 10110005 16068606 17262757
8560A7262757j778281l180313m686210n431936l010356J429699K486664k259509
$$ 17262757 15484476 12304163 7617953 2186017 -824339 605360 3092024 832515
8552H32515p076356m906936K248627N833897L198223M07510J469007K595800L10622
$$ 832515 -6243841 -11150777 -8902150 -3068253 129970 537480 2006487 4602287 4912909
8543D912909k328710k182185j777968l211529k856557J574039M881019K440982
$$ 4912909 2584199 402014 -1375954 -4587483 -7444040 -5870001 -988982 1452000
8535A452000j307953m00666K017457k31587m217433k383989L721335N381026J333148
$$ 1452000 144047 -256619 1760838 1529251 -2688182 -5072171 -1350836 4030190 5363338
8526E363338p10478K150690L542369l58992m282849l068987N80016J902542J217162
$$ 5363338 4652860 6803550 10345919 9986927 5704078 2635091 3215107 5117649 6334811
8517F334811J033805J096636J7783j957040m163788n964646n172371n68256L738694
$$ 6334811 7368616 8465252 8483035 6525995 2362207 -3602439 -8774810 -9343066 -5604372
8508e604372K280618k761669l225427K793985P555934N305627J89640j526382
$$ -5604372 -3323754 -6085423 -9310850 -6516865 1039069 6344696 6534336 5007954
8500E007954p18568j586094l511268k613274J306197M254822L251254p90215m046901
$$ 5007954 4289386 2703292 -807976 -3421250 -2115053 2139769 5391023 4600808 553907
8491E53907k542573L580655Q108443M898466l469658q029822n347586j230837
$$ 553907 -1988666 1591989 9700432 14598898 11129240 3099418 -2248168 -3479005
8483c479005o72384q60894J962689M966585L582852n80652k425119r94263O94406
$$ -3479005 -4151389 -5012283 -3049594 1916991 5499843 4919191 2494072 1499809 2194215
8474B194215J200929J372656J059494p97806l544258n009296l619172P92996O318910
$$ 2194215 3395144 4767800 5827294 5029488 1485230 -3524066 -7143238 -6350242 -31332
8465c1332Q610643M639438k250975n256923l247544j843275l698730m134936J39825
$$ -31332 8579311 13218749 10967774 5710851 2463307 620032 -3078698 -7213634 -7073809
8456g073809M540777M006906J194844J128368K397580N57881l214800l969236
$$ -7073809 -2533032 1473874 2668718 3797086 6194666 6752547 3537747 -431489
8448d31489j308607O23618M3251j253583k123590k372277o25233K992112M322532
$$ -431489 -1740096 -1116478 -1073227 -2326810 -4450400 -6822677 -7447910 -4455798 -133266
8439a33266Q59491k693776j053338K160640k28081n681372l948013O331752J2943235
$$ -133266 726225 -1967551 -3020889 -860249 -1088330 -6769702 -10717715 -4385963 8557272
8430H557272O641119n405395r242711k291105N202546M772125r65004m453591
$$ 8557272 15198391 9792996 550285 -1740820 3461726 8233851 7268847 2815256
8422B815256l479198j929398k366905k176807J310746N120774M369294N62788
$$ 2815256 -663942 -2593340 -4960245 -7137052 -5826306 -705532 3663762 4226550
8414D226550J89422L638791K528698p128849j5483595j0737688L227339J0899655
$$ 4226550 4415972 8054763 10583461 3454612 -12028983 -22766671 -19539332 -8639677
8406h639677O095313j242262j173581L229913M035329J226657k07069k92060k460260
$$ -8639677 -2544364 -3786626 -4960207 -1730294 2305035 3531692 3324623 3032563 572303
8397E72303m785041j852502M682238N992865q20605o828789l505020M389234N125102
$$ 572303 -4212738 -6065240 -1383002 4609863 3789258 -3039531 -6544551 -2155317 2969785
8388B969785l078617r307903n306328L595488P085481L926843R04064P36959q40314
$$ 2969785 -108832 -9416735 -14723063 -11127575 -4042094 -115251 788813 1525772 685458
8379F85458n446114p352350k169491N430435P806371M685050K070473K729944
$$ 685458 -4760656 -12113006 -14282497 -8852062 -1045691 3639359 5709832 8439776
8371H439776L171440P2479m707673o785517m322050N74635M026929L602543L82936
$$ 8439776 11611216 11683695 6976022 190505 -4131545 -3556910 470019 4072562 4455498
8362D455498k213700k115255k70850J508003K402976J650119j463150n074621
$$ 4455498 2241798 126543 -144307 1363696 3766672 5416791 3953641 -1120980
8354a120980n134035o89967L807188M089483J367128p47455j636769k392621k016344
$$ -1120980 -6255015 -6944982 -3137794 951689 2318817 1571362 -65407 -2458028 -4474372
8345d474372N41703K672635J347945j358765r07572K555471M616538L438056J138187
$$ -4474372 -3932669 -1260034 87911 -1270854 -2178426 377045 4993583 8431639 9569826
8336I569826j132515l996007n683274k986821K438092M356138O50886l223485
$$ 9569826 8437311 4441304 -1241970 -4228791 -1790699 2565439 3216325 -7160
8328g160k113194J908810L639926K145087M60746L34096O83156N2302j902482
$$ -7160 -2120354 -211544 3428382 5573469 6034215 6368311 7051467 7103769 5201287
8319E201287m512730o038007m584081m86119L218223L844040J801288l65051q19171
$$ 5201287 688557 -5349450 -9933531 -10419650 -7201427 -3357387 -1556099 -1921150 -2740321
8310b740321N2368K81150j319389k846425p56126M856675Q425335N309547j536894
$$ -2740321 -2687953 -2406803 -3726192 -6572617 -7328743 -2472068 5953267 11262814 9725920
8301I725920n074747l315282n46643N9691j68917j49577j690036n010942o157647
$$ 9725920 4651173 1335891 789248 848939 680022 530445 -1159591 -6170533 -12328180
8292a2328180k201734M002408P263387O009512K392585j311004l868687m438378
$$ -12328180 -14529914 -10527506 -3264119 2745393 5137978 3826974 -41713 -4480091
8284d480091l194429j569479l21192J384249L792143N121858L740587M88333k258847
$$ -4480091 -7674520 -9243999 -9565191 -8180942 -4388799 733059 4473646 4961979 2703132
8275B703132k735064o00045K718291M167858J659365k865191m960798k884846
$$ 2703132 -31932 -631977 2086314 6254172 7913537 5048346 87548 -2797298
8267b797298O02274J950029L36000k585292m283149k890410N74146K253759L98023
$$ -2797298 -2195024 -244995 91005 -2494287 -6777436 -9667846 -9093700 -6839941 -6441918
8258f441918j297039Q68620L889042K545155j014928m6595M476010L846033l487724
$$ -6441918 -7738957 -6870337 -2981295 -436140 -1451068 -1497663 2978347 6824380 3336656
8249C336656p186139r66324O046794K672102o754780q890996j309475N462937
$$ 3336656 -3849483 -4815807 1230987 3903089 -2851691 -11742687 -13052162 -7589225
8241g589225M616572P76727l39929j21369j297032j886571J60163J907173J92290
$$ -7589225 -2972653 -2195926 -2535855 -2657224 -3954256 -5840827 -5680664 -3773491 -3581201
8232c581201k342332r83875L489027N523246K355480k647299m405937j644521
$$ -3581201 -5923533 -6907408 -3418381 2104865 4460345 1813046 -2592891 -4237412
8224d237412K397318L530400P46536k632068k383645J411264L624986K07374n451216
$$ -4237412 -1840094 1690306 2436842 -195226 -2578871 -1167607 2457379 2664753 -2786463
8215b786463n210222L109687J0530732O860525m943759j0650367l408518O326949
$$ -2786463 -7996685 -4886998 5643734 12504259 7560500 -3089867 -6498385 -171436
8207a71436N660932j978958l146175L613523N427231l203378j0231174m891242
$$ -171436 5489496 3510538 364363 3977886 9405117 6201739 -4029435 -8920677
8199h920677M979145N407032k279097n397022m44671L908527K882770J537161
$$ -8920677 -3941532 1465500 -813597 -6210619 -6655290 -2746763 136007 1673168
8191A673168L293950M151174J538423q62899q80246j763142m476427m388939r1108
$$ 1673168 4967118 9118292 10656715 9793816 8913570 7150428 2674001 -1714938 -1806046
8182a806046K463657j70224k523152J73827L072936p3723n609155n449165M6053
$$ -1806046 657611 487387 -2035765 -1861938 1210998 1137275 -4471880 -9921045 -9874992
8173i874992L366024J814806j04724N83223J873954K266170K867936L124375M89010
$$ -9874992 -6508968 -4694162 -4798886 -4215663 -2341709 -75539 2792397 5916772 6405782
8164F405782m245060o487183m278510p87696Q20408P84360N0568j283641j565607
$$ 6405782 2160722 -4326461 -8604971 -9392667 -8572259 -7787899 -7737331 -9020972 -10586579
8155a0586579J608576O302457O697812J240087m150345m155215r88580O58902
$$ -10586579 -8978003 -2675546 4022266 5262353 1112008 -3043207 -4031787 -3372885
8147c372885J277079L678794N777367L096539k711682m987076k325134p34232
$$ -3372885 -2095806 1582988 7360355 10456894 7745212 2758136 433002 -301230
8139c01230l214057m066197J608984Q320455P161525n08432m338359J0913M865420
$$ -301230 -3515287 -7581484 -5972500 2347955 9509480 9001048 4662689 4673602 9539022
8130I539022K314384m501763o907905l196022O51187J020725J036248L864362
$$ 9539022 11853406 7351643 443738 -2752284 -2101097 -1080372 -44124 3820238
8122C820238O772559M850360j834291p616208p222867j043433N292254O147291
$$ 3820238 10592797 15443157 13608866 5992658 -1230209 -2273642 3018612 9165903
8114I165903J152500m690747o489832m155084p68398J891673L695938L564461
$$ 9165903 10318403 5627656 -862176 -5017260 -5785658 -3893985 -198047 3366414
8106C366414N07889k908337k579631O86892J383688j982039l410155J404945O919881
$$ 3366414 3874303 965966 -1613665 -926773 456915 -1525124 -4935279 -3530334 3389547
8097C389547M891566k888817o344943j622885L502653J366883m680434n928822
$$ 3389547 8281113 5392296 -952647 -2575532 927121 2294004 -2386430 -8315252
8089h315252q07186M119631M075594J312847p9498J71694J42733k91916R0491
$$ -8315252 -9122438 -5002807 -927213 385634 306136 477830 620563 328647 419138
8080D19138J015746Q81597p41183k653492l823731m062259l079196n81686K379230
$$ 419138 1434884 2316481 1575298 -1078194 -4901925 -8964184 -12043380 -12625066 -10245836
8071a0245836L753391L005490K081821K757158L845903K504519j775174n801717
$$ -10245836 -6492445 -3486955 -1405134 1352024 5197927 7702446 5927272 125555
8063A25555n994288k489005R10370J096589o33234k13463L630294O797999M350777
$$ 125555 -5868733 -8357738 -7447368 -6350779 -6984013 -7197476 -3567182 3230817 7581594
8054G581594k934374q741163q375364l506707J340960M450689O527311O710371
$$ 7581594 4647220 -4093943 -12469307 -15976014 -14635054 -10184365 -3657054 3053317
8046C053317L139876k426283m644601j163896L605545L812523m90679m033348
$$ 3053317 6193193 3766910 -877691 -2041587 1563958 5376481 4885802 852454
8038H52454l417929o26292O59140m20746k091397k635339j295359K112771O335160
$$ 852454 -2565475 -3191767 -2532627 -2953373 -5044770 -7680109 -8975468 -6862697 -527537
8029e27537P911272L828426m009949q847300n740391K274866O721561K919125
$$ -527537 7383735 11212161 7202212 -1645088 -7385479 -5110613 1610948 4530073
8021D530073m823547q196724l980108L141059O334128L745659n30807j764324
$$ 4530073 -293474 -8490198 -12470306 -9329247 -2995119 750540 219733 -1544591
8013a544591J57056J307173q19283l860849l697366M3358L608244M018172K046670
$$ -1544591 -1387535 -80362 -899645 -4760494 -8457860 -8414502 -4806258 -788086 1258584
8004A258584q0547j484003k047796j362996J61086J038361J032966J677797K998988
$$ 1258584 1178037 -305966 -2353762 -3716758 -3555672 -2517311 -1484345 193452 3192440
7995C192440K460409n94122k513657o76122J648060J73238l049284k647039J091784
$$ 3192440 5652849 5058727 2545070 1868948 3517008 3690246 640962 -2006077 -914293
7986i14293K542096M8534j673466M4179J370251j004627l836646k491776J798572
$$ -914293 1627803 1676337 2871 47050 1417301 412674 -3423972 -5915748 -4117176
7977d117176M166170K927574L76545j235368j357499n86286q52668l806937o868025
$$ -4117176 48994 2976568 3353113 2117745 760246 173960 -678708 -4485645 -11353670
7968a1353670m357679M195991J0592792P465859j502218o151075k858904K540394
$$ -11353670 -15711349 -11515358 -922566 6543293 5041075 -1110000 -3968904 -1428510
7960a428510L998992J677127j361957l655161m797827m150097j953400N74065
$$ -1428510 2570482 4247609 2885652 -769509 -5567336 -9717433 -11670833 -11096768
7952a1096768L055763N684478P107638N394062J371516j839152k993727l651975
$$ -11096768 -8041005 -2356527 4751111 10145173 11516689 9677537 6683810 3031835
7944C031835m595947m279775j644204J986820M480995M382152J029653m215388
$$ 3031835 -1564112 -5843887 -7488091 -5501271 -1020276 3361876 4391529 176141
7936A76141p248739n012644k2378K324723J003668K113J426285K665290J767136
$$ 176141 -7072598 -12085242 -12107620 -9782897 -8779229 -8777116 -7350831 -4685541 -2918405
$$ [...]
##END NTUPLES=NMR SPECTRUM
##END=
