##TITLE=31Pdec_SR60_cl
 CDCl3, 24 sc
 14.05.2021
##JCAMPDX= 6.0         $$ Bruker NMR JCAMP-DX V2.0
##DATA TYPE= NMR SPECTRUM
##DATA CLASS= NTUPLES
##ORIGIN= UXNMR, Bruker Analytische Messtechnik GmbH
##OWNER= root
$$ XWIN-NMR		Version 3.5
$$ Fri May 14 10:20:52 2021 Russian Standard Time (UT+4h)  she@DPX200
##.OBSERVE FREQUENCY= 81.013821
##.OBSERVE NUCLEUS= ^31P
##.ACQUISITION MODE= SIMULTANEOUS
##.ACQUISITION SCHEME= undefined
##.AVERAGES= 24
##.DIGITISER RES= 16
##SPECTROMETER/DATA SYSTEM= spect
##.PULSE SEQUENCE= zgpg30
##.SOLVENT NAME= CDCl3
##.SHIFT REFERENCE= (INTERNAL, CDCl3, 0, 248.564)
##AUDIT TRAIL= $$ (NUMBER, WHEN, WHO, WHERE, WHAT)
$$ ##TITLE= Audit trail, XWIN-NMR		Version 3.5
$$ ##JCAMPDX= 5.01
$$ ##ORIGIN= Bruker BioSpin GmbH
$$ ##OWNER= she
$$ F:/spectra/data/she/nmr/P31/1/pdata/1/auditp.txt
$$ ##AUDIT TRAIL=  $$ (NUMBER, WHEN, WHO, WHERE, WHAT)
(   1,<2021-05-14 10:19:39.81 +0400>,<she>,<DPX200>,
      <created by zg, POWCHK disabled, PULCHK disabled
       configuration hash MD5:
       00 E9 B6 7A A2 85 ED C7 34 08 36 98 17 FE 4E 26
       data hash MD5: 32K
       84 35 81 72 96 B8 44 E2 E3 A4 79 7A 15 AE 8A 2C>)
(   2,<2021-05-14 10:19:50.56 +0400>,<she>,<DPX200>,
      <Start of raw data processing
       efp BC_mod = 2 LB = 1 FT_mod = 6 PKNL = 1 PHC0 = -6515.294 PHC1 = -90.79945 SI = 64K 
       data hash MD5: 64K
       80 02 71 0C 4B 2B 29 15 C7 D3 2D 3F 47 40 05 98>)
(   3,<2021-05-14 10:20:16.29 +0400>,<she>,<DPX200>,
      <pk PHC0 = 105.2783 PHC1 = -238.6 
       data hash MD5: 64K
       CE 59 AE 77 D3 B0 18 2A B0 98 13 A7 28 B3 2B F9>)
(   4,<2021-05-14 10:20:20.03 +0400>,<she>,<DPX200>,
      <abs ABSG = 5 
       data hash MD5: 64K
       7A FB 4E B7 8A 50 0D 37 3E 93 99 AD 58 22 D0 A9>)
$$ ##END=
$$ 
$$ hash MD5
$$ FE 9E 98 3F 9A 0B 17 BE 39 E1 F4 1E B0 E0 3B BB
##$RELAX= 
##$RELAX= 
##$RELAX= 
##$RELAX= 
##$RELAX= 
##$RELAX= 
##$RELAX= 
##$RELAX= 
$$ Bruker specific parameters
$$ --------------------------
##$DU= <F:/spectra>
##$EXPNO= 1
##$NAME= <P31>
##$PROCNO= 1
##$TYPE= <nmr>
##$USER= <she>
##$AMP= (0..31)
100 100 100 100 100 100 100 100 100 100 100 100 100 100 100 100 100 100 
100 100 100 100 100 100 100 100 100 100 100 100 100 100 
##$AQSEQ= 0
##$AQ_mod= 1
##$AUNM= <au_zg>
##$AUTOPOS= <>
##$BF1= 81.014009
##$BF2= 200.13
##$BF3= 200.13
##$BF4= 200.13
##$BF5= 200.13
##$BF6= 200.13
##$BF7= 200.13
##$BF8= 200.13
##$BYTORDA= 1
##$CFDGTYP= 0
##$CFRGTYP= 5
##$CHEMSTR= <none>
##$CNST= (0..31)
1 1 145 1 1 1 1 1 1 1 1 1 1 1 1 1 1 1 1 1 1 1 1 1 1 1 1 1 1 1 1 1 
##$CPDPRG= <waltz16>
##$CPDPRG1= <>
##$CPDPRG2= <waltz16>
##$CPDPRG3= <>
##$CPDPRG4= <mlev>
##$CPDPRG5= <mlev>
##$CPDPRG6= <mlev>
##$CPDPRG7= <mlev>
##$CPDPRG8= <mlev>
##$CPDPRGB= <>
##$CPDPRGT= <>
##$D= (0..31)
0 1 0 0 0 0 0 0 0 0 0 0.03 2e-05 3e-06 0 0 0 0 0 0 0 0 0 0 0 0 0 0 0 0 
0 0 
##$DATE= 1620973179
##$DBL= (0..7)
120 120 120 11 120 120 24 19 
##$DBP= (0..7)
150 150 150 150 150 150 150 150 
##$DBP07= 0
##$DBPNAM0= <>
##$DBPNAM1= <>
##$DBPNAM2= <>
$$ [...]
##$SUBNAM3= <"">
##$SUBNAM4= <"">
##$SUBNAM5= <"">
##$SUBNAM6= <"">
##$SUBNAM7= <"">
##$SUBNAM8= <"">
##$SUBNAM9= <"">
##$SW= 501.771253377433
##$SWIBOX= (0..15)
0 1 3 0 0 0 0 0 0 0 0 0 0 0 0 0 
##$SW_h= 40650.406504065
##$TD= 32768
##$TD0= 1
##$TE= 0
##$TE2= 300
##$TE3= 300
##$TEG= 300
##$TL= (0..7)
0 120 53 12 22 120 120 120 
##$TP= (0..7)
150 150 150 150 150 150 150 150 
##$TP07= 0
##$TPNAME0= <>
##$TPNAME1= <>
##$TPNAME2= <>
##$TPNAME3= <>
##$TPNAME4= <>
##$TPNAME5= <>
##$TPNAME6= <>
##$TPNAME7= <>
##$TPOAL= (0..7)
0.5 0.5 0.5 0.5 0.5 0.5 0.5 0.5 
##$TPOFFS= (0..7)
0 0 0 0 0 0 0 0 
##$TUNHIN= 0
##$TUNHOUT= 0
##$TUNXOUT= 0
##$USERA1= <user>
##$USERA2= <user>
##$USERA3= <user>
##$USERA4= <user>
##$USERA5= <user>
##$V9= 5
##$VALIST= <valist>
##$VCLIST= <CCCCCCCCCCCCCCC>
##$VD= 0
##$VDLIST= <DDDDDDDDDDDDDDD>
##$VPLIST= <PPPPPPPPPPPPPPP>
##$VTLIST= <TTTTTTTTTTTTTTT>
##$WBST= 1024
##$WBSW= 4
##$XGAIN= (0..3)
0 0 0 0 
##$XL= 0
##$YL= 0
##$YMAX_a= 2501
##$YMIN_a= -2289
##$ZGOPTNS= <>
##$ZL1= 120
##$ZL2= 120
##$ZL3= 120
##$ZL4= 120
##$ABSF1= 248.5645
##$ABSF2= -253.2056
##$ABSG= 5
##$ABSL= 3
##$ALPHA= 0
##$AQORDER= 0
##$ASSFAC= 0
##$ASSFACI= 0
##$ASSFACX= 0
##$ASSWID= 0
##$AUNMP= <proc_1d>
##$AZFE= 0.1
##$AZFW= 0.5
##$BCFW= 0
##$BC_mod= 2
##$BYTORDP= 0
##$COROFFS= 0
##$CY= -3
##$DATMOD= 1
##$DC= 0
##$DFILT= <>
##$DTYPP= 0
##$F1P= 0
##$F2P= 0
##$FCOR= 1
##$FTSIZE= 65536
##$FT_mod= 6
##$GAMMA= 0
##$GB= 0
##$INTBC= 1
##$INTSCL= 5.30512e-09
##$ISEN= 30
##$LB= 1
##$LEV0= 0
##$LPBIN= 0
##$MAXI= 10000
##$MC2= 0
##$MEAN= 0
##$ME_mod= 0
##$MI= 50
##$NCOEF= 0
##$NC_proc= -7
##$NLEV= 6
##$NOISF1= 182.463
##$NOISF2= 159.3651
##$NSP= 0
##$NTH_PI= 0
##$NZP= 0
##$OFFSET= 248.5645
##$PC= 4
##$PHC0= -6410.016
##$PHC1= -329.3995
##$PH_mod= 1
##$PKNL= yes
##$PPARMOD= 0
##$PSCAL= 0
##$PSIGN= 0
##$REVERSE= no
##$SF= 81.014009
##$SI= 65536
##$SIGF1= 159.3651
##$SIGF2= -187.1042
##$SINO= 113.3802
##$SIOLD= 16384
##$SREGLST= <1H.CDCl3>
##$SSB= 0
##$STSI= 65536
##$STSR= 0
##$SW_p= 40650.406504065
##$SYMM= 0
##$S_DEV= 0
##$TDeff= 32768
##$TDoff= 0
##$TI= <>
##$TILT= no
##$TM1= 0
##$TM2= 0
##$TOPLEV= 0
##$USERP1= <user>
##$USERP2= <user>
##$USERP3= <user>
##$USERP4= <user>
##$USERP5= <user>
##$WDW= 1
##$XDIM= 65536
##$YMAX_p= 346742002
##$YMIN_p= -25797653
$$ End of Bruker specific parameters
$$ ---------------------------------
##NTUPLES= NMR SPECTRUM
##VAR_NAME=  FREQUENCY,     SPECTRUM/REAL,   SPECTRUM/IMAG
##SYMBOL=    X,             R,               I
##VAR_TYPE=  INDEPENDENT,   DEPENDENT,       DEPENDENT
##VAR_FORM=  AFFN,          ASDF,            ASDF
##VAR_DIM=   65536,         65536,           65536
##UNITS=     HZ,            ARBITRARY UNITS, ARBITRARY UNITS
##FACTOR=    0.620285442955139, 1,           1
##FIRST=     20137.2065510759, 0,            0
##LAST=      -20513.1999529892, 0,           0
##MIN=       -20513.1999529892, -25797653,   0
##MAX=       20137.2065510759, 346742002,    0
$$ Real data points
##PAGE= N=1
##DATA TABLE= (X++(R..R)), XYDATA
$$ [...]
15096 -2482473 313607 2453100 3306234 3580716 3170702 1354716 -1288029 -3204740 -3549928
15087 -3549928 -1939323 2015290 6803410 8572040 5621071 1728898 1509283 3788740
15079 3788740 3560511 -272798 -3399714 -2489867 776166 2860436 2521394 889395 -455892
15070 -455892 -780617 -709908 -1212315 -1589573 -309462 1341359 -258289 -4951074 -7265794
15061 -7265794 -4303687 -716215 -1099727 -1986279 2020614 7854983 7860766 2105308 -1635330
15052 -1635330 228391 3308494 3751424 2763684 1617713 -356490 -1302721 2352332 8677562
15043 8677562 10736962 6422117 1125227 -1381700 -3621955 -7388976 -9243777 -6577042
15035 -6577042 -1946979 1871703 5170366 6977197 4269282 -1328958 -3203368 255361
15027 255361 2706548 860310 157945 4233258 7391956 4687667 1272341 2939751
15019 2939751 4708503 -622451 -8189430 -7264342 1309151 5962883 2207903 -1714413
15011 -1714413 1275861 7300967 8984651 5256263 -10354 -3703239 -4508980 -2224141
15003 -2224141 1291775 3044105 2035949 -511705 -3509165 -5730130 -4569474 850082
14995 850082 6270613 6398123 1846853 -2117303 -2713285 -1003819 2372723 7104208 9735252
14986 9735252 6803209 1628056 1409489 6623560 9937224 7318189 3381776 2895065
14978 2895065 3669722 2171086 402457 1699019 3833729 2291980 -1917076 -3279898
14970 -3279898 286038 5107188 7260951 6757686 5814229 5554491 5028910 2286667 -3210628
14961 -3210628 -8376672 -8256776 -1865484 5115802 5958774 548445 -4864330 -5084851 -752285
14952 -752285 4116771 6645107 6370462 4246280 1863010 500771 -150708 -1385044 -2847596
14943 -2847596 -2097081 1587902 4492841 2445231 -2850958 -4900981 -909005 4169418
14935 4169418 4429337 929132 -886630 317428 688433 -1656380 -3400696 -1521394
14927 -1521394 1965462 3098737 1015432 -2315106 -5204332 -7144935 -8399103 -10037924
14919 -10037924 -12440790 -13079397 -8873597 -1862503 1415022 -1598511 -5662601 -5501375
14911 -5501375 -3306123 -4150667 -7401366 -8188301 -5377804 -2467823 -1489224 -1293567 -1559423
14902 -1559423 -3385494 -5606227 -5292820 -2695142 -1354600 -2332349 -2467482 297038 3706920
14893 3706920 5025816 4789016 4933149 5920486 7331202 8851255 9331080 7392294 4281368
14884 4281368 3417710 5488458 6648177 3612439 -1797299 -5411205 -5937376 -4994139 -3764919
14875 -3764919 -2558514 -2518330 -4493743 -6420039 -4991606 -605834 2263047 1121926
14867 1121926 -688072 1229603 5542335 6951977 4352398 2623502 4491215 5089206
14859 5089206 -1089519 -10691735 -14683069 -10393134 -4565299 -3318653 -4627047 -3473885
14851 -3473885 178961 2513498 2017598 766055 1246944 4621607 10327730 15079368
14843 15079368 14433640 7917947 662179 -2292797 -1104346 1374241 4019230 6488185
14835 6488185 6961571 4455166 1110805 -893711 -2147182 -2908554 -843058 4290006
14827 4290006 7457107 4789945 6769 -914890 1468880 2347354 910051 -163136
14819 -163136 -1156252 -4079132 -6383656 -3429676 3081918 6350217 4480750 2456931
14811 2456931 3543125 5439661 6040443 6568993 7526830 7320132 6128496 5661581 4540421
14802 4540421 -52102 -5803509 -7202108 -4666823 -4201255 -6714211 -6000198 157332
14794 157332 5275949 4314720 752113 -821759 -1799433 -4242741 -5318770 -2606465 948681
14785 948681 2620380 4559808 7643859 7032509 195566 -6407820 -5684436 -171844 2825191
14776 2825191 1799470 -87294 -2067359 -4257128 -3354274 2150234 6164574 2781326
14768 2781326 -3394601 -3621238 1050426 2076369 -1951854 -3626677 -78555 2413370
14760 2413370 -399175 -4052496 -3490435 -441202 1131921 852268 -244090 -2354686
14752 -2354686 -4439023 -4164299 -2695562 -4023952 -7174239 -5610842 1903735 6544541
14744 6544541 1165706 -8449582 -10754919 -3481594 5116288 8008628 5815390 2143859
14736 2143859 -1151692 -2816986 -1202733 3262974 7372326 8623073 7617085 6073538
14728 6073538 4360425 2161937 146015 -361880 1238342 4459464 8093623 10296470
14720 10296470 9013601 3585841 -3692789 -8405939 -7483269 -2144558 3163466 4982371
14712 4982371 3369227 280079 -2862741 -4963336 -4582614 -1952408 -508316 -3127327
14704 -3127327 -6930076 -5561774 2091006 9012631 8439987 2405316 -1456522 185834
14696 185834 3658194 4847762 4113037 3678938 3913212 4239397 4936658 5689593 4690132
14687 4690132 1815983 536473 3341534 7040368 6792508 3863063 4320575 9529742
14679 9529742 13267945 10505971 4356104 899632 895010 729486 -1208352 -3532517 -5346573
14670 -5346573 -6516274 -5873965 -3057986 -690018 -834487 -1109438 1251339 3622249 1970066
14661 1970066 -1106632 576732 5997123 6998258 744510 -5440728 -4812190 -107596
14653 -107596 2281935 1175303 -1032796 -3802332 -6892786 -7187642 -2576795 3318871
14645 3318871 4973578 1946233 -1427745 -1638795 1345031 4828034 4657563 -1286593
14637 -1286593 -8837023 -10526017 -5062014 643466 1362551 -185402 -405256 -1411927
14629 -1411927 -4923461 -6013085 -627367 5504692 3869071 -4268151 -10403989 -11056268
14621 -11056268 -9305796 -6728178 -2579341 769500 371266 -842492 999076 1403599
14613 1403599 -6186804 -16011478 -14643570 -1611897 7690607 4014985 -3312520 -2732010
14605 -2732010 2218191 1516255 -4163619 -6289541 -3503978 -2627098 -6208633 -8500173
14597 -8500173 -4537002 3537412 10372852 12899041 11067140 6638329 2127572 -795386
14589 -795386 -1814726 -647495 2517255 4682626 2012200 -3956173 -6241598 -1505418
14581 -1505418 4729395 5413843 792507 -3961117 -6249927 -6682074 -5374628 -2601266
14573 -2601266 -868452 -1750035 -2623619 -706212 2010939 2227058 1146714 1858952 3286033
14564 3286033 2342896 313711 1022918 3631412 3394736 -524704 -3851785 -4205204 -3707548
14555 -3707548 -3688038 -2201120 1427348 4162217 3417097 130746 -3739152 -7371825 -9523264
14546 -9523264 -8325780 -4136012 334407 3632253 6225577 7178150 4305540 -1105199
14538 -1105199 -4001251 -2119907 848185 917998 -982932 -2181776 -3125176 -5417622 -7516149
14529 -7516149 -6457407 -2768191 -163228 -658171 -2629021 -3609094 -2924781 -1566892 -994119
14520 -994119 -1994037 -3689120 -4064330 -2319895 -51702 608456 -925856 -4101822 -8168309
14511 -8168309 -11398764 -10788363 -4568726 5187676 13709409 17265040 15529869 11169093
14503 11169093 7585080 6009257 4349434 152505 -5199036 -7496189 -5568213 -3173319
14495 -3173319 -3276169 -3632813 -1249942 1492860 -156300 -5376457 -8005514 -5302501
14487 -5302501 -1764661 -2388741 -6131931 -8824857 -9468192 -10108644 -11219496 -10811463 -7771534
14478 -7771534 -3354614 697348 3497100 4524770 3592381 1305485 -1760300 -5707092
14470 -5707092 -9438814 -9258734 -2392120 8106172 15185943 15428831 11988585 8935296
14462 8935296 6161535 2198728 -1154849 -781337 2878104 6531594 8603906 9628481
14454 9628481 9113763 6296998 3855065 6046551 11918704 14900997 11443386 5944015
14446 5944015 3882325 3781187 599129 -5245976 -7719791 -3823255 2397992 5582198
14438 5582198 4993574 3048956 937835 -1908221 -5575915 -8878068 -10132039 -7917312
14430 -7917312 -2323021 3669076 5640243 2154101 -3220213 -5712285 -4355393 -1798317
14422 -1798317 -123787 958434 1936760 2038929 1099800 1097435 3864898 7878595 9279598
14413 9279598 6383984 1618247 -1726527 -3278221 -4940684 -7534370 -9711667 -9798656
14405 -9798656 -7216233 -2369678 3287837 7321553 8294329 7670170 7841664 8459955 7320118
14396 7320118 4929043 4615012 6957285 7995121 5270191 1894156 1404933 2250165 1657033
14387 1657033 1488625 4460229 7101020 3646498 -3932144 -7471733 -4894376 -3059133
14379 -3059133 -6056369 -8623246 -5590289 -775995 -418444 -3332306 -4405501 -3521955
14371 -3521955 -3663334 -3443637 543482 5936948 7200753 5013634 4955796 7066953 5476088
14362 5476088 -345996 -3056641 732186 4705264 3566887 1401463 2909334 3616474
14354 3616474 -2367602 -9827153 -8013990 2913836 11086363 9657905 5319139 6675213
14346 6675213 11665864 12315031 7401434 3766433 6170360 11349658 13342672 11166522
14338 11166522 8833447 9155650 10111834 8058588 2928443 -1653903 -3117336 -2667367
14330 -2667367 -2649183 -3300060 -3551821 -3340648 -3267508 -3183360 -2859046 -2884694 -3210402 -2271647
14320 -2271647 322713 1779625 -469796 -4495312 -6061728 -4450425 -2914028 -3465289
14312 -3465289 -4383193 -3445631 -1014503 975586 1410417 1008225 2057217 6417966 12321509
14303 12321509 14686053 10958464 4928700 1738983 1111977 -398261 -2441446 -1806463
14295 -1806463 565904 61287 -3407384 -4240967 -185784 3675676 2887266 -190981 -1786422
14286 -1786422 -2835325 -5118957 -6110243 -3228679 301103 -407972 -4320476 -6516090
14278 -6516090 -6054533 -6421724 -9089556 -11664631 -12212924 -11140182 -8866961 -5424690 -2273267
14269 -2273267 -1088201 -900250 412253 2226034 2081075 149220 -645890 873226 2549387
14260 2549387 2148748 -203220 -2910503 -4161312 -2630773 1051817 4030314 4076832 1688100
14251 1688100 -1953340 -6631141 -10444482 -8878543 -737776 7508505 8386556 2960718
14243 2960718 -1268235 -635366 2120972 4599342 7413300 9574093 7855439 2871487
14235 2871487 22886 1596739 3042006 502271 -2530353 -510593 5361050 8490819
14227 8490819 5879402 1684980 1497401 5681347 9461341 8674280 4376358 1012835
14219 1012835 372762 -439219 -3790669 -7014543 -6134538 -1988521 1401250 3194134 5777266
14210 5777266 9065384 9976292 8109868 6831500 7251257 5812408 113069 -6615477
14202 -6615477 -9276321 -6601495 -1516145 1979347 1639199 -960178 -1403755 1688442
14194 1688442 3141026 -1975274 -9635768 -11545638 -8051083 -8112845 -14681902 -18934110
14186 -18934110 -13443476 -3270901 2235575 2471308 3306594 6282175 7597157 5640610
14178 5640610 3091012 2414173 3763567 6021957 6572870 2582388 -4098645 -6858322
14170 -6858322 -3222919 346394 -2228150 -6877451 -5748441 224258 3259263 1290416
14162 1290416 -108418 1801083 3100536 1499087 666236 3100792 4916091 1783460
14154 1783460 -4252224 -7708118 -6529952 -3027574 -154459 746792 91905 -424410 299685
14145 299685 894826 -672005 -3423496 -4172071 -2296066 -618092 -608148 149282 3991010
14136 3991010 9166644 11852290 10616841 7132861 3527005 656641 -1371204 -2260104
14128 -2260104 -1700484 -486060 -726754 -3582752 -6802867 -6563639 -2449809 1774206 3471342
14119 3471342 4188426 5427947 4876324 347237 -5389706 -7966735 -7360914 -5975343 -3092674
14110 -3092674 2985908 8613797 7445104 121574 -4978431 -2717882 2386557 3394309
14102 3394309 52 -3059726 -3327160 -2590471 -3068095 -4468603 -4575916 -1788206 2449184
14093 2449184 4259122 1917212 -1391932 -2152026 -2349949 -6389752 -13014799 -15988827
14085 -15988827 -13511091 -10903884 -11800755 -12580276 -9056648 -3406885 114529 1971299
14077 1971299 4664281 6796494 5603774 2954634 2734953 3652432 966095 -4796442
14069 -4796442 -7201976 -3310518 1991357 3542419 2914567 4332245 7359932 8154251
14061 8154251 5946263 3590848 2048231 -1316795 -7643611 -13001949 -12319922 -5562973
14053 -5562973 2028704 5522196 4705611 2975082 3046262 4490783 5372007 5623996 7494451
14044 7494451 11635624 14050595 9833730 345642 -6733118 -6541668 -3047928 -2549290
14036 -2549290 -4156824 -2242080 2946203 4053328 -2379918 -9925754 -10873320 -6087265
14028 -6087265 -1911494 -851369 -399760 933805 1476003 -82325 -2557942 -3576152
14020 -3576152 -1021913 5330416 11557785 11510605 4138329 -3652893 -5236768 -2752101
14012 -2752101 -2772566 -6092081 -7866124 -6547743 -5853026 -7453555 -8188974 -6190249 -4144190
14003 -4144190 -4259413 -4906231 -4675921 -5171069 -6881946 -6459002 -1589327 4560711 7176128
13994 7176128 5629845 2470861 -1076714 -5273471 -9171541 -11084817 -11066491 -10413932 -9295330
13985 -9295330 -6973885 -3777853 -795324 1988089 5222604 7871410 7340468 2814950
13977 2814950 -2673305 -4774057 -2334961 1513088 3030941 1618201 -816791 -2783636
13969 -2783636 -3573575 -1887115 2707601 7147084 7458348 4612420 3748180 6448856 8591604
13960 8591604 7846446 7564317 9498363 8624796 1077252 -7601389 -9173895 -4199391 350624
13951 350624 1866168 2615010 2052649 -2389708 -7842077 -8287066 -4311850 -2018390 -2234532
13942 -2234532 -152086 3639079 2183173 -5306047 -10277744 -8241492 -5531925 -7507661
13934 -7507661 -9423742 -5782011 -368434 1005349 836167 4308552 8696179 7528246
13926 7528246 2024391 -298782 3091308 7172289 7375246 4214528 413772 -1721117
13918 -1721117 -566443 3308722 6606179 6965278 5530119 3916638 1810288 -95697
13910 -95697 870025 4050258 3961529 -1560559 -6468809 -4905391 49997 1885729 650844
13901 650844 803723 2699665 3467323 3665723 5620443 6984073 3437619 -3106339 -6089624
13892 -6089624 -3845882 -1106498 -1066602 -2156084 -2971552 -4430093 -6125809 -5782128 -3493508
13883 -3493508 -2270783 -3506451 -5348445 -5767258 -4204721 -812931 2924095 4186130
13875 4186130 2644830 2200382 5248140 7998080 6015256 1345051 -1271629 -2040076
13867 -2040076 -3485460 -3337576 1972184 8692253 9350852 4300588 931760 1357812 192325
13858 192325 -4116195 -5425246 -678337 4242357 4235287 3215928 6971011 13412159 15925367
13849 15925367 12767457 7921568 4982606 4278574 4375377 3540405 1119472 -1042581 -521326
13840 -521326 1805359 2826427 2485758 3877789 7184457 8289238 5301791 1847721
13832 1847721 1307519 1933977 676458 -1642049 -2088469 54464 3272175 5904494 6417129
13823 6417129 3956846 136394 -2135257 -2651912 -4065734 -7328972 -10078000 -10237358
13815 -10237358 -7987070 -3911851 860304 2630072 -1639447 -8256051 -9643877 -4905740
13807 -4905740 -1582442 -4326949 -8040865 -6320952 -1207987 727472 -1976636 -5319275
13799 -5319275 -6440981 -5641276 -3469097 -81824 3166262 4307612 2371084 -2617325
13791 -2617325 -9278666 -13957919 -13484604 -9831375 -8073840 -8755383 -7448957 -3459950
13783 -3459950 -2280072 -5843171 -7312729 -1358582 6340133 7161319 2628009 1247866
13775 1247866 5071274 7992329 6549295 4124778 3545411 2851097 561860 -899105
13767 -899105 76830 785962 -1424539 -4562874 -4754275 -1519382 2243090 4343145 5230679
13758 5230679 6070785 6417875 4849324 2024602 1603888 5846948 10833270 9769758 2209196
13749 2209196 -4056661 -2931757 1943444 2901396 -1309752 -5800478 -7913044 -9266823
13741 -9266823 -10023032 -7316664 -908423 4476916 4859867 1790374 -572461 -401929 1643653
13732 1643653 4536982 6694257 5604375 541227 -5002932 -6162281 -2335590 1908972
13724 1908972 2469800 742905 1216230 4737584 6974213 4626943 436598 -676044
13716 -676044 1469683 2958443 2325281 1890293 2254483 423883 -4622236 -8809865 -8338830
13707 -8338830 -4837492 -2135754 -889778 237423 742381 -389978 -1307072 677822
13699 677822 4436306 6020264 4205462 2080100 2776112 5785017 8029262 7360619 4624801
13690 4624801 2442542 1704915 143044 -3981767 -7956941 -7681438 -4096544 -2216495
13682 -2216495 -3557470 -4688731 -4162920 -4546249 -5310761 -1017955 8745647 14458515 8533935
13673 8533935 -2936493 -7824669 -3684875 1840977 3409705 2402532 457718 -2913436
13665 -2913436 -5965426 -5399630 -2418790 -1876393 -4639759 -6654618 -6097457 -5458539 -5892544
13656 -5892544 -5589270 -4588877 -5061637 -5856228 -3294556 1233200 1439801 -3801234 -7575935
13647 -7575935 -5456424 -2174817 -3260186 -6064937 -4948884 -887196 582602 -1510153
13639 -1510153 -2646852 -352291 2364620 1825752 -1225021 -2586908 297838 4686944
13631 4686944 4705849 -1617282 -8723501 -9756250 -5375810 -2180261 -2864967 -3548564 -1712120
13622 -1712120 -328621 -1286434 -912791 3351411 6831802 3807651 -3593537 -8341173
13614 -8341173 -7996322 -5715060 -3321964 795208 6749526 11039465 10829871 7436446
13606 7436446 4365186 3514440 3866916 3145009 827367 -710459 455147 1974155 223004
13597 223004 -2793725 -810399 6417762 10187659 4556062 -4451561 -7439677 -4912675
13589 -4912675 -4188904 -6130139 -4320891 2776629 8149120 6974219 3121597 1473043
13581 1473043 672921 -1926574 -3959808 -2332311 386530 -212724 -2908077 -3018962 -360882
13572 -360882 791909 -865229 -1994468 -1042296 -925968 -3213205 -4217803 -317554 5913914
13563 5913914 8825527 7307805 5348267 5488986 5749287 3938350 1432901 521709 634839
13554 634839 11180 -741223 -126716 280533 -2487831 -6794404 -6455630 936071 9146365
13545 9146365 10201546 4274881 -928472 146228 5448100 9779846 11257247 11623531
13537 11623531 12241722 12094037 9638539 5451474 2316293 2307739 3998349 3780354 541868
13528 541868 -2504530 -2022446 925954 2653582 1962411 825368 630072 736742 685288
13519 685288 767375 93162 -2765611 -6569028 -8092426 -6869318 -5648990 -4923433 -1432893
13510 -1432893 5335066 9751727 7394679 2113797 534910 2273622 1697203 -2277302
13502 -2277302 -5023919 -4624554 -4371951 -5701888 -5661577 -3864421 -4975584 -10316875 -13599221
13493 -13599221 -10545516 -6913528 -9762234 -15267756 -13967196 -5781738 -395374 -2582517
13485 -2582517 -6316226 -5667094 -3075715 -2564809 -1889514 2569528 7964546 8498176 4176310
13476 4176310 296569 -492183 -644828 -2742004 -6276420 -9459590 -10877544 -9248934
13468 -9248934 -4438027 1038193 3871288 3541675 2231715 1424106 586130 -769327 -1511387
13459 -1511387 141778 4634079 9669147 10886876 5931303 -1402884 -3739862 1413338
13451 1413338 8360623 10480602 7756467 4101093 643721 -3600022 -6935272 -6768660
13443 -6768660 -5159753 -6575265 -10092710 -10036111 -5514220 -2969195 -6392176 -10627027
13435 -10627027 -8782364 -2286775 1485244 -604318 -4519104 -5606318 -3921177 -2474984
13427 -2474984 -3182951 -5678071 -8337888 -9245360 -6925477 -1380271 5083374 8478500
13419 8478500 5889164 -1520329 -9100157 -13334162 -14801762 -15342222 -14295573 -10465967
13411 -10465967 -6380554 -6381358 -10231278 -12486294 -9262388 -2351760 4357131 9062139 11253450
13402 11253450 10299851 7010382 3847165 1637855 -1335648 -5386344 -7675428 -6383930
13394 -6383930 -3420713 -791233 2168443 5239101 5020311 134007 -4773804 -4920027
13386 -4920027 -2345929 -1875650 -2928457 -1680375 563047 -1216466 -5963570 -6078271
13378 -6078271 1132297 8586445 9439851 5733649 2702688 353255 -3205239 -4728439
13370 -4728439 -23034 6963833 7486038 767589 -4195233 -1646912 3192144 3195766 -171320
13361 -171320 -1213180 -146204 -1422566 -4188467 -2620387 3688970 7370194 4068136
13353 4068136 -864303 -662459 3081607 4240565 1854994 -115312 -454102 -1694886
13345 -1694886 -4196251 -5334377 -5037850 -6448640 -9787009 -10839030 -7671350 -4174207
13337 -4174207 -4147723 -5771420 -5084255 -1819580 1452388 3501809 4555349 4097388 1569889
13328 1569889 -1872376 -4551135 -6127968 -6750324 -5964552 -4001930 -2336302 -1537897 -533818
13319 -533818 971471 2047688 3523853 7663030 13112430 14647084 10719773 6404186
13311 6404186 5008235 2273119 -5207049 -11038893 -6953747 3442828 8468583 5126531
13303 5126531 2222630 5489721 9493360 8156746 4616600 4792684 7744237 8810618
13295 8810618 7487751 6005020 4124665 1598082 2122529 7764580 12070046 6735096
13287 6735096 -5453241 -12166594 -7277813 1844904 5219443 2277497 -790576 -838928
13279 -838928 181346 437029 545965 1181555 1939654 2849240 4543375 6573115 7347501
13270 7347501 6093125 3598572 946292 -1219606 -2074717 -765042 2005845 3471901
13262 3471901 1169743 -4011940 -7991076 -7510431 -3794530 -1176606 -1897613 -3750888
13254 -3750888 -3865823 -2990117 -3590278 -4963470 -4015113 -1161509 -1192437 -6192441 -11383325
13245 -11383325 -11439991 -8044403 -6747832 -8163469 -7499480 -2543212 3158674 6073169
13237 6073169 6681972 5751615 1355897 -6975800 -14734364 -17199004 -15623720 -14857282 -16285871
13228 -16285871 -16899814 -14547895 -10518374 -6968913 -4690719 -3522219 -2741913 -1234223
13220 -1234223 908661 1791024 655385 -121242 1372520 2834209 1293962 -1187453
13212 -1187453 -96570 4049294 6180542 4792636 3731150 4572315 3439773 -1556446
13204 -1556446 -5413114 -3382304 1289756 2133772 -910490 -2171129 1068141 5941866
13196 5941866 9435726 11221078 10653938 5980658 -1437407 -5768231 -2537008 5609039
13188 5609039 11003757 8451583 -155450 -8113871 -10250356 -7297246 -4056863 -3329174
13180 -3329174 -2898175 444220 5327935 6698608 2227246 -4502981 -8195083 -7633786
13172 -7633786 -5874192 -5559926 -5980432 -5180202 -3286644 -2004500 -1479686 -130968 1898099
13163 1898099 1985179 -387368 -1102507 3114186 8728179 9521204 5815132 4148123 7050232
13154 7050232 8781712 3798011 -5185666 -11000019 -10469913 -5807032 -572111 2437484
13146 2437484 1859142 -446532 -475197 2494440 4404734 2914235 1425529 2750301 2941660
13137 2941660 -2874564 -11527862 -15240078 -12581451 -9525905 -9964386 -11364039 -10404319
13129 -10404319 -7306843 -3427620 631451 3417599 3573308 3308144 6485497 12226757
13121 12226757 14891805 11733908 6279135 2679312 1000725 -181006 -739044 -745606 -1651374
13112 -1651374 -3602050 -4692471 -4461975 -4831854 -6252491 -6659282 -5680736 -5697151 -6860012
13103 -6860012 -5526007 -224765 5028906 6302659 4643842 2451274 -680520 -4669394
13095 -4669394 -5723349 -1396619 4115273 4774330 686063 -3376138 -5464953 -7491814
13087 -7491814 -10008233 -10992425 -9737533 -7869288 -6340565 -4561024 -2256956 484860
13079 484860 4095317 7720320 8190721 4251488 71321 300860 3074882 2830963 -814374
13070 -814374 -2558213 117464 3671238 4906184 5202791 6092713 5396963 1014822 -4792657
13061 -4792657 -7994478 -7368996 -4290456 -319779 2962124 4075794 3595335 3866057 5328651
13052 5328651 5799201 4843241 5314131 8181468 9659415 7098705 4388906 6796941 12631613
13043 12631613 15077613 11203693 4392524 -1357841 -4436321 -3207883 3542633 12301274
13035 12301274 16184044 13168690 8839461 8292870 9357145 7295170 2615592 -336903
13027 -336903 -236534 615124 1362404 3420617 6191824 6416029 2931823 -1337451 -3386771
13018 -3386771 -3166228 -1451045 2135822 6978239 10091229 9625643 7949593 8358220 9857294
13009 9857294 8417532 3320908 -927856 -317206 3262336 4399872 996207 -3542285
13001 -3542285 -5152979 -3983363 -2847746 -2296909 -61186 4415135 7917220 7729472
12993 7729472 5687729 5350247 6647222 6480813 3885851 1173737 -49937 -576456 -798949
12984 -798949 264900 2037585 1906191 -624643 -2520563 -1992419 -1411218 -2761607 -3426375
12975 -3426375 -366953 3788154 3387029 -2310261 -7982455 -9126248 -6554567 -3497400
12967 -3497400 -1390477 159411 1357961 1686755 686829 -1176727 -2157997 -420017 3663939
12958 3663939 7404935 8910162 8938935 8702416 7980788 7054180 7740297 9709152 8546575
12949 8546575 1635624 -6026127 -6905617 -1024894 4177995 4101509 1778128 1446588 2681072
12940 2681072 3206089 2916284 1986496 -1183186 -6394484 -8937120 -4807829 2707853 5792199
12931 5792199 1479587 -4922198 -6565660 -2848912 865621 -111761 -5169013 -10102067
12923 -10102067 -11685168 -9698060 -5920021 -3067233 -3784690 -7772392 -10083662 -6018231
12915 -6018231 1575977 4461712 381709 -3146685 -175998 4341729 2879688 -2073041
12907 -2073041 -2608843 418608 -1590195 -9828575 -14792975 -10923348 -4672008 -3277268
12899 -3277268 -4172983 -1770387 2431649 3745165 2862369 3126714 3286481 273425 -3737015
12890 -3737015 -4124986 -1607928 -466259 -559750 1944041 6375169 6985473 1754318 -3700068
12881 -3700068 -2995942 3711200 10530202 11441015 5018420 -3820506 -7104270 -1557306
12873 -1557306 7352508 11496268 9038298 4523800 1738943 422190 -822885 -2419440
12865 -2419440 -4490636 -6361987 -5956453 -2882253 -955278 -3733857 -8620091 -9924621
12857 -9924621 -7044130 -4463606 -3817443 -1854160 2432075 4492953 1068406 -4068720
12849 -4068720 -4909930 -1004682 2924031 3496429 1870773 1029219 1920623 2562328 534851
12840 534851 -3722014 -7090878 -8061664 -8858020 -11027910 -11228367 -5577972 3079850 7487273
12831 7487273 5648037 2794345 2663221 2677871 413293 -937698 1768370 4792342 2291511
12822 2291511 -4103794 -6409723 -1001472 6671590 9284493 5854100 947958 -1581189
12814 -1581189 -1544598 -382963 1074048 2212014 1736170 -1074231 -4371824 -4727297 -1039463
12805 -1039463 3753369 6137293 6091874 6019516 6763574 7298480 7923939 10531323 14865950
12796 14865950 17391407 15578331 11324970 8259596 7044045 5299402 1546069 -2435852
12788 -2435852 -3285318 480008 6485913 9954750 7927184 2207337 -2658259 -4135456
12780 -4135456 -3240378 -1736520 8782 1774830 2202488 199971 -3503286 -7256050
12772 -7256050 -9950639 -10862675 -9377840 -6018777 -2643896 -367005 1854566 5285426
12764 5285426 8858403 10184528 8949300 7715153 8763291 11171557 11974242 9754139
12756 9754139 5895151 2160057 -1437112 -5173490 -7444112 -6463709 -3660896 -2317267
12748 -2317267 -2381168 -245052 4680774 7187631 3549446 -1708618 -1322778 4251431 7613131
12739 7613131 5388450 2445721 3583200 6444986 5995667 2173405 -859545 -865324 811504
12730 811504 2698217 4991577 7719275 9260838 7500249 2073897 -4317621 -7029368
12722 -7029368 -3384597 3912191 8690638 7555195 3109327 307351 965767 2802122
12714 2802122 2655015 -442443 -4559486 -6470415 -4729423 -1548942 -660268 -3096404
12706 -3096404 -6288597 -7439979 -6281295 -4341001 -3306821 -4438714 -7520164 -9707824
12698 -9707824 -7619234 -1774642 2907912 2476061 -1642957 -4891772 -4922043 -3277929 -2674871
12689 -2674871 -3925522 -5317880 -4583244 -1756296 381209 -297836 -2256671 -2482267 -794294
12680 -794294 662175 1583691 3668847 6510292 7261988 5370249 3694564 3410055 1938731
12671 1938731 -1754949 -4060355 -2367576 -149313 -2062546 -6727596 -9211953 -8844017
12663 -8844017 -9265979 -11291909 -11011337 -5993179 870012 5409114 6941737 7206778 6945851
12654 6945851 5549602 2771990 -774719 -4175346 -6436489 -6857414 -5803371 -4534612
12646 -4534612 -3794361 -2959346 -916487 2324794 4967234 4730218 1606435 -854006 1426900
12637 1426900 8080668 13862411 14342344 10741647 7758499 7810846 9152189 8859570 5865266
12628 5865266 1376198 -2176602 -2728806 -256964 3241242 5943395 7577380 8084208
12620 8084208 6507400 2643612 -1549845 -3999808 -4966897 -5689509 -5725430 -3937776 -1389390
12611 -1389390 -598950 -1824992 -2418000 -466854 2635429 3911702 1901688 -2243925
12603 -2243925 -5661802 -5710018 -2291531 1516890 2265455 -245539 -3102784 -3928491 -3010497
12594 -3010497 -1595870 260856 2983412 5527719 5717930 2826719 -1156294 -3713658
12586 -3713658 -4869662 -6707741 -9413749 -9576004 -4316465 3857482 8906650 8012172
12578 8012172 4026963 855453 -730833 -1487599 -890318 1570665 4052621 3927823 1042187
12569 1042187 -2308699 -4029379 -3735283 -2682870 -3141421 -6273925 -9578679 -8535287
12561 -8535287 -2396818 3929799 5903713 4903397 4989501 6309935 5351301 484229 -6326114
12552 -6326114 -12522508 -16285231 -15806116 -11149976 -6400239 -5752433 -7300319 -5041716
12544 -5041716 2169436 8309873 8740937 6697793 7888209 11743490 12245842 6287491
12536 6287491 -2435029 -7891421 -7476558 -3041436 1610125 3424517 1851391 -811786
12528 -811786 -1292710 1483187 5086053 6167556 4549064 3760167 6537807 10617701 10929437
12519 10929437 6011830 -4834 -2609709 -1751794 -9510 1548236 3061575 3432147
12511 3432147 1718919 158561 2133306 6932831 9831244 8162239 4392440 1904421
12503 1904421 334621 -2861053 -7689718 -10608453 -8234338 -1227134 5733455 8053139
12495 8053139 5541965 2075614 730410 709233 -35547 -1291503 -1841138 -2286389 -3561204
12486 -3561204 -3998931 -1466249 2381431 3833503 2693188 1907181 1699162 -968241 -6006108
12477 -6006108 -8387899 -5163785 -10528 2094303 984412 -955916 -3433386 -6806735
12469 -6806735 -9083265 -8532410 -6931029 -6201375 -4300587 961758 6393573 7357382 5696595
12460 5696595 7169369 11159610 10225727 1857511 -6280708 -6895167 -3128673 -2503247 -4937633
12451 -4937633 -3823480 2423241 7053188 4630475 -1548276 -4589023 -2859484 -218367
12443 -218367 590996 1083172 3562346 7108311 8272630 5107907 -340566 -4004771 -4274018
12434 -4274018 -3606006 -4732501 -6354605 -4921474 -490763 2245425 -9716 -4851166
12426 -4851166 -7920305 -8618918 -9421387 -11307162 -13029372 -13843384 -13816065 -12136949 -8243998
12417 -8243998 -4023856 -1647159 73613 3346449 6080125 3834466 -2535634 -6636981
12409 -6636981 -5504753 -3298254 -3504371 -3247479 453389 4052265 2875601 -736516
12401 -736516 -1104566 1668922 2947779 2020110 1987341 2087807 -1632522 -6924869 -5181637
12392 -5181637 5556723 14795760 12716556 3904738 822037 6379166 10860267 6505990
12384 6505990 -2040753 -5223721 -1620663 1713956 99619 -3314896 -4271209 -4622930
12376 -4622930 -8545100 -14081868 -14292522 -7254857 572443 3358622 3432310 5891415 9602524
12367 9602524 8959750 2668598 -4485263 -7957950 -7215782 -4086049 -1707790 -3991305
12359 -3991305 -11050760 -15980277 -11911978 -2047763 3689557 2436245 1498421 5631702
12351 5631702 8947838 4230747 -5672333 -11691177 -10051184 -4615079 -339410 919334
12343 919334 73724 141458 3861779 8928302 8823801 2083695 -3354399 -479648 5784268
12334 5784268 5176942 -2311966 -6052997 -786693 5396350 2998953 -5307746 -8936125
12326 -8936125 -3959329 2750925 3757887 261122 -1321852 913871 1922176 -2682960
12318 -2682960 -9837411 -12537597 -8706639 -3124507 -536544 -508072 -335345 458121 841225
12309 841225 784833 582637 -181328 -979217 -242448 1060539 -774240 -5835506 -7987561
12300 -7987561 -3118314 3449889 3522305 -2494593 -7180636 -7605404 -7896448 -10328393 -11497106
12291 -11497106 -9297256 -6910272 -6782682 -6341954 -3139913 762162 3139459 5533380
12283 5533380 8771254 9218841 4619484 -136841 1022161 6191128 8405923 6150425
12275 6150425 4526337 6203935 7698120 6085831 3732053 3662301 4747585 4762929 4688518
12266 4688518 6164415 7178531 4588076 -131471 -1812186 1505458 6080397 7783064
12258 7783064 6820166 5551803 4367114 2469257 1033453 2096868 4524226 4476150 917015
12249 917015 -2225733 -1253811 2243469 3983435 2935764 1624084 1418175 1072167 187935
12240 187935 648026 3234138 5620226 5590093 4030045 2700895 1121931 -1691414 -3961730
12231 -3961730 -2875040 921714 3658515 3491108 2362954 2214923 2284095 1667029 1939559
12222 1939559 4696065 7939014 7619495 2473082 -4646026 -10017545 -11878074 -10380631
12214 -10380631 -6972436 -4065505 -3218211 -3043351 -880344 2829062 4247320 1550397
12206 1550397 -1928372 -2344743 -984008 -1858447 -4875608 -5542006 -1767875 3088438 5594770
12197 5594770 7206245 11121693 16494945 19053580 16631237 11336776 6503479 3865971
12189 3865971 3756678 5680482 7901702 8259864 6560942 5134380 6009751 8205694 8786188
12180 8786188 6321562 2443050 -105448 -256462 934813 2064403 2627831 2455738 1174614
12171 1174614 -856843 -2087157 -1723951 -1461605 -3314668 -6015518 -6014907 -2482106 1331666
12162 1331666 2794685 3149549 4099873 3941807 470718 -3975690 -4515519 -583377 3077344
12153 3077344 3082019 1533327 1813003 3323256 3096107 645058 -1869607 -3379575 -4644967
12144 -4644967 -5224736 -2957751 2078755 5649353 4065610 -328539 -1433857 2586960
12136 2586960 6516451 4882657 -802020 -4300479 -2896175 -45747 366244 -875290
12128 -875290 -576010 1841734 3882393 3482338 946132 -2153997 -4248323 -3987713 -803561
12119 -803561 4047430 7728600 7974707 5325775 2962853 3499299 5602998 5093873 657129
12110 657129 -3010451 -396556 7122146 12166421 10406196 5165663 1679149 580763
12102 580763 -200191 -433202 1460413 4283861 5086128 3767299 3104950 4253787 5365663
12093 5365663 4905974 3494407 1963968 63470 -2315019 -4698829 -7234643 -10278764
12085 -10278764 -12421505 -11187267 -6634599 -2409228 -1942735 -4677761 -7118163 -7048456
12077 -7048456 -5823942 -6229618 -8209519 -7768304 -1824629 6197240 8700425 3085393
12069 3085393 -4697480 -8274855 -9154039 -12672046 -18177355 -19150421 -12982124 -5074658
12061 -5074658 -1616219 -2502647 -3460514 -1951772 1128727 3329092 2632129 -623684 -3113378
12052 -3113378 -1909210 1334603 2351721 524564 -415968 1418947 3337049 3076466
12044 3076466 2410720 3319408 4301991 3531494 2473987 2996664 3565784 1916817 -690380
12035 -690380 -1596351 -1316549 -2047772 -2834119 -467376 4850954 8475450 6825273 1484507
12026 1484507 -2926471 -3329990 -410748 2349935 1886720 -1136147 -2748574 -462139
12018 -462139 3379121 4422803 1369517 -3338150 -6619847 -6771288 -3807118 -44369
12010 -44369 851401 -2197874 -5767931 -6331784 -5136301 -5623898 -7416166 -7070754 -4451704
12001 -4451704 -3630794 -6375443 -9066564 -8259494 -5746725 -5159478 -6080766 -4918184 -503585
11992 -503585 4073083 5067828 1761443 -3180520 -5875590 -4491012 -1384039 -804939 -3309431
11983 -3309431 -4348054 -587188 4334913 3994210 -1783714 -6587825 -6728896 -5957667 -8306219
11974 -8306219 -10794413 -8193399 -2370807 -645742 -4901829 -8376536 -5344806 1014917
11966 1014917 3795704 1574174 -1706140 -3377581 -3854242 -3183801 -691651 1888824
11958 1888824 1285999 -2326466 -4708440 -3161384 177558 1972675 1944814 1868005 2521142
11949 2521142 3460536 4306748 4661118 3820100 1866428 314786 732768 3000651 5059074
11940 5059074 4126674 -928146 -7464404 -10680413 -8983237 -6093581 -5606440 -5749590 -3040424
11931 -3040424 1235656 3260762 3649031 5816973 8142796 5367454 -1225433 -3254609
11923 -3254609 2190498 7346290 5601999 1053514 340324 1797689 280627 -2657460
11915 -2657460 -2012153 922213 855551 -1579773 -756692 4054984 7761092 8234460 8518688
11906 8518688 9926503 10035538 8288715 7006823 6116107 3226370 -635428 -2123501
11898 -2123501 -2686957 -6846708 -12416539 -11251373 -2400610 4447225 3052968 -391751
11890 -391751 1546666 5200565 2911364 -3151495 -3835303 2777117 8887164 8682597 5154654
11881 5154654 3735995 4653346 4033792 -436439 -6765043 -10293854 -7943384 -1850858
11873 -1850858 2150539 887303 -2865815 -4781285 -4366836 -3955209 -4790895 -6761708 -9792109
11864 -9792109 -12673354 -12701533 -9486158 -6829444 -7504066 -8653201 -6399498 -2588492 -1849739
11855 -1849739 -3572232 -2728382 1478532 3789400 1118639 -2616607 -2491207 520648
11847 520648 1754514 -465417 -3284402 -3300978 -29161 4017736 5470011 2841217 -2178136
11838 -2178136 -6553931 -8959686 -10153406 -10752385 -10270823 -8545171 -6609602 -5606727
11830 -5606727 -5690552 -6140431 -5843026 -3951247 -923955 1555627 2538573 2871055 3372120
11821 3372120 3337696 2386048 2157725 3831348 5381573 4372907 2484526 3456931 6610663
11812 6610663 6633894 1180212 -5037752 -6163149 -2491195 1063219 2039237 2586261 4787105
11803 4787105 6925104 5859712 1618208 -2231698 -2813563 -1193444 -553399 -1954852
11795 -1954852 -3422250 -3118679 -1562381 59497 1986338 4742132 7090834 7002652 4299978
11786 4299978 961537 -1029545 -1270106 -824446 -1223774 -2917540 -4297669 -3459026 -1360551
11777 -1360551 -1303153 -4180483 -6354122 -3980050 2278025 8448017 11214457 9135470
11769 9135470 2618145 -4834652 -8035576 -5969212 -3867665 -5986393 -8955639 -6826748
11761 -6826748 -502674 3371369 1812802 -1837374 -4217704 -5084117 -3876988 756655
11753 756655 6535646 8179240 4641495 1002629 1089714 2855269 3293535 3040226 3037632
11744 3037632 1207981 -3591817 -7759900 -7137132 -2655477 1487134 3122697 2741852
11736 2741852 1185483 -291198 362800 3519540 6635067 7546952 7008703 6262161 4859523
11727 4859523 2895878 2169235 2553817 574623 -5275490 -10985832 -12225072 -10008303
11719 -10008303 -7579995 -5057490 -1651510 48288 -2326286 -5171581 -2847891 3463954
11711 3463954 6634965 3450168 -1586530 -3029128 -572738 2683907 4319644 3846365
11703 3846365 2730437 3603538 6954642 9101058 6504540 1283101 -1327190 -288582
11695 -288582 796561 119428 -454462 -188873 -711180 -1195186 2105027 8973416 12936884
11686 12936884 9442178 2330552 -1783166 -2222592 -2838287 -4502988 -4505057 -2749370 -3109572
11677 -3109572 -7059650 -9985326 -6680795 1556630 8261231 9514178 7476797 5856816
11669 5856816 4931561 3300056 2204870 4046673 7046242 6041019 56319 -5281569
11661 -5281569 -5667569 -4428453 -6785156 -11106499 -11378450 -6650339 -2049937 -556322
11653 -556322 475079 3457128 6348984 6349344 3821217 395967 -3448097 -6710224 -6738583
11644 -6738583 -2334908 3814320 7624409 7220706 3447449 -1082376 -2823147 146817
11636 146817 5238735 7376781 4922610 1144227 -1119708 -3241374 -7476403 -12424580
11628 -12424580 -14246497 -11266097 -5799648 -1984962 -2093811 -4046029 -3174393 1862614
11620 1862614 6186669 4561568 -1185073 -4678088 -4061363 -3430097 -5214601 -7034380
11612 -7034380 -7404889 -8488659 -10676014 -10284842 -6210040 -3559175 -6259268 -10422111
11604 -10422111 -9732219 -3850659 2939600 7862615 9716980 6367677 -2156168 -10250132
11596 -10250132 -11760442 -7229697 -2165845 -88451 -1171604 -4883743 -9013759 -8802450
11588 -8802450 -2846568 2242357 -693709 -8772160 -12555510 -9200241 -5037172 -4966459
11580 -4966459 -6683654 -6982424 -6777844 -6924607 -4919786 431536 5236141 4850350 -862571
11571 -862571 -8630445 -14816392 -15833487 -9848753 -631645 4314248 2529397 -10850
11563 -10850 2615392 8015157 9604066 5991051 1746697 640075 2362709 4845909
11555 4845909 5992384 4032091 -111859 -1679122 2618288 8571761 8363227 1097323
11547 1097323 -5273960 -4515828 -259677 -156879 -5120632 -9048711 -7918443 -4249784
11539 -4249784 -1967967 -1111245 422031 3013859 5632878 7700622 8288448 5754219
11531 5754219 1140205 -311076 4799903 11771578 12527767 6555762 1854067 3723287
11523 3723287 7978438 8080479 4101027 329852 -2241079 -5646899 -9142169 -9183069 -5188334
11514 -5188334 -1020847 -12643 -1552294 -3139366 -3304719 -1972764 105849 1819792
11506 1819792 2716400 3254512 3336289 2068310 134817 60441 2005381 1967749 -2605494
11497 -2605494 -7811764 -8011445 -3806971 -671500 -697703 -835525 746502 1789748 552491
11488 552491 -1228649 -1665027 -1276232 -479059 2160444 7124920 11945642 13905728 12953709
11479 12953709 10729490 8418952 6391113 4302633 1174326 -2951157 -5700986 -5046752
11471 -5046752 -2893393 -3020089 -5539470 -6762515 -4832363 -1818645 580606 3549132
11463 3549132 7674999 10311814 8737028 3764019 -1626904 -5523778 -7703964 -8847837
11455 -8847837 -10249753 -12690858 -14886837 -14709562 -12222716 -9512194 -7431474 -4946466
11447 -4946466 -1891696 346585 1369258 2310311 3250803 2660059 122079 -2595556 -3637424
11438 -3637424 -2373868 959165 4705568 5920299 3980387 2708459 5256723 8579519
11430 8579519 7798648 4450274 4172221 6955568 7007316 2922520 223938 1693647 2806038
11421 2806038 81828 -3224854 -3997773 -5002595 -8498505 -10079116 -5056603 3441394
11413 3441394 8650435 8933523 7204917 5178938 3418006 3796858 6682067 8512559
11405 8512559 6810388 4324600 3737452 2506317 -1532079 -3934329 -42651 5925241
11397 5925241 5915643 -146612 -5234931 -6109497 -5401212 -4067622 -398025 3323604 1897933
11388 1897933 -3304255 -3967106 3084551 10372469 10058841 3943402 -932564 -1855282 -1108731
11379 -1108731 -637873 -660412 -1671393 -4026084 -6338685 -6710826 -4840022 -1609415 2041334
11370 2041334 4698957 4726671 2427447 450696 548804 1168901 -262369 -3532279 -5469573
11361 -5469573 -3273620 2693922 9132439 12362649 10889664 5859108 -443582 -5862531
11353 -5862531 -8623262 -8062613 -5654161 -3801959 -3008958 -1821816 57620 1013067 837492
11344 837492 2111924 6433013 11382033 13071578 10075397 3893046 -2117304 -3619673
11336 -3619673 1331156 8451975 10676390 7070368 3830270 4613917 5785279 4443505
11328 4443505 4298992 8070170 10493060 6353526 288725 16125 3739762 3675234 -540608
11319 -540608 -2031570 740612 1769367 -1324618 -3375657 -1012962 2354147 3390199
11311 3390199 3296924 2956311 674504 -2511864 -2043158 2513653 5168768 2145751 -2670793
11302 -2670793 -4055948 -2233793 -495517 -530831 -2345997 -4501893 -3268306 3312247
11294 3312247 9894930 8888002 2095908 -260362 5947529 13566133 16332072 16923104
11286 16923104 18060654 15119579 5177516 -4277758 -4601640 1411843 4765667 3808028
11278 3808028 3915053 6742676 8440813 7145464 4716996 1759513 -2641089 -6862154
11270 -6862154 -8113967 -7150537 -6699084 -6510603 -4761399 -2494814 -1533162 -137337 3566868
11261 3566868 6064607 2876085 -3161508 -5075500 -2302908 -739093 -2445605 -3059500
11253 -3059500 -576017 949426 -886706 -2113122 1004266 5988826 8672596 9304085
11245 9304085 10053590 9906249 6518993 1191551 -2087490 -1862785 -383429 296905 827989
11236 827989 2388980 3553853 1094630 -5483111 -11467958 -11318145 -5672850 -1057685
11228 -1057685 -1297583 -2708043 -613875 2969410 2911906 -222045 -864038 2738838 6316938
11219 6316938 6749925 5819672 5395068 4370867 2897641 4576950 10659152 15905535 14677255
11210 14677255 8800969 5045715 6060888 8072299 7508806 5938750 6771987 9509263
11202 9509263 9906419 5724979 242840 -1555644 468772 1373763 -1819997 -5766703
11194 -5766703 -5986340 -3901026 -4458693 -7859227 -8815641 -4760348 281822 2137317 2215696
11185 2215696 3518391 4802989 3182228 45398 -492238 1993672 3857499 3134049
11177 3134049 1497905 298213 -1206817 -2765512 -2214599 773757 3354203 3500233
11169 3500233 2005268 -1035111 -7371934 -15239034 -17468121 -10176614 -71244 3285613
11161 3285613 520760 384130 5209043 7234583 1860514 -4048770 -2590568 3117488
11153 3117488 4367759 -171375 -4469707 -5278435 -4617434 -3560091 -973961 1867933
11145 1867933 2377133 2413133 5978246 10758234 9629818 2240789 -2762884 -196464 4334271
11136 4334271 3804551 -314061 -2874424 -3815265 -5572126 -6287392 -2857488 1842439 1619633
11127 1619633 -4264092 -10642819 -13971127 -15198791 -15619509 -14583057 -11548147 -6953797
11119 -6953797 -1330954 3765547 5457838 3441842 2195445 5201498 8882125 7284158
11111 7284158 1541983 -1048398 2512603 6891633 6155278 1034827 -3395687 -3929242
11103 -3929242 -1281025 1715152 2561472 1154137 -278707 -334371 -320639 -1052491 170142
11094 170142 5816344 12764593 14971685 11070995 5409173 2031570 1696288 4047072
11086 4047072 7664344 8119087 1793383 -7319616 -10404848 -5342522 191248 -181768
11078 -181768 -3143890 -2545381 632063 1230805 -556170 385366 4980077 7848449 5631521
11069 5631521 2219847 2944972 7020032 9047671 6238522 952676 -3257029 -5025501
11061 -5025501 -4239666 -865548 3332150 4227109 -221105 -5702757 -5371959 1368437 7174557
11052 7174557 5462805 -2016734 -8460971 -10324464 -9457071 -8752364 -9015570 -9603012 -9509591
11043 -9509591 -7911391 -5320122 -3664078 -3979675 -5181662 -6142004 -6850815 -6160907 -1632688
11034 -1632688 5703118 9847300 7005470 1313291 -1106549 -811284 -2029346 -3562416
11026 -3562416 -201186 7283481 11389696 8679194 4411196 3800918 4817947 3246007
11018 3246007 -214645 -2140723 -2059423 -1941363 -2496195 -3208038 -4146543 -5336918 -6146839
11009 -6146839 -6858589 -8471643 -9687723 -7295546 -1388096 3120730 2581884 -684929
11001 -684929 -2181766 -1006029 622120 1103761 303886 -1199508 -1777203 47371 2614245
10992 2614245 2327945 -694076 -1919559 712426 3558938 3627057 3292654 4718566 4447815
10983 4447815 -887279 -7349658 -8605808 -5281527 -2659321 -1113039 3528162 10640775
10975 10640775 13768825 10272350 5044261 2474176 1180952 -451315 40733 3639705
10967 3639705 5467241 1545795 -3956662 -4278219 -343040 835950 -3028981 -6704264
10959 -6704264 -6116553 -3956106 -4353966 -6619390 -7458176 -6152488 -4161702 -1905983 615779
10950 615779 1664530 -237546 -3181125 -4313330 -4720300 -7854421 -13077542 -15343963
10942 -15343963 -12688764 -9588233 -10196000 -12100867 -10556001 -5903222 -2215464 -519034
10934 -519034 1460404 3539109 2604206 -1255399 -3329305 -1247632 914713 -1343709
10926 -1343709 -6084141 -7862183 -5441485 -2525480 -1715413 -1855801 -1734981 -2499108 -4509120
10917 -4509120 -4746865 -436290 6022476 9035511 6864951 3580129 2766862 2455717 -793975
10908 -793975 -5141545 -5324225 -818455 2728546 1502378 -1550586 -2244563 -1440732 -2081905
10899 -2081905 -3228070 -1791157 1568148 3005769 1320938 -813747 -1084809 519669
10891 519669 3305554 5698956 4382764 -1939344 -8338138 -8189387 -2316695 1404815
10883 1404815 -1412411 -6664528 -8996581 -8628878 -7808779 -5339334 575995 6990701
10875 6990701 8754595 5435787 1797166 1599260 3939786 5768101 5489410 3609223
10867 3609223 1661523 1207739 2730266 4689258 4216726 -168097 -6037903 -8202236
10859 -8202236 -4070430 2329042 4163129 230809 -3576673 -2781306 -237720 -204258 -605438
10850 -605438 3239498 9848559 13077242 11192793 7888210 4854310 477780 -3824435
10842 -3824435 -3783552 -414706 -175208 -4286924 -5769111 -1133390 2742177 -838692 -7729490
10833 -7729490 -9762439 -6848859 -4756167 -4974860 -4746924 -4325586 -6092913 -7940978 -5377010
10824 -5377010 110694 2044992 -1324772 -5067055 -6101926 -6887425 -8842521 -8739350
10816 -8739350 -4872230 -1253433 -1479640 -2663741 -249195 3961759 3827241 -1912737
10808 -1912737 -7135063 -6009633 118488 5237966 5902806 3686920 1467949 126525
10800 126525 -386911 693491 3337971 4849310 2730098 -797009 -542953 4377909 8346754
10791 8346754 6562442 1865470 799182 4147797 5432669 -367692 -9795632 -14893939
10783 -14893939 -12606298 -7309870 -4013049 -2390283 184705 2426999 568456 -4570549
10775 -4570549 -7396730 -5913257 -4680962 -6358050 -6288188 -981507 3409339 -1045878
10767 -1045878 -11140511 -16279871 -13283984 -8156266 -4041459 1821228 7893877 6645919
10759 6645919 -2471022 -8503600 -3785598 5041211 7673451 4582226 3202438 5624702
10751 5624702 8102446 8476143 6631871 1254504 -6822051 -11440115 -8242295 -1910034
10743 -1910034 384404 -482618 1310527 5948991 8403162 7563050 7191004 8542125 8882406
10734 8882406 6799321 3074400 -2379599 -8399437 -9491920 -2149353 7272784 8958590
10726 8958590 3306606 10607 3326403 6943769 5261351 1388012 445820 1728375
10718 1728375 1663778 -494762 -3613480 -7102419 -9202223 -6711279 283501 6416777
10710 6416777 6793548 2594651 -1244913 -1987306 -842256 -275146 -1076952 -1573850 255425
10701 255425 3275256 3378384 -1024269 -5827358 -6519816 -4510662 -4146257 -5173277 -3237981
10692 -3237981 2634992 8162437 9959457 9202461 8086763 6173460 1682883 -5532327
10684 -5532327 -12775905 -15511885 -11304088 -4042412 -986835 -3333667 -4210697 421655
10676 421655 4818413 3422107 1385295 5712906 10866217 5639401 -7320321 -12562799
10668 -12562799 -4407156 4634092 2982865 -4206684 -5887818 -2080263 -380901 -1985190
10660 -1985190 -1513155 1990696 2957455 -1814993 -8511717 -11197907 -7404753 874007
10652 874007 8380877 9523226 3532589 -3561407 -4881257 -376207 3782498 3097881
10644 3097881 -450316 -1836154 856706 4971319 7102826 6735933 5430836 3833749
10636 3833749 1679980 257957 1632148 4594562 4842065 911455 -3460829 -4891793
10628 -4891793 -4324042 -3003681 548617 5676603 7043161 2508958 -1376177 1450138
10620 1450138 6418046 5446998 335375 -571257 3313771 4431877 589195 -1716918
10612 -1716918 1136237 4789844 5824837 6843729 9464904 10403808 8357855 7668358
10604 7668358 10983182 14148787 12277611 6193234 -68923 -3992882 -5019369 -4442155
10596 -4442155 -5650275 -10056020 -13227160 -10509706 -5253209 -4476938 -7648945 -8227940
10588 -8227940 -5516325 -5122807 -7513269 -7048178 -3867353 -5083343 -11055824 -12265959
10580 -12265959 -4710168 2659020 1801593 -3268898 -5595201 -5735562 -5910149 -2876413
10572 -2876413 5041927 11329089 9869534 4068053 378222 -1127076 -3112286 -4304522
10564 -4304522 -3294911 -2989684 -4706193 -3911422 1630556 5783284 3073892 -2283128
10556 -2283128 -3667593 -2585898 -4214365 -7427379 -7212047 -3350601 467575 3335351
10548 3335351 6841158 10420911 11673755 9321481 3502469 -3611231 -6828742 -3074770
10540 -3074770 2238325 1324847 -3551203 -3453371 1103446 -139819 -8966769 -14102943 -9665314
10531 -9665314 -4120979 -4389228 -5157389 -1908010 -444454 -4165561 -5623208 -963843
10523 -963843 803379 -5955703 -11424768 -6542125 1580296 2900713 564030 1176637
10515 1176637 1599024 -1702001 -2818995 1361514 2330010 -4341088 -9060266 -5917518
10507 -5917518 -3253459 -4429174 939149 12301346 10022629 -9559429 -19328558 -5158861
10499 -5158861 6926914 -2921040 -9823406 8811198 24158647 5328280 -16835729
10492 -16835729 -116210 26193584 12516603 3681546 95575455 263774475 346742002
10485 346742002 251133128 81966325 -1456472 15732380 33514409 7124848 -15099753
10478 -15099753 -1230664 16217299 10522408 1594902 6560978 8458931 -3821930 -11139075
10470 -11139075 -1150102 8034774 890148 -10416962 -11314913 -7684282 -7908677 -6728381
10462 -6728381 -1192836 -582308 -7829747 -11502818 -7037249 -5590865 -11649707 -12633996
10454 -12633996 -1905773 7904378 6379679 1223555 621428 -1811683 -11017377 -16589623
10446 -16589623 -9822498 -203893 -37302 -5060243 -4855046 -1421112 -2591452 -6028429
10438 -6028429 -4395291 96568 -368428 -5373452 -7801553 -5671233 -2947503 -1594453
10430 -1594453 -667138 -550722 -1943902 -3391525 -3989873 -4809868 -4980452 -1784069 3106828
10421 3106828 4271460 1561404 492447 1493260 -1565028 -8968115 -12149443 -7813928
10413 -7813928 -3979781 -5905157 -7212110 -2549520 1833188 -723761 -5332089 -4765744
10405 -4765744 -2002883 -3116941 -5233979 -2497891 2157379 1929431 -2165578 -4339119
10397 -4339119 -3949128 -3151749 38123 6626409 9887107 4237902 -3763018 -4171880 744949
10388 744949 1209261 -3198953 -3949122 786188 3707509 2140065 2125872 6406617 9011191
10379 9011191 5571141 241656 -1952277 -2699630 -5915480 -10674990 -12556899 -9159981
10371 -9159981 -2234850 3555331 3874235 -803091 -4912532 -4665695 -2848933 -3309781 -4293455
10362 -4293455 -2536781 -242422 -1048021 -2170178 1358997 6912210 7638519 4216742
10354 4216742 3569147 6121195 4763565 -2050932 -6684586 -5024565 -3007364 -5827730
10346 -5827730 -9473558 -8708298 -5824557 -5080284 -4872927 -2156542 672054 74014 -1756417
10337 -1756417 -866068 1279320 1058991 -41155 1876700 5493451 6005744 3075315 756811
10328 756811 347332 -562999 -2117027 -1259951 2481332 5538733 5798940 4986523 4319075
10319 4319075 2253583 -1536799 -3840462 -2046800 2175786 5494529 6792808 6422925
10311 6422925 4019451 -229271 -3627513 -3146868 703921 4224258 4892061 3968930 4334901
10302 4334901 6582091 7973659 5462758 -483246 -5839323 -7280605 -5539830 -3432738
10294 -3432738 -1747478 585359 2794777 2074295 -1925882 -5508148 -5854895 -4956436 -5940433
10285 -5940433 -7766166 -7228716 -4747712 -3643679 -3902661 -1673926 3669723 6868857
10277 6868857 4215754 -296353 -456214 3285167 5319107 3736844 2214335 2980129
10269 2980129 3416454 1551619 232800 2469173 5764842 5073627 56161 -4172866
10261 -4172866 -3498863 558466 3183975 1705745 -1870225 -3164656 -132406 4542806
10253 4542806 6329711 3915562 85107 -2337448 -3252620 -3399872 -2288430 326246
10245 326246 2920973 4054766 4124600 3686725 2087658 -298865 -928629 1055612 2171086
10236 2171086 -681457 -4874329 -5674833 -3639836 -3342163 -5444499 -5785421 -2929130 -711501
10227 -711501 -1384950 -1935497 -323337 -37194 -3894852 -7673233 -5698638 -109091 1649372
10218 1649372 -2428252 -6649706 -6531117 -4422314 -4376118 -5886466 -5702349 -3074721 -132058
10209 -132058 1635436 2763257 4053168 5112046 4914013 3292839 1669331 1777288 3218575
10200 3218575 3413660 1347860 2618 2499705 6776593 7803583 5267131 4634035
10192 4634035 8707819 12384381 9517830 2108896 -1973962 804359 6342192 9748335
10184 9748335 10890058 11642310 11535058 9097353 5397027 3128056 2777421 2146386 -145907
10175 -145907 -2457677 -2050879 1702570 6472100 8739041 6336242 274567 -5199708
10167 -5199708 -5242866 1195769 9258620 11991745 7488464 1155058 -749057 1247625
10159 1247625 1292170 -3083861 -7454272 -7003871 -2831551 1050394 3801608 6678411 8178097
10150 8178097 5732803 1700325 1724832 5792782 6616379 35102 -7797250 -8225359 -1798722
10141 -1798722 3250245 2635177 367825 1114043 3510402 3508836 788103 -1480472 -1678725
10132 -1678725 -1483059 -2537954 -3521210 -1658481 3326784 7743279 7182349 1379886 -4928933
10123 -4928933 -6715469 -3734369 -97796 709890 -797365 -1560337 568183 5246852
10115 5246852 10446859 13953134 14497930 12362113 9288621 7438102 7570514 7849922 5358111
10106 5358111 -42588 -4108366 -2543884 3085574 6410340 4232005 661642 1131188
10098 1131188 4758494 6106484 3186807 -352245 -1089683 69908 1023981 2385620
10090 2385620 5740749 9820573 11121221 8121726 3258288 456825 1284440 3537526
10082 3537526 3633397 734521 -2035744 -1553578 819243 823650 -2622202 -5644502 -4821744
10073 -4821744 -1798493 -426355 -1264235 -1595274 211004 3115911 5628249 6876483
10065 6876483 5749895 2050774 -1141079 324352 5630504 8401618 4747744 -721163
10057 -721163 -562516 5364043 9742668 7608668 1842360 -2283898 -3638790 -3598988 -1613505
10048 -1613505 3237945 8027885 7941244 2597920 -3059302 -4793986 -3278755 -1793428
10040 -1793428 -2365768 -4953147 -8099431 -9481815 -7702871 -4146350 -1294931 754466
10032 754466 3622723 6567969 6509211 3018766 -182211 -311226 1063000 1544713 1722991
10023 1722991 3148146 5204694 6346506 6096430 4042176 -184571 -4185660 -4023532
10015 -4023532 -665986 -486691 -5587649 -8781775 -3790001 4338706 6377048 2810920
10007 2810920 1656463 4408241 4426885 -63040 -1898577 2605144 6508706 3182290
9999 3182290 -3050300 -4088787 -434087 1132658 -1097183 -2252493 455045 4077014
9991 4077014 5149872 3440821 -157371 -5130290 -9557335 -10252422 -6345139 -677451
9983 -677451 3493989 5632540 6941354 7715219 6984314 4405620 1478396 317832 1409249
9974 1409249 3370541 5100741 6767575 7826133 6138506 1322462 -2899470 -3116041
9966 -3116041 -1695574 -3514315 -7758550 -8190437 -2398985 4527034 7511602 7599122 7737212
9957 7737212 7320195 4923055 2580207 2791148 3980405 3222760 1305956 1008446 2227111
9948 2227111 2811340 2650188 3049286 3418098 2362551 879806 788238 1080484 -492422
9939 -492422 -3184493 -4311544 -3788614 -3920867 -5089374 -5143228 -2992345 181984 3105180
9930 3105180 5208496 5817696 5045159 4645095 5569273 5990544 4315225 2253705 1772154
9921 1772154 1345351 -635978 -1117679 3445159 9561459 9715842 3140019 -2562788 -2000441
9912 -2000441 1403179 1909166 -76679 415101 5480320 11532391 13060552 7982224 14749
9903 14749 -4430545 -2918943 547083 1458347 866329 2225857 4735525 4877939 2933938
9894 2933938 2058415 1744076 -1212560 -5244944 -4696890 828511 4940185 4296516 2762134
9885 2762134 2932349 1111885 -4793723 -9360824 -7372986 -1766102 2043636 4311661
9877 4311661 6659478 4711155 -6198633 -20411539 -25797653 -18409932 -6615208 -117880
9869 -117880 -492431 -3143352 -3526254 -437871 2986368 1336900 -6453935 -13348056 -11460238
9860 -11460238 -2387761 4693471 4848264 1663909 -492960 -1977660 -3601835 -2992861
9852 -2992861 1008608 4728856 4494555 1950149 784877 747733 -1182338 -5505216 -9932087
9843 -9932087 -13248038 -15695403 -16052049 -12201587 -5271273 29471 733762 -867280 -679797
9834 -679797 1779506 3382411 2025455 -839991 -2522232 -2247905 -1279336 -1125424 -2530210
9825 -2530210 -5120519 -6917702 -5331249 -304083 4350627 4716698 1352721 -1961258
9817 -1961258 -3393896 -4210522 -5092134 -4903722 -3838582 -4105209 -5935820 -6406358 -4316219
9808 -4316219 -2812951 -4444042 -6876491 -6983076 -6250405 -7827016 -10258342 -8992099 -3433594
9799 -3433594 1846863 3095510 1117727 -1168562 -2023307 -1467931 -713078 -840883 -773083
9790 -773083 1743206 5385260 4644971 -2531323 -9709788 -9591984 -3996118 -117497 867642
9781 867642 3519235 7146598 4556199 -5625605 -13908266 -12165703 -4585265 -958611
9773 -958611 -3859118 -8010986 -8727818 -5542217 -103416 4592458 4985063 1311281 -928621
9764 -928621 2100056 6712804 7267815 4884818 5057672 8440269 10214730 8036114 4500336
9755 4500336 1443497 -2104604 -5035904 -3360536 2868979 6953658 3845970 -2572665
9747 -2572665 -4833330 -2058883 -95253 -2371118 -5366997 -4347735 -75754 2715711
9739 2715711 1881724 71163 302745 1776980 1667571 -334276 -1769287 -1645921 -2166838
9730 -2166838 -4830879 -7084699 -5412682 -629555 2825070 2826718 1966605 3090170 4928599
9721 4928599 4201869 666124 -2469368 -3111857 -2961990 -4545651 -7257274 -8330981 -7062608
9712 -7062608 -5697829 -5799128 -6104304 -5131176 -3646368 -2698587 -1301619 1376077 3367927
9703 3367927 2698838 1321951 2329247 4256706 2893418 -1465644 -3909022 -2776194
9695 -2776194 -1892917 -3195004 -3321776 -810848 -400939 -5014122 -8972598 -6080116 -421753
9686 -421753 -1012833 -7759707 -11372155 -7346653 -1663051 -475914 -1703757 -786173 1303850
9677 1303850 1095402 -358256 730832 3848603 4217655 -71622 -5124610 -6605176 -5043485
9668 -5043485 -3885735 -4189662 -4048308 -3005976 -3843742 -8023368 -11730603 -10176339 -5112825
9659 -5112825 -3492312 -7570284 -11018638 -7646542 64116 4977291 4589620 1807971
9651 1807971 -994847 -3584939 -4983188 -3996448 -2066469 -1461562 -1643298 -1487370 -3210002
9642 -3210002 -8711243 -13621867 -11651487 -4565358 -904331 -3992241 -8062582 -7874068
9634 -7874068 -5287156 -3684781 -2443234 -661657 -776944 -4233244 -7923388 -8711420 -7616557
9625 -7616557 -6356648 -3982269 -270604 1857398 930008 -152142 709874 1032715 -1109952
9616 -1109952 -2733946 -1091602 1231191 1133986 595169 2176151 3221130 730064 -1710039
9607 -1710039 1053126 6321093 6509830 372552 -5566244 -6418725 -3555126 208373 4158856
9598 4158856 7639495 9300122 9345180 9060956 8260894 6445849 5278123 6060529 6398579
9589 6398579 3784717 593201 395374 1371662 -429704 -2954507 -561241 5926663 9283034
9580 9283034 6784033 3613818 3706145 4339200 2434568 -262386 -1430732 -1992666 -2749461
9571 -2749461 -2530271 -2391820 -5921234 -12136194 -14032224 -8402573 -1589429 -542216 -3170393
9562 -3170393 -3272192 -707921 19976 -1540799 -1539846 851000 2352009 2041245 3171208
9553 3171208 7066964 9748108 7031082 230752 -5529149 -7207286 -6072557 -4604279
9545 -4604279 -3111762 -494523 2570489 3525859 1897236 890900 2586474 3667200
9537 3667200 -161732 -6669451 -8848333 -4358649 1649074 4250139 4501170 5622495
9529 5622495 7951684 10238961 12076761 12437357 9380897 3739283 -441740 -1472988
9521 -1472988 -2130800 -3792738 -3150038 1763315 6867591 7693704 5620404 3826625 1234699
9512 1234699 -3864194 -7888990 -6442386 -2323127 -2097796 -5864042 -7239241 -3400576
9504 -3400576 1197178 1811685 -1278388 -5212189 -7553180 -6464187 -2582466 -865731
9496 -865731 -5463985 -12449575 -13268855 -6313054 892836 2635740 1784849 2661277 3368459
9487 3368459 135533 -5267307 -8164399 -8329468 -9244577 -11466855 -11931913 -9608403 -7150052
9478 -7150052 -6106441 -4468905 -769303 2355508 1328496 -3028310 -5978018 -4725224
9470 -4725224 -1623143 -487698 -1341217 -929783 2116208 5369596 6544538 6591306 7017766
9461 7017766 6578066 3569335 -216258 -1404339 -216748 -17632 -1648912 -2183819 -444379
9452 -444379 53320 -3851884 -9542151 -11198242 -6723800 239223 4772829 5311150 3718854
9443 3718854 2039837 8042 -3866361 -8886900 -11329705 -8628811 -3491273 -1320794
9435 -1320794 -3539597 -6191223 -5815896 -3737201 -2907092 -3313092 -3264228 -3293643 -5257070
9426 -5257070 -8071981 -7866408 -3278222 2056712 3900892 2448325 1037535 1185776 1538932
9417 1538932 1444877 2422240 4788266 5636325 2912290 -334763 499341 4384079 5354089
9408 5354089 1284838 -2479107 -788207 3811728 4981635 1288404 -3331153 -6101276
9400 -6101276 -7697169 -8597121 -7810507 -5736720 -4308822 -3537515 -1563002 1128511 1477161
9391 1477161 -929645 -2410743 -845999 1092469 867820 498749 2613690 5168186 4321616
9382 4321616 661097 -1764010 -1610410 -1216851 -1650810 -914114 2088595 5156976 5702147
9373 5702147 3674571 616500 -2010217 -2720800 -608813 2737903 4060615 2514387
9365 2514387 912050 1482792 2669442 2193904 1079532 1620331 2827648 1530008 -2292939
9356 -2292939 -4868146 -4104139 -2702531 -4293330 -8505029 -11443805 -9995162 -4875783
9348 -4875783 -293255 -353582 -4346261 -6658567 -4166419 -2229860 -8185535 -19118592
9340 -19118592 -23312666 -16359525 -8079626 -8120026 -12134141 -10566102 -4979397 -4264895 -7873216
9331 -7873216 -6174305 1786749 4381688 -4268416 -14055837 -14185490 -8709851 -7706455
9323 -7706455 -10842662 -10379501 -5443319 -2163197 -1842325 564222 6230376 9798199 8233645
9314 8233645 4860604 2739793 295735 -4294611 -9321520 -12106570 -11548243 -7187472
9306 -7187472 353487 7304137 9183755 6401442 4054008 5366241 8317609 9112328
9298 9112328 6158950 682643 -3943274 -4194948 -492584 2108696 310141 -2750419
9290 -2750419 -3034436 -2387014 -4047387 -4815848 231235 7085705 6288461 -2623941 -9575620
9281 -9575620 -8675511 -5126570 -4159737 -2519398 3277223 8090435 5127099 -3203502 -8587151
9272 -8587151 -8003452 -5548526 -5034000 -6080102 -6825212 -6711639 -6668231 -8053525 -10367677
9263 -10367677 -10139722 -5257943 -179713 -1688915 -8573661 -11668569 -6444480 753420
9255 753420 2302421 -1156638 -4852481 -7191566 -7688232 -3564603 5059922 11226244 9124117
9246 9124117 2518559 -926932 -200025 416672 -367953 -867162 -1803791 -4558542 -6322331
9237 -6322331 -4015608 -940091 -2265189 -5815708 -5291143 -1401192 -1123748 -5731284 -8291119
9228 -8291119 -4791857 239535 1904608 1498499 1480125 354759 -3041393 -5316743 -3434156
9219 -3434156 -181719 -66934 -2291410 -2344909 703429 2674848 243735 -4520758 -6757453
9210 -6757453 -4619310 -1056657 335859 -90435 686395 3133299 4295303 2930571 1929695
9201 1929695 3512014 5575147 5886167 6288416 8494959 8997675 3737954 -4227879 -7688214
9192 -7688214 -4934143 -813279 1182520 1955083 2015229 -82692 -3365722 -4068683 -1392968
9183 -1392968 999691 817706 134698 1044808 2464257 2898469 2723710 2314745 1220026
9174 1220026 29571 -314472 -1258970 -4721134 -8505378 -8393087 -4917394 -2677981 -2592210
9165 -2592210 -1113183 1783749 962885 -4950572 -9889678 -9271891 -6369919 -5583295 -5346731
9156 -5346731 -2739850 235084 613305 238874 2022126 4453656 5192176 5816403 7218582
9147 7218582 5033436 -3051745 -9657193 -6243706 3354387 7484501 3582428 291971
9139 291971 2088065 2775444 -1998237 -5897713 -2147093 5134851 7884133 6983284 9272390
9130 9272390 14572465 15114723 8158366 769086 -630464 1192097 264004 -3026077 -3656277
9121 -3656277 -620236 1670735 288501 -2465815 -3195295 -1899117 -755958 -739325 -1136565
9112 -1136565 -1093661 -508524 -418024 -2783462 -8080181 -12774771 -11912963 -5494724 482664
9103 482664 1263582 -1118642 -2009428 -888100 -234430 -36199 1692118 3878945 2969873
9094 2969873 -1076173 -3845564 -2595617 442224 2013568 1610416 113393 -1875867
9086 -1875867 -2835688 -644020 4121397 7775043 7825352 5334610 2334188 26293 217480
9077 217480 4371926 9530048 9515550 3038614 -3183680 -2774346 2057114 4333894 1681875
9068 1681875 -2235768 -3857347 -3214269 -1994885 -1273229 -877670 681410 4328836 7270129
9059 7270129 4698603 -3040676 -8575238 -6458954 -652983 1574629 73659 132682 2618380
9050 2618380 3140737 799915 142334 2572902 2799334 -2557656 -8378765 -7715464 -1237938
9041 -1237938 4703088 6890546 7401237 8290154 8609885 6912466 3564323 -703 -2470304
9032 -2470304 -3146058 -2767119 -3261092 -5063754 -5695957 -3170424 241925 653188 -1440801
9023 -1440801 -1371047 2788972 7093443 7349508 4728640 2920178 2124939 -266068 -4097532
9014 -4097532 -5778093 -3647393 -305252 1845130 4205649 8825226 13925340 15512025
9006 15512025 12602056 8447555 6696387 7888917 9524779 8461133 3761801 -1844876
8998 -1844876 -4207362 -2477558 -296212 -859564 -2546538 -1889519 484868 326624 -3827482
8989 -3827482 -8009328 -7857815 -4121428 -1474825 -2785034 -5886221 -6229532 -2433752 1545123
8980 1545123 955462 -3429567 -5969693 -3797473 -731811 -1619165 -5764661 -8934278 -9304880
8971 -9304880 -7887674 -5229580 -1630929 1112648 2078241 3442445 6374743 7339840 3587838
8962 3587838 -517701 671619 4201031 2575061 -3418021 -5338774 -1265247 655348
8954 655348 -4261105 -9686677 -8965700 -4887020 -3045039 -2866164 -1622043 -838302 -1896629
8945 -1896629 -1071767 3865632 7294399 3638484 -2738333 -3441834 1559622 5223735 4321752
8936 4321752 1417518 -1621921 -4408196 -4260326 579773 5209508 3020165 -4466046
8928 -4466046 -9798671 -10604279 -10902934 -12091560 -10674930 -5708462 -1158724 616397 1654969
8919 1654969 3628275 5741574 7634802 8926815 6545712 -1064640 -7887269 -6044855
8911 -6044855 2532535 8171112 7492856 6552934 8712663 9079828 4330027 -946914 -2308371
8902 -2308371 -2112323 -3333256 -3851949 -1819822 78245 762291 4304238 11678300 15705020
8893 15705020 10938465 2745998 -612175 256196 -356241 -2404388 -1662625 852032 -159852
8884 -159852 -4956491 -8098412 -6956979 -4308819 -2396448 -359942 2063538 3555211
8876 3555211 4380607 5940882 6951143 4518640 -556065 -3650506 -2244448 1166315
8868 1166315 2473565 -88467 -4880691 -7526880 -4059666 3967765 9454742 7948922
8860 7948922 3478950 2360338 3935193 2771617 -1832411 -4719630 -2885705 1022498
8852 1022498 3579292 4040358 2576576 -305622 -2180766 -909831 1378826 842459 -1745925
8843 -1745925 -2118243 145370 959550 -1065961 -2636870 -2165731 -2092279 -2824211 -513657
8834 -513657 5874136 10712708 9029945 3416943 -469315 -1695750 -3084624 -5265251
8826 -5265251 -6026843 -4124137 -503626 3117928 4887496 3803831 1611467 1320879 2638502
8817 2638502 2272716 225006 1162842 6795965 11783559 11310735 8233044 7695299 8828249
8808 8828249 7897274 6215479 7606060 9994663 7382000 -42299 -5184648 -4347531 -1413651
8799 -1413651 -191106 735930 2895277 3816481 1755538 -359415 357706 2084072 2175450
8790 2175450 2070313 4115943 6534802 6099579 3742791 3079497 4622504 5477714 4010691
8781 4010691 1283860 -1555213 -4125955 -5564723 -5300906 -4532751 -4371708 -3533362 -699965
8772 -699965 2160651 2388608 1428433 2823309 5978849 6720011 4444760 3640440 6617630
8763 6617630 9465985 8082879 4477611 3598938 6350248 9017707 8065815 3000441 -3877228
8754 -3877228 -8309849 -6687454 -471092 3879043 2326786 -1256156 -492197 4350522
8746 4350522 7159586 5359724 3353461 5260298 8645464 8279036 3349586 -2073008
8738 -2073008 -4261443 -2912043 91497 2521884 2568135 -185075 -4066030 -6863860 -8379539
8729 -8379539 -10277720 -12991587 -14134984 -11291180 -5749109 -1754430 -1671397 -3365313 -3389997
8720 -3389997 -1547406 -644059 -2371006 -5324997 -7029656 -6147982 -2719856 1797386 4573375
8711 4573375 3761662 1225441 419946 1070382 -761368 -6007761 -9827236 -8259283 -4276849
8702 -4276849 -3413158 -5946064 -7859190 -7800648 -8144892 -9748898 -10457098 -9182132 -7427669
8693 -7427669 -6307819 -5658631 -6118927 -8076281 -8613558 -4391687 1804670 2919954 -2147449
8684 -2147449 -5757884 -2123777 4449919 6342155 3429831 1606272 3102032 4245294
8676 4245294 2285108 -733758 -1711285 -420212 1339462 1957177 603965 -2461006 -5567930
8667 -5567930 -6867610 -5977796 -3614043 -436398 2511568 3442123 1765763 -472566 -881191
8658 -881191 451949 2097535 3840615 5729118 5882322 2460615 -2506951 -4379169 -1366595
8649 -1366595 3783392 7800686 9826774 9693241 6376561 277896 -4811280 -4606430 909871
8640 909871 7085909 9194185 6719159 2998797 1340431 2107800 3385314 3415965 1726284
8631 1726284 -1117077 -3434097 -2892914 816313 4032914 2515370 -2786093 -6202101
8623 -6202101 -4544374 -707188 1508668 2615414 4555808 5744830 3276261 -1492708
8615 -1492708 -3879067 -2091577 976456 2085316 670848 -2498924 -6672750 -10490410
8607 -10490410 -12095607 -10405846 -5458129 1386522 6484003 5821126 609687 -1927392
8599 -1927392 2470101 8015180 6449427 -237028 -2086615 3782712 8679232 5561309
8591 5561309 -943877 -2725874 -223938 352169 -2093882 -2722079 553303 4115211 4821178
8582 4821178 3875962 3238026 2381998 681015 -45255 2022697 5195233 5684733 2504854
8573 2504854 -802147 -402559 2642219 3351243 -355142 -4034627 -2304529 3572810 7427668
8564 7427668 7023880 6456635 8527775 9701298 5958788 -125638 -2636850 -539405 1783008
8555 1783008 1247871 -788414 -2045877 -2354693 -2454140 -2416306 -2199335 -2145743 -2451619 -3163657
8545 -3163657 -4402302 -5532589 -5014873 -2576816 -513631 -991706 -2979464 -3812422 -2910032
8536 -2910032 -1871505 -1771330 -2537970 -4089289 -5712746 -5280739 -1843170 1682870 1397013
8527 1397013 -2233856 -4723389 -3247409 587102 3539155 3762082 1299559 -1686919
8519 -1686919 -1379813 4029164 10979045 13533644 9770832 2789813 -3793214 -8041002
8511 -8041002 -8398502 -4737099 -646043 -40881 -1267633 353866 3774048 2342144 -5502362
8502 -5502362 -12340787 -12038719 -7805944 -5633230 -5464043 -4347836 -3106743 -3298634 -1989068
8493 -1989068 3003868 6291654 1861219 -5517570 -5290224 2961185 8353831 4904852
8485 4904852 -763655 -1433282 80272 -1812468 -4913934 -3602144 828773 2140581
8477 2140581 -639412 -2273233 -325244 1178529 -1555970 -6347949 -8047485 -4594092
8469 -4594092 1436393 5542674 4568134 -1225457 -8197055 -11950796 -10575604 -5647523
8461 -5647523 -687641 1324629 32519 -2158022 -2778929 -2085440 -1937798 -2457181 -2109019
8452 -2109019 -893003 -320789 141298 2822128 6822658 7362804 2451085 -3538292 -5641717
8443 -5641717 -3979924 -813484 3641493 8276134 8392392 1841575 -5231837 -5212520 426872
8434 426872 3823645 2373463 688028 1723085 3421942 4571761 6629820 8508523
8426 8508523 6759868 2744970 2296457 5699304 5557126 -1569475 -8643682 -8244107 -2731359
8417 -2731359 1284497 2637060 3244347 1472796 -4317301 -9387436 -7948921 -2626875
8409 -2626875 -863611 -3479216 -4708057 -2869986 -2685496 -6037176 -8192537 -5614115
8401 -5614115 -1115889 1540689 2664778 3309683 2027084 -1409826 -3104047 112670
8393 112670 5530167 7732268 5162084 826480 -1994425 -2332584 -967682 720287 1903364
8384 1903364 3262098 5951367 9346129 11274076 10653692 8139930 4214446 -994466
8376 -994466 -5785864 -7479994 -5733554 -3128844 -2051251 -3030405 -5835807 -9315658 -10486648
8367 -10486648 -7421772 -3029427 -1903287 -3391214 -2755813 324788 637565 -3268050
8359 -3268050 -5395269 -1709427 3040466 3176419 1271756 2910456 6564150 6238119 1568993
8350 1568993 -2387169 -4017764 -6158094 -8694897 -7961116 -4378141 -3194890 -5573749
8342 -5573749 -5987355 -1606402 2223817 216327 -4560923 -5810449 -3367368 -1809278
8334 -1809278 -2364332 -1970304 631157 3000959 3317539 2516125 1655720 504244 -689244
8325 -689244 -1013814 -1241837 -3561551 -7770962 -10121164 -7656355 -2171445 1763629 1655444
8316 1655444 -1529610 -5816732 -9876957 -12183807 -10836124 -5886382 -758698 903591
8308 903591 -7108 1303338 6892989 12164506 11175727 4772831 -22389 917643 3955027
8299 3955027 3648318 350848 -1469787 -572886 -343931 -2835492 -5397669 -4892558 -2327484
8290 -2327484 -827883 -926485 -873045 -723544 -2572494 -6039169 -6940955 -2924871 1841632
8281 1841632 1258874 -3964011 -6170001 -687794 7572711 10275686 6040607 945409
8273 945409 -273969 736056 330958 -1574289 -2418324 -972996 1843615 4607009 6056088
8264 6056088 5551315 4489457 5612365 8953332 10235388 6022764 -780526 -3790594
8256 -3790594 -1075315 2980937 3903414 2017428 313935 470125 2477130 5642175 8022189
8247 8022189 6898308 2009601 -3078161 -4855435 -3963286 -3442909 -4043938 -3721030 -1409538
8238 -1409538 994103 765460 -2860157 -7948956 -10921841 -9185974 -4268591 -1330010
8230 -1330010 -3390075 -6924552 -6047257 -564282 3771860 3451068 1455430 1428818 1709241
8221 1709241 -1000018 -4682881 -3751167 2569334 8122505 7575365 3147295 1348406 4730044
8212 4730044 9331808 10094595 6840421 3768271 3661466 4321952 1933363 -3143896 -6452690
8203 -6452690 -5554955 -3077494 -2011514 -984576 2499335 6205138 5093606 -1119919
8195 -1119919 -6604679 -6564548 -2264590 2210460 4786239 5328142 3946791 1661003 335182
8186 335182 -82932 -1934585 -5613104 -7739980 -5916423 -2389829 -158226 1402241 3303395
8177 3303395 2692688 -2779093 -8622237 -8053240 -2242675 718373 -2218780 -5028599 -2717115
8168 -2717115 1305154 1906586 480443 1200852 3410932 3741709 2880302 4032228 6381921
8159 6381921 6252724 4028653 3827311 6097216 6495064 3298606 379902 825858 2631173
8150 2631173 3279959 3997192 6280550 8218860 7814371 6551786 6091742 4874367 2181101
8141 2181101 2096328 7872679 14732431 14745089 8158255 3359617 4879111 7812385 6425940
8132 6425940 2582233 1722127 4412493 6256741 4204956 -522556 -4552178 -4861568 -519053
8123 -519053 5840822 9589104 9028024 7203047 7169626 7729828 6149152 2670032 -693193
8114 -693193 -3656265 -6415794 -6860629 -3319733 1116940 1696780 -921383 -1362947 2402013
8105 2402013 6437616 7345916 6688897 6830189 6548676 3860242 246229 -1165940 74906
8096 74906 1734521 1881741 76589 -2962386 -5291281 -4810646 -1725076 1499420 3273532
8087 3273532 3851794 2936089 -98105 -2549018 345458 7744360 11496114 6471327 -1298034
8078 -1298034 -2286954 3653265 8419760 7821166 5458497 4555174 3280699 264733 -1543435
8069 -1543435 52072 2266818 1868066 365403 1020265 3500189 5265238 6238981 8264586
8060 8264586 10917661 11372315 8478372 4419791 1882256 1248973 1134450 705278 675228
8051 675228 1710591 2160920 -991404 -7541594 -12047214 -9229601 -727701 6598552 8602414
8042 8602414 6490581 2181263 -3647459 -7966008 -6034482 1095654 5012220 430580
8034 430580 -6963449 -8323951 -3723345 -286163 -668387 -435044 3318692 7221402 6995965
8025 6995965 2821886 -2346128 -6298091 -8147635 -8190051 -7779007 -6985202 -3155452 4713639
8016 4713639 11277086 9626970 971810 -5812655 -5476951 -2028367 -1296349 -3251210 -4757187
8007 -4757187 -5310670 -6149729 -6981434 -7185912 -7629004 -8310256 -6981806 -2929319 862182
7998 862182 2197933 3016795 5041093 5805030 3147367 87805 190026 1187710 -846584
7989 -846584 -3359374 -249870 7798488 12798834 10088163 3571419 -916650 -2005723
7981 -2005723 -783276 2383012 6246322 7859998 6131172 3380857 1559661 -82819
7973 -82819 -2046753 -2785023 -1835460 -1446623 -2867070 -4073859 -3480253 -2954067 -4695215
7964 -4695215 -7810683 -10375340 -12183047 -13016535 -11062915 -5924862 -651982 2076096
7956 2076096 3239360 4202528 3388875 11380 -1971791 1365228 7133604 8939174 6042397
7947 6042397 3937470 5850410 8750197 8649466 5343744 541689 -4716036 -9019783
7939 -9019783 -10331450 -8756106 -7091788 -6984608 -6675708 -4002932 168126 2729302 1314098
7930 1314098 -3762409 -9098198 -10310654 -6797025 -3496455 -4855907 -8332256 -8451376
7922 -8451376 -6261207 -8004909 -13507169 -13950450 -5216704 4071489 4482984 -133617 966847
7913 966847 8657639 13354247 10243091 5172139 3715362 3628875 1935608 1192767 3001920
7904 3001920 2212371 -4971159 -12090224 -10276359 -2276971 653824 -4352666 -7507165
7896 -7507165 -1705702 6530480 7245658 1892960 178947 5012174 8817229 5326103
7888 5326103 -1907618 -5592451 -4425569 -2792403 -3438788 -4587172 -3758147 -1176074 1314842
7879 1314842 2680356 2902064 1736193 -1408020 -6030014 -9669402 -9658429 -6245091 -2897511
7870 -2897511 -2313051 -3094671 -2285940 -388247 -790916 -3865129 -5191404 -1607949 3941881
7861 3941881 6433097 5324529 3644452 2252251 -563473 -4101880 -4613513 -1069339
7853 -1069339 2381236 2210661 815703 2804379 7722409 10074587 6431848 -509893
7845 -509893 -5760290 -7547163 -7393628 -6207179 -2797876 3306098 9469808 12105175 10792013
7836 10792013 8621895 8199108 8895303 8816941 7802143 6888403 6061930 4637443 3224705
7827 3224705 3002590 3135829 1368377 -2194701 -4172168 -2122163 1894972 3557657 1311762
7818 1311762 -2093546 -2649713 1234842 7619320 12612975 13269158 9885284 5844131 4779987
7809 4779987 7264959 9999026 8759663 2918107 -3344160 -5603985 -4661798 -5122419 -8089024
7800 -8089024 -8719289 -3546233 2838659 2745658 -4357983 -11245832 -12427708 -9538629 -6480391
7791 -6480391 -4082816 -1861393 -912201 -1678798 -1625453 1411561 5364395 6606056 5198977
7782 5198977 4366353 5337130 5617639 2690287 -2526531 -6468693 -6301139 -2443199 1861032
7773 1861032 3722534 3160657 1701702 -551081 -3997865 -6241544 -3685662 2321017
7765 2321017 4941158 216127 -7116069 -9527711 -6130377 -2566103 -3003911 -5948590
7757 -5948590 -7461951 -5515355 -1347990 1338259 -758431 -6562505 -10776379 -10030166
7749 -10030166 -6987608 -5772407 -5784254 -3947080 -1020326 -585914 -2613968 -3474253 -2585759
7740 -2585759 -3462255 -6631612 -6920166 -928615 6845886 9210179 5104676 -387926 -3220014
7731 -3220014 -3871784 -4131901 -3856092 -2104033 435572 1856262 1568732 1191769 2282269
7722 2282269 3947465 4135811 3114859 3467367 5786970 6897175 4390009 690672 -391658
7713 -391658 463971 -686230 -4674571 -7829497 -7104940 -3338392 911865 3771224 4099418
7704 4099418 2271686 1192510 3330402 6477583 5940983 1309626 -2835580 -3524318 -2301494
7695 -2301494 -580966 2632862 6153158 5317903 -709270 -5108566 -2053462 4488643
7687 4488643 6532827 3951691 3660534 7923253 10859960 7936504 2353278 -919240
7679 -919240 -1926287 -2504942 -935694 4551453 9723676 8424349 2347821 178427 5195020
7670 5195020 9925290 7208791 1325245 1499097 7319960 9080188 3017991 -2449532
7662 -2449532 527878 7657608 9971930 7451167 7015814 9621340 8348083 -34727
7654 -34727 -9317887 -12154483 -8343795 -2170596 3516716 7418966 8083333 5683491 3009394
7645 3009394 2141571 2284095 2383417 2961839 3755739 2885620 437117 -373761 2134614
7636 2134614 5337926 6362491 5736219 4805728 3044682 619125 148109 2812894 5892142
7627 5892142 7196621 8522644 11300253 12489157 9151344 4088612 2278096 4028691
7619 4028691 6072959 7158595 7989687 7742911 5485709 3467559 4446187 7215664 8897077
7610 8897077 9488962 9603228 6517291 -1565622 -9617329 -11118622 -8083748 -8394392 -13362225
7601 -13362225 -15708661 -11165550 -4662023 -2374417 -3912633 -5460133 -5357698 -3510725
7593 -3510725 93786 3397942 3047850 -312435 -1805740 222582 1219546 -2122623 -6172370
7584 -6172370 -6070622 -3193816 -2428890 -4728611 -6693569 -5991373 -3732959 -2357891 -3284738
7575 -3284738 -5555015 -5874120 -2107351 2832044 3903449 1265476 118321 1978057
7567 1978057 1747059 -3689518 -9569499 -10062977 -6038930 -1545466 2544802 6133513 6100297
7558 6100297 1552848 -1169017 3668869 11161566 11588530 4558612 -1045494 -760961 513795
7549 513795 -1527002 -4036436 -3445187 -1597012 -1579865 -2614662 -2811621 -2888319 -3900429
7540 -3900429 -4886083 -5490281 -7274154 -9874465 -9876107 -6476643 -4132870 -5776359 -7155061
7531 -7155061 -2645373 5901640 10993719 8711957 1778445 -5387812 -10272093 -11526769
7523 -11526769 -9206998 -6336616 -6427962 -8347022 -6892745 5838 7488297 9385547
7515 9385547 5813148 2464030 2795647 3610648 -266715 -8391502 -14180082 -12489279 -5707697
7506 -5707697 -576918 -250715 -1923505 -1690937 1254796 5522806 9378607 10549473 7264870
7497 7264870 1395265 -2147031 -1442746 -480977 -3239952 -7257700 -6959459 -2072552 1562981
7488 1562981 -206073 -4730375 -6187333 -1991603 5116939 9708668 8314084 3076561
7480 3076561 309366 3523333 8852323 9989268 6417654 2914062 1606106 -351056
7472 -351056 -4311112 -6762894 -5082754 -2060561 -1030136 -337312 2824411 6084560 4864322
7463 4864322 152287 -2355827 -806947 537423 -1305542 -3425635 -2272173 543293
7455 543293 1169794 -416396 -1139327 -407854 -1122874 -4699056 -8102041 -7517294 -3536691
7446 -3536691 -816578 -2561508 -6692920 -8416904 -5948029 -2149592 -311077 -276358 -134718
7437 -134718 115180 -740117 -1703523 -185624 3612169 6145203 5551020 4321147 5107763
7428 5107763 6397782 4873192 367004 -4024729 -5531202 -3214571 2575154 9481062
7420 9481062 13087561 10896059 5998780 3754638 5039393 6017163 4507334 2577268
7412 2577268 1831937 336162 -3286276 -6060891 -4382082 583460 4683533 6612281
7404 6612281 8336193 10275819 9925260 6082600 1358061 -1092301 -1239243 -999667 -994399
7395 -994399 -356441 1029472 1911214 1393811 213347 -18531 1572243 4333853 6739701
7386 6739701 7913849 8447007 9291372 9993476 8973420 5885821 2631351 1156729 1076979
7377 1076979 608342 -830755 -2448384 -4029491 -5999373 -7370855 -6086621 -2592709
7369 -2592709 -661309 -2409747 -4491046 -2490857 2167483 3976802 1938707 1351200
7361 1351200 5216188 8949300 7554530 3961742 4658292 9428459 11762067 8757417
7353 8757417 4189979 1191509 -1536816 -4350645 -4156102 -738595 543234 -2799289
7345 -2799289 -4783814 -32704 6155787 4593978 -3764915 -9162742 -7464178 -4355232
7337 -4355232 -4122694 -3125114 2135707 8037216 9965995 9733414 11373753 13682775 12483881
7328 12483881 7638116 2917343 785234 1202313 3534685 6070881 6014305 3458855 2522946
7319 2522946 4834388 5675180 1664615 -1751758 2398580 10654811 13037882 8060587
7311 8060587 4604402 7420650 9871175 5032162 -3622544 -8192868 -7457367 -5954944
7303 -5954944 -5587079 -4126739 -550569 2854359 3331405 -3751 -5512364 -9003570 -6722896
7294 -6722896 -527310 2675799 -662348 -5611425 -5157974 738598 5874046 5584323 519111
7285 519111 -5564688 -8537136 -6013713 72839 4185116 2992148 -910074 -2974350
7277 -2974350 -2063310 244688 2598505 3436368 1140052 -2110610 -664153 6308805 11340586
7268 11340586 8934760 4703377 6935240 12872772 12667328 5268908 192354 2588975
7260 2588975 6266102 4600206 54141 -1616412 -205795 644763 -646315 -3499042
7252 -3499042 -7364781 -10711209 -10806074 -6966023 -1571331 2994491 5282254 3172139 -3618143
7243 -3618143 -9690878 -9004494 -4091131 -2942243 -5999626 -5299544 1087975 4141232 -1461480
7234 -1461480 -7803903 -6487422 -2272569 -4500731 -11531008 -14200724 -10535334 -6768855
7226 -6768855 -6140950 -6030578 -4976975 -4483883 -4820549 -5743969 -9353153 -15550505 -17866089
7217 -17866089 -11733884 -3623913 -2669844 -6090207 -3735856 4538231 8265986 3735901
7209 3735901 -455092 1800757 5362895 4698367 3176072 5259997 7935791 6820765
7201 6820765 4224453 4558343 7035413 8785743 10381230 12731465 12993148 9038601 4171088
7192 4171088 2571877 3791209 5889782 9409090 13477694 12983319 5644088 -2212513
7184 -2212513 -3322754 445823 2233726 1335936 2697083 6838048 8223360 4499229
7176 4499229 699888 1826182 5801016 6712458 2662003 -2094073 -2397386 1595917 4427280
7167 4427280 2346412 -1223647 -305132 4509498 6629611 3757201 1346070 3191719
7159 3191719 5125270 2771707 -294124 1555355 6478184 8474759 6820283 5058094
7151 5058094 3376132 -267375 -3264298 -930715 4386040 4888644 -1096158 -6675501
7143 -6675501 -7176511 -6091005 -7441738 -8800468 -6059364 -414750 3604856 3986071 1894352
7134 1894352 -946170 -3034131 -3611936 -4341100 -8002340 -13850347 -16910096 -13768911 -6801405
7125 -6801405 -1055710 938843 115566 -1004932 -96095 2679385 3562570 -647793 -6860155
7116 -6860155 -8049586 -2581545 3224180 4028208 2371022 3179400 5623355 5428150 2498450
7107 2498450 583042 465745 -953721 -4481654 -6674930 -5743284 -5110944 -8137781 -12155374
7098 -12155374 -11495952 -5496968 40470 -82 -4131423 -7002510 -6078214 -3213739 -625299
7089 -625299 1517636 2979598 2098456 -1422568 -4491418 -3995465 -1029770 743361 184384
7080 184384 -427466 840361 3524446 6443395 8863230 9676012 7868861 4505870 2144038
7071 2144038 1514040 701645 -1537329 -3542301 -3109835 -815331 384034 -1522157 -5340367
7062 -5340367 -7679741 -6281140 -2430402 594138 1543081 2147077 3632964 4804116 5061529
7053 5061529 6338541 9304567 10662530 8194375 5742952 7820126 11216048 8683487
7045 8683487 627295 -4184756 -1055373 4545966 6149174 4796648 4065489 2662340
7037 2662340 -1926821 -6578057 -6013409 -1012439 2880733 3656971 4209279 5894542 6309454
7028 6309454 4265861 2220761 2107481 2318338 667489 -2202763 -4005429 -3589997 -1445680
7019 -1445680 891618 1051628 -2689929 -8715241 -12161155 -9522572 -2945566 1503126
7011 1503126 407313 -3052896 -2960608 1747159 5645645 4085014 -120129 -428154 4139938
7002 4139938 7829429 6779034 4061499 3852943 4957869 4035257 2102529 2933229 6353201
6993 6353201 7831973 4781250 -421568 -4036598 -4563472 -2471693 753339 2644659
6985 2644659 1248441 -2632700 -6358851 -8699801 -10274920 -10927759 -9201224 -5022642
6977 -5022642 -702720 1736569 2673499 3519873 4545190 4877276 3865602 1928561 399590
6968 399590 374701 1380007 1946683 1954257 2850717 4469242 3784158 -826093 -5835030 -6214204
6958 -6214204 -1881069 2580735 3817685 1922236 -2437963 -8661500 -13591334 -12907689
6950 -12907689 -6991958 -1681886 -970506 -2172832 -850401 2464074 3784572 1977212
6942 1977212 -5251 290097 1688769 1177137 -2409312 -6442162 -6107673 723187 9966625
6933 9966625 14838436 13632601 11248854 11710288 12799798 10966436 7976815 7997737 10228009
6924 10228009 9937867 6270798 3441530 3410183 2780082 -857725 -4270627 -3643745 -696686
6915 -696686 239194 -1120120 -1432601 469974 2253868 2287780 1628428 1500656 1864987
6906 1864987 3086016 6156847 10151710 11789689 8903834 2803342 -3538880 -7841112
6898 -7841112 -8559127 -5282970 -709387 196886 -4478820 -10490141 -11917747 -7714662 -1668119
6889 -1668119 2887516 5515422 6546955 5817600 4129744 3398304 4201333 4743651 2951558
6880 2951558 -1635925 -8128206 -14725821 -18769470 -18368187 -14541494 -10053736 -5917464
6872 -5917464 -1147914 3911385 7077432 8174106 9993038 13056384 12419692 3517838
6864 3517838 -10085380 -18726328 -16834798 -8350830 -1269390 885317 775805 1989937
6856 1989937 4236723 4399576 1348347 -2131082 -3188069 -3161501 -5494607 -9872672 -11779004
6847 -11779004 -8848668 -4367759 -2412253 -2416369 -1378607 945910 2462008 2615415 2271685
6838 2271685 990756 -1796370 -3823357 -2409422 413826 -371830 -5349078 -9314367
6830 -9314367 -8635145 -5771228 -4419102 -4125014 -2862003 -1899468 -4157589 -9114934 -12849165
6821 -12849165 -12790900 -9889189 -6356510 -3586749 -2339220 -2914405 -4539624 -5791788 -6108331
6812 -6108331 -6201397 -6808064 -7593697 -7547032 -6330103 -5010291 -4876813 -5228538 -3467177
6803 -3467177 1301655 5815212 6027851 2462328 -457765 -341220 1033619 1859399 2658109
6794 2658109 3004460 150342 -5950485 -9828850 -7007446 -902059 1512426 -609602
6786 -609602 -1815561 618754 3039565 1871373 -1239502 -2857989 -2251611 24470 4267569
6777 4267569 9150744 10336499 5701627 -47767 -387411 4257685 7140274 4705670
6769 4705670 1015391 1080194 3692275 4075630 1364509 -466109 1161362 3706264 3281418
6760 3281418 -114730 -3068015 -3369336 -2164173 -1686872 -2695867 -4618333 -6622858 -7529815
6751 -7529815 -5946527 -1997848 1822305 3147101 2641717 2653770 3343299 2696664 896637
6742 896637 1596939 6586305 11457643 10149903 3242812 -1897616 -37899 6077212 10492263
6733 10492263 11618356 11857606 11619862 8298156 1702971 -3617599 -3767867 -411228 2478824
6724 2478824 4470907 7506239 10276071 8781826 3223166 -617289 580328 2451226
6716 2451226 -331638 -5472755 -6466663 -2666230 266409 -211270 -307347 2096504 2777758
6707 2777758 -1461788 -6076940 -4918958 534847 4032051 4050308 3912629 3922611 885427
6698 885427 -3999204 -4305867 1800110 7207551 5281059 -1263069 -5198919 -4367842 -1662434
6689 -1662434 1032364 3292912 2860571 -2048500 -7785564 -8183034 -2853197 2257775 3471532
6680 3471532 3785655 6691243 9668030 7349642 -516440 -7351390 -6359078 2173036 10758104
6671 10758104 12424379 8395833 6267398 9841649 13886073 11692225 4761687 251019
6663 251019 582154 1386975 -428065 -2624079 -2840431 -2193786 -1608239 125306 2034948
6654 2034948 127503 -5590680 -8506300 -4482359 1185358 1573114 -1286568 -644942 3174536
6645 3174536 3698324 234731 -136061 5432495 9673656 5759615 -2452012 -6411231 -4890639
6636 -4890639 -3598023 -4973605 -5178315 -1644151 2344483 3115092 2438638 4318273 8264817
6627 8264817 9571025 5637255 -1194661 -7108304 -10014492 -8837002 -3263367 3732960
6619 3732960 6232657 1600236 -5337697 -7662279 -4616521 -990315 426886 1157508
6611 1157508 2116441 1699906 50757 235977 2847434 3853681 788918 -2841651 -2775865
6602 -2775865 -213276 924543 37630 -807529 -1149869 -1734219 -1843456 -912666 -972521
6593 -972521 -3687086 -6774964 -7125167 -5408940 -3630170 -664292 4691503 8449761 5452301
6584 5452301 -2083946 -6133523 -3314286 1540014 2809225 211260 -3170616 -4569398
6576 -4569398 -2700392 861715 1689333 -2137626 -5879791 -4278149 -46883 338767 -2203185
6567 -2203185 -874268 4454253 5945443 1174960 -2007751 1789206 6860731 6065950
6559 6065950 1281138 -2031305 -3638626 -5189947 -4558569 -912962 315709 -4650765
6551 -4650765 -10139306 -9188607 -4679294 -3594398 -4729702 -2233346 1924973 350598
6543 350598 -5971814 -7555996 -1212225 5254101 5565267 3116610 3306274 5599542 7115001
6534 7115001 7679249 7580035 5559669 2001308 -682168 -2732071 -6720307 -11052808 -10301901
6525 -10301901 -4251367 362243 188329 49696 3309591 5016651 628621 -4950179
6517 -4950179 -4286512 1454835 5596892 6303929 6404019 5927876 2767578 -785516 205270
6508 205270 5352656 9387230 10406479 11182973 12059127 9399952 2716011 -2730992 -2854047
6499 -2854047 545096 4123626 7402484 10342210 10933069 8453936 5736548 4949917 3943035
6490 3943035 25921 -5024472 -7263207 -6220687 -4717418 -3953498 -2247465 1270887
6482 1270887 4606075 5317661 3146930 -366583 -3364110 -4186747 -1947674 2200893 5141201
6473 5141201 4486408 1294420 -868588 -10701 1930427 1676687 -1055689 -3313136 -2989819
6464 -2989819 -1217004 238557 2019013 5668556 10309975 13230589 13442058 12510384 11870880
6455 11870880 11221266 9508960 5643701 -1278160 -9746553 -14123721 -9193882 2101412
6447 2101412 9416977 6575191 -565906 -1728183 4474137 9885351 8833048 4941737
6439 4941737 4072424 5697943 5469566 3016505 1823828 2446674 1336067 -2710376 -5921944
6430 -5921944 -5760135 -5420843 -8309939 -11383571 -9278126 -3401897 -793452 -3586971 -5796508
6421 -5796508 -2810011 1684399 2256846 422930 1262768 4577363 5727150 3742878 2201097
6412 2201097 2342992 1705360 232498 1159598 3959401 3069723 -2954395 -7190750 -4045211
6403 -4045211 2067913 3602448 1105710 589187 2706379 2589799 -483321 -1486250 1152028
6394 1152028 2261883 -1306753 -4938859 -3229911 2062053 5325014 4828120 2932657
6386 2932657 1268645 -47510 -141393 1656761 3468725 2842211 556596 -265437 1631002
6377 1631002 4554416 6270920 5381343 1322353 -4561899 -8672719 -8254087 -4407811 -265090
6368 -265090 2686146 4321806 3613629 4772 -3724725 -3615797 195633 3369496 2892666
6359 2892666 47939 -2315817 -2599866 -215454 4309851 8058776 7522108 3081263 -711645
6350 -711645 -658311 1532557 2514423 1795271 1261858 2137547 4207906 6643836 8103902
6341 8103902 7316867 4784832 2620631 1868577 1716483 2099933 4538984 8806758 11413414
6332 11413414 9977869 7161415 7284051 10173632 11305964 7624981 730193 -5610743
6324 -5610743 -9047695 -9676779 -9029934 -8129596 -5955922 -915375 5370682 7901593 4057787
6315 4057787 -2305803 -5255655 -3711400 -876209 1530830 4052994 5362667 2916708
6307 2916708 -1181501 -502677 6565151 12578812 10302185 3062051 646191 6256051
6299 6256051 12948642 13484761 8767832 4446441 3051523 2884854 2516479 2536487 3099614
6290 3099614 2886737 1429465 409994 1417571 3662430 5087160 4949383 4247562 4130637
6281 4130637 4842594 5871111 6346552 5651527 4224328 3086960 1957994 -882461 -5481822
6272 -5481822 -8415701 -6561740 -1895838 533986 -616179 -1749873 -732142 -528299
6264 -528299 -3845084 -7450975 -5933845 377188 5373130 4879738 775475 -3217951 -6525334
6255 -6525334 -10684929 -15366448 -17689879 -15393432 -9734063 -4910076 -4279272 -6972714
6247 -6972714 -8998642 -8014084 -5530654 -3568498 -1474697 1641651 3566325 1867629
6239 1867629 -1111823 -794357 2136014 1930454 -3143303 -7229933 -5522142 -1709171 -2008172
6230 -2008172 -5290794 -5341080 -1365334 616307 -2320043 -5139841 -2875926 1615748 2477595
6221 2477595 110328 157918 4358807 7781881 6095683 1227080 -2287773 -3251079 -3312534
6212 -3312534 -2949952 -1443017 199408 -145181 -2033594 -2562146 -983621 -228314 -2103429
6203 -2103429 -3594100 -786546 4937686 7880859 5203416 363148 -1393535 1232921
6195 1232921 5587717 8924690 10336046 9753388 7245782 3721836 1005611 479365 2057309
6186 2057309 4556011 6387168 5931421 2533255 -2110050 -4621449 -3283617 -125900
6178 -125900 1645653 1721309 2329232 4021961 4352854 1658917 -2123149 -3993767 -3442957
6169 -3442957 -1833775 -95747 1045404 621826 -246132 2171099 8835858 14114735 12246788
6160 12246788 6553372 6167627 12962477 18089444 14102316 4877843 -494908 765952
6152 765952 4362390 6308369 6097416 4518528 2916107 3473011 6495342 8582201 6660735
6143 6660735 2132602 -2139665 -6436026 -11643784 -14749972 -12273994 -6584907 -3122159
6135 -3122159 -2394325 -766799 1502512 68689 -4886871 -7064693 -3607207 20315
6127 20315 -1819246 -7113400 -10345145 -10031626 -8091937 -5461994 -2604705 -1434383 -2605595
6118 -2605595 -3266007 -1296526 568401 -1143736 -4480439 -4409212 -94229 4398882 6073675
6109 6073675 5760281 5059875 4218354 3489708 3520869 3685853 2597192 965746 1560437
6100 1560437 5243137 8928706 8909775 5205284 1338210 107009 625240 60889 -2155695
6091 -2155695 -3164423 -528820 3937336 6069587 4556577 1979315 717835 427728
6083 427728 65729 -351379 -1035556 -2758898 -4527012 -3668207 -111361 2009659 -598399
6074 -598399 -5788034 -8824305 -8105716 -5691121 -3760447 -3105441 -3939309 -5739032 -6982133
6065 -6982133 -6891282 -6645207 -7439999 -8480232 -8137716 -5730298 -1291880 4284672 7959652
6056 7959652 6513538 1574564 -683369 2644609 7058773 7274277 4315373 2236914
6048 2236914 1529177 676595 885482 3270151 3979326 -898611 -7023733 -5975816 2218305
6039 2218305 8308021 6944223 3158000 2862689 3837412 1042783 -4062235 -5322585 -776021
6030 -776021 4992608 6756453 3823750 -501764 -2865597 -3226476 -4344155 -7209608 -8445194
6021 -8445194 -4945597 424868 2275693 1074713 2139889 5657626 4902399 -2482021
6013 -2482021 -8366072 -4834433 4139743 8285947 4930554 414036 -595006 -262919
6005 -262919 -1924912 -5051018 -7090044 -6211853 -1395928 6577001 13537667 14710576 9940037
5996 9940037 3564900 -916619 -3123306 -3167474 -775394 2380811 3362987 2198759 1997306
5987 1997306 3591000 3675856 152609 -4114034 -5407945 -4198692 -3218105 -2823671 -1531781
5978 -1531781 289479 583425 -941415 -2142867 -1274538 1328443 4241999 6127834 6201638
5969 6201638 4841704 3362746 2201323 227107 -2956164 -5338835 -4944885 -2805477
5961 -2805477 -1392539 -1152225 -1084061 -1737141 -4321282 -7138046 -6696530 -3230699 -1551396
5952 -1551396 -4706618 -9775837 -12027641 -10594485 -7586402 -4099225 -435965 1321867
5944 1321867 -1197460 -6715899 -10884287 -11173930 -8932089 -6455526 -4465552 -3082122
5936 -3082122 -3019553 -4483957 -6160802 -6489435 -5439679 -4385516 -4374553 -4665752 -3178356
5927 -3178356 931817 5330563 6707954 5092621 3531123 2719387 -403486 -6285229
5919 -6285229 -9058275 -3990625 4132458 6109712 699962 -4264730 -2955051 2664705
5911 2664705 8631734 13444084 14774898 9175131 -927384 -6325572 -2223595 4844343
5903 4844343 6487063 3813622 3164729 4993510 4587700 1272107 -807691 -192369 372587
5894 372587 -380154 -1089142 -1978051 -4263093 -5635591 -2705995 1699043 279932 -8292529
5885 -8292529 -16669393 -18321541 -14155252 -7901538 -1000755 4977826 6474821 2697137
5877 2697137 -1675418 -2215275 44115 2052991 3720278 6005440 7416771 6358108
5869 6358108 4514715 4276759 4842153 4191873 2985883 3204748 4607717 5705005 6722696
5860 6722696 8454401 9460556 7637881 3908904 1589004 2365593 4849783 6563001
5852 6563001 5863775 2883374 -87233 -403769 1590773 2797688 1986529 1505161 2639994
5843 2639994 2584556 -863899 -4536565 -4061581 -898761 -441794 -3758225 -6060858 -4165022
5834 -4165022 -1222650 -1951716 -5939504 -8302012 -6008426 -1427357 840748 -349329
5826 -349329 -1446430 880853 5029347 6693463 5000716 3271056 3459256 3687054 2766754
5817 2766754 3101363 6133445 8355805 5808064 200151 -3531640 -4091075 -4146737 -5064151
5808 -5064151 -5608265 -5345168 -5254340 -5026723 -3434523 -1341026 -721257 -746431 1206562
5799 1206562 4278476 4110461 -499612 -4602504 -2864844 4156120 11191653 13662859
5791 13662859 10688719 4903660 652285 492788 2332120 1783943 -1899092 -4591771
5783 -4591771 -3110537 363808 1679266 436088 -213528 1698610 4927728 7377257
5775 7377257 8398031 8453007 7898704 6679332 4684651 2133704 -296274 -1880702 -2466148
5766 -2466148 -2371792 -1702329 -356557 1124978 1459471 25916 -1842200 -1708539 1247145
5757 1247145 4529036 4386984 292785 -3723959 -3807595 -1430222 -1142441 -3403511 -3458260
5748 -3458260 1161025 5832396 4662952 -1684695 -7710087 -10514972 -11279012 -10747736 -8175551
5739 -8175551 -4616897 -2512900 -1317615 1973201 6758317 7944138 3415229 -1754137
$$ [...]
##END NTUPLES=NMR SPECTRUM
##END=
